##TITLE= S#348837
##JCAMP-DX= 5.00 $$ JEOL NMR v1.10
##DATA TYPE= NMR SPECTRUM
##DATA CLASS= NTUPLES
##NUM DIM= 1
##ORIGIN= DELTA_NMR
##OWNER= organic
##SPECTROMETER/DATA SYSTEM= DELTA_NMR
##.OBSERVE FREQUENCY= 3.00529655924288E+02
##.OBSERVE NUCLEUS= ^1H
##.DELAY= (2.194E+02,2.194E+02)
##.ACQUISITION MODE= SIMULTANEOUS
##.FIELD= 7.0586013
##.FILTER WIDTH= 1.81675738660864
##.ACQUISITION TIME= 3.6339712
##.SPINNING RATE= 16
##.OBSERVE 90= 9.6
##NTUPLES= NMR SPECTRUM
##VAR NAME= FREQUENCY,    SPECTRUM/REAL, SPECTRUM/IMAG, PAGE NUMBER
##SYMBOL=   X,            R,             I,             N
##VAR TYPE= INDEPENDENT,  DEPENDENT,     DEPENDENT,     PAGE
##VAR FORM= AFFN,         ASDF,          ASDF,          AFFN
##VAR DIM=  16384, 16384, 16384, 2
##UNITS= PPM,     ARBITRARY UNITS, ARBITRARY UNITS, 
##FIRST=  1.2501033903057E+01, -2.16407260768374E+02, -1.62042015222189E+02, 1
##LAST=  -2.50011824950436, -1.81007578764358E+02, -2.01713301833203E+02, 2
##FACTOR=  9.1565355261926E-04, 6.77495997745387E-03, 6.77495997745387E-03, 1
##PAGE= N=1
##DATA TABLE=(X++(R..R)), XYDATA
$$ [...]
9241 -3578285 -3538976 -3517844 -3449489 -3647173 -3599866 -3546751 -3505638 -3553752 -3540906 -3555097 -3574531 -3635397
9229 -3635397 -3532640 -3490677 -3493040 -3525662 -3533356 -3551682 -3507538 -3533072 -3476837 -3600051 -3626572 -3629484 -3599899
9216 -3599899 -3561638 -3514454 -3536850 -3535958 -3512121 -3621136 -3605122 -3420152 -3586658 -3542141 -3584835 -3614128 -3633125
9203 -3633125 -3634850 -3529161 -3498566 -3522314 -3543957 -3517530 -3544195 -3572310 -3522301 -3437604 -3567543 -3600958 -3559916
9190 -3559916 -3580572 -3585263 -3655937 -3640606 -3538286 -3576251 -3579999 -3606004 -3540499 -3530221 -3625015 -3580348 -3628553
9177 -3628553 -3635029 -3580986 -3636596 -3649547 -3605150 -3695523 -3653788 -3672818 -3598924 -3653986 -3559477 -3599582 -3555693
9164 -3555693 -3614233 -3582450 -3578054 -3682421 -3696060 -3503465 -3443731 -3504733 -3540761 -3532901 -3575824 -3599142 -3523588
9151 -3523588 -3572761 -3583686 -3646236 -3555371 -3537284 -3477969 -3578617 -3641557 -3548608 -3625707 -3676747 -3665290 -3571248
9138 -3571248 -3656654 -3883974 -3625132 -3561274 -3609932 -3576045 -3450092 -3557305 -3531055 -3532720 -3528301 -3550762
9126 -3550762 -3493753 -3540968 -3525514 -3560877 -3510588 -3524451 -3538442 -3634780 -3568766 -3541954 -3518317 -3516337 -3556568
9113 -3556568 -3504147 -3502939 -3564150 -3592745 -3593538 -3580892 -3553110 -3558391 -3505361 -3589534 -3615139 -3601379 -3532059 -3537205
9099 -3537205 -3571144 -3536919 -3555881 -3529146 -3570985 -3444301 -3488487 -3549437 -3590292 -3618135 -3583081 -3638397 -3576269
9086 -3576269 -3505756 -3601952 -3619008 -3601243 -3633952 -3562155 -3544423 -3507689 -3575075 -3547782 -3540452 -3488582 -3561097
9073 -3561097 -3614698 -3516404 -3618634 -3748026 -3932446 -3354943 -3496570 -3458792 -3562332 -3493616 -3529717 -3450956
9061 -3450956 -3452281 -3481392 -3416867 -3537818 -3503287 -3536609 -3505956 -3533507 -3532586 -3556222 -3511596 -3610658 -3570824
9048 -3570824 -3587897 -3570345 -3547296 -3559147 -3498858 -3511730 -3504290 -3412348 -3493106 -3497189 -3486586 -3536101 -3529038
9035 -3529038 -3564803 -3544268 -3551223 -3667945 -3590442 -3557435 -3597716 -3590642 -3456587 -3595421 -3622488 -3601053 -3567341
9022 -3567341 -3695251 -3564038 -3528198 -3493521 -3419762 -3444601 -3506830 -3489254 -3500611 -3633461 -3583213 -3491829
9010 -3491829 -3536055 -3618331 -3593601 -3662374 -3627473 -3559963 -3483235 -3640226 -3664960 -3647956 -3574216 -3556186 -3611025
8997 -3611025 -3567293 -3643562 -3644250 -3696402 -3528014 -3554255 -3607117 -3636828 -3631649 -3574494 -3642653 -3603086 -3646242
8984 -3646242 -3620772 -3606919 -3600964 -3650882 -3559861 -3528613 -3617167 -3592288 -3570033 -3605259 -3580163 -3547407 -3551307
8971 -3551307 -3596723 -3576428 -3588909 -3567534 -3608453 -3578180 -3614114 -3648574 -3561402 -3502451 -3537213 -3566145 -3551852
8958 -3551852 -3639016 -3672921 -3581903 -3579901 -3598537 -3508102 -3542835 -3484482 -3602155 -3632444 -3632797 -3632666 -3612603
8945 -3612603 -3418329 -3497975 -3511402 -3474069 -3575145 -3640493 -3534705 -3650587 -3657660 -3669178 -3639248 -3536909
8933 -3536909 -3520083 -3581799 -3597243 -3564226 -3599934 -3466675 -3503809 -3628550 -3564661 -3560806 -3525977 -3592628 -3569016
8920 -3569016 -3617967 -3563561 -3533756 -3632650 -3598096 -3575953 -3538932 -3549329 -3661453 -3630939 -3542065 -3530026 -3562517
8907 -3562517 -3626686 -3600477 -3580833 -3564437 -3491627 -3536396 -3542074 -3529859 -3572281 -3568404 -3557174 -3601441 -3506003
8894 -3506003 -3538177 -3590383 -3637708 -3557322 -3567564 -3571208 -3629306 -3533818 -3464310 -3498817 -3564961 -3603849 -3576751
8881 -3576751 -3572350 -3577523 -3512428 -3520242 -3552180 -3640955 -3531085 -3495550 -3608489 -3661032 -3584695 -3587452 -3549364
8868 -3549364 -3562481 -3611199 -3505167 -3601871 -3512983 -3433762 -3537573 -3586677 -3552584 -3616834 -3493697 -3620077
8856 -3620077 -3622606 -3531127 -3571922 -3546259 -3588443 -3663197 -3642514 -3658496 -3630124 -3623743 -3570374 -3669324 -3688400
8843 -3688400 -3591979 -3661295 -3596165 -3614303 -3651943 -3496053 -3557332 -3596182 -3589763 -3557628 -3633012 -3608709 -3479098
8830 -3479098 -3552452 -3473564 -3502859 -3598572 -3571805 -3577940 -3634160 -3566871 -3646108 -3630967 -3625503 -3687201 -3582765
8817 -3582765 -3637839 -3545972 -3618655 -3588149 -3548638 -3622839 -3607985 -3658599 -3617943 -3627772 -3558276 -3641837 -3566667
8804 -3566667 -3582223 -3622355 -3628885 -3656961 -3516711 -3554036 -3495927 -3557920 -3560261 -3598215 -3567185 -3537845 -3603310
8791 -3603310 -3666061 -3573900 -3641426 -3622144 -3633732 -3594058 -3535920 -3477736 -3470208 -3555839 -3474703 -3559686 -3601211
8778 -3601211 -3616625 -3548070 -3567582 -3596887 -3598124 -3616690 -3542080 -3572659 -3542698 -3573499 -3467057 -3465399 -3477585
8765 -3477585 -3543232 -3533879 -3552585 -3514423 -3571130 -3569922 -3479607 -3569107 -3527965 -3529351 -3646981 -3542247 -3461901
8752 -3461901 -3356465 -3547727 -3639371 -3600114 -3573411 -3541623 -3613431 -3564812 -3566714 -3582562 -3632642 -3672984 -3628431
8739 -3628431 -3561479 -3504590 -3462549 -3442634 -3481411 -3529302 -3788182 -3756830 -3585113 -3589844 -3686031 -3614215 -3682598
8726 -3682598 -3587316 -3566983 -3568459 -3629240 -3529676 -3633443 -3626126 -3636002 -3606851 -3623852 -3690484 -3542722 -3490874
8713 -3490874 -3540316 -3550678 -3545591 -3512212 -3526647 -3558803 -3615275 -3547845 -3676716 -3569524 -3648822 -3555369 -3538125
8700 -3538125 -3645087 -3583839 -3646046 -3725335 -3816992 -3667074 -3467356 -3572504 -3630074 -3591709 -3545957 -3717919
8688 -3717919 -3728690 -3667489 -3599426 -3626684 -3577999 -3519387 -3597752 -3499318 -3423440 -3611893 -3583001 -3591716 -3534034
8675 -3534034 -3528241 -3548448 -3536464 -3582777 -3536272 -3543563 -3654678 -3675298 -3675727 -3680418 -3606240 -3531313 -3636770
8662 -3636770 -3566759 -3573952 -3640593 -3599437 -3592337 -3553649 -3537166 -3598642 -3543970 -3609551 -3564556 -3647196 -3666928
8649 -3666928 -3560711 -3564190 -3537618 -3503061 -3549149 -3578128 -3535370 -3644238 -3628799 -3554285 -3595826 -3676648 -3676143
8636 -3676143 -3599454 -3625703 -3662479 -3614703 -3640236 -3560085 -3572166 -3601409 -3543540 -3576792 -3521000 -3593670 -3647848
8623 -3647848 -3474385 -3553111 -3563090 -3518121 -3517561 -3548650 -3547924 -3599933 -3533263 -3566221 -3577158 -3563286 -3588350 -3624133
8609 -3624133 -3654310 -3648919 -3746590 -3690449 -3631443 -3642843 -3613856 -3571800 -3632219 -3581786 -3516924 -3578481 -3617965
8596 -3617965 -3564796 -3605227 -3578478 -3601984 -3684284 -3641571 -3626994 -3518108 -3539764 -3517315 -3539490 -3667274
8584 -3667274 -3639559 -3545764 -3623425 -3597005 -3534433 -3535042 -3518039 -3542759 -3643624 -3587110 -3469669 -3471243 -3508309
8571 -3508309 -3564221 -3540783 -3581612 -3735573 -3642406 -3574226 -3580646 -3541158 -3580674 -3674418 -3510808 -3513405 -3639733
8558 -3639733 -3613252 -3629098 -3595384 -3479401 -3563419 -3617694 -3547665 -3553531 -3497475 -3488895 -3571329 -3644861 -3610436
8545 -3610436 -3541340 -3566223 -3558358 -3639082 -3551117 -3652026 -3574967 -3579562 -3645575 -3551671 -3645421 -3514332 -3528640
8532 -3528640 -3635588 -3528791 -3458646 -3500494 -3701128 -3603833 -3770151 -3658147 -3589405 -3575580 -3647415 -3643231
8520 -3643231 -3571974 -3560071 -3583977 -3559189 -3566158 -3470926 -3598989 -3650751 -3641179 -3580102 -3670662 -3720495 -3694596
8507 -3694596 -3598985 -3626550 -3553722 -3625973 -3644574 -3673005 -3635503 -3680987 -3533886 -3644529 -3516480 -3516708 -3583662
8494 -3583662 -3724777 -3654720 -3582765 -3546813 -3607216 -3586134 -3550646 -3562679 -3652994 -3716239 -3624676 -3580750 -3659927
8481 -3659927 -3592394 -3568593 -3565524 -3544369 -3562767 -3567431 -3515811 -3605168 -3653973 -3616296 -3502670 -3605992 -3546968
8468 -3546968 -3565130 -3564353 -3592684 -3532150 -3594905 -3683902 -3590171 -3562978 -3579258 -3564670 -3574052 -3657259 -3616451
8455 -3616451 -3592269 -3556525 -3560213 -3637666 -3651401 -3657490 -3540279 -3576774 -3515195 -3592696 -3674776 -3664736 -3618760
8442 -3618760 -3560415 -3556071 -3642121 -3567866 -3722003 -3662969 -3528965 -3571731 -3535486 -3539557 -3635369 -3617053 -3627986
8429 -3627986 -3740630 -3616939 -3565100 -3688211 -3607049 -3606768 -3626629 -3606986 -3678067 -3693151 -3536558 -3591765 -3600536
8416 -3600536 -3495435 -3565066 -3595193 -3669947 -3554041 -3553114 -3561984 -3595624 -3561013 -3549731 -3611315 -3609555 -3629907
8403 -3629907 -3639079 -3626965 -3555816 -3619703 -3583802 -3641439 -3694333 -3718935 -3716358 -3604015 -3682536 -3647878 -3650438
8390 -3650438 -3610284 -3594960 -3543724 -3550897 -3604467 -3543471 -3621473 -3648818 -3618037 -3583613 -3561249 -3576860 -3546454
8377 -3546454 -3510802 -3659166 -3673849 -3646971 -3582167 -3592794 -3571760 -3586217 -3646831 -3653718 -3643241 -3671953 -3581364
8364 -3581364 -3597209 -3573784 -3675113 -3704588 -3612064 -3521486 -3638047 -3576707 -3555512 -3648293 -3545779 -3545504 -3597613
8351 -3597613 -3689738 -3636449 -3569860 -3588940 -3502028 -3535657 -3554742 -3596736 -3542472 -3551836 -3613145 -3715672 -3609822
8338 -3609822 -3606899 -3632348 -3592145 -3636997 -3650056 -3658211 -3591409 -3649362 -3686787 -3624791 -3589225 -3590188 -3535412 -3581338
8324 -3581338 -3663414 -3595282 -3593339 -3586777 -3638151 -3712858 -3618420 -3514814 -3600400 -3542310 -3576209 -3608367 -3548423
8311 -3548423 -3642701 -3632799 -3582776 -3596898 -3566092 -3553342 -3419524 -3518277 -3558962 -3498422 -3465945 -3553496 -3585713
8298 -3585713 -3589166 -3686602 -3625386 -3648346 -3645156 -3609128 -3591532 -3651808 -3614238 -3704130 -3600911 -3551277 -3555431
8285 -3555431 -3587992 -3627977 -3573820 -3596434 -3594916 -3663910 -3578399 -3572890 -3547972 -3549371 -3598430 -3514305 -3570611
8272 -3570611 -3522648 -3541648 -3541704 -3570497 -3583513 -3566854 -3608527 -3614969 -3590038 -3519397 -3542740 -3504742 -3623515 -3617478
8258 -3617478 -3522519 -3474043 -3600047 -3727143 -3644105 -3644920 -3722728 -3671223 -3702029 -3662252 -3679525 -3597402 -3549713
8245 -3549713 -3650724 -3664915 -3627995 -3629293 -3585818 -3613584 -3682890 -3678474 -3566077 -3538456 -3520761 -3519974 -3717993
8232 -3717993 -3539589 -3582835 -3540233 -3608100 -3662142 -3603510 -3619499 -3612459 -3584237 -3576176 -3603838 -3727314 -3580625
8219 -3580625 -3683261 -3606306 -3561705 -3641970 -3630536 -3569541 -3634731 -3630074 -3650957 -3617500 -3588851 -3688389 -3665246
8206 -3665246 -3641178 -3686869 -3671253 -3588516 -3562052 -3347830 -3561284 -3529704 -3595183 -3566690 -3486747 -3461592
8194 -3461592 -3648334 -3552355 -3503882 -3548227 -3513554 -3485529 -3552628 -3607429 -3602120 -3553322 -3544682 -3710453 -3457897
8181 -3457897 -3577523 -3480271 -3512742 -3540496 -3533558 -3483159 -3471324 -3588109 -3553968 -3539635 -3550027 -3500172 -3560145
8168 -3560145 -3581640 -3529355 -3571791 -3547815 -3456159 -3556288 -3574070 -3557805 -3550994 -3561179 -3651457 -3615615 -3653610
8155 -3653610 -3556962 -3541342 -3567110 -3584732 -3613465 -3640538 -3570594 -3535376 -3477080 -3556572 -3632618 -3574040 -3593073
8142 -3593073 -3544612 -3592064 -3646341 -3630161 -3568000 -3565803 -3623976 -3674735 -3616960 -3559160 -3454796 -3519970 -3595822
8129 -3595822 -3566787 -3513947 -3587903 -3583499 -3625177 -3569287 -3566083 -3544534 -3455391 -3519638 -3641107 -3632776 -3599740
8116 -3599740 -3601547 -3689003 -3619255 -3569042 -3557609 -3537608 -3547036 -3557214 -3562878 -3604607 -3558296 -3610858 -3520491 -3515244
8102 -3515244 -3587969 -3562341 -3688799 -3568948 -3644234 -3611110 -3637424 -3559997 -3566095 -3622584 -3566871 -3570573 -3568451
8089 -3568451 -3577026 -3642318 -3617455 -3651362 -3549295 -3613569 -3674583 -3592598 -3536246 -3557359 -3619877 -3603287 -3557095
8076 -3557095 -3566715 -3555675 -3695297 -3621509 -3684876 -3524496 -3618753 -3616484 -3652802 -3586581 -3547824 -3563373 -3494099
8063 -3494099 -3471075 -3375107 -3584833 -3590380 -3625125 -3701551 -3608325 -3686923 -3616028 -3585352 -3404885 -3542802
8051 -3542802 -3628961 -3603133 -3559883 -3574837 -3632324 -3597648 -3549119 -3507626 -3541411 -3617526 -3596687 -3600907 -3561348
8038 -3561348 -3588409 -3539486 -3555933 -3484670 -3528781 -3624641 -3637575 -3620867 -3579635 -3532095 -3606121 -3553973 -3546769
8025 -3546769 -3417383 -3538471 -3514514 -3451579 -3454733 -3428107 -3522465 -3493140 -3487238 -3470277 -3499737 -3481111 -3487018
8012 -3487018 -3550254 -3587437 -3501419 -3528995 -3610090 -3539738 -3639482 -3683593 -3658521 -3546833 -3518934 -3763931
8000 -3763931 -3632449 -3579891 -3612907 -3653578 -3571488 -3565928 -3524024 -3605213 -3638347 -3519261 -3525859 -3419268
7988 -3419268 -3552107 -3483379 -3527449 -3514632 -3549882 -3497805 -3489077 -3450524 -3425810 -3447761 -3345577 -3410387
7976 -3410387 -3304142 -3334941 -3364335 -3340115 -3341378 -3275532 -3233222 -3253580 -3232701 -3336439 -3306312 -3266787 -3233657
7963 -3233657 -3239978 -3230426 -3156859 -3138413 -3147952 -3119911 -3063825 -3123716 -3090894 -3130415 -3173330 -3135241 -3059467
7950 -3059467 -3154871 -3162147 -3137861 -3195433 -3201709 -3099259 -3026182 -3038544 -3046939 -3005821 -2993151 -2960811 -3024616
7937 -3024616 -3047330 -2953836 -2836901 -2594185 -2604591 -2450382 -2471741 -2470599 -2666178 -2657188 -2322616 -2075121
7925 -2075121 -1920985 -1800002 -1669809 -1956351 -2347860 -2703248 -2891753 -3056767 -3202072 -3215435 -3277498
7914 -3277498 -3408961 -3335547 -3452845 -3521445 -3555426 -3539096 -3443554 -3615376 -3675439 -3642504 -3633154 -3648690
7902 -3648690 -3632511 -3648398 -3650305 -3613147 -3584834 -3558080 -3623256 -3561817 -3489221 -3379579 -3479538 -3521921 -3383914
7889 -3383914 -3444359 -3497266 -3572127 -3539193 -3580521 -3645643 -3695660 -3686152 -3635720 -3639485 -3649991 -3694368 -3622509
7876 -3622509 -3647031 -3717594 -3645401 -3630006 -3629260 -3732221 -3637265 -3656504 -3560052 -3574099 -3599751 -3560064 -3517150
7863 -3517150 -3520543 -3563956 -3580838 -3482224 -3521982 -3487967 -3546054 -3512833 -3483917 -3496497 -3645546 -3693589 -3691828
7850 -3691828 -3624059 -3590931 -3612558 -3703911 -3659264 -3595240 -3583488 -3599632 -3536804 -3612426 -3630577 -3629955 -3615364
7837 -3615364 -3648944 -3639560 -3672658 -3734783 -3795237 -3621468 -3556523 -3597981 -3852650 -3692104 -3633695 -3605050
7825 -3605050 -3669931 -3581360 -3626662 -3616631 -3589696 -3617173 -3686458 -3673698 -3624204 -3665509 -3629724 -3708457 -3675612
7812 -3675612 -3640484 -3690073 -3540485 -3525426 -3634529 -3723959 -3784797 -3521583 -3538016 -3744885 -3626639 -3616383
7800 -3616383 -3642647 -3631103 -3734463 -3701935 -3664158 -3572663 -3706499 -3723710 -3587398 -3596649 -3488282 -3631579
7788 -3631579 -3611439 -3596911 -3577129 -3629346 -3661144 -3548664 -3740861 -3657623 -3620596 -3682722 -3631256 -3579855
7776 -3579855 -3620602 -3589641 -3564691 -3727016 -3689988 -3612424 -3590510 -3655984 -3690049 -3695781 -3638715 -3665091 -3673326
7763 -3673326 -3702745 -3668868 -3652056 -3590085 -3678747 -3621143 -3721811 -3719999 -3730460 -3708305 -3658169 -3660868 -3747806
7750 -3747806 -3677124 -3737230 -3638951 -3788742 -3588552 -3525769 -3517764 -3490112 -3577524 -3724186 -3742596 -3708579 -3714023
7737 -3714023 -3704836 -3712185 -3628109 -3635798 -3679705 -3582008 -3676113 -3771529 -3706903 -3696437 -3676017 -3670091 -3653997 -3659143
7723 -3659143 -3672343 -3658154 -3641013 -3687333 -3662764 -3689189 -3655799 -3601293 -3661003 -3670072 -3655851 -3660252 -3658028
7710 -3658028 -3697962 -3695502 -3575208 -3638244 -3576960 -3645996 -3664158 -3642501 -3657353 -3643028 -3665370 -3629807 -3635863
7697 -3635863 -3528127 -3426207 -3629829 -3651854 -3645418 -3567982 -3631769 -3638154 -3729873 -3903075 -3620199 -3670375
7685 -3670375 -3605583 -3657107 -3643072 -3635081 -3667305 -3647013 -3684348 -3621662 -3667560 -3695290 -3709408 -3745897 -3664316
7672 -3664316 -3693523 -3645528 -3548683 -3586020 -3582182 -3629381 -3663991 -3673070 -3758472 -3675689 -3586176 -3516808 -3591240
7659 -3591240 -3603388 -3590247 -3587322 -3687254 -3647967 -3705816 -3798426 -3675398 -3574260 -3509836 -3594916 -3631333 -3635134
7646 -3635134 -3589568 -3667158 -3720448 -3620040 -3493211 -3536929 -3495038 -3561862 -3633599 -3543012 -3659385 -3705473
7634 -3705473 -3592994 -3679167 -3541943 -3526876 -3553676 -3585082 -3581229 -3502591 -3575225 -3591780 -3596949 -3630622 -3614109
7621 -3614109 -3695625 -3763126 -3639436 -3647270 -3683687 -3648644 -3695388 -3755626 -3663349 -3631869 -3688129 -3690071 -3690605
7608 -3690605 -3714593 -3676682 -3675506 -3580367 -3626450 -3659815 -3623245 -3659943 -3626394 -3661927 -3598243 -3616550 -3658881
7595 -3658881 -3567940 -3631114 -3631845 -3608067 -3702171 -3651377 -3617291 -3596921 -3593045 -3664046 -3671857 -3652913 -3517408
7582 -3517408 -3652561 -3585691 -3618547 -3630730 -3584127 -3638926 -3640503 -3635073 -3716435 -3679049 -3658642 -3638144 -3644237
7569 -3644237 -3604347 -3620355 -3660917 -3636435 -3697178 -3650436 -3756278 -3656038 -3594413 -3600195 -3619867 -3606419 -3667918
7556 -3667918 -3628768 -3674240 -3715063 -3719241 -3762044 -3733197 -3679518 -3702211 -3637295 -3709162 -3667942 -3570250 -3600755
7543 -3600755 -3622633 -3714932 -3625436 -3518421 -3558708 -3657414 -3684285 -3634164 -3687159 -3685941 -3652278 -3632150 -3621201
7530 -3621201 -3715359 -3668124 -3646280 -3682664 -3636959 -3625626 -3543238 -3659981 -3543954 -3571289 -3683937 -3556197
7518 -3556197 -3409664 -3674288 -3556835 -3534176 -3605989 -3510865 -3524200 -3503999 -3514187 -3657057 -3597313 -3595049 -3594525
7505 -3594525 -3633088 -3665190 -3770173 -3635932 -3641407 -3663749 -3624582 -3661030 -3776868 -3716983 -3651900 -3606195
7493 -3606195 -3637194 -3733067 -3716234 -3665642 -3662051 -3655574 -3585552 -3629046 -3763626 -3639207 -3624814 -3630510 -3616734
7480 -3616734 -3646810 -3634517 -3583122 -3567440 -3608290 -3608840 -3617314 -3599306 -3637135 -3525580 -3640196 -3633046 -3600959
7467 -3600959 -3623307 -3594038 -3624748 -3607393 -3692675 -3772390 -3830305 -3590047 -3576822 -3526331 -3603965 -3610622 -3699404
7454 -3699404 -3562997 -3612404 -3669329 -3621799 -3685282 -3671820 -3728770 -3656594 -3722693 -3673957 -3785440 -3588880
7442 -3588880 -3362227 -3583345 -3661190 -3594456 -3655730 -3633632 -3573185 -3593188 -3624563 -3614632 -3645214 -3693741 -3618841
7429 -3618841 -3641974 -3667931 -3545398 -3626471 -3741229 -3529516 -3707900 -3679943 -3665742 -3771960 -3756032 -3684326
7417 -3684326 -3579807 -3631720 -3684487 -3667817 -3662115 -3675962 -3680457 -3675086 -3686340 -3630464 -3707623 -3693704 -3559618
7404 -3559618 -3605848 -3618078 -3605009 -3611550 -3604510 -3592572 -3531334 -3651487 -3682833 -3667772 -3649010 -3558627 -3633680
7391 -3633680 -3697914 -3603756 -3669396 -3663754 -3652444 -3624425 -3649696 -3583843 -3657285 -3785715 -3770189 -3629669 -3651394
7378 -3651394 -3713302 -3668834 -3681114 -3692264 -3621594 -3719074 -3666818 -3720983 -3660338 -3698899 -3767504 -3642143 -3675780
7365 -3675780 -3722410 -3640653 -3713916 -3775922 -3750884 -3750912 -3702032 -3694065 -3684108 -3630979 -3694699 -3756051 -3792867 -3771187
7351 -3771187 -3784494 -3736351 -3771077 -3710961 -3715690 -3775238 -3733128 -3753118 -3663655 -3702391 -3688874 -3716919 -3710367
7338 -3710367 -3792137 -3672898 -3606510 -3675164 -3674366 -3736448 -3746070 -3775766 -3624781 -3710339 -3763092 -3759422 -3758112
7325 -3758112 -3669959 -3620248 -3718257 -3706952 -3700725 -3804750 -3796855 -3757497 -3663567 -3509896 -3590290 -3735775 -3707926
7312 -3707926 -3669567 -3735733 -3603429 -3683072 -3638852 -3758915 -3674462 -3653241 -3710452 -3709392 -3692887 -3707580 -3612679
7299 -3612679 -3626126 -3719275 -3582836 -3620800 -3735877 -3684615 -3682004 -3629041 -3572372 -3644462 -3747132 -3702240
7287 -3702240 -3758223 -3703362 -3662315 -3672339 -3679008 -3725188 -3739979 -3750375 -3704994 -3698751 -3720333 -3731648 -3659809
7274 -3659809 -3639467 -3682709 -3580662 -3641925 -3779905 -3708099 -3787068 -3701533 -3738223 -3601874 -3648507 -3673768
7262 -3673768 -3816671 -3711897 -3595171 -3617127 -3702452 -3660676 -3705992 -3687466 -3763645 -3744599 -3731704 -3702535
7250 -3702535 -3774241 -3775623 -3716335 -3658491 -3689803 -3652324 -3665241 -3606535 -3690276 -3733764 -3674066 -3657794 -3669502
7237 -3669502 -3723350 -3782670 -3680724 -3622263 -3710148 -3783789 -3698928 -3715872 -3644225 -3644483 -3667245 -3754756 -3742869
7224 -3742869 -3742433 -3690372 -3690928 -3745756 -3726508 -3723009 -3798027 -3799456 -3788703 -3717483 -3744407 -3773074 -3733024 -3572464
7210 -3572464 -3584766 -3624904 -3668364 -3627346 -3598399 -3727404 -3768511 -3630512 -3733731 -3702942 -3627390 -3629470 -3624054
7197 -3624054 -3652484 -3722619 -3677082 -3636779 -3670903 -3786915 -3756102 -3745633 -3756907 -3800165 -3736659 -3619305
7185 -3619305 -3544642 -3623334 -3691822 -3744081 -3681682 -3628742 -3676095 -3690062 -3721018 -3642128 -3779987 -3707560 -3615688
7172 -3615688 -3708360 -3687962 -3675976 -3785150 -3677637 -3724028 -3731998 -3750656 -3731089 -3776939 -3657510 -3638447 -3630891
7159 -3630891 -3632116 -3693308 -3699303 -3762255 -3703423 -3740923 -3629240 -3706391 -3711529 -3717203 -3682722 -3768415 -3671885
7146 -3671885 -3690763 -3718250 -3763542 -3770848 -3814737 -3761207 -3688277 -3668997 -3704038 -3750280 -3723112 -3599303 -3656076
7133 -3656076 -3757102 -3790663 -3710308 -3654590 -3681222 -3740203 -3833682 -3863857 -3747985 -3625378 -3626282 -3742296
7121 -3742296 -3762032 -3691052 -3797091 -3700237 -3693743 -3654588 -3699802 -3709081 -3681462 -3721737 -3765394 -3796909 -3550842
7108 -3550842 -3567011 -3714233 -3793577 -3717604 -3618757 -3674691 -3710279 -3658568 -3677564 -3682373 -3569613 -3604435 -3639253
7095 -3639253 -3638939 -3760317 -3799827 -3673939 -3627914 -3555699 -3552883 -3622589 -3728519 -3723655 -3724906 -3641256 -3703843
7082 -3703843 -3714090 -3679313 -3708456 -3602166 -3706651 -3707999 -3687388 -3679707 -3726671 -3638085 -3694540 -3648451 -3742903
7069 -3742903 -3755277 -3715191 -3723352 -3814265 -3719162 -3746128 -3701749 -3713253 -3728069 -3687725 -3673965 -3712256 -3660005
7056 -3660005 -3706823 -3700133 -3678525 -3613268 -3652346 -3692986 -3694364 -3700270 -3766577 -3743337 -3740047 -3679248 -3694700 -3782900
7042 -3782900 -3718187 -3600487 -3655251 -3713542 -3618634 -3817754 -3763868 -3728471 -3642281 -3698683 -3711873 -3656872
7030 -3656872 -3589631 -3746013 -3825136 -3763082 -3685268 -3689458 -3697977 -3700351 -3704679 -3693381 -3724417 -3858173 -3867335
7017 -3867335 -3856650 -3647611 -3671876 -3683690 -3644350 -3673168 -3642722 -3702629 -3730807 -3669974 -3658119 -3632273 -3677906
7004 -3677906 -3724266 -3772952 -3584836 -3607127 -3686399 -3664875 -3697897 -3790678 -3694345 -3699954 -3680478 -3719707 -3676649
6991 -3676649 -3779187 -3901145 -4091525 -3638114 -3603849 -3704316 -3645759 -3787720 -3678892 -3625811 -3604266
6980 -3604266 -3584137 -3684982 -3655755 -3573550 -3720264 -3701866 -3742339 -3619592 -3805546 -3585502 -3558817 -3588363
6968 -3588363 -3589931 -3728812 -3536967 -3605038 -3637316 -3609264 -3765326 -3721115 -3722130 -3621342 -3651800 -3673528
6956 -3673528 -3652976 -3806747 -3613544 -3625364 -3677428 -3640279 -3731917 -3792405 -3705281 -3820439 -3706385 -3743165
6944 -3743165 -3849078 -3774532 -3658708 -3687950 -3741740 -3746554 -3721484 -3772890 -3815629 -3740049 -3738618 -3694088 -3655501
6931 -3655501 -3697134 -3825584 -3781313 -3619884 -3642998 -3677291 -3738154 -3693836 -3720125 -3724300 -3710801 -3736083 -3703568
6918 -3703568 -3779202 -3775247 -3689534 -3767492 -3862070 -3818261 -3825062 -3851783 -3803223 -3768666 -3640594 -3683283 -3625575
6905 -3625575 -3715612 -3833504 -3797182 -3853064 -3981641 -3739527 -3490840 -3764115 -3832688 -3896576 -3791809 -3826686
6893 -3826686 -4027398 -3811997 -3901779 -3809415 -3814067 -3818187 -3773306 -3792417 -3758998 -3713198 -3790763 -3706961 -3847788
6880 -3847788 -3795775 -3791092 -3793523 -3707459 -3774485 -3838051 -3766877 -3747554 -3788727 -3717453 -3688124 -3650706 -3768502
6867 -3768502 -3846393 -3780951 -3833284 -3804399 -3775390 -3732506 -3828890 -3760603 -3695588 -3742454 -3728621 -3770284 -3766585
6854 -3766585 -3738262 -3769607 -3743034 -3777302 -3792939 -3767182 -3813042 -3745933 -3748371 -3708904 -3827040 -3697475
6842 -3697475 -3810665 -3806625 -3791815 -3784363 -3768364 -3768090 -3695918 -3746913 -3721419 -3685698 -3766499 -3740504 -3702806
6829 -3702806 -3684210 -3717854 -3720655 -3711650 -3685446 -3803513 -3801119 -3750797 -3836201 -3750167 -3733143 -3689234 -3660513
6816 -3660513 -3685025 -3640916 -3703182 -3700516 -3697598 -3765322 -3647432 -3584036 -3783364 -3879664 -3630020 -3764648
6804 -3764648 -3851630 -3862893 -3859949 -3758018 -3751076 -3760357 -3937456 -3892457 -3848839 -3776088 -3671949 -3723187 -3734613
6791 -3734613 -3716093 -3742307 -3819058 -3760469 -3842928 -3863474 -3856327 -3815803 -3698335 -3599383 -3634276 -3660865 -3782440
6778 -3782440 -3697905 -3730817 -3734825 -3667309 -3692805 -3685516 -3697361 -3853015 -3921610 -3847701 -3769068 -3804850 -3702468
6765 -3702468 -3760563 -3747604 -3748819 -3801416 -3784708 -3750763 -3737492 -3703022 -3653040 -3621997 -3710498 -3631291 -3714011
6752 -3714011 -3793366 -3702577 -3702214 -3658236 -3795141 -3714558 -3741978 -3723330 -3757837 -3754040 -3776951 -3722933 -3781480
6739 -3781480 -3762971 -3669200 -3743509 -3770085 -3746383 -3706843 -3787732 -3778353 -3740098 -3669675 -3647171 -3666483 -3709895
6726 -3709895 -3756753 -3765191 -3783518 -3714361 -3752161 -3760096 -3791166 -3698798 -3679317 -3747863 -3765825 -3697886 -3727073
6713 -3727073 -3785854 -3752036 -3727927 -3733083 -3795303 -3762491 -3742156 -3711789 -3769250 -3752152 -3739330 -3727046 -3829074
6700 -3829074 -3977724 -3772467 -3795732 -3670444 -3768376 -3625170 -3780586 -3672272 -3735303 -3725053 -3798759 -3715745
6688 -3715745 -3743244 -3777277 -3862340 -3767428 -3840946 -3759034 -3807164 -3824833 -3798468 -3760805 -3768900 -3724817 -3672834
6675 -3672834 -3708309 -3742483 -3761405 -3731597 -3682573 -3710115 -3665678 -3687984 -3718358 -3685588 -3751195 -3688471 -3701277
6662 -3701277 -3635558 -3753380 -3841210 -3821810 -3831582 -3731300 -3721508 -3791360 -3833889 -3822624 -3768523 -3790165 -3650238
6649 -3650238 -3715431 -3698111 -3793313 -3800266 -3803684 -3804026 -3769680 -3774313 -3814406 -3783963 -3760337 -3793196 -3705935 -3656878
6635 -3656878 -3697766 -3760036 -3755135 -3729868 -3790143 -3720738 -3765417 -3724234 -3758365 -3834295 -3797811 -3793417 -3783745
6622 -3783745 -3691416 -3659567 -3549592 -3656174 -3634789 -3698443 -3883005 -3663651 -3900368 -3912372 -3874567 -3891733
6610 -3891733 -3858696 -3809121 -3790450 -3846646 -3807995 -3856277 -3818857 -3809784 -3726473 -3682798 -3744831 -3798180 -3809266
6597 -3809266 -3819851 -3817366 -3853484 -3878097 -3719513 -3738017 -3752724 -3790071 -3707165 -3729936 -3748772 -3803743 -3859042
6584 -3859042 -3870299 -3827303 -3825380 -3896536 -3849083 -3852004 -3849825 -3796231 -3745195 -3880467 -3853579 -3960322 -3871112
6571 -3871112 -3887543 -3867976 -3916082 -3864326 -3819638 -3869170 -3907267 -3824146 -3832787 -3941047 -3883723 -3904322 -3993569
6558 -3993569 -4014139 -4138992 -4135285 -4334651 -4807970 -6088615 -3963002 -3097673 -3343709 -3427586 -3558481
6547 -3558481 -3547529 -3509898 -3619763 -3594339 -3773189 -3580748 -3608995 -3583496 -3560307 -3603088 -3648192 -3624776
6535 -3624776 -3633121 -3639058 -3729519 -3696052 -3746861 -3712268 -3743518 -3730323 -3661350 -3613127 -3765726 -3882354 -3773189
6522 -3773189 -3803512 -3911660 -3547140 -3740276 -3746233 -3754927 -3663515 -3692346 -3727657 -3706830 -3835090 -3835758 -3826580
6509 -3826580 -3731733 -3680319 -3720510 -3712660 -3745092 -3675053 -3688540 -3731579 -3725581 -3775237 -3737794 -3701564 -3716104
6496 -3716104 -3743145 -3750981 -3720827 -3812393 -3850629 -3841792 -3823563 -3893289 -3821902 -3778693 -3703269 -3726131 -3787598
6483 -3787598 -3751403 -3759045 -3799887 -3724404 -3735897 -3794505 -3782347 -3749038 -3661018 -3737594 -3783901 -3750349 -3829441
6470 -3829441 -3731708 -3834049 -3767030 -3798079 -3773296 -3772243 -3660650 -3756213 -3781563 -3772943 -3775355 -3779138 -3831662
6457 -3831662 -3732637 -3682593 -3643365 -3710143 -3655985 -3860089 -3599542 -3606443 -4024802 -3997798 -3554267 -3780937
6445 -3780937 -3715173 -3775219 -3699854 -3651471 -3660539 -3717254 -3733809 -3738846 -3721707 -3736202 -3755764 -3673998 -3742116
6432 -3742116 -3744984 -3807169 -3785490 -3718665 -3809496 -3822685 -3777007 -3761807 -3729748 -3757640 -3939552 -3827300 -3753497
6419 -3753497 -3809319 -3783527 -3737088 -3810967 -3790183 -3783853 -3763114 -3750741 -3751575 -3797204 -3708902 -3856085 -3675129
6406 -3675129 -3723514 -3752446 -3754368 -3737067 -3770100 -3755261 -3814039 -3841867 -3847149 -3608748 -3702793 -3746461 -3764831
6393 -3764831 -3827392 -3683794 -3731366 -3717203 -3784004 -3731308 -3792312 -3738667 -3747315 -3727201 -3697341 -3779688 -3661197
6380 -3661197 -3562324 -3638981 -3653162 -3734798 -3835706 -3742849 -3776352 -3761695 -3825049 -3812013 -3783544 -3623570
6368 -3623570 -3788387 -3688077 -3765792 -3798577 -3834798 -3827164 -3778197 -3856293 -3859952 -3827532 -3759076 -3780043 -3772716
6355 -3772716 -3753558 -3697805 -3863411 -3790424 -3819208 -3847837 -3876478 -3827410 -3816018 -3793605 -3839196 -3823772 -3739588
6342 -3739588 -3834297 -3782394 -3807317 -3819551 -3763930 -3838633 -3894199 -3990650 -3944295 -3751912 -3736401 -3846575
6330 -3846575 -3890891 -3817444 -3831813 -3781377 -3816738 -3769801 -3736036 -3797161 -3761475 -3762780 -3763411 -3851332 -3833109
6317 -3833109 -3742206 -3828669 -3828254 -3896842 -3798150 -3755045 -3760731 -3699431 -3642966 -3636570 -3775919 -3784546 -3825885 -3805173
6303 -3805173 -3787262 -3827520 -3726667 -3822130 -3819994 -3833122 -3821292 -3744880 -3765799 -3760122 -3747711 -3740026 -3719926
6290 -3719926 -3862744 -3851114 -3820623 -3828884 -3762761 -3765929 -3803288 -3801750 -3808271 -3788455 -3858637 -3799658 -3843472
6277 -3843472 -3855909 -3888958 -3756787 -3825943 -3772832 -3822929 -3760401 -3752703 -3672969 -3756626 -3829466 -3805997 -3825415
6264 -3825415 -3853048 -3754606 -3794042 -3801326 -3732031 -3700180 -3658202 -3704705 -3662865 -3809717 -3841359 -3773551 -3846683
6251 -3846683 -3780136 -3785867 -3747198 -3699034 -3780707 -3778794 -3835659 -3781331 -3709499 -3703071 -3765140 -3825637 -3724194
6238 -3724194 -3777548 -3794076 -3862548 -3748512 -3796275 -3800835 -3767899 -3842568 -3752925 -3818581 -3809979 -3832210 -3817798
6225 -3817798 -3824019 -3806312 -3809695 -3761172 -3701616 -3860916 -3839054 -3841350 -3761574 -3794753 -3855688 -3714369 -3661377
6212 -3661377 -3645079 -3837461 -3769933 -3774643 -3841272 -3909913 -3808171 -3902023 -3811861 -3818230 -3830134 -3811126 -3830903
6199 -3830903 -3780033 -3764124 -3764126 -3697396 -3754408 -3765083 -3824007 -3790436 -3786410 -3746810 -3747843 -3774882 -3747523 -3704366
6185 -3704366 -3681598 -3756928 -3789865 -3805008 -3705847 -3688519 -3876036 -3800378 -3772034 -3768634 -3794673 -3800352 -3838418
6172 -3838418 -3825847 -3826816 -3786992 -3784406 -3710189 -3788238 -3791498 -3886604 -3893817 -3922393 -3812532 -3918165 -3843289
6159 -3843289 -3757694 -3795976 -3852050 -3754392 -3824100 -3719693 -3644254 -3568923 -3736250 -3761397 -3826399 -3823135 -3892308
6146 -3892308 -3822047 -3790976 -3799394 -3844340 -3785832 -3737225 -3741304 -3759264 -3907868 -3847200 -3848234 -3819681 -3820671 -3818529
6132 -3818529 -3738705 -3859029 -3859140 -3899082 -3867462 -3859362 -3913836 -3921054 -3924128 -3917740 -4036602 -4117035 -4168166 -4194136
6118 -4194136 -4337028 -4791165 -1087992 -2769388 -3201077 -3357163 -3442235 -3522899 -3599754 -3647672 -3683519
6107 -3683519 -3694877 -3637257 -3711581 -3691722 -3661559 -3602261 -3545186 -3575241 -3560220 -3640671 -3745187 -3765717 -3817457
6094 -3817457 -3771908 -3774244 -3739891 -3721761 -3716235 -3660894 -3684494 -3667237 -3691440 -3678204 -3661894 -3687402 -3679404
6081 -3679404 -3701733 -3743096 -3738424 -3820262 -3659609 -3709191 -3689944 -3781760 -3657010 -3633829 -3640948 -3791886 -3807176
6068 -3807176 -3820401 -3834757 -3809277 -3758905 -3804542 -3877841 -3826457 -3716530 -3801566 -3744862 -3767415 -3854873 -3796552
6055 -3796552 -3755334 -3794379 -3831870 -3785705 -3752962 -3905109 -3848374 -3827177 -3783638 -3775804 -3740330 -3779515 -3692698
6042 -3692698 -3773680 -3852785 -3854393 -3782380 -3771770 -3775045 -3790683 -3831054 -3833676 -3875651 -3807175 -3743169 -3628477
6029 -3628477 -3763288 -3874717 -3798041 -3758243 -3808201 -3803220 -3844070 -3779492 -3788918 -3804223 -3751189 -3781698 -3779673
6016 -3779673 -3792105 -3818666 -3777194 -3782108 -3647382 -3793934 -3975519 -3884325 -3787579 -3869919 -3883756 -3833677
6004 -3833677 -3795336 -3728407 -3804543 -3859154 -3866811 -3826074 -3890539 -3769006 -3799496 -3780723 -3809676 -3779150 -3759797
5991 -3759797 -3773749 -3803660 -3790033 -3837665 -3841482 -3796866 -3810026 -3769709 -3764276 -3814814 -3880551 -3901864 -3798820
5978 -3798820 -3749909 -3772931 -3709921 -3801446 -3947371 -3959765 -3816004 -3870704 -3749150 -3790939 -3755529 -3721650
5966 -3721650 -3790363 -3717883 -3735863 -3797664 -3777953 -3813931 -3770799 -3949970 -3775691 -3781377 -3808985 -3648040
5954 -3648040 -3817948 -3960897 -3932196 -3872015 -3992338 -3862299 -3720776 -3621604 -3732741 -3719569 -3734263 -3692171
5942 -3692171 -3725877 -3728244 -3748642 -3628381 -3813285 -3846936 -3727976 -3771185 -3857688 -3869348 -3806550 -3766998 -3768659
5929 -3768659 -3865471 -3791533 -3750777 -3766688 -3798227 -3807130 -3811796 -3764307 -3764768 -3701853 -3779591 -3786497 -3741470 -3779979
5915 -3779979 -3774235 -3826502 -3834947 -3801767 -3707447 -3751018 -3797124 -3734149 -3745548 -3758477 -3763055 -3702000 -3729379
5902 -3729379 -3904355 -3824144 -3759736 -3828934 -3643324 -3795880 -3744488 -3756785 -3760492 -3808542 -3801452 -3753445 -3718695
5889 -3718695 -3802631 -3850869 -3818956 -3776827 -3766144 -3892471 -3790769 -3736242 -3777669 -3824123 -3767631 -3832550
5877 -3832550 -4002435 -3960366 -3821717 -3789201 -3846285 -3846629 -3783976 -3828340 -3719953 -3699027 -3774216 -3815383 -3839775
5864 -3839775 -3868060 -3872851 -3831436 -3882786 -3864518 -3761975 -3752968 -3777558 -3825751 -3816286 -3796837 -3843838 -3889092
5851 -3889092 -3862885 -3870016 -3798030 -3751463 -3756317 -3807508 -3816626 -3849050 -3868316 -3830308 -3758136 -3746015 -3715426
5838 -3715426 -3671805 -3691999 -3758818 -3741928 -3782585 -3832934 -3739045 -3773079 -3855999 -3810489 -3750749 -3750519 -3738518
5825 -3738518 -3671584 -3771978 -3763462 -3787720 -3789423 -3743031 -3766732 -3779252 -3785951 -3826466 -3815787 -3762327 -3949910
5812 -3949910 -3940914 -3837047 -3753472 -3775836 -3767748 -3817872 -3859747 -3833237 -3903042 -3890075 -3849201 -3741297 -3803508
5799 -3803508 -3871989 -3823070 -3823798 -3823829 -3757205 -3786875 -3859650 -3755639 -3765706 -3890495 -3784461 -3796502 -3734359
5786 -3734359 -3726298 -3679935 -4062261 -3884772 -3829248 -3752320 -3749037 -3752761 -3754770 -3799728 -3717862 -3767434 -3700468
5773 -3700468 -3856464 -3809719 -3780255 -3809636 -3789032 -3830829 -3856954 -3823194 -3796733 -3857140 -3760480 -3775556 -3806629
5760 -3806629 -3839727 -3789356 -3844876 -3859116 -3752264 -3738735 -3715631 -3786151 -3891932 -3878055 -3846163 -3890450
5748 -3890450 -3784717 -3884618 -3948505 -3807954 -3824280 -3771520 -3780631 -3815751 -3823416 -3801593 -3782011 -3861963 -3830200
5735 -3830200 -3862721 -3814790 -3848773 -3875136 -3849636 -3778483 -3771476 -3886665 -3780858 -3868369 -3894885 -3803096 -3886594
5722 -3886594 -3937267 -3958152 -3849753 -3859532 -3849457 -3772506 -3802953 -3817898 -3956181 -3890631 -4048253 -4612337
5710 -4612337 -3877656 -3828868 -3859532 -3852787 -3894860 -3779530 -3759182 -3773318 -3835688 -3821259 -3819188 -3851783 -3807302
5697 -3807302 -3777546 -3871199 -3893182 -3844338 -3820881 -3816750 -3862803 -3808914 -3777677 -3793487 -3767886 -3762786 -3769139
5684 -3769139 -3782772 -3772960 -3763611 -3144437 2931447 -3229454 -3716622 -3722809 -3642025 -3760119 -3811486 -3826950
5672 -3826950 -3855488 -3823666 -3778217 -3814880 -3770819 -3806230 -3804146 -3757662 -3779775 -3835364 -3831526 -3860960 -3851966
5659 -3851966 -3954960 -3919926 -3824274 -3822000 -3802053 -3900542 -3909135 -3890151 -3840169 -3879463 -3863071 -3778609 -3823557
5646 -3823557 -3839285 -3801544 -3928096 -3905741 -3808501 -3818589 -3758984 -3804195 -3767339 -3732882 -3795808 -3794259 -3761953
5633 -3761953 -3828572 -3888425 -3795789 -3792483 -3760757 -3760899 -3792125 -3875155 -3765884 -3843617 -3823094 -3805711 -3753051
5620 -3753051 -3878588 -3830232 -3844486 -3846378 -3782505 -3832328 -3937029 -3815852 -3775777 -3833611 -3732416 -3899719
5608 -3899719 -3815677 -3893122 -3763873 -3729339 -3786755 -3708388 -3860829 -3792509 -3743052 -3692771 -3675270 -3729090
5596 -3729090 -3887858 -3863926 -3821480 -3797760 -3816547 -3775468 -3777669 -3756899 -3705852 -3617972 -3627466 -3565032 -3802576
5583 -3802576 -3758215 -3765481 -3742511 -3838196 -3761319 -3764782 -3768352 -3771124 -3830856 -3818955 -3792740 -3782936 -3842896 -3827021
5569 -3827021 -3892979 -3877681 -3822584 -3877754 -3882034 -3904077 -3897560 -3883075 -3853093 -3884315 -3862166 -3950558 -3832034
5556 -3832034 -3850280 -3871856 -3891132 -3907745 -3876887 -3869852 -3946601 -3915369 -3893092 -3841190 -3860026 -3971776 -3918521
5543 -3918521 -3963971 -3969333 -3948898 -3913246 -3873263 -3852176 -3895346 -3952701 -3969675 -3832920 -3802128 -3796473 -3839228
5530 -3839228 -3849235 -3847529 -3858765 -3894031 -3786506 -3734350 -3802704 -3947230 -3893913 -3861857 -3860568 -3827933 -3820831
5517 -3820831 -3803050 -3837157 -3904414 -3880303 -3872954 -3915990 -3826321 -3859368 -3896446 -3894472 -3828293 -3895148 -3879007
5504 -3879007 -3791957 -3785846 -3826150 -3757554 -3804481 -3824379 -3800100 -3860781 -3814108 -3840097 -3905979 -3852870 -3785612
5491 -3785612 -3789817 -3763937 -3902038 -3859544 -3911836 -3980726 -3992632 -3860566 -3922693 -3849464 -3789134 -3767883
5479 -3767883 -3901676 -3876099 -3915508 -4015477 -3871858 -3835046 -3773472 -3744887 -3909340 -3977584 -4002966 -3690728
5467 -3690728 -3924186 -3627313 -3613211 -3520831 -3433270 -2621623 -3832685 -3942275 -3838777 -3948579 -3889898
5456 -3889898 -4025762 -3847852 -3834220 -3908399 -3961075 -3871155 -3841111 -3742383 -3908688 -3775436 -3965280 -3939274
5444 -3939274 -3845416 -3846490 -3956455 -3803495 -3741530 -3751342 -3831380 -3858513 -3861204 -3889383 -3886074 -3796230 -3827982
5431 -3827982 -3933101 -3897255 -3881643 -3704396 -3716237 -3807313 -3942354 -3901869 -3952551 -3945420 -3911861 -3890811
5419 -3890811 -3866237 -3971496 -3902981 -3854620 -3909687 -3930608 -3899704 -3829087 -3792644 -3820342 -3808832 -3875763 -3872076
5406 -3872076 -3894262 -3870519 -3880211 -3875953 -3813752 -3849167 -3809341 -3831029 -3947361 -3871022 -3865173 -3879449 -3910978
5393 -3910978 -3839847 -3783490 -3733667 -3809166 -3984634 -3921073 -3897231 -3808551 -3862606 -3878929 -4003572 -3951147
5381 -3951147 -3870602 -3777143 -3775561 -3847754 -3955091 -4009417 -3943149 -3823074 -3873455 -3941996 -3976265 -3856454
5369 -3856454 -3824347 -3846619 -3803677 -3821397 -3901701 -3893827 -3863727 -3742721 -3817472 -3825431 -3831676 -3973591 -3807021
5356 -3807021 -3873666 -3914536 -3908361 -3937486 -3881546 -3882628 -3973272 -3988318 -3962852 -3906937 -3876766 -3866425 -3839822
5343 -3839822 -3940226 -3783153 -3803501 -3862262 -3821223 -3819166 -3828042 -3813261 -3894391 -3835576 -3844394 -3857115 -3844460
5330 -3844460 -3824923 -3852382 -3931123 -3988194 -3929302 -3951035 -3841298 -3922848 -3958244 -3905684 -3986348 -3992464 -3854651
5317 -3854651 -3843847 -3874958 -3736448 -3902235 -3897851 -3842327 -3870424 -3871991 -3873110 -3930989 -3856468 -3950014 -4104628
5304 -4104628 -3981710 -3940304 -3915140 -3776703 -3861840 -3820253 -3915690 -3950720 -3921865 -3812539 -3879425 -3852014
5292 -3852014 -3874947 -3808082 -3896672 -3908439 -3888812 -3820949 -3830121 -3934412 -3911629 -3974690 -3897444 -3902390 -3916452
5279 -3916452 -3832249 -3887066 -3861668 -3942231 -3939734 -3871424 -3904071 -3951209 -3868614 -3892967 -3901498 -3901030 -3917041 -3900277
5265 -3900277 -3927214 -3900719 -3900309 -3948673 -3898513 -3894221 -4070638 -4001023 -3935689 -4009476 -4008403 -4042348 -4018337
5252 -4018337 -3912550 -3981838 -4001153 -4221240 -4182444 -4273708 -4471522 -5278026 -10433043 -3578568 -3368072
5241 -3368072 -3585406 -3596827 -3696881 -3744081 -3691250 -3681019 -3768462 -3915402 -3863080 -3918126 -3874654 -3785369
5229 -3785369 -4024832 -3895082 -3793844 -3739723 -3793080 -3827337 -3785693 -3866312 -3841749 -3799903 -3712188 -3914418
5217 -3914418 -3861520 -4007410 -3941480 -3974260 -3441365 -3575516 -3665315 -3765419 -3682477 -3747636 -3788099 -3784658 -3785215
5204 -3785215 -3807842 -3745863 -3729441 -3711972 -3837427 -3752469 -3757549 -3868496 -3859862 -3900470 -3729496 -3788198 -3798714
5191 -3798714 -3774541 -3816314 -3863798 -3819848 -3822958 -3873387 -3873325 -3758925 -3825994 -3767474 -3779408 -3828842 -3778073
5178 -3778073 -3762032 -3885424 -3872725 -3802242 -3826678 -3827348 -3866650 -3846895 -3694668 -3768110 -3723985 -3770453 -3810303
5165 -3810303 -3770423 -3774925 -3793174 -3802058 -3782093 -3747473 -3739683 -3859940 -3866303 -3830244 -3771136 -3833879 -3747516
5152 -3747516 -3797324 -3733032 -3797108 -3764593 -3681531 -3704422 -3710295 -3729898 -3720176 -3807738 -3793119 -3964136 -4014683
5139 -4014683 -3924987 -3967904 -3977937 -4005021 -3938470 -3960966 -3842860 -3775489 -3889020 -3831108 -3855922 -3925521
5127 -3925521 -3828021 -3850133 -3871247 -3991560 -3891503 -3848373 -3916371 -3860603 -3830279 -3879068 -3926335 -3879485
5115 -3879485 -3925193 -3885068 -3902555 -3970248 -3971569 -4000188 -3862767 -3896294 -3892348 -3895500 -3873692 -3873722 -3832642 -3882560
5101 -3882560 -3900533 -3876113 -4004455 -3932390 -3872472 -3913698 -3920254 -4006489 -3966118 -3890723 -3944883 -4009593 -3938969
5088 -3938969 -3975540 -3847624 -3930450 -3959250 -3900717 -3950526 -3946452 -3960523 -3994075 -3871793 -3893473 -3903942 -3813030
5075 -3813030 -3896564 -3865022 -3982934 -3938061 -3874321 -3949534 -3907245 -3888824 -3902587 -3899743 -3816922 -3832259 -3980898
5062 -3980898 -3934940 -3931073 -3919191 -3892351 -3908401 -4003795 -3878063 -3861531 -3902512 -3902265 -3917704 -3941009 -3990015
5049 -3990015 -3977938 -3985489 -4136590 -3865708 -3841779 -3863820 -3862390 -3893994 -3794220 -3845218 -3990167 -4024668
5037 -4024668 -3917817 -3814842 -3902177 -3845733 -3837866 -3828097 -3857412 -3917815 -3942423 -4012875 -3857922 -3991886
5025 -3991886 -3892861 -3933009 -3869958 -3756929 -3859121 -3907678 -3924588 -3867047 -3876735 -3894979 -3850562 -3910120
5013 -3910120 -3791022 -3876405 -3981518 -3870888 -3887961 -3847090 -3899408 -3887414 -3940911 -3842570 -3829180 -3767072
5001 -3767072 -3851795 -3872699 -3880374 -3883002 -3849122 -3815787 -3843932 -3838188 -3783705 -3811909 -3824364 -3845728 -3791466
4988 -3791466 -3825179 -3830313 -3865122 -4074363 -3938152 -3796435 -3831765 -3960991 -3924811 -4047288 -3808420 -3872901
4976 -3872901 -3918846 -4240350 -4416699 -3647931 -3823324 -4044217 -3960810 -4029855 -3929439 -3953384 -3904822
4965 -3904822 -3722492 -3823939 -3868630 -3875788 -3910324 -3940311 -3948302 -3908555 -3927810 -3918075 -3904810 -3959395 -3987669
4952 -3987669 -3928441 -3820099 -3834488 -3880550 -3808716 -3900566 -3786317 -3773032 -3848502 -3844052 -3811391 -3817839 -3893993
4939 -3893993 -3792288 -3856205 -3928810 -3929505 -3868213 -3890832 -3909493 -3919877 -3811931 -3939588 -3975759 -3914216 -3938986
4926 -3938986 -3809926 -3855628 -3853398 -3821682 -3899733 -3914870 -3942531 -3983591 -3843203 -3778305 -3804093 -3968378
4914 -3968378 -4035625 -4169934 -3825779 -3822267 -3925446 -4022003 -3937766 -3915676 -3961601 -3982715 -3976986 -4018927 -4078040
4901 -4078040 -3994792 -3996976 -3979733 -3982991 -3918222 -3956904 -3947907 -3879420 -3932814 -3927201 -3962930 -3924781 -3866412 -3814318
4887 -3814318 -3794117 -3883129 -3857627 -3859000 -3819155 -3912249 -3932899 -3831037 -3896877 -3854028 -3818284 -3893853 -3919304
4874 -3919304 -3897157 -4019587 -3986265 -3989695 -3922675 -3804269 -3878803 -3913912 -3924886 -3969289 -3896372 -3908381
4862 -3908381 -3806063 -3882693 -3957177 -3871332 -3880579 -3833870 -3869788 -3854161 -3891278 -3913126 -4005644 -3973710 -4022472
4849 -4022472 -3946921 -3948557 -3867224 -3772168 -3822855 -3820687 -3812984 -3838042 -3968147 -3921033 -3795817 -3969236 -4011586
4836 -4011586 -3910788 -3915351 -3867881 -3829007 -3745177 -3844722 -3783906 -3848797 -3792199 -3794300 -3850640 -3906486 -3870601
4823 -3870601 -3867367 -3872251 -3843428 -3883782 -3772715 -3785299 -3769545 -3897106 -3857487 -3868747 -3786646 -3699427 -3783991
4810 -3783991 -3750162 -3837542 -5930191 -5279929 -4586119 -4285855 -4235071 -4098344 -4124517 -4016170 -3979904
4799 -3979904 -3993433 -3964818 -3946193 -4012348 -4013164 -3997707 -3973422 -4027337 -3975978 -3924524 -3978399 -3923119 -3955609
4786 -3955609 -3854206 -3892602 -3922632 -3949630 -3947398 -3926554 -3821811 -3933704 -3865705 -3857873 -3920094 -3952592 -3889839
4773 -3889839 -3887438 -3819821 -3944246 -3841492 -3860532 -3891874 -3869797 -3874549 -3839506 -3838142 -3922095 -3948133 -3944983
4760 -3944983 -3922484 -3954512 -3896667 -3766253 -3797860 -3846993 -3811219 -3790051 -3846434 -3969371 -3936395 -3901901
4748 -3901901 -3884899 -3875550 -3820126 -3843152 -3974246 -4043175 -4022082 -3958152 -4002119 -4004203 -3975020 -3951979 -3945253
4735 -3945253 -3917414 -3873537 -3843221 -3910121 -3890144 -3930138 -3946152 -3807789 -3923397 -3915614 -3920893 -3937039 -3997026
4722 -3997026 -3907544 -3899878 -3947289 -3858461 -3869219 -3930129 -3873288 -3886062 -3840140 -3855399 -3890227 -3906247 -3885503
4709 -3885503 -3881207 -3998614 -3915988 -3869617 -3845645 -3824065 -3806115 -3845716 -3936543 -4021278 -3952936 -4015320 -3952792
4696 -3952792 -3936607 -3936958 -3927381 -3909545 -3926295 -3844602 -3939221 -3953675 -4048192 -3982798 -3923520 -3987977 -3967191
4683 -3967191 -3977447 -3885779 -3835679 -3875960 -3934805 -3911133 -3883221 -3927272 -3906994 -3937188 -3961802 -3931098 -4007789
4670 -4007789 -4008093 -3939581 -3899313 -3822245 -3874774 -3911544 -3922271 -3921161 -3917982 -3866600 -3866931 -3896301 -4015286 -3940033
4656 -3940033 -3932233 -3907925 -3851497 -3905287 -4002188 -3999309 -3831272 -3804075 -3884589 -3981217 -3934589 -3936866 -3848945
4643 -3848945 -3882601 -3906272 -3823571 -3865446 -3869584 -3880531 -3854388 -3995156 -3825646 -3871170 -3943149 -3920460 -3896122
4630 -3896122 -3972069 -3964974 -3959753 -3932980 -3872967 -3968579 -3886593 -3863871 -3893291 -3954965 -3923731 -3897675 -3900048
4617 -3900048 -3921566 -3889053 -3900684 -3920125 -3935698 -3929435 -3997970 -4008717 -3959377 -3809745 -3900455 -3870570 -3890119
4604 -3890119 -3914730 -3883252 -3980932 -3917460 -3965444 -3925577 -3903297 -3985243 -3890375 -3906307 -3798398 -3760665 -3788086
4591 -3788086 -3841814 -3800247 -4016075 -3919730 -3895351 -3934507 -3968471 -4000170 -3897613 -3891372 -3871443 -3922109 -3962808
4578 -3962808 -3943143 -3922201 -3981986 -3980256 -3957702 -3937319 -3880618 -3874431 -3787420 -3904518 -3985032 -4010550 -3837597
4565 -3837597 -3937962 -3879573 -3870314 -3893856 -3898722 -3937512 -3910698 -3923630 -3888611 -3877312 -3905781 -3894939 -3871811
4552 -3871811 -3893166 -3857595 -3942599 -3878413 -3926090 -3912604 -3961947 -4010650 -3860642 -3817972 -3861232 -3897497 -3879140
4539 -3879140 -3959180 -3919401 -4009135 -3924481 -3869032 -3844031 -3879290 -3870595 -3956955 -3913649 -3989063 -3928024 -3883613
4526 -3883613 -3884992 -3908543 -3899277 -3887992 -3898996 -3972193 -3908983 -3899588 -3926993 -3980729 -3918031 -3879774 -3848084
4513 -3848084 -3903031 -3936133 -3848604 -3823297 -3859868 -3964822 -3798801 -3897452 -3960101 -3897988 -3831706 -4059535
4501 -4059535 -3956407 -3975045 -3880251 -3866006 -3879795 -3903257 -3874319 -3887967 -3971126 -3923893 -3916465 -3872154 -3877727
4488 -3877727 -3869900 -3912422 -3914464 -3858364 -3844837 -3844293 -3796299 -3808687 -3920226 -3892802 -3807811 -3744954 -3966233
4475 -3966233 -3877544 -4150188 -4144295 -4032471 -3986699 -3854210 -3857624 -3788136 -3886313 -3848057 -3813909 -3756439 -3854199
4462 -3854199 -3908348 -3907855 -3895305 -3832734 -3872221 -3901498 -3916724 -3900849 -3988637 -3954492 -3953952 -3917832 -3877776 -3906735
4448 -3906735 -3889948 -3953908 -3885009 -3821040 -3874588 -3910333 -3910331 -3891330 -3897089 -3883250 -3886835 -3848043 -3724008 -3904207
4434 -3904207 -3812388 -3827198 -3846195 -3849781 -3879882 -3859108 -3943117 -3863317 -3863199 -3842970 -3866332 -3925823 -3844453
4421 -3844453 -3922428 -3919069 -3924100 -3985865 -4005165 -3964727 -3921397 -3866901 -3902039 -4025447 -4010455 -3916519 -3896026
4408 -3896026 -3908080 -3969681 -4007621 -4164634 -4023255 -3622652 -3833209 -3841309 -3830048 -3878344 -3830787 -3829671
4396 -3829671 -3937979 -3936178 -3812065 -3874277 -3972043 -3967787 -3854962 -3872479 -3902627 -3754198 -3793078 -3956594 -3956641
4383 -3956641 -3969814 -3959999 -3752313 -3851967 -3740076 -3744272 -3765960 -3735238 -3685432 -3590842 -3390056 -2964827
4371 -2964827 -5195611 -4670262 -4364920 -4121304 -4144746 -4060904 -4142900 -4043785 -3901768 -3984168 -4074447 -4112892
4359 -4112892 -3990494 -3979927 -4047221 -4054789 -4001426 -4021947 -4058701 -4051922 -3993649 -3961498 -3814848 -3925838 -3985894
4346 -3985894 -4010547 -3979504 -3980344 -3927179 -3977582 -3952148 -3904903 -3920798 -3973571 -4059023 -4013174 -3887667 -3996736
4333 -3996736 -3939989 -3947511 -3785949 -3907708 -4003006 -3828183 -3962627 -3935502 -3882770 -3875934 -3895017 -3859161 -3857793
4320 -3857793 -3901004 -3879443 -3848760 -3895734 -3926316 -3888552 -3901440 -3976143 -3844722 -3897737 -3989611 -3970134 -3975622
4307 -3975622 -3991722 -4031040 -4002797 -4008823 -4021203 -3973896 -3990980 -4024442 -4052925 -3902355 -3875476 -3905800 -3795634
4294 -3795634 -3861745 -3999607 -4018558 -3967011 -4014573 -3976575 -3984428 -3875299 -3965122 -3775019 -3761743 -3869040
4282 -3869040 -3893961 -3917120 -3869358 -3827270 -3787613 -3815337 -4071814 -4106193 -4078804 -4003783 -3880809 -4004819
4270 -4004819 -3919440 -3893326 -3882181 -3972977 -3855096 -3890739 -3960786 -3941030 -3922667 -3943922 -3978275 -3919362 -3847230
4257 -3847230 -3883130 -3874614 -3926955 -3961200 -3962735 -3949903 -3869606 -3916853 -3941616 -4030656 -4129712 -4089600 -3984967
4244 -3984967 -3986322 -3959945 -3901695 -3982510 -4097370 -3960954 -4015819 -4042042 -4154442 -4185215 -3944053 -4001479
4232 -4001479 -4037733 -4052595 -4066336 -4199647 -4101943 -4131745 -3673058 -3896961 -3800615 -4014276 -4073669 -3957448
4220 -3957448 -3933617 -4011085 -4034244 -3950789 -3993412 -4022113 -3983265 -3992059 -3989053 -3988821 -3895450 -3961934 -3915523 -3852304
4206 -3852304 -3941165 -3926222 -3913047 -3908359 -3898682 -3899654 -3935031 -3894600 -3935614 -3889868 -3882721 -3912236 -3948823 -3948933
4192 -3948933 -3967135 -4065164 -3925862 -3888991 -3865617 -3901939 -3882086 -4009777 -3971791 -3874867 -3951558 -4002029
4180 -4002029 -4090032 -3964712 -3923817 -3974463 -3951063 -4013533 -3984893 -3959059 -3976707 -3968721 -3942537 -3963952 -3984598
4167 -3984598 -3995566 -3915717 -3964845 -3931125 -3998545 -3976123 -3972089 -3975665 -3935851 -3930677 -3981769 -3933487 -3886642
4154 -3886642 -3871007 -4026799 -3889854 -3921360 -3983857 -3985430 -3929031 -3946594 -3847520 -3941005 -3971889 -3923137 -3998564
4141 -3998564 -3930083 -3845870 -3903349 -3936983 -3856362 -3811965 -3839087 -3897669 -3928425 -3893972 -3876448 -3879409 -4014442
4128 -4014442 -3960161 -3964936 -4002350 -4029802 -4035070 -4026436 -4023797 -3912769 -3958935 -3885937 -3842381 -3989947 -3945126
4115 -3945126 -3973712 -4058355 -4029593 -4011836 -4035383 -3973335 -3979864 -3927168 -3943363 -3949616 -3912539 -3808678 -3863865
4102 -3863865 -3996907 -3899214 -3886693 -3901468 -3912645 -3945774 -3986761 -3902925 -3953555 -3962361 -4004049 -3926816 -4006996
4089 -4006996 -3955513 -3970189 -4010205 -4002356 -3980222 -4047991 -4004006 -3914856 -3961416 -3956983 -3952727 -3969412 -3904126
4076 -3904126 -3851448 -3875486 -3971478 -3948282 -3875419 -3967480 -4016627 -3964252 -3983393 -3875826 -4016701 -3909787
4064 -3909787 -3981538 -3983510 -3952653 -3956421 -4028378 -3962203 -3985598 -4094630 -4004671 -3902740 -3970779 -4049668 -3926730
4051 -3926730 -3954552 -3844970 -3969138 -3973625 -3957051 -4036203 -4027286 -4033377 -3968238 -3982169 -4067834 -4010647 -3983173
4038 -3983173 -3859410 -3899443 -4006478 -4034580 -4061399 -3971758 -3925941 -4025121 -3930000 -4045654 -3978582 -3855371
4026 -3855371 -3881285 -3851262 -3985206 -3902047 -3968446 -4109178 -4104661 -4065772 -4162904 -3940016 -3974947 -3867310
4014 -3867310 -4101046 -4035068 -3977460 -4050406 -3943934 -4021187 -3839771 -3960364 -3906495 -3858338 -3892288 -3857734
4002 -3857734 -3969068 -3884437 -3995538 -3866930 -3857592 -3873317 -3909275 -3938401 -4005136 -3939304 -3889074 -3951444
3990 -3951444 -3884852 -3867660 -3931454 -3884819 -3781676 -3883563 -3829195 -3931327 -3894053 -3945209 -3897265 -3889316
3978 -3889316 -3856002 -3762006 -3940246 -3937853 -3871154 -3947775 -3976230 -3988709 -3974630 -3946883 -3933497 -3960224 -3859073
3965 -3859073 -3917321 -3879590 -3893620 -3929567 -3823796 -3869076 -3843511 -3936580 -3886991 -3929280 -3884701 -3878327 -3917646
3952 -3917646 -3841672 -3849365 -3922633 -3972187 -3853374 -3931242 -3864152 -3865231 -3882619 -3943591 -3960743 -4055066 -3975603
3939 -3975603 -4022482 -3969623 -4121329 -4484111 -3713364 -3756742 -3803579 -3792475 -3799570 -3821823 -3828401 -3752077
3927 -3752077 -3867633 -3865031 -3931579 -3888491 -3948385 -3859757 -3888500 -3944614 -3930866 -3953685 -3824938 -3806737 -3852966
3914 -3852966 -3828458 -3910080 -3871137 -3758021 -3830144 -3814426 -3669764 -3955376 -3900811 -3932443 -3833831 -3823090
3902 -3823090 -3831437 -3836326 -3831415 -3880508 -3887030 -3873243 -3930640 -3788166 -3875172 -3895801 -3816561 -3859829 -3701892
3889 -3701892 -3723956 -3893987 -3845951 -3913935 -3915430 -3965353 -3944600 -3915174 -3920151 -3883183 -3907813 -3885960 -3945102
3876 -3945102 -3917214 -3832562 -3976928 -3834608 -3798886 -3844619 -3796152 -3814418 -3771714 -3789891 -3826454 -3751142
3864 -3751142 -3820647 -3846670 -3773381 -3826961 -3893043 -3813518 -3855957 -3869658 -3888425 -3848115 -3935924 -3861671 -3868506
3851 -3868506 -3835232 -3899029 -3875335 -3885872 -3879871 -3923168 -3952305 -3878039 -3890556 -4016535 -3921274 -3938477 -3955514
3838 -3955514 -3969982 -3895808 -3943649 -4071646 -4078651 -3995334 -3901971 -3908553 -3844655 -3909508 -3921598 -3921289 -4001237
3825 -4001237 -4028034 -3986065 -3976553 -3827696 -3802385 -3787197 -3873543 -3898050 -3977780 -3860137 -3666423 -3814079
3813 -3814079 -3805182 -3865425 -3867807 -3899847 -3829111 -3830676 -3995775 -3939393 -3920348 -3889619 -3928842 -3996021 -3963387
3800 -3963387 -3921832 -3751642 -3958518 -4099194 -4039620 -4032520 -3971955 -3976120 -3990449 -3902665 -3888532 -3979397 -3964043
3787 -3964043 -4027527 -3948343 -3956113 -3938909 -3893104 -4092581 -4025903 -3952944 -3946621 -3892026 -3886640 -3912468 -3891443
3774 -3891443 -3936557 -4089717 -4010053 -3979666 -4018510 -3989467 -3968196 -4042729 -4088697 -4068533 -4081723 -3936034
3762 -3936034 -3922433 -4011128 -3944619 -3989199 -3960319 -3919411 -3951331 -4049593 -4062711 -4037307 -4043501 -4053165 -4036256
3749 -4036256 -4008167 -4074621 -4062423 -4042923 -4017214 -4008091 -4140083 -4110093 -4082963 -3990448 -3877782 -4027083
3737 -4027083 -3792946 -3807340 -4021496 -4028973 -3977634 -3971724 -3989389 -3941977 -3964307 -3880402 -3938445 -3938435 -3843985 -3849658
3723 -3849658 -3938452 -3916332 -3939533 -3928564 -3922970 -4047604 -3979180 -3988955 -4052994 -4106829 -3907966 -3948906 -3940179
3710 -3940179 -4059481 -3960908 -4016056 -3996893 -3909951 -4051698 -3962829 -3953823 -3961308 -3959030 -3948344 -3955007 -3915393
3697 -3915393 -3953951 -3865646 -3942205 -4074053 -3966561 -3927955 -3913859 -4026312 -3993110 -4018367 -4060798 -4121359
3685 -4121359 -4049691 -4058266 -3982339 -4073197 -4023749 -4068512 -4018361 -4016782 -4020277 -4034859 -4045850 -4086798 -4088062 -4075655
3671 -4075655 -3995896 -4067464 -4058737 -3965215 -4038886 -4049332 -4025626 -4085982 -4115467 -4020993 -3995623 -4084023 -4015418
3658 -4015418 -3965537 -3952724 -4024341 -4029977 -3951650 -3956808 -4006252 -3995904 -4058700 -4032383 -4069647 -4009811 -3967804
3645 -3967804 -3980397 -3980711 -3987910 -3989119 -3972901 -3970693 -3913327 -3919930 -3986005 -4062521 -4091056 -4046706 -4028579 -4027294
3631 -4027294 -4068605 -4027455 -4050787 -4049102 -4090975 -3940250 -4076424 -4050365 -4086771 -4119815 -4068468 -4113044 -4047895
3618 -4047895 -4065508 -4033979 -4011859 -4000225 -4092455 -4047352 -4007469 -3961165 -3992205 -3939722 -4100636 -3959318
3606 -3959318 -3939315 -3986024 -4174762 -4004245 -3997661 -3913638 -3909430 -4019377 -3993250 -3960766 -4016759 -4032899 -4012203
3593 -4012203 -4039167 -4112820 -4116314 -4121765 -4021874 -4100068 -4080652 -4103663 -4013969 -4027361 -3952402 -3985526 -3970097
3580 -3970097 -4085718 -4077232 -4043212 -3966160 -4006422 -4017329 -4052578 -4025938 -4037022 -4017560 -3979473 -4055341 -3958487
3567 -3958487 -4001942 -4007218 -3979141 -4075725 -4096894 -3976310 -3990974 -3893100 -3901080 -3981782 -4024130 -3966330 -3918315
3554 -3918315 -3976666 -3971406 -3984040 -3984355 -3879612 -3937701 -3971166 -3982255 -3980154 -4007916 -3918841 -3962739 -3980003
3541 -3980003 -3899500 -3907520 -4044185 -3932036 -3895590 -3923946 -4040569 -4026554 -4094024 -3996455 -4003345 -4023370 -4073790
3528 -4073790 -4095528 -4034522 -3946800 -4003534 -3971544 -3923268 -4003117 -3964750 -4039143 -3997652 -4022293 -4041598 -3955662
3515 -3955662 -3971547 -3921467 -3899736 -3902764 -3910552 -3918783 -3917077 -3928866 -3850527 -3865492 -4020334 -4018523 -4054305 -3986355
3501 -3986355 -3934749 -3814529 -3921346 -3999213 -3969848 -4106756 -4126718 -3946605 -4065563 -3983109 -3954644 -3998734
3489 -3998734 -3929332 -3953226 -3962915 -3988388 -3941675 -3949747 -3962588 -3858653 -3832200 -3868604 -3947334 -3942975 -3937639 -3937175
3475 -3937175 -3905455 -3917606 -3867385 -3844338 -3824383 -3868036 -3784065 -3736298 -3742340 -3876915 -3953453 -3799984 -3841461
3462 -3841461 -3892835 -3949338 -3904857 -3933720 -3905929 -3877967 -3884914 -3886761 -3847273 -3937734 -3894665 -3921644 -3959685
3449 -3959685 -3912677 -3977795 -3949306 -3886746 -4049078 -3940751 -3942586 -3897233 -3921123 -3906812 -4008527 -3916941
3437 -3916941 -3935698 -3953577 -3941565 -3927967 -4007184 -3963011 -3894423 -3923751 -3976615 -3922784 -3962120 -3969657 -3947315
3424 -3947315 -4073499 -4046912 -3885453 -4013638 -4136154 -4123725 -4002939 -3997013 -4123783 -4016437 -3946803 -3991622
3412 -3991622 -3974065 -4048638 -3988783 -3982311 -4102874 -3999821 -4004495 -3906339 -3929788 -3921477 -3919353 -3888846 -3961935
3399 -3961935 -3889902 -3816162 -3828756 -3872324 -3849983 -3916954 -3822684 -3860679 -3954846 -3945251 -3977929 -4038059 -4008510
3386 -4008510 -4045371 -4084059 -4138139 -4055405 -4119419 -4230201 -4130622 -4115150 -3964455 -4070400 -4109886 -4215963
3374 -4215963 -4070865 -3974487 -4166548 -4161861 -3985925 -3982642 -4082496 -4030529 -4099632 -4056384 -4057639 -4093550 -4054273
3361 -4054273 -4190593 -4151315 -4074598 -4103238 -4118992 -4110490 -4094269 -4128076 -4099218 -4189236 -4167690 -4065198 -4113565
3348 -4113565 -4160237 -4248219 -4228204 -4131937 -4219569 -4119901 -4062675 -4035443 -3998388 -4050578 -4034818 -3912675 -3917769
3335 -3917769 -3941827 -3906832 -3799909 -3895221 -3959509 -4000331 -3873299 -3819715 -3805591 -4041669 -4002721 -4004742
3323 -4004742 -3993701 -4049703 -4128911 -4068941 -4140760 -4207706 -4250520 -4248661 -4268342 -4299625 -4302707 -4269287 -4189938
3310 -4189938 -4236083 -4215342 -4191761 -4211369 -4211268 -4181819 -4210712 -4129553 -4116358 -4119330 -4197984 -4172316 -4079711
3297 -4079711 -4182632 -4255605 -4309298 -4295660 -4275045 -4196823 -4371877 -4405635 -4388221 -4354441 -4094678 -4273543
3285 -4273543 -4201909 -4089266 -4247662 -4283611 -4161312 -4256482 -4281665 -4286138 -4191974 -4305609 -4225531 -4170720
3273 -4170720 -4246564 -4262113 -4244589 -4262408 -4192360 -4227827 -4338029 -4317821 -4310350 -4245858 -4157460 -4135813 -4081103
3260 -4081103 -4001497 -3822172 -3775429 -3682682 -3605110 -3528940 -3397848 -3409711 -3304203 -3295875 -3181016 -3079595
3248 -3079595 -3011046 -3045778 -2940941 -2941913 -2938152 -2900108 -2892371 -2875203 -2947061 -2984154 -2975000 -3073696 -3308899
3235 -3308899 -3193749 -3225545 -3263374 -3347942 -3263795 -3182626 -3321909 -3358178 -3329521 -3200060 -3183219 -3133443
3223 -3133443 -3089436 -3029197 -2973900 -2959643 -2782968 -2517893 -2645248 -2548119 -2511469 -2408299 -2420981 -2416666
3211 -2416666 -2369957 -2362804 -2353523 -2278132 -2221797 -2204811 -2218355 -2258336 -2272026 -2173707 -2121094 -2078439 -2222979
3198 -2222979 -2414622 -2536371 -2685769 -2776341 -2732389 -2743345 -2800765 -2798082 -2758064 -2793159 -2916504 -2904923
3186 -2904923 -2979295 -2990981 -2884617 -2709522 -2567852 -2470558 -2414913 -2355895 -2297285 -2083616 -1996541 -1829962
3174 -1829962 -1717738 -1663041 -1554888 -1238025 -1071818 -870108 -743511 -692853 -395934 -269885 -141575
3163 -141575 5396 228724 435481 663158 889996 1105822 1262183 1512316 1809934 1926996 2037556
3152 2037556 2137083 2149707 2176550 2132699 2304702 2529439 2854069 2909720 3410479 3786865 3898694
3141 3898694 4082453 4734550 5651983 6593898 7384486 7762744 8192900 8433599 8628673 9073955 9669709
3130 9669709 10356034 10914661 11592351 12293996 12942753 13704996 14287401 15006094 15581629 16179004 16680699
3119 16680699 17183240 17282262 17542274 17860639 18082737 18457145 18957527 19140935 19481891 19632347 19761168
3108 19761168 20071566 20261851 20718150 21111354 21731396 22325156 22916877 23471008 24062248 24649115
3098 24649115 25141474 25504797 26200695 26782196 27632066 28588092 29742517 30995692 32329109 33302434
3088 33302434 33797516 34592262 35414046 36367839 37340888 38008122 39352930 40567929 41326176 42011423
3078 42011423 43042542 44339682 45771550 47007801 48150626 48854451 49516438 50236540 50910062
3069 50910062 52125020 53415567 55086946 56575441 57932408 58947341 60128266 61437187 62770443
3060 62770443 64730898 68023724 70821963 72482928 73176457 72348809 70114067 67609120 66642612
3051 66642612 66759702 67103897 67141947 67141431 67464423 68786159 71172682 74194290 77934877 82195255
3041 82195255 87386198 93330558 98970216 105072605 111735196 119335712 130066136 142671058
3033 142671058 155475521 168813157 178831260 185061847 187437494 186933643 185044355 181444591
3025 181444591 176331813 170823436 165416639 161977558 160189473 158564507 152900563 141232020
3017 141232020 127676589 112700229 96218905 78692611 63272894 51687352 42175047 33428923
3009 33428923 25872390 19624222 15283565 12146489 9474236 6993135 4939306 3749258 2341317
3000 2341317 1414323 178413 -790970 -1383294 -1852795 -2325311 -2614931 -3021541 -3654697 -3864360
2990 -3864360 -3636029 -3607651 -3828639 -4469246 -4941361 -5367827 -5794050 -6268469 -6533402 -6753793 -6744005
2979 -6744005 -6523205 -6367066 -6005739 -5716607 -5460163 -5233272 -5028782 -4978421 -4821105 -4230907 -3414943
2968 -3414943 -2539884 -1388668 -399489 183904 344743 530097 487915 473237 851833 1504413 1949908
2957 1949908 1456003 717509 442010 -265030 -1601188 -2422876 -2053529 -1939827 -2315532 -2837825
2947 -2837825 -3215326 -3227323 -3314928 -3584796 -3987838 -4156953 -4252905 -4175700 -4225255 -4478885 -4804464
2936 -4804464 -4936617 -5068958 -5266840 -5403031 -5486105 -5463643 -5450631 -5255021 -5189011 -4909428 -4799835
2925 -4799835 -4572451 -4433944 -3876848 -3906128 -3873281 -3756251 -3704313 -3686993 -3834844 -3814634 -3810768 -3726095
2913 -3726095 -3645867 -3604976 -3510198 -3590955 -3657092 -3613484 -3702826 -3785274 -4034823 -4135292 -4164937 -4176735
2901 -4176735 -4075026 -3962950 -4037443 -4112967 -4102038 -4143469 -4128476 -4199264 -4223683 -4390041 -4424989 -4517657
2889 -4517657 -4419430 -4528553 -4541159 -4519368 -4513186 -4497601 -4680448 -4617989 -4612235 -4729195 -4676320 -4641698 -4648290
2876 -4648290 -4471875 -4424053 -4242576 -4188291 -4114300 -4036812 -4081370 -4003733 -3988786 -4036164 -4106095 -3981660
2864 -3981660 -3986053 -4006839 -3986753 -4098927 -4229815 -4190194 -4286225 -4336458 -4376603 -4331883 -4390478 -4480520
2852 -4480520 -4618832 -4547533 -4602795 -4569002 -4580342 -4621587 -4594700 -4359355 -4500719 -4468637 -4384894 -4364947
2840 -4364947 -4410830 -4361158 -4261572 -4201448 -4246357 -4216464 -4093062 -4000195 -4029379 -3922343 -3959746 -3978370 -3982318
2827 -3982318 -4071238 -4041011 -4040161 -3966124 -3959523 -4011078 -4068582 -4001905 -4098951 -4240440 -4204474 -4220239 -4249040
2814 -4249040 -4232489 -4406157 -4394894 -4308651 -4309634 -4306847 -4272345 -4227513 -4079776 -4017576 -4043965 -4100960 -4011859
2801 -4011859 -3956114 -3865527 -3866965 -3766454 -3679056 -3462600 -3499593 -3513857 -3492959 -3411313 -3371647 -3410634 -3387212
2788 -3387212 -3363468 -3323591 -3264450 -3175318 -3190961 -3246831 -3250574 -3336672 -3260453 -3386408 -3480484 -3342100
2776 -3342100 -3451774 -3468962 -3512087 -3702358 -3621192 -3607075 -3715062 -3625675 -3696634 -3631386 -3669163 -3753415
2764 -3753415 -3701998 -3690979 -3788769 -3754465 -3742259 -3728946 -3818553 -3833731 -3788756 -3834238 -3755442 -3826661 -3803838
2751 -3803838 -3751046 -3816577 -3820547 -3903883 -3877979 -3835576 -3827662 -3908944 -3883243 -4017222 -4018211 -3885328 -3954235
2738 -3954235 -3912092 -3937665 -4047088 -4014536 -4097012 -4063891 -4143996 -4167922 -4048004 -4067644 -4122896 -4128941 -4138802
2725 -4138802 -4175240 -4125546 -4225781 -4329941 -4230043 -4288655 -4264909 -4255427 -4252331 -4138572 -4137043 -4124867 -4084610
2712 -4084610 -4075008 -4139459 -4095872 -4042410 -4031025 -4001099 -3954250 -3952578 -4066213 -4081580 -4024994 -4018165 -4006321
2699 -4006321 -3934626 -3987876 -4043637 -3977667 -3872895 -3842932 -3827355 -3860900 -3889899 -3789183 -3795769 -3779844
2687 -3779844 -3886114 -3744957 -3797237 -3771294 -3765434 -3808456 -3878236 -3932175 -3982766 -3937767 -4017379 -4022281 -4067351
2674 -4067351 -4113603 -4134841 -3900555 -3965948 -4081848 -4026201 -3842603 -3949691 -3929903 -3867321 -3891655 -3972192
2662 -3972192 -3957294 -3991498 -3898627 -4007335 -4007534 -3882303 -3963027 -3931214 -4047302 -4087282 -4124122 -4020186
2650 -4020186 -4003047 -3966952 -3978474 -3986805 -3999948 -4060714 -4076542 -4028240 -4050677 -4043703 -4094935 -4059202 -4030235
2637 -4030235 -4109626 -4065734 -4064078 -4050433 -4007245 -4024933 -4066950 -4004951 -4055404 -4098285 -3848359 -3845268 -3911798
2624 -3911798 -3914993 -3988217 -3958424 -4025764 -3918572 -3928558 -3968377 -3978049 -3982124 -3939333 -3930978 -4056968 -4058904 -4047624
2610 -4047624 -4103686 -4097010 -4016076 -3900862 -4123677 -4163559 -4151086 -4113580 -4122677 -4054309 -4197764 -4109560 -4084930
2597 -4084930 -4072505 -4145520 -4067755 -4122433 -4087129 -4035252 -4056633 -4089675 -4017896 -4091094 -4079075 -4065561 -4056744
2584 -4056744 -3994183 -4099013 -4030407 -3988843 -3913819 -3938586 -4102147 -4118997 -4015887 -4033324 -4039903 -4004455
2572 -4004455 -4014939 -3929056 -3958485 -4001376 -4132342 -4200181 -4348451 -4291050 -4258683 -4395403 -4402121 -4519234
2560 -4519234 -4643063 -4588558 -4653189 -4476988 -4515021 -4442226 -4495436 -4467585 -4415135 -4376556 -4366011 -4361130 -4312912
2547 -4312912 -4339652 -4397302 -4279947 -4368626 -4321057 -4219219 -4200031 -4244823 -4304429 -4206369 -4260492 -4269169 -4262597
2534 -4262597 -4267673 -4299819 -4186888 -4183825 -4268719 -4162270 -4070707 -4202967 -4207078 -4158191 -4216357 -4178720 -4211613
2521 -4211613 -4156205 -4245416 -4315943 -4263074 -4266354 -4267355 -4226925 -4145707 -4214286 -4241162 -4275928 -4187934 -4214813
2508 -4214813 -4170556 -4188862 -4139699 -4191261 -4236525 -4093657 -4156704 -4150359 -4209388 -4214787 -4211933 -4217171 -4184500
2495 -4184500 -4218862 -4120360 -4153780 -4141175 -4271244 -4242649 -4210077 -4184104 -4219630 -4209774 -4228692 -4243731 -4317760
2482 -4317760 -4296468 -4225772 -4337055 -4258718 -4275396 -4283732 -4235580 -4315141 -4276820 -4122245 -4184814 -4283790 -4248901
2469 -4248901 -4300991 -4211159 -4245489 -4198401 -4159893 -4172236 -4094611 -4178457 -4213492 -4097456 -4097012 -4175713 -4196286
2456 -4196286 -4093646 -4132593 -4121173 -4157984 -4137102 -4244075 -4160819 -4221576 -4158667 -4169278 -4150567 -4132897
2444 -4132897 -4107401 -4163094 -4118688 -4205366 -4265654 -4240406 -4167945 -4157088 -4147444 -4194897 -4237423 -4297509 -4310442
2431 -4310442 -4309725 -4314988 -4260559 -4186453 -4254569 -4360655 -4301089 -4190820 -4390924 -4303789 -4306300 -4229570 -4175418
2418 -4175418 -4154126 -4168922 -4159374 -4010010 -4085175 -4083137 -4119956 -4212226 -4217876 -4117651 -4125457 -4124747 -4097949 -4077538
2404 -4077538 -4044463 -3996760 -4053340 -4066733 -4356009 -4153030 -4011027 -4163064 -4163837 -4168195 -4128298 -4019248
2392 -4019248 -4145477 -4110538 -4194511 -4196363 -4285444 -4162226 -4046777 -4226116 -3949379 -3991912 -3942341 -4085667
2380 -4085667 -4064693 -4056028 -3977102 -4062167 -4019785 -4000450 -3889836 -3901109 -3938003 -3986266 -3939479 -3879061 -3884235
2367 -3884235 -3922222 -3903892 -3914615 -3933060 -3953251 -3992010 -3945274 -3935722 -4021115 -3972748 -3937429 -4015668 -4004954
2354 -4004954 -3941970 -4022969 -4070938 -3971531 -4077678 -4065453 -4047091 -4065548 -4017650 -4118687 -3999080 -4043206
2342 -4043206 -3988126 -3944494 -4005083 -3993659 -3938699 -3861361 -3904915 -3940104 -3986140 -3920587 -3984116 -4032057 -4023089
2329 -4023089 -4089463 -4030078 -4056836 -3970080 -3982301 -4072815 -3959531 -3999254 -3931419 -3968840 -3923689 -4041000
2317 -4041000 -4100739 -4064720 -4063840 -4251038 -4112632 -4118384 -4057291 -4017214 -4049928 -4055992 -4062839 -3940840 -3887229
2304 -3887229 -3922249 -3947871 -3827459 -3847018 -4031889 -3986550 -4023753 -4132244 -3889970 -3988760 -4023452 -4039131
2292 -4039131 -4062222 -4130127 -4140737 -4060739 -4110801 -4071042 -4070978 -4186704 -4193092 -4107243 -3949900 -4050678 -4075166
2279 -4075166 -4089200 -4149564 -4117437 -4160698 -4118156 -4148196 -4139946 -4074238 -4068532 -4106828 -4110767 -4138940 -4180691
2266 -4180691 -4150573 -4084333 -4003006 -4031955 -4024981 -4119996 -4101419 -4082636 -4128370 -4113155 -4091297 -4112306 -4084858
2253 -4084858 -4076569 -4066831 -4099026 -4009919 -4093060 -4066187 -4055223 -4125393 -4269547 -4280268 -4165113 -4043681 -4132293
2240 -4132293 -4079684 -4153980 -4243822 -4158758 -4129347 -4117820 -3995171 -4048556 -4084108 -4037080 -3935813 -4080484
2228 -4080484 -4079470 -4158332 -4110158 -4101496 -4020856 -4027460 -4058297 -4078571 -3951574 -3942860 -4048763 -4039562 -4073421
2215 -4073421 -4057275 -4046983 -4019510 -4073797 -4039990 -4079583 -4113243 -3979993 -3941242 -3960712 -3966292 -3902333 -4005330
2202 -4005330 -3967427 -4013810 -3911306 -3873512 -3912407 -3963300 -4043873 -3995987 -3890759 -3912688 -3966139 -3847891
2190 -3847891 -3933933 -3972620 -4031393 -4030228 -3955698 -3985887 -3985187 -3984682 -3969727 -3997269 -4013040 -4053363 -4016906 -4087366
2176 -4087366 -4026301 -4008354 -4099618 -4004972 -3931457 -3966571 -3995179 -3967590 -3979542 -3965705 -3897705 -3905886 -3959960
2163 -3959960 -3983399 -4038011 -4048669 -3987789 -4001697 -4014032 -4003844 -3921378 -3975222 -3993577 -3982286 -3912915 -3947708
2150 -3947708 -3922640 -3982029 -3987184 -3951416 -3944389 -4023384 -4001504 -4060980 -3944842 -3954058 -4033012 -3916934 -3902403
2137 -3902403 -4023772 -3998289 -4037014 -4080060 -4107336 -4037316 -4134579 -4026940 -4086157 -4028661 -4181212 -4138934
2125 -4138934 -4112674 -4144830 -4201748 -4259428 -4060784 -4149802 -4206138 -4240898 -4161102 -4186641 -4209995 -4262886 -4215810
2112 -4215810 -4191015 -4097473 -4066188 -4022471 -4137390 -4103310 -4024445 -4217773 -4079124 -4246032 -4151656 -4239048
2100 -4239048 -4208628 -4094084 -4065542 -4085411 -3999030 -4154498 -4221338 -4171560 -4205750 -4217478 -4266261 -4247423
2088 -4247423 -4288451 -4302867 -4301543 -4382575 -4320140 -4316298 -4136048 -4154456 -4148482 -4127721 -4157585 -4119993 -4120138 -4028601
2074 -4028601 -4133886 -4064615 -4111258 -4107622 -4227693 -4300303 -4271080 -4268656 -4223595 -4204174 -4269641 -4183985 -4171863
2061 -4171863 -4255038 -4267568 -4316567 -4202663 -4223780 -4213235 -4148697 -4137132 -4070056 -4134663 -4084470 -4210211
2049 -4210211 -4187949 -4170771 -4175054 -4188162 -4253190 -4338984 -4290368 -4418259 -4383166 -4412128 -4284026 -4371861 -4322137
2036 -4322137 -4326383 -4373805 -4378187 -4393813 -4342132 -4401029 -4317975 -4340331 -4393814 -4361666 -4290252 -4371054 -4384373
2023 -4384373 -4324636 -4363981 -4311600 -4272053 -4350663 -4264956 -4212751 -4231799 -4290376 -4308294 -4316694 -4340129 -4283112
2010 -4283112 -4188989 -4206324 -4209118 -4189289 -4107488 -4070904 -4034890 -4047560 -4117350 -4112199 -4215970 -4209486 -4167569
1997 -4167569 -4286518 -4253043 -4262147 -4284710 -4270750 -4210885 -4251581 -4314460 -4278372 -4308133 -4237235 -4234684 -4266361
1984 -4266361 -4365799 -4358860 -4455657 -4462730 -4477200 -4529863 -4593778 -4451268 -4390625 -4359086 -4249071 -4242584 -4365530
1971 -4365530 -4475246 -4275823 -4228567 -4218283 -4357055 -4376560 -4339603 -4303134 -4289620 -4285994 -4248094 -4245181 -4208689
1958 -4208689 -4236335 -4222530 -4297502 -4345328 -4364034 -4253304 -4276611 -4455069 -4513305 -4590721 -4488839 -4437464
1946 -4437464 -4495436 -4348884 -4406156 -4553703 -4600055 -4514641 -4252651 -4177528 -4226429 -4257279 -4317833 -4387331
1934 -4387331 -4384908 -4316915 -4177031 -4172258 -4194671 -4312522 -4200067 -4291951 -4217388 -4173744 -4100774 -4156063 -4110427
1921 -4110427 -4040205 -4152625 -4153955 -4154065 -4201173 -4214694 -4189728 -4304940 -4257331 -4287624 -4266426 -4328057 -4338352
1908 -4338352 -4357183 -4347218 -4380986 -4362846 -4394582 -4486099 -4467602 -4443525 -4335022 -4293584 -4335123 -4304991 -4170420
1895 -4170420 -4170051 -4126963 -4028086 -3995983 -4032276 -4020896 -4041567 -4090651 -4172051 -4231633 -4282546 -4229372 -4267315
1882 -4267315 -4232023 -4190040 -4310634 -4373541 -4424589 -4472236 -4395661 -4487572 -4486473 -4460996 -4506397 -4613624 -4672247
1869 -4672247 -4662404 -4407463 -4498820 -4480134 -4368394 -4339858 -4223512 -4200250 -4067465 -4056018 -4109655 -4184376
1857 -4184376 -4031285 -4056961 -4193414 -4105692 -4087797 -4207589 -4084124 -4049939 -4052264 -4126781 -4105824 -4224503
1845 -4224503 -4264366 -4242631 -4154228 -4179042 -4239677 -4144957 -4109182 -4065880 -4207800 -4162526 -4125760 -4158482 -4139175
1832 -4139175 -4064768 -4016563 -4081709 -4001707 -3898413 -3873890 -3905428 -4027113 -4041072 -4157234 -4173117 -4148632
1820 -4148632 -4164855 -4174127 -4234604 -4345102 -4302452 -4229435 -4222454 -4178188 -4241090 -4276518 -4297020 -4269271 -4341057
1807 -4341057 -4313594 -4297583 -4418471 -4411804 -4251419 -4169697 -4103327 -4045861 -3977538 -3901957 -3917125 -3881918 -3806566
1794 -3806566 -3820878 -3924173 -3896991 -3823897 -3798203 -3937312 -3854027 -4001856 -4047248 -4073899 -4152675 -4199973
1782 -4199973 -3944576 -4109104 -4096882 -3974264 -4031482 -4115137 -4146714 -4117376 -4026358 -4070054 -4031370 -4182152
1770 -4182152 -4194965 -4176409 -4327812 -4363553 -4459442 -4390035 -4359101 -4328645 -4227390 -4189892 -4169261 -4155759
1758 -4155759 -4055374 -4016574 -3906528 -3813579 -3761789 -3744700 -3876350 -3969939 -3850266 -3724242 -3755733 -3714921
1746 -3714921 -3764974 -3751171 -3812962 -3683903 -3677511 -3709404 -3813704 -3851917 -3869726 -3930174 -3970796 -3979577 -4020584
1733 -4020584 -4226523 -4122563 -4242016 -4381506 -4411139 -4484911 -4398282 -4421659 -4482367 -4411929 -4467187 -4479524
1721 -4479524 -4366649 -4289377 -4279790 -4309168 -4282051 -4224346 -4153981 -4250165 -4299166 -4309353 -4363673 -4315650 -4276180
1708 -4276180 -4241301 -4186965 -4169435 -4193158 -4127635 -4206044 -4184627 -4251044 -4181068 -4063109 -4070803 -4051163 -3931950
1695 -3931950 -3803237 -3872971 -3836405 -3848955 -3732251 -3618527 -3654105 -3761698 -3809783 -3971911 -3863388 -3819420
1683 -3819420 -3917334 -3886651 -3970863 -3955666 -3845726 -3715629 -3563629 -3449594 -3299307 -3105400 -2852269
1672 -2852269 -2771502 -2640342 -2316549 -2069348 -2050370 -2119186 -2277822 -2409530 -2765933 -2794135 -2603671
1661 -2603671 -2542894 -2623867 -2558173 -2706785 -2745966 -2800802 -2493124 -2353964 -2308380 -2384222 -2753067 -2958414
1649 -2958414 -3012927 -2995871 -2941350 -3008496 -2952237 -2961884 -3016860 -3077154 -2979868 -2854966 -2740855 -2735690 -2664468
1636 -2664468 -2735656 -2792069 -3010685 -3136305 -3150052 -3108360 -3147443 -3261998 -3281580 -3230065 -3187428 -3007994
1624 -3007994 -3101160 -3239071 -3355722 -3353080 -3472308 -3577383 -3628311 -3631963 -3696148 -3873033 -4031655 -4114696
1612 -4114696 -4150191 -3956347 -3979672 -3816525 -3810381 -3885599 -4019407 -3989432 -3952076 -3858363 -3943587 -3883673
1600 -3883673 -3814410 -3739061 -3574779 -3493800 -3320113 -3372617 -3449141 -3392612 -3306353 -3140412 -3017160 -3117838
1588 -3117838 -3286542 -3510567 -3790549 -4144560 -4278447 -4231406 -4313744 -4523902 -4714303 -4837852 -4969595
1577 -4969595 -5010821 -4997631 -4868525 -4696588 -4351482 -4323705 -4146331 -4183532 -4299398 -4176407 -3830341 -3837410
1565 -3837410 -3388767 -3345995 -3576339 -3749721 -3905374 -3788655 -3732570 -3564041 -3381913 -3484235 -3407820
1554 -3407820 -3507498 -3456616 -3515066 -3513423 -3366165 -3337250 -3413577 -3470593 -3565073 -3815097 -3752957 -3870917
1542 -3870917 -3778023 -3642112 -3482637 -3268549 -3100767 -3079652 -3041537 -3156536 -2986063 -2650831 -2310120
1531 -2310120 -2021736 -1786205 -1529648 -1301015 -1080096 -698705 -413330 -336296 -426185 -732277 -1018828
1520 -1018828 -1231217 -1409769 -1693821 -2023639 -2444036 -3210691 -3644146 -3883744 -3804652 -3731940 -3660006
1509 -3660006 -3820381 -3848379 -3825001 -3665786 -3611131 -3582398 -3360032 -3131878 -3112115 -3118250 -3474022 -3668495
1497 -3668495 -3548653 -3509244 -3307291 -3252742 -2613887 -2416477 -2063157 -2011550 -1715328 -1291748 -1176786
1486 -1176786 -1107935 -1073722 -1240969 -986614 -858727 -790135 -1032773 -1197716 -1415603 -1473880 -1183522
1475 -1183522 -754948 -834888 -713334 -705831 -821792 -660968 -241532 209886 313722 293311 279235
1464 279235 72271 342081 1095649 1467630 1287044 856419 477319 349922 1238688 2236000 3557356
1453 3557356 4492127 5142636 5917828 7794916 10267010 13573877 16431048 18811835 20331341
1444 20331341 21424214 22567773 23564796 23932625 23406993 22071295 20395497 18557743 16803400
1435 16803400 15614294 14346228 13150125 11759066 10785194 10079222 9255414 8700199 8386799 7939936
1425 7939936 7234916 6698253 6414992 6461798 6354563 6797964 7646560 8184022 8574581 8774515 9085165
1414 9085165 10059520 10892131 12193502 13000251 13673748 13952539 14220820 14710178 15817993 16475421
1404 16475421 17020267 17821205 17802637 17369396 17204320 16402383 16157383 15534381 15253843 15234980 14608487
1393 14608487 14246909 13721621 12732285 11988988 10871154 10900496 11249235 11076220 10215642 9336355
1383 9336355 8652946 8081191 8612079 10633986 11725703 12103225 12585523 13289024 14469004 13995241
1373 13995241 14650358 16052904 16694782 16938602 18367998 18790817 18883744 19923174 21267455 22159850
1363 22159850 23066521 23044630 24000591 25901366 28475868 31235508 32585282 35149229 36492123
1354 36492123 38425093 39332579 40850912 41446416 41919879 44192206 46417873 48090833 47060864
1345 47060864 44770030 44910050 47344366 51478385 54352441 56406558 55400357 51586459 48177408
1336 48177408 47951988 48766878 48278365 46274438 46039063 44892368 46993076 50789898 56062280
1327 56062280 60420503 62064834 66419822 73797050 79019513 85779571 93896700 99498626 104516672
1318 104516672 104806176 107151413 106599871 106817052 108539375 108754541 109750878 110162158 110483260 110099764
1308 110099764 108968357 108221614 108082425 107207767 110151864 115371121 119092484 119879478 117601491
1299 117601491 114332925 109958356 109475467 113076340 118137064 120773237 121026052 118641197 117115909
1290 117115909 116373800 121940765 132980039 144914162 159779279 174998472 180783553 179384001
1282 179384001 176960839 185884502 202411812 220180111 241691506 254561648 252047676 249808350
1274 249808350 249380635 260698128 273300437 283130896 301835504 329718571 355475872 386768923
1266 386768923 411913287 434197305 446876351 459055471 475494797 496114899 511225593 530073041
1258 530073041 547297630 560653790 568905892 572720426 582001954 589672496 603467905 618450755
1250 618450755 633469137 645137075 643962405 643407918 639953731 638485120 644273542 656604426
1242 656604426 676691754 692177169 707181316 708562723 697865846 693346991 699918281 729954796
1234 729954796 774717342 835415009 895045676 939741749 971601825 1006159226 1049861087 1079418813
1226 1079418813 1176830989 1389722444 1578726235 1798289216 1968612447 2001754344 1960002529
1219 1960002529 1906678665 1943901500 2085541607 2147483647 2117593218 1915722481 1559556334
1212 1559556334 1213898536 947592445 804787850 730915393 644745639 557742927 470144126
1205 470144126 393575275 332027880 279944439 225745122 183583378 159110275 145930491 130417629
1197 130417629 106851028 79801823 57945569 53309904 55332961 57783350 58418620 58757521 57258107
1188 57258107 60187149 56831436 56313885 56719543 47714454 37333010 28286238 19542563 14314948
1179 14314948 10576033 10707831 6913092 -1995266 -10768378 -10222290 -6174570 -1860496 3014299
1170 3014299 2345045 221952 -2298239 -1319535 5202257 11557355 18666802 20812891 25122723
1161 25122723 30325612 37258871 42459140 43778735 48112735 53164781 53992490 66913916 69635599
1152 69635599 74496543 76173297 71469357 56998384 47728689 36625256 31959228 24012859 20430773
1143 20430773 18655134 16296887 15294120 14784527 11725565 9272546 5912637 5075438 4785910
1134 4785910 2413602 568296 -1412246 -4282177 -7466481 -10991868 -11029349 -12272965 -12507188
1125 -12507188 -8862918 -6286428 -5795814 -7824176 -12098072 -11292418 -11108031 -9245745 -5793786 -5847549
1115 -5847549 -3038628 672821 3375328 8216565 7827001 8019384 9267691 11231070 14730272
1106 14730272 16041954 13345006 9778036 5369831 1737573 596926 208569 634414 1792405
1097 1792405 1893052 1377255 -265484 -1758099 -2719005 -1451497 894913 2295409 1258470
1088 1258470 -84699 -1563154 -1612034 -555972 316502 -17093 -2513031 -4621510 -5291188 -5868428
1078 -5868428 -7590656 -8136098 -9058959 -9774100 -8711481 -7307761 -6325351 -6184841 -5967609 -4787185
1068 -4787185 -4079357 -2590963 -1681654 -597155 -136466 -224871 107510 555713 749072 1387070
1058 1387070 781281 666643 154211 -253421 -438089 -1758584 -3217350 -3706271 -4248990 -4491824
1048 -4491824 -4297808 -4125724 -4806424 -5920026 -7111469 -7236467 -7066917 -6294735 -5328069 -4841515
1038 -4841515 -4784711 -4350968 -4412620 -4428144 -4387695 -3945703 -2960582 -2131402 -1507495 -878113 -577787
1027 -577787 -325035 524145 1550073 2115440 2629851 2656118 2731999 3088342 3203447 3031670 2769602
1016 2769602 2305149 1392140 407462 -309270 -1057553 -1541019 -1654040 -1270425 -973338 -1436039 -1374204
1005 -1374204 -946748 -700695 -34741 768298 1692950 2125499 2487995 3360608 4436953 5716234
995 5716234 7123072 8533412 9297922 9842504 10819466 12126747 13476293 15088147 15989999 16240852
985 16240852 15255004 14271984 13509031 13009977 12283295 11617619 10501573 9028993 7825199 6604848
975 6604848 5666580 4856987 4207437 4161756 4236565 4166471 3719417 3125428 2510857 2408935 2441131
964 2441131 2573727 2299747 1613961 858642 467455 331507 487640 791805 978494 915579 921075
953 921075 664903 812485 1027339 1199300 812872 866633 452269 220070 21179 -395458 -750632
942 -750632 -825459 -852945 -991661 -1173458 -1264299 -1235959 -1123186 -987430 -753753 -990445 -1256960 -1704302
930 -1704302 -2060286 -2067329 -2042267 -2065083 -2163810 -2676909 -3059598 -3392856 -3505366 -3339129 -3417905 -3342277
918 -3342277 -3579912 -3943946 -4087435 -4149704 -4057895 -3758682 -3735658 -3673553 -3752632 -3887018 -3961988 -3754455
906 -3754455 -3438534 -3130030 -2843930 -2531670 -2389839 -2102479 -2095318 -2022439 -1729880 -1567404 -1638856 -1614766
894 -1614766 -1502034 -1572765 -1791308 -2000577 -2097041 -2027862 -1892034 -1685364 -1591813 -1465250 -1470977 -1417699
882 -1417699 -1267016 -1080519 -1165310 -1140069 -1067186 -943961 -1044662 -1275646 -1143444 -1221062 -1601428
871 -1601428 -1880136 -2116655 -2359905 -2555023 -2486696 -2484407 -2818725 -2962912 -3230905 -3564096 -3691634
860 -3691634 -3752194 -3633366 -3692973 -3582756 -3640018 -3757328 -3615969 -3430673 -3216569 -3070547 -3133988 -3193157
848 -3193157 -3204091 -2955699 -3035267 -3045317 -3047479 -3108141 -3287602 -3564405 -3696712 -3962777 -3871246 -3942511
836 -3942511 -3720661 -3767544 -3794742 -3884218 -3885815 -3515537 -3536187 -3437942 -3485353 -3642601 -3508442 -3520049
824 -3520049 -3325139 -3292300 -3369588 -3476068 -3569607 -3728266 -3693079 -3793637 -3784519 -3814408 -3609009 -3665228
812 -3665228 -3865187 -4006138 -4115515 -4084594 -4110502 -4154305 -4205142 -4442741 -4625180 -4446931 -4348531 -4285973
800 -4285973 -4291291 -4426917 -4620911 -4794929 -4770638 -4676121 -4724133 -4654943 -4521068 -4550102 -4430788 -4447423
788 -4447423 -4399840 -4343600 -4167796 -3627658 -3451392 -3604917 -3649060 -3827981 -3904264 -3720029 -3596573 -3527740
776 -3527740 -3598392 -3941038 -4013781 -4073075 -4085768 -4240372 -4261492 -4199652 -4247175 -4131293 -3967930 -3940730
764 -3940730 -3982892 -3972047 -3899574 -3819828 -3576594 -3497664 -3395793 -3193636 -3209436 -3127371 -3039621 -3055571 -3059874
751 -3059874 -3094861 -2988391 -2955901 -2965246 -3032671 -2864819 -3027258 -3041431 -2926345 -2823718 -2971946 -3011189
739 -3011189 -2994581 -3024325 -3051390 -3057930 -3063657 -3122292 -3238624 -3205501 -3238279 -3296671 -3305430 -3254770 -3112157
726 -3112157 -3123468 -3144348 -3012591 -3116780 -3059033 -3012612 -2892747 -3074441 -3177493 -3280679 -3424170 -3350470
714 -3350470 -3453511 -3466900 -3628857 -3728033 -3639627 -3595807 -3607501 -3566413 -3627466 -3585166 -3625487 -3540724 -3470792
701 -3470792 -3586256 -3768245 -3736823 -3841413 -3896923 -3867344 -3890070 -3832488 -3842475 -3898026 -4006325 -3988305
689 -3988305 -3788384 -3584511 -3580792 -3528082 -3622038 -3650912 -3570991 -3543075 -3531102 -3469103 -3394619 -3502410
677 -3502410 -3611524 -3726069 -3647092 -3731298 -3748714 -3607562 -3505032 -3516714 -3613853 -3562650 -3543377 -3406294
665 -3406294 -3278245 -3179105 -3233818 -3079125 -3169328 -3273781 -3372062 -3429249 -3342509 -3365355 -3337558 -3464912
653 -3464912 -3476389 -3463389 -3479729 -3479926 -3546352 -3417949 -3458682 -3432769 -3251744 -3271224 -3246256 -3363179 -3338589
640 -3338589 -3319749 -3237308 -3275145 -3290598 -3405239 -3352187 -3388955 -3390435 -3319371 -3314128 -3300197 -3344667 -3313335
627 -3313335 -3288543 -3275668 -3277983 -3380908 -3476850 -3526440 -3474949 -3681846 -3669412 -3790053 -3949902 -3973430
615 -3973430 -3847372 -3909878 -3938366 -3885923 -3777958 -3738930 -3757376 -3771674 -3655064 -3755496 -3639487 -3563274
603 -3563274 -3505534 -3431195 -3634042 -3641060 -3615042 -3586141 -3518037 -3543314 -3576278 -3503549 -3569184 -3722462 -3674768
590 -3674768 -3557820 -3565909 -3573589 -3685890 -3769677 -3685699 -3632266 -3609591 -3663133 -3577519 -3693874 -3561315
578 -3561315 -3689287 -3663143 -3588441 -3625338 -3650447 -3666252 -3750601 -3789925 -3813192 -3754039 -3876852 -3888808 -3828107
565 -3828107 -3643700 -3612807 -3713998 -3729604 -3792155 -3648886 -3685132 -3582223 -3750558 -3738220 -3705076 -3913353
553 -3913353 -3937374 -3991361 -3970431 -3924889 -3654492 -3828018 -3555909 -3579639 -3892216 -3791303 -4073453 -3851740
541 -3851740 -3764395 -3651891 -3706490 -3734566 -3708430 -3704423 -3689014 -3697580 -3672401 -3678833 -3714171 -3690530 -3756533
528 -3756533 -3659304 -3692872 -3748494 -3696949 -3712197 -3679760 -3652074 -3598634 -3684852 -3670162 -3655410 -3660030 -3743600
515 -3743600 -3857756 -3709923 -3588222 -3727759 -3743931 -3715071 -3750229 -3753161 -3775607 -3771062 -3826154 -3823700 -3878691
502 -3878691 -3806984 -3845734 -3861323 -3822113 -3692641 -3772595 -3737647 -3749456 -3751167 -3784268 -3846990 -3954027 -3998990
489 -3998990 -3949248 -4007264 -4074343 -4061001 -4083947 -4065726 -4063036 -3943831 -3867086 -3927792 -3936326 -3862168 -3844037 -3843475
475 -3843475 -3794304 -3772641 -3682507 -3611771 -3579811 -3765466 -3802177 -3779217 -3671867 -3688360 -3761226 -3742615 -3774550
462 -3774550 -3734692 -3751134 -3711577 -3790583 -3732161 -3815621 -3684251 -3747256 -3715118 -3679649 -3736460 -3728447 -3715045
449 -3715045 -3830308 -3766860 -3840798 -3825523 -3807487 -3825608 -3729645 -3687127 -3818369 -3831932 -3934614 -3898204
437 -3898204 -3827616 -3706871 -3731706 -3705532 -3749572 -3765262 -3713945 -3904290 -3787567 -3731049 -3712868 -3702839
425 -3702839 -3807912 -3707877 -3811092 -3746806 -3656909 -3699909 -3580614 -3651733 -3690592 -3638736 -3679921 -3730612
413 -3730612 -3694564 -3704300 -3633654 -3653760 -3835843 -3729049 -3708815 -3590240 -3655088 -3721882 -3689151 -3634400 -3574411
400 -3574411 -3646181 -3615466 -3695665 -3729439 -3641417 -3708027 -3746918 -3705294 -3802165 -3840507 -3873465 -3889436 -3984637
387 -3984637 -3983776 -4020593 -4072070 -3979743 -3944042 -3942856 -3915043 -3915637 -3837139 -3997154 -4074667 -3929967 -4030812
374 -4030812 -4057600 -4014645 -3959416 -3965518 -3872601 -3907344 -3887985 -3906016 -3965540 -3873657 -3900886 -3865713 -3907919
361 -3907919 -3840144 -3932422 -3954142 -3962631 -4078672 -3988132 -4071145 -4093639 -4083474 -3990622 -4054919 -3863697 -3872741
348 -3872741 -3761296 -3819536 -3767788 -3661203 -3628553 -3635266 -3647216 -3728869 -3740867 -3833859 -3853434 -3890943 -3964059
335 -3964059 -4028550 -3964397 -3907108 -3976962 -4040415 -4001209 -3942665 -4003718 -3975791 -3995522 -3959747 -4032204 -3973965
322 -3973965 -4072438 -3996433 -3988652 -4068711 -4027871 -4018732 -4072075 -3983094 -3996825 -3975728 -4013750 -4091558 -4208835
309 -4208835 -4091764 -4118905 -4131373 -4036809 -4288753 -4262189 -4182770 -4234671 -4339424 -4163885 -4240617 -4282129
297 -4282129 -4212075 -4327475 -4258423 -4252220 -4262177 -4234276 -4235104 -4173917 -4264633 -4199995 -4236663 -4210174 -4171768 -4107005
283 -4107005 -4051253 -4142089 -4182946 -4159749 -4061733 -4147953 -4094026 -4013326 -4045759 -4006818 -4070169 -4018496 -4109336
270 -4109336 -4097714 -4058420 -4110266 -4173124 -4067615 -4100968 -4126875 -4096680 -4022206 -4009029 -4058659 -3993921 -3920467
257 -3920467 -3942926 -3894056 -3914519 -3947574 -3999878 -4098623 -4058982 -4129043 -4099052 -4160983 -4124538 -4166041 -4130389
244 -4130389 -4146849 -4146807 -4133616 -4081978 -4054532 -4104164 -4160381 -4107213 -4088414 -4102311 -4119510 -4117018 -4062882 -4033997
230 -4033997 -4132042 -4069446 -4085724 -3981992 -4038671 -4040649 -3974337 -3963239 -4017441 -4006941 -3984938 -4022731 -3976958
217 -3976958 -3990059 -4028938 -4054932 -3984703 -3935703 -3917603 -3926736 -3987854 -4007574 -4045022 -4076887 -3922053 -3944886
204 -3944886 -3986264 -3945714 -3964175 -4075982 -3894696 -3916917 -3929534 -3896688 -3934279 -3864510 -3985627 -3949611
192 -3949611 -3930018 -4009382 -4063831 -4025629 -4091226 -4074987 -4083509 -4064133 -3996843 -4106582 -3987280 -4021756 -3982909
179 -3982909 -4077846 -4076671 -4081360 -4035904 -4052702 -4060220 -4135716 -4075593 -4037514 -4083043 -4127489 -4092740 -4063311 -4081505
165 -4081505 -4064917 -4080777 -4017401 -3997851 -4107314 -3998633 -3967212 -3965440 -3918826 -4096097 -4103745 -4015984 -4047836
152 -4047836 -4081537 -4107224 -3983078 -4083565 -4035390 -4004905 -3954798 -3993347 -4021834 -4086153 -4007888 -3943728
140 -3943728 -4056759 -4107384 -4084907 -4108925 -4136393 -4122236 -4045383 -4079939 -4155704 -4136566 -4245540 -4339791 -4333303
127 -4333303 -4267532 -4172129 -4250113 -4160777 -4249378 -4219375 -4218681 -4094377 -4076680 -4087200 -4036041 -4050880 -4034521
114 -4034521 -4042852 -3976087 -4018447 -4034403 -4086304 -4097692 -4079202 -4081863 -4069206 -4094326 -4121069 -4138581 -4143672 -4103241
100 -4103241 -4110765 -4051441 -4158876 -4116432 -4040451 -4094998 -3978026 -4069014 -4110148 -4057877 -4068270 -3923574 -3988900
87 -3988900 -4105764 -4022259 -3970587 -3939579 -3932603 -3921677 -4007231 -3930792 -3882020 -3906857 -3916509 -3900926 -3953704
74 -3953704 -4019057 -3976699 -3962953 -4054251 -4057356 -4036501 -4050859 -4056085 -4072283 -4077458 -4060715 -4125575 -4096795 -4126710
60 -4126710 -4030212 -4006967 -4020677 -4041666 -3998062 -3996416 -3960550 -4105136 -4048981 -3924731 -3859933 -3810406 -3871742
47 -3871742 -3898352 -3882226 -3790803 -3893784 -3910300 -3881261 -3940359 -3978243 -3937053 -3967253 -3902212 -3960073 -3939872
34 -3939872 -3972051 -3954090 -3924495 -3882170 -3913695 -3881753 -3880054 -3865805 -3865457 -3845550 -3789937 -3840864 -3832224 -3794518
20 -3794518 -3574660 -3812728 -3800196 -3897878 -3933032 -3914458 -3882546 -3876856 -3910925 -3896097 -3923192 -3917317 -3899929
7 -3899929 -3948935 -3916729 -3964635 -3885523 -3820953 -3822207 -3930552 -3953985 -3897270 -3970583 -3949851 -3817984 -3953524
-6 -3953524 -3881847 -3881191 -3880620 -3957226 -3872928 -3896684 -3864326 -3973115 -3890513 -3899123 -3910969 -3981210 -3961255 -3908033
-20 -3908033 -3900702 -3910079 -3938127 -3972880 -4036381 -4064327 -4002459 -3979650 -3853221 -3844723 -3837130 -3930814 -3901185 -3982362
-34 -3982362 -4029091 -3972683 -3965748 -3947656 -3797661 -3932981 -3888052 -3887384 -3981491 -3882900 -3968760 -3985835 -4026544
-47 -4026544 -3863714 -3988211 -3999779 -4056884 -4029277 -4016241 -4108870 -4138080 -4014682 -4034999 -3949726 -3959541 -3911154
-60 -3911154 -3966470 -3929231 -4006862 -3951598 -3875836 -3862352 -3887283 -3869584 -3937117 -3977778 -3917641 -4010658 -3961430
-73 -3961430 -3885005 -3929197 -4075978 -3992267 -3926500 -3834702 -3846117 -3948560 -3955802 -3978622 -3881072 -3919544 -3986960
-86 -3986960 -3950808 -3819571 -3887348 -3867977 -3840439 -3815984 -3870735 -3841841 -3995665 -3931261 -4010254 -3925590 -3909591
-99 -3909591 -4011068 -3917069 -3980077 -3980352 -4000415 -3946703 -3966976 -4028664 -4014429 -3959238 -3991727 -3921942 -4050951
-112 -4050951 -3954204 -3855654 -3892490 -3846927 -3935825 -3983744 -3950361 -3857403 -3897862 -3811169 -3905895 -3820195 -3972652
-125 -3972652 -3880338 -3982441 -4041916 -4045616 -4133872 -4075648 -4160934 -4324453 -4484037 -4423139 -4358393 -4357834 -4397509
-138 -4397509 -4473835 -4326613 -4304983 -4351385 -4298998 -4342736 -4221456 -4264799 -4086902 -4467575 -4426358 -4297188
-150 -4297188 -4280700 -4301870 -4259154 -4251799 -4192207 -4172693 -4211254 -4203605 -4252284 -4224645 -4239280 -4281515 -4268536
-163 -4268536 -4247521 -4201508 -4252808 -4328157 -4275458 -4161403 -4224985 -4206536 -4271435 -4263728 -4190746 -4246010 -3992698
-176 -3992698 -4166423 -4239016 -4183202 -4209563 -4211800 -4259140 -4280743 -4301844 -4301690 -4287814 -4128863 -4052744 -4178450
-189 -4178450 -4138656 -4160873 -4240912 -4240855 -4437121 -4066519 -4082498 -4114207 -4194928 -4266710 -4242751 -4252374 -4139812
-202 -4139812 -4199922 -4131132 -4296464 -4208629 -4182392 -4208839 -4151322 -4129797 -4234943 -4255087 -4225776 -4290021 -4287818
-215 -4287818 -4259319 -4234857 -4269873 -4228913 -4215451 -4171977 -4224512 -4217781 -4240893 -4179690 -4146163 -4103381 -4142435
-228 -4142435 -4292016 -4282230 -4221247 -4287242 -4327949 -4280653 -4287054 -4368342 -4428257 -4416368 -4276641 -4165436 -4150021
-241 -4150021 -4181893 -4095228 -4120095 -4094494 -4141759 -4041176 -4031075 -3834324 -3885811 -4015872 -3997909 -3904051
-253 -3904051 -3878910 -4008562 -3886533 -3925729 -3982707 -4007427 -4031365 -3986947 -3972252 -3957121 -3915589 -3910503
-265 -3910503 -4042489 -3957365 -3964289 -4213901 -4140985 -4071199 -4069563 -4008709 -4007457 -3942989 -4071743 -3989388 -4090053
-278 -4090053 -4005263 -4024660 -3978070 -4000466 -3989931 -4070967 -4045984 -4016249 -4093168 -4035648 -4057742 -4115934 -4039530
-291 -4039530 -4042389 -4107519 -4097059 -4021918 -4139224 -4204368 -4271678 -4126315 -4099082 -4081083 -4031840 -4049475 -4111348
-304 -4111348 -4087823 -4088307 -4173450 -4171456 -4113898 -4113872 -4122468 -4114195 -4120812 -4149768 -4174267 -4074261 -4074106 -4064764 -4053539
-319 -4053539 -4094278 -4045726 -4051741 -4064035 -4086053 -4033748 -3923521 -3976395 -4032270 -4014403 -4066211 -4097838 -4144585
-332 -4144585 -3937819 -3993682 -3981854 -4105018 -4130370 -4146502 -4057350 -4077292 -4064518 -4166230 -4098172 -4101452
-344 -4101452 -4077816 -4097808 -4105825 -4097649 -4177218 -4099397 -4099132 -4075466 -4135530 -4059804 -4063578 -4074396 -4274948
-357 -4274948 -4158047 -4122322 -4110186 -4092154 -4214834 -4184923 -4122909 -4088745 -4084979 -4155589 -4167938 -4173256 -4172439
-370 -4172439 -4065937 -4094938 -4201276 -4143821 -4183432 -4153218 -4208571 -4078759 -4215623 -4190269 -4158239 -4100968
-382 -4100968 -4102255 -4179565 -4231751 -4075775 -4133773 -4147615 -4040796 -4081953 -4167580 -4141121 -4082467 -3988870 -4075506
-395 -4075506 -4129208 -4122347 -4139607 -4170628 -4145237 -4148623 -4160330 -4142306 -4226714 -4122298 -4129631 -4070070 -4067528
-408 -4067528 -4130137 -4117307 -4062840 -4068725 -4107612 -4103468 -4161627 -4104014 -4041267 -4102502 -4087694 -4114430 -4139712
-421 -4139712 -4040533 -4037778 -4041156 -4116297 -4153066 -4153649 -4179072 -4102110 -4068282 -4172577 -4168217 -4200196 -4175506 -4178465
-435 -4178465 -4153021 -4111377 -4222268 -4219896 -4193274 -4102550 -4125324 -4024499 -3982533 -4071188 -4124038 -4092271 -4121799
-448 -4121799 -4114249 -4161959 -4135780 -4107264 -4049720 -4052001 -4161611 -4148669 -4093520 -4080672 -4129104 -4183230 -4156855
-461 -4156855 -4080949 -4095162 -4124268 -4184338 -4159889 -4066565 -4101896 -4156672 -4138300 -4238888 -4168026 -4146411 -4101223
-474 -4101223 -4158697 -4098031 -4172697 -4161307 -4059466 -4066815 -4102500 -4180775 -4127323 -4148815 -4145176 -4173628 -4120033
-487 -4120033 -4104086 -4115089 -4048266 -4058168 -4015341 -4007462 -4127429 -4149630 -4122018 -4152314 -4229235 -4150688 -4129347
-500 -4129347 -4107440 -4101384 -4125373 -4128124 -4134436 -4136169 -4092185 -4203952 -4167534 -4172654 -4177809 -4112306 -4213344 -4154136
-514 -4154136 -4138727 -4104820 -4178023 -4208763 -4073403 -4059681 -4158951 -4139078 -4105530 -4126976 -4138214 -4036720
-526 -4036720 -4008305 -3971390 -3893316 -3795030 -3949852 -4080094 -4114856 -4043226 -3981342 -4074008 -4131699 -4101327
-538 -4101327 -4083372 -4104980 -4057073 -4099091 -4065465 -4071728 -4193930 -4274024 -4264968 -4093360 -4053658 -4163120 -4092783
-551 -4092783 -4121621 -3994755 -4070375 -4132215 -4114862 -4207580 -4171264 -4092213 -4133392 -4082610 -4061283 -4082497 -4028255
-564 -4028255 -4111809 -4241315 -4203324 -4121010 -4122826 -4132322 -4080590 -4145504 -3987243 -4047819 -4192970 -4114332 -4089363
-577 -4089363 -4085115 -4092879 -4120271 -4136265 -4092418 -4144436 -4126261 -4087985 -4184415 -4188234 -4168075 -4230452 -4178928
-590 -4178928 -4255964 -4160956 -4169124 -4212483 -4185546 -4188569 -4141895 -4198932 -3917077 -4122596 -4187875 -4210141 -4145558
-603 -4145558 -4202642 -4123843 -4084278 -4102027 -4167593 -4139550 -4051898 -4195569 -4260520 -4212882 -4135405 -4191430 -4109790
-616 -4109790 -4307604 -4145069 -4178365 -4217463 -4314643 -4142054 -4119771 -4109784 -4104169 -4154963 -4118657 -4136050 -4092779
-629 -4092779 -4031796 -3991239 -4010594 -4012778 -3983100 -3946873 -4115747 -4085546 -4028256 -4115570 -4128804 -4066206 -3967221
-642 -3967221 -4047602 -4177532 -4114595 -4150498 -4165416 -4245366 -4203220 -4140742 -4109256 -4195623 -4146112 -4050862 -4129188
-655 -4129188 -4069659 -4035097 -4055979 -4012866 -3947330 -3936719 -3979859 -4020849 -4070067 -4083118 -4150628 -4078252 -4095125
-668 -4095125 -4068005 -4033640 -4071903 -3981822 -4046590 -4024962 -4118406 -4203517 -4097746 -4195808 -4140425 -4160462 -4153879
-681 -4153879 -4203539 -4130384 -4166015 -4248852 -4175159 -4187318 -4168858 -4238337 -4213564 -4156533 -4139989 -4192489 -4200827
-694 -4200827 -4147672 -4176808 -4111809 -4131044 -4143291 -4088655 -4024707 -4023837 -4091819 -4088514 -4089050 -4082263 -4094448 -4057346
-708 -4057346 -4075054 -4148559 -4093759 -4107236 -4144906 -4155197 -4092499 -3997538 -3936430 -4094381 -4071794 -3982371 -4064332
-721 -4064332 -4174077 -4164119 -4156493 -4211864 -4108269 -4082737 -4133973 -4076021 -4075142 -4160947 -4091291 -4094692 -4122442
-734 -4122442 -4111464 -4074474 -4103783 -4067656 -4082202 -4009262 -4014605 -4007604 -4110286 -4038210 -4083968 -3984004 -3955264
-747 -3955264 -3937372 -3968863 -3953937 -4027795 -4000323 -4000064 -3942749 -3960689 -4007193 -3920095 -3899389 -4110455 -4059076
-760 -4059076 -3988877 -4052863 -3963099 -3986394 -4036741 -4011938 -4133606 -4093893 -4047961 -4120142 -3971013 -4010250
-772 -4010250 -4070517 -4038168 -4026561 -4106928 -4074179 -4083402 -4034791 -3991015 -3992411 -3984602 -4032083 -4013454 -4085499
-785 -4085499 -4063653 -4024595 -4008106 -4008505 -4042241 -4056720 -4083036 -3997942 -3916668 -3982526 -3974832 -4088809 -4225479
-798 -4225479 -4032199 -4011875 -3995128 -4018441 -3944566 -3883162 -3989356 -4008956 -4059594 -4075027 -4053868 -4046310 -4018470
-811 -4018470 -4131123 -4073968 -4047506 -3969185 -4068918 -4071426 -4034235 -4084893 -4138577 -3996418 -4039162 -4060012 -4013502
-824 -4013502 -4037596 -3923885 -4052672 -4050175 -4081775 -4106899 -3947343 -3999555 -4028725 -4012269 -4055064 -4024085
-836 -4024085 -3949360 -3913567 -3883386 -3796606 -3642486 -4303848 -4430665 -4278524 -4249412 -4220644 -4194200 -4284419
-848 -4284419 -4124769 -4134865 -4100726 -4079575 -4163147 -4143891 -4089885 -4126590 -4082759 -4080681 -4035348 -4022124 -4077181
-861 -4077181 -3979832 -4141553 -4102430 -4044898 -4034681 -4109039 -4118771 -4060449 -4107867 -4166555 -4178452 -4098716 -4077211
-874 -4077211 -4103585 -4112001 -4167407 -4210260 -4137586 -4133670 -4226303 -4123745 -4306809 -4129415 -3950556 -4046814
-886 -4046814 -4166272 -4047991 -3960781 -4086213 -4104447 -4094146 -4025597 -4120748 -4100239 -4183455 -4124963 -4033452
-898 -4033452 -4187620 -4168283 -4082585 -4107607 -4103322 -4130283 -4168606 -4050166 -4084296 -4079346 -4093412 -4026267 -4140983
-911 -4140983 -4098677 -4147257 -4084915 -4158400 -4168218 -4189849 -4153143 -4090011 -4049683 -4166186 -4119957 -4291184 -4231327
-924 -4231327 -4215981 -4249792 -4169261 -4212004 -4091161 -3989864 -4058327 -3958782 -4012967 -4058416 -4201054 -4349716
-936 -4349716 -4181434 -4131769 -4148230 -4123777 -4136138 -4175760 -4112551 -4139929 -4092503 -4065559 -4091184 -4040439
-948 -4040439 -4146771 -4151153 -4117453 -4130830 -4199693 -4127053 -4143588 -4127099 -4148495 -4230230 -4094886 -4041168 -4085795
-961 -4085795 -4029637 -4016675 -4087309 -4111944 -3990094 -3999657 -4090248 -4045266 -3996077 -3968327 -4040549 -4026041 -4010598
-974 -4010598 -4031765 -4031889 -4001955 -3980298 -4089429 -3968040 -3925196 -3969923 -4027909 -4034416 -3981520 -4012781 -3990643
-987 -3990643 -4028549 -4056644 -4090097 -4030417 -4117046 -4069119 -4043853 -4132314 -4052364 -4111843 -4114343 -4128386 -4069420
-1000 -4069420 -4045560 -4100498 -4162137 -4045448 -4061564 -4015770 -4158092 -4143153 -4147516 -4128286 -4080034 -4118554
-1012 -4118554 -4025918 -4044863 -4120518 -4050455 -4082451 -4048913 -4038219 -4069353 -4032430 -4143921 -4098096 -4090500 -4003703
-1025 -4003703 -4117940 -4121693 -4047101 -4015128 -4145788 -4190331 -4151903 -4089552 -4113589 -4117483 -4118119 -4046940 -4039936
-1038 -4039936 -4225647 -4120495 -4035359 -4126517 -4022424 -4100893 -4073888 -4065470 -4006459 -4045991 -4063846 -4107756
-1050 -4107756 -4015373 -4046420 -4101823 -4043552 -4090521 -4067831 -4111961 -4144351 -4088826 -4228071 -4268062 -4189971
-1062 -4189971 -4112158 -4153715 -4139826 -4096738 -4138578 -4035872 -4075877 -4060397 -4135175 -4108709 -4128476 -4153255
-1074 -4153255 -4112398 -4180352 -4175497 -4122927 -4150581 -4191116 -4183834 -4126208 -4035524 -4114301 -4072135 -4080743 -4055995
-1087 -4055995 -4130651 -4122195 -4151668 -4120033 -4134665 -4058137 -4129444 -3923870 -4016832 -4038235 -3981597 -4019530 -4025421
-1100 -4025421 -3940536 -4016727 -4047947 -4009470 -4062169 -4019060 -4084643 -4042946 -4075757 -4144715 -4143946 -4047941 -4063573
-1113 -4063573 -4124754 -4121852 -4143976 -4067623 -4018113 -4091211 -4153913 -4080979 -4082351 -4069078 -3987400 -4090050 -4143161
-1126 -4143161 -4106346 -4085127 -4070237 -4090728 -4119535 -4133857 -4083252 -3831580 -3978250 -4025362 -4055155 -4058262
-1138 -4058262 -4088016 -4141564 -4146208 -4080078 -4040627 -3971345 -4059216 -4009462 -4036515 -4094708 -4081361 -4043639 -4068005
-1151 -4068005 -4175908 -4081570 -4017851 -4059383 -4069297 -4016757 -4100204 -4082649 -4016134 -4070491 -4006284 -3972950 -4041716
-1164 -4041716 -4147523 -4145313 -4113954 -4041680 -4005833 -3893854 -3957785 -4098800 -4125276 -4079094 -4062035 -4122501
-1176 -4122501 -4182738 -4138452 -4090988 -4153053 -4204216 -4197267 -4082620 -4098601 -4038220 -4071194 -4108809 -4112981 -4117370
-1189 -4117370 -4069270 -4102914 -4140341 -4090824 -4068258 -4117891 -4075904 -4042896 -4019610 -4112227 -4128353 -4127590 -4218338
-1202 -4218338 -4184480 -4029007 -4152568 -4063697 -4066993 -4151098 -4179348 -4114850 -4094501 -4085359 -4033520 -4015814 -4072716
-1215 -4072716 -4065046 -4105211 -4105592 -4052526 -4030482 -3992981 -4082389 -4111242 -4167804 -4066531 -4055428 -4099843 -4127658
-1228 -4127658 -4022350 -4117215 -4092314 -4077558 -4210710 -4115500 -4099929 -4104835 -4051005 -4042658 -4002497 -4073305 -4149041
-1241 -4149041 -4085836 -4066818 -4092254 -4092975 -4074981 -4018549 -4061837 -4112368 -4187861 -4146302 -4009978 -4034924 -4012665
-1254 -4012665 -4106618 -4090847 -4112095 -4182466 -4195720 -4072488 -4055784 -4023432 -4112451 -4112191 -4126532 -4194941 -4174205
-1267 -4174205 -4043534 -4082136 -4047816 -4154307 -4104372 -4078344 -3981798 -4169617 -4148886 -4109683 -4027158 -4008478
-1279 -4008478 -4073901 -4103625 -4111061 -4063376 -4078438 -4150677 -4169826 -4166719 -4212124 -4160810 -4114394 -4081537 -4257010
-1292 -4257010 -4190579 -4239342 -4273715 -4275386 -4230573 -4171838 -4113235 -4099950 -4149040 -4203160 -4097029 -4109604
-1304 -4109604 -4234300 -4024235 -4062822 -4110528 -4031281 -4126349 -4029043 -4124667 -4179978 -4166206 -4162692 -4142826
-1316 -4142826 -4113513 -4132489 -4159954 -4131095 -4125432 -4180458 -4076068 -4067301 -4076402 -4053376 -3991455 -4108404 -4174846
-1329 -4174846 -4234358 -4137059 -4210398 -4193072 -4108615 -4179199 -4198957 -4116416 -4092796 -4122953 -4078027 -4120100 -4136951
-1342 -4136951 -4109467 -4156550 -4144874 -4107518 -4193574 -4204318 -4178810 -4137822 -4228271 -4233292 -4186989 -4155628 -4142158
-1355 -4142158 -4139013 -4168723 -4183957 -4110338 -4121809 -4184496 -4052890 -4105129 -4184546 -4261761 -4247745 -4144743
-1367 -4144743 -4182077 -4102555 -4105558 -4064636 -4146016 -4233574 -4257391 -4167401 -4314158 -4198497 -4212984 -4275627
-1379 -4275627 -4116085 -4209820 -3825414 -4172146 -3859048 -3910763 -4085576 -4179532 -4039261 -4212599 -4138569
-1390 -4138569 -4142629 -3970840 -4154966 -4066790 -4167734 -4254519 -4244682 -4209464 -4172543 -4144918 -4187953 -4215298
-1402 -4215298 -4161552 -4217042 -4159642 -4065756 -4058332 -4088805 -4176223 -4101495 -4076125 -4174819 -4094739 -4110379 -4135824
-1415 -4135824 -4053308 -3990578 -4045220 -4002239 -4046424 -4050222 -4002800 -4072251 -4062712 -4142723 -4110616 -4040583 -4037140
-1428 -4037140 -4106328 -4159590 -4137511 -4121655 -4056538 -4280771 -4103368 -3974351 -3969745 -4064072 -4083353 -4123567
-1440 -4123567 -4069326 -4056245 -4072789 -4095791 -4134965 -4168428 -4094538 -4080499 -4077295 -4035575 -4086511 -3986948 -4008387
-1453 -4008387 -3991193 -4180621 -4008591 -4075410 -4022775 -4078858 -4122513 -4041471 -4030207 -4042374 -4075839 -4160852
-1465 -4160852 -4113270 -4185465 -4177711 -4039813 -4158758 -4102855 -4140308 -4145595 -4173463 -3982560 -4070925 -4056798
-1477 -4056798 -4024150 -4068280 -3978398 -3997166 -4031574 -3967687 -3853407 -4125737 -4018573 -4037583 -4126526 -4091917
-1489 -4091917 -4097939 -4068996 -4034984 -4070620 -3997649 -4043491 -4074057 -4091342 -4105479 -4013359 -4010868 -4066155 -3952823
-1502 -3952823 -4164337 -4127313 -4205339 -4141392 -4101426 -4070025 -4043699 -4078860 -4128484 -4086602 -4118820 -4121499 -4099998
-1515 -4099998 -4032687 -4035641 -4077700 -3996761 -4081850 -4052741 -4072050 -4019564 -4006522 -4037192 -4144988 -4106670 -4097477
-1528 -4097477 -4104692 -4016282 -4139018 -4142000 -4105868 -4118804 -3985743 -4001640 -4081756 -4104393 -3970307 -4022536 -4015418
-1541 -4015418 -4078630 -4095097 -4095333 -3972413 -4122186 -3979021 -4149134 -4080349 -4044880 -4133486 -4085495 -4142006
-1553 -4142006 -4157628 -4026469 -4066687 -3956505 -4061511 -4041214 -4113820 -4137793 -4132412 -4077602 -4013865 -4053329
-1565 -4053329 -3983832 -4013243 -4081602 -4001455 -3993991 -4030782 -4057688 -4049630 -4197351 -4144127 -4198164 -4149169 -4070775
-1578 -4070775 -4048637 -3991009 -4115697 -4107758 -4106566 -4044828 -4028558 -4098039 -3926029 -3968076 -3969264 -3984461 -4083370
-1591 -4083370 -4037751 -4034985 -4100482 -4106156 -4025458 -4040745 -4026943 -3988756 -4011565 -3956529 -3960975 -3962887 -3948053
-1604 -3948053 -4027315 -3966180 -4204060 -4209770 -4109341 -4078205 -4088090 -4174767 -4192291 -4151508 -4177694 -4133504 -4103582
-1617 -4103582 -4139231 -4048275 -4070456 -4087656 -4203770 -4334863 -4128057 -4177206 -4196846 -4241126 -4095661 -3982718
-1629 -3982718 -4143754 -4008258 -4095834 -4178608 -4152190 -4122999 -4108387 -4030710 -3991606 -4070205 -4109323 -4143168
-1641 -4143168 -4063637 -4215079 -3978784 -4043769 -4209614 -4192940 -3971078 -4074911 -4115382 -4077347 -4075540 -4098566
-1653 -4098566 -4046073 -4094621 -4047780 -4117128 -4156066 -4181386 -4117031 -4143096 -4139704 -4134589 -4027666 -4051556 -4094026
-1666 -4094026 -4145384 -4171458 -4031609 -4121014 -4078204 -4072709 -4120890 -4081469 -4101832 -4072982 -4075688 -4024611 -4022847
-1679 -4022847 -4005522 -4252023 -4162128 -4135854 -4086021 -4021158 -4009734 -4063824 -4042986 -4124957 -4116485 -4077326 -4162940
-1692 -4162940 -4123906 -3996120 -4078468 -4110228 -4062985 -4081064 -4107899 -4205737 -4134637 -4027734 -4036967 -4054638
-1704 -4054638 -4095564 -4033894 -4097244 -4043282 -4093705 -4133251 -4125887 -4123085 -4184534 -4197819 -4161754 -4046154 -4002181
-1717 -4002181 -4077295 -4037873 -4038814 -4087750 -3994633 -3954255 -3899533 -3945101 -3949824 -3971321 -3959812 -4072838 -4067241
-1730 -4067241 -4017668 -4015993 -4068516 -4075027 -4073927 -4074835 -4102005 -4091548 -4103643 -4107037 -4010041 -4004493 -4074062 -4000129
-1744 -4000129 -4033234 -4025548 -4002438 -4052941 -4089018 -4048973 -4133155 -4178494 -3997681 -4050755 -4060799 -4053008 -4116304
-1757 -4116304 -4179449 -4109366 -4078026 -4049507 -4069042 -4086293 -4060320 -4032739 -4067598 -4077468 -4014872 -4028319 -4066447
-1770 -4066447 -3964770 -3970936 -4060013 -4138239 -4091429 -4068939 -4045943 -4059883 -4135734 -4142932 -4102221 -4172093 -4126611
-1783 -4126611 -4188487 -4132695 -4037089 -4107514 -4072609 -4134442 -4118392 -4082176 -4021751 -4119952 -4108673 -4062807 -4029913
-1796 -4029913 -4142688 -4183128 -4142702 -4153361 -4117374 -4087577 -4018899 -4098863 -4098131 -4130373 -4130848 -4096624 -4165845
-1809 -4165845 -4145208 -4012773 -4032693 -4060922 -4128773 -4136877 -4092117 -4061077 -4090978 -4097427 -4029530 -3996250 -4086744
-1822 -4086744 -4097939 -4279286 -4100860 -4076077 -4113113 -4104759 -4223916 -4143833 -4063325 -4092941 -4069788 -4263802
-1834 -4263802 -4145839 -4244497 -4371572 -4349021 -4130342 -4098354 -4043675 -4111275 -4084445 -3994155 -4069271 -4057367
-1846 -4057367 -4085423 -3966061 -4038678 -4012626 -4028758 -4038984 -4066712 -4019060 -4020847 -3925626 -4215988 -4089979
-1858 -4089979 -4120524 -4038692 -4032185 -4019253 -4088766 -4024675 -4081500 -4065009 -4073999 -4069618 -3947740 -4044599 -4075465
-1871 -4075465 -4037723 -3986669 -4055535 -4074666 -4037287 -4061613 -4034288 -4033361 -4051307 -4069876 -4049738 -4053824 -4119490
-1884 -4119490 -4145462 -4160923 -4068133 -4080530 -4097491 -4107106 -4082222 -4173385 -4172018 -4099233 -4101475 -4065743 -4108961
-1897 -4108961 -4055813 -3997295 -3993663 -4039804 -3941375 -3906268 -3962465 -4015050 -4029465 -3915142 -4043047 -4079165
-1909 -4079165 -4040723 -4340955 -4141301 -4142570 -4135580 -4004075 -4049435 -4003407 -3973257 -3979809 -3964363 -3987103
-1921 -3987103 -4090540 -4143619 -4107868 -4122221 -4132933 -4102972 -4121320 -4024019 -3994465 -4106415 -4022168 -4008422
-1933 -4008422 -4019359 -4058759 -4074568 -4018983 -4028838 -4064034 -3991500 -3982464 -4066065 -4061470 -4014567 -4072548 -4112508
-1946 -4112508 -4080901 -4024851 -4069548 -4065426 -4030142 -4112146 -4119196 -4034863 -4013479 -3972845 -4013926 -3948713 -3942374
-1959 -3942374 -4088370 -4050645 -3997195 -4025881 -4045782 -3963872 -4016928 -3960683 -4045948 -4128944 -4206148 -4023631
-1971 -4023631 -3915874 -4128834 -4125163 -4038173 -4154900 -4038029 -4106969 -4044936 -4147249 -4049336 -4130902 -4066864
-1983 -4066864 -4156323 -4056103 -3935820 -3991850 -4074208 -4071226 -4102712 -4182367 -4147103 -4136196 -4016885 -4033917
-1995 -4033917 -3995173 -4103817 -4125945 -3928433 -4066067 -4161120 -4093596 -4019129 -4097208 -3978922 -4079253 -4047111
-2007 -4047111 -4081441 -4053761 -3936027 -3909958 -4036748 -4031321 -4066557 -4015545 -4000673 -4053580 -4067418 -4137465
-2019 -4137465 -4084319 -4083581 -3969789 -3968045 -3949887 -4032673 -4082855 -4056708 -4150555 -4064153 -3972713 -4046165 -4130748
-2032 -4130748 -4104590 -4143222 -4068890 -4040774 -3985894 -3983343 -4025984 -3993223 -4019500 -4023670 -4006217 -3982737 -3936019
-2045 -3936019 -3920356 -4051807 -3938640 -3955672 -3905176 -3926117 -4067525 -4107827 -4056740 -4060349 -4057297 -3991260
-2057 -3991260 -4005302 -4035978 -4095513 -4073227 -4086899 -4063680 -4020644 -4043495 -4015236 -4098494 -4079838 -4070989 -4106567
-2070 -4106567 -4123213 -4033398 -4090151 -3986970 -3900463 -4009158 -4006230 -4062922 -3981723 -4029902 -4052306 -3952289
-2082 -3952289 -4018388 -3949577 -4032786 -3984886 -4082048 -4014043 -3970114 -4025331 -4078455 -3989277 -3966378 -4025342 -3986416
-2095 -3986416 -4016857 -4008029 -4045168 -4010339 -4103091 -4170825 -4052473 -3986042 -4030786 -3941750 -4038021 -4033562 -4009821
-2108 -4009821 -3993665 -3981431 -3999479 -3895028 -3875846 -4010994 -3915194 -4116663 -4132492 -4093517 -4086042 -3844135
-2120 -3844135 -4109610 -4113112 -4023062 -4081222 -4105429 -4044845 -4031624 -4014458 -4080973 -4020671 -4033584 -4022747 -3991357
-2133 -3991357 -3952994 -4025337 -4013150 -3970046 -3970473 -3983841 -3988425 -4022007 -4020969 -3995405 -4000032 -3998386 -4030861 -4018270
-2147 -4018270 -3994833 -4064656 -4019548 -4001914 -3993424 -3982837 -3969248 -4022478 -4113903 -4076607 -4054192 -4000278 -4011890
-2160 -4011890 -4006205 -4016647 -3962845 -3938548 -3968239 -3955785 -3993055 -4022899 -3922123 -3989940 -4096317 -4100797 -4079109
-2173 -4079109 -3981732 -3903620 -4085104 -4030203 -4015809 -3929425 -3895341 -3947156 -3867509 -3987339 -4034104 -4068103
-2185 -4068103 -3979533 -4023548 -4021522 -4060210 -4024303 -3967048 -3951449 -4029432 -3960815 -3971557 -4051095 -3970637 -3944849
-2198 -3944849 -3939679 -3996846 -3974564 -3990071 -3991330 -3992713 -4013057 -4030034 -3870643 -4002810 -4056534 -4042511 -3969355
-2211 -3969355 -4037697 -4003056 -3950628 -3982086 -4017341 -4128836 -4054118 -4026247 -4023857 -3987411 -3984334 -4026382 -3980918
-2224 -3980918 -3970203 -3981774 -4010904 -3960254 -3995102 -3902561 -3981482 -4035834 -3996791 -4043769 -4050890 -4003522 -3919664
-2237 -3919664 -3919458 -4016986 -4030452 -4045056 -4016324 -4005160 -4042763 -3959485 -3950457 -3982505 -3968621 -3950654 -4117993
-2250 -4117993 -3976120 -4025979 -3979570 -4043153 -4055306 -4031305 -3875366 -3948220 -3985479 -4028383 -3989568 -4006216
-2262 -4006216 -4028887 -4081020 -4042633 -3846363 -3988096 -3995388 -4025466 -3967120 -3976651 -4046944 -3983822 -4014956 -4015625
-2275 -4015625 -4060646 -4037255 -3966357 -3999830 -3885980 -3997891 -4029947 -4046165 -3943500 -3731755 -3948260 -3864493
-2287 -3864493 -4025133 -4036419 -3959472 -3931504 -3948790 -4004980 -4002091 -3987397 -3920991 -3808618 -3838090 -3881480
-2299 -3881480 -3930124 -3932291 -3891606 -3857084 -3921112 -3886198 -3970811 -4006102 -3993201 -3994873 -3991596 -3939502 -3920590
-2312 -3920590 -3987514 -4023016 -4000087 -3945627 -3947880 -3913087 -3929854 -4016444 -3975393 -3955509 -3956300 -3972540 -4044123
-2325 -4044123 -3956583 -4055840 -4000858 -4021273 -4004519 -3963236 -3906390 -3991843 -3954985 -4059897 -3972636 -3951363
-2337 -3951363 -3982281 -3882780 -3898718 -3937242 -4004742 -3991667 -4001173 -3954319 -3998028 -3952229 -3976274 -4001921 -3923041
-2350 -3923041 -3957614 -3957044 -4017720 -4057719 -4039784 -4021170 -3952944 -3974572 -3859743 -3985947 -3803265 -3983147
-2362 -3983147 -3992692 -3971526 -3984257 -3860444 -3915612 -4022225 -4055889 -4111064 -4118211 -4001115 -3983967 -3749948
-2374 -3749948 -3882521 -4025047 -4064471 -4079081 -4040224 -4035501 -3938625 -4044394 -3993397 -4000124 -3989996 -4039159
-2386 -4039159 -3971920 -4151648 -4032070 -4030330 -4049419 -4032132 -4083272 -4050169 -3977438 -3930190 -3894133 -4035742
-2398 -4035742 -4029050 -4001822 -3911683 -3912223 -3897398 -3851132 -3923542 -3939905 -3951004 -3970946 -3936867 -4029648 -4013629
-2411 -4013629 -3975417 -3831198 -3803294 -3919763 -4034755 -4108752 -4093966 -4111062 -4069798 -4099881 -3998491 -3972195
-2423 -3972195 -3923551 -3895552 -3895730 -3940558 -4059564 -4132673 -4051501 -3952145 -4024568 -3837539 -3955317 -4074051
-2435 -4074051 -4149296 -4176523 -4116373 -3826017 -3850418 -3942417 -3991969 -3898330 -3981236 -4017420 -4074394 -4003598
-2447 -4003598 -4100407 -4048182 -3971215 -3915392 -3865059 -3966605 -3981512 -4052308 -3978909 -4027192 -3923847 -3886859
-2459 -3886859 -3840706 -3959510 -3917537 -3991452 -4014572 -3984634 -4044898 -3995064 -4006865 -4050752 -3979916 -3973140 -3935199
-2472 -3935199 -4026284 -3986313 -3947133 -4012094 -4033214 -3857182 -3973426 -3827626 -3981400 -3945142 -3981087 -3982944
-2484 -3982944 -3960932 -3960271 -4084335 -3985045 -4021058 -3982114 -3878487 -3859268 -4015683 -3880475 -3976306 -3972068
-2496 -3972068 -3990859 -3990256 -4023988 -3956030 -3846310 -4004057 -4004300 -4012652 -4023461 -4002417 -3958441 -3943253 -3866139
-2509 -3866139 -3935021 -3942076 -3909206 -3964280 -3978975 -3990671 -3972676 -3923567 -4029319 -3997003 -3941737 -4056785
-2521 -4056785 -3991706 -4065390 -4037183 -3924195 -3931654 -3948054 -3931247 -3883841 -3981914 -3957302 -3988431 -3929372
-2533 -3929372 -4029857 -3983752 -3991435 -4045421 -4005261 -3949829 -3954916 -4075640 -4014395 -4013029 -4043378 -3990912 -3984720
-2546 -3984720 -4073344 -3982729 -3968875 -3939978 -3975085 -4035726 -4006167 -4019490 -4016383 -3942260 -4118352 -4088699 -3997654
-2559 -3997654 -3966201 -3916002 -3962599 -3922850 -3982640 -4079606 -4108012 -4043476 -4030169 -4000855 -3992999 -3993029 -3934141
-2572 -3934141 -4011132 -3947353 -3950687 -3911240 -3921244 -4003416 -3999664 -3950161 -3983410 -3911575 -3985722 -3957297 -3919909
-2585 -3919909 -4015737 -3868334 -3876329 -3950731 -3963457 -3898154 -3892106 -3971734 -3911454 -3931504 -3938155 -3846889 -3935299
-2598 -3935299 -3991339 -3949237 -3904431 -4030009 -4002255 -4004353 -3994706 -3997365 -3955092 -4026944 -4015781 -4019052 -4027019
-2611 -4027019 -4005669 -4013966 -4107198 -4078760 -3913609 -3906239 -3854413 -3902701 -3930208 -3947878 -3972299 -4011295 -3924177
-2624 -3924177 -3983493 -3964360 -3995783 -3943878 -3948812 -3952461 -3910760 -3940769 -3947153 -3945907 -3962908 -3932601 -3968868
-2637 -3968868 -3904925 -3995796 -3904156 -3961543 -3970927 -3943562 -3967528 -4016660 -3961781 -3917384 -3951843 -3936421 -3914347
-2650 -3914347 -3848415 -3899511 -3957467 -3966443 -4068022 -3984850 -3927005 -3958216 -3991896 -3913927 -3937845 -3930527 -3948460
-2663 -3948460 -3869985 -3896572 -3949522 -3971407 -3947839 -3802858 -3921617 -4036471 -4037635 -4021097 -4038069 -4004503
-2675 -4004503 -4011334 -4012225 -4000912 -4050283 -4055480 -4025672 -4088494 -4061987 -4064110 -4042988 -4024501 -4010271 -4099276
-2688 -4099276 -3997366 -3999303 -4018923 -3975872 -3948205 -4010577 -3938789 -3958485 -3982596 -3997067 -4026787 -4105510 -4112355
-2701 -4112355 -4029240 -3981890 -4008986 -4005723 -3935909 -4016388 -4010097 -4006691 -3994122 -4002009 -3973431 -4004400 -3964476
-2714 -3964476 -4020328 -3980849 -3980072 -3977712 -3838841 -3816223 -3978399 -3907644 -3880519 -3905515 -3955711 -3979811 -3992497
-2727 -3992497 -3918793 -3929746 -3943513
-2730c943513  $$ checkpoint
##PAGE= N=2
##DATA TABLE=(X++(I..I)), XYDATA
13653 -3530321 -3544575 -3478447 -3447360 -3416578 -3484373 -3523148 -3483820 -3486969 -3438583 -3476584 -3601067 -3551308 -3528177
13640 -3528177 -3562147 -3469768 -3519851 -3472052 -3498939 -3405353 -3400808 -3403762 -3356800 -3398207 -3480311 -3454464 -3515814
13627 -3515814 -3430431 -3488287 -3543876 -3613520 -3598494 -3569920 -3519888 -3449061 -3436770 -3489961 -3470375 -3474896 -3498773
13614 -3498773 -3470650 -3530801 -3539533 -3501737 -3482000 -3435219 -3429711 -3478760 -3422686 -3371645 -3387228 -3406113 -3374723
13601 -3374723 -3456267 -3570229 -3381238 -3533354 -3494751 -3507092 -3516482 -3426806 -3348791 -3581202 -3517243 -3526656
13589 -3526656 -3471458 -3433451 -3415388 -3401109 -3406366 -3433460 -3450783 -3345125 -3394874 -3452304 -3466828 -3375899 -3410198
13576 -3410198 -3498061 -3444914 -3281357 -3281044 -3282112 -3385710 -3349795 -3376925 -3394386 -3382836 -3385111 -3364349 -3476133
13563 -3476133 -3471636 -3344098 -3384939 -3350791 -3289395 -3335911 -3416071 -3342620 -3294981 -3292070 -3395115 -3374897
13551 -3374897 -3274016 -3328699 -3366618 -3371496 -3357530 -3306655 -3362170 -3372555 -3408127 -3325861 -3375744 -3375241 -3443615
13538 -3443615 -3288193 -3293297 -3375137 -3338205 -3270491 -3287430 -3356262 -3365818 -3170219 -3333986 -3247570 -3297252
13526 -3297252 -3280511 -3206334 -3268613 -3253208 -3294199 -3264028 -3507641 -3254616 -3251606 -3285241 -3181606 -3273385
13514 -3273385 -3221699 -3176579 -3314201 -3222136 -3242441 -3241521 -3196973 -3326190 -3221847 -3351598 -3279337 -3220238
13502 -3220238 -3254812 -3292872 -3326495 -3345368 -3312168 -3291724 -3297965 -3198957 -3195416 -3148069 -3148908 -3250249 -3128044
13489 -3128044 -3254138 -3212236 -3185060 -3183667 -3211960 -3250020 -3260746 -3180235 -3253077 -3227650 -3197346 -3143213 -3124106
13476 -3124106 -3138678 -3073154 -3085318 -3161889 -3069040 -3109019 -3123510 -3030432 -3132372 -3116608 -3199181 -3180852
13464 -3180852 -3155903 -3243068 -3184803 -3140705 -3066576 -3088675 -3169419 -3193260 -3162016 -3090445 -3044110 -3056150 -3097921
13451 -3097921 -3128325 -3164436 -3186275 -3101067 -2979205 -3177683 -3136477 -3072673 -3113850 -3117933 -3113874 -3160654 -3099742
13438 -3099742 -3204948 -3102379 -3167964 -3104869 -3103432 -3051206 -3092730 -3061428 -3032236 -3183562 -3096450 -3158101
13426 -3158101 -3056388 -3187128 -3078842 -3036079 -3080355 -3169404 -3189025 -3160351 -3085813 -3152402 -3277156 -2955627
13414 -2955627 -2984302 -3169406 -3066549 -3166880 -3134865 -3062256 -3119161 -3088351 -3010200 -3014842 -3053585 -2959912
13402 -2959912 -3045496 -3031039 -3066977 -3063326 -2984675 -2943144 -2979780 -3077472 -3057892 -3023866 -2967891 -2957379 -2964124
13389 -2964124 -2909871 -2968610 -3043813 -3032177 -3063619 -2943092 -2958445 -3044425 -3024437 -3054084 -3019439 -3087192 -3077290
13376 -3077290 -3032755 -2989679 -3024956 -3021474 -2889613 -2926260 -2888391 -2744765 -2908755 -2974973 -3101721 -3150165
13364 -3150165 -3068793 -2984968 -2899021 -2738896 -2932465 -3039960 -3021143 -2913356 -2762570 -2728691 -2836216
13353 -2836216 -2971655 -2971749 -3011926 -2947454 -2922159 -2846422 -2846654 -2894704 -2915325 -2881428 -2758016 -2847454 -2878175
13340 -2878175 -2895915 -2845014 -2802089 -2858111 -2871198 -2933760 -2912239 -2946306 -2854440 -2836380 -2839397 -2893096 -2808659
13327 -2808659 -2719271 -2785915 -2823640 -2861841 -2881562 -2801204 -2819836 -2883105 -2858484 -2810474 -2891859 -2856941 -2898911
13314 -2898911 -2838125 -2842976 -2869698 -2838551 -2935808 -2834874 -2888230 -2868158 -2861669 -2790044 -2775000 -2765670 -2809772
13301 -2809772 -2804580 -2809267 -2796496 -2783538 -2745056 -2821515 -2928307 -2949147 -2716787 -2675693 -2689999 -2805314
13289 -2805314 -2855868 -2768161 -2807732 -2853777 -2847966 -2779980 -2799288 -2808723 -2827272 -2913236 -2867298 -2833923 -2740269
13276 -2740269 -2772595 -2750235 -2756884 -2800858 -2751684 -2779063 -2723441 -2692142 -2871316 -2850424 -2779876 -2670743
13264 -2670743 -2736295 -2779331 -2820497 -2855958 -2824266 -2799100 -2713904 -2782230 -2780610 -2819906 -2758521 -2665654 -2834839
13251 -2834839 -2754364 -2795263 -2737679 -2762705 -2738793 -2769097 -2723206 -2789790 -2682702 -2754840 -2775479 -2722915 -2719588
13238 -2719588 -2826843 -2745847 -2784442 -2748833 -2640685 -2690305 -2729163 -2697424 -2724250 -2743424 -2720119 -2649625
13226 -2649625 -2575677 -2644461 -2623142 -2768137 -2667030 -2515808 -2704313 -2648130 -2510441 -2625423 -2708212
13215 -2708212 -2720073 -2651560 -2690271 -2487495 -2640342 -2749973 -2495048 -2608284 -2700977 -2651557 -2639353 -2563259
13203 -2563259 -2612383 -2597632 -2576313 -2649263 -2559542 -2555226 -2592942 -2725668 -2732793 -2656994 -2621278 -2527087 -2515295
13190 -2515295 -2603303 -2659183 -2685061 -2546971 -2599313 -2640634 -2654602 -2588973 -2636916 -2669648 -2654034 -2650366 -2657725
13177 -2657725 -2561034 -2549715 -2467729 -2497560 -2497410 -2597248 -2622040 -2536443 -2612602 -2580529 -2535065 -2556890 -2548984
13164 -2548984 -2586621 -2570761 -2693212 -2631178 -2575715 -2592843 -2657270 -2606532 -2528358 -2597272 -2584868 -2498664
13152 -2498664 -2613735 -2531752 -2629796 -2547034 -2549204 -2589406 -2547714 -2657237 -2597422 -2525295 -2623759 -2564002
13140 -2564002 -2593414 -2609494 -2680667 -2553921 -2486763 -2583322 -2630653 -2516540 -2487166 -2490481 -2533838 -2490450
13128 -2490450 -2578411 -2532223 -2569977 -2525028 -2481049 -2583900 -2637047 -2464088 -2533061 -2457530 -2554759 -2459738
13116 -2459738 -2525118 -2580739 -2610457 -2504970 -2448418 -2470448 -2485129 -2567806 -2449877 -2552005 -2465243 -2554903
13104 -2554903 -2510948 -2444742 -2426037 -2527013 -2486172 -2415842 -2422161 -2536637 -2483508 -2423197 -2415499 -2493398 -2477602
13091 -2477602 -2495716 -2502895 -2439928 -2446880 -2453912 -2447006 -2453620 -2523948 -2505723 -2411112 -2481452 -2439853 -2418694 -2410186
13077 -2410186 -2397440 -2419164 -2350632 -2355971 -2477229 -2421592 -2340542 -2373688 -2424849 -2416992 -2452217 -2531439 -2497048
13064 -2497048 -2480101 -2471140 -2428674 -2387077 -2438787 -2351207 -2382979 -2399668 -2307164 -2412268 -2377768 -2340436 -2407544
13051 -2407544 -2380849 -2429782 -2400007 -2413794 -2435505 -2404343 -2446361 -2549690 -2425143 -2362616 -2331493 -2292577
13039 -2292577 -2352338 -2288417 -2343026 -2438129 -2417701 -2347047 -2330371 -2340264 -2488168 -2425639 -2373022 -2444005 -2386259
13026 -2386259 -2275977 -2442016 -2417702 -2448124 -2435189 -2454361 -2425104 -2430883 -2316982 -2280699 -2382534 -2294816
13014 -2294816 -2318082 -2259950 -2317815 -2209951 -2294813 -2225481 -2379888 -2294719 -2306314 -2329746 -2359950 -2333775
13002 -2333775 -2252952 -2288805 -2322071 -2360120 -2342384 -2296345 -2278273 -2337220 -2284284 -2266487 -2189922 -2314623 -2316174
12989 -2316174 -2313180 -2290176 -2313579 -2227752 -2231908 -2215644 -2283912 -2254678 -2263070 -2305181 -2289708 -2272182 -2290852
12976 -2290852 -2268524 -2293166 -2267336 -2250270 -2211304 -2285213 -2296656 -2307751 -2281056 -2398281 -2291891 -2250981
12964 -2250981 -2265517 -2262923 -2304351 -2257536 -2286788 -2281048 -2220528 -2267245 -2255555 -2208900 -2224271 -2219230 -2273622
12951 -2273622 -2195150 -2198793 -2173168 -2172700 -2172411 -2177775 -2146055 -2314166 -2262414 -2189028 -2221902 -2154045 -2118695 -2196880
12937 -2196880 -2218928 -2161182 -2118474 -2137911 -2151670 -2187738 -2170484 -2247434 -2292478 -2345748 -2201120 -2001770
12925 -2001770 -2199053 -2340252 -2146358 -2196310 -2248804 -2311227 -2299894 -2306821 -2258019 -2242709 -2225572 -2234395
12913 -2234395 -2217987 -2270703 -2230038 -2185370 -2118333 -2112453 -2020305 -2134137 -2235577 -2151621 -2132925 -2236259
12901 -2236259 -2253255 -2299553 -2145283 -2175576 -2073611 -1909073 -1996962 -2133613 -2160777 -2174538 -2194296 -2160155
12889 -2160155 -2084742 -2051092 -2211624 -2206468 -2188150 -2178603 -2177203 -2202106 -2195769 -2134831 -2168965 -2160448 -2191469
12876 -2191469 -2148604 -2073376 -2111982 -2139063 -2127381 -2026181 -2143305 -2116733 -2145624 -2009464 -2059704 -2142790
12864 -2142790 -2111082 -2107069 -2107370 -2062305 -2072298 -1965512 -2103286 -2057291 -2077230 -2062257 -2110502 -2046061 -2076695
12851 -2076695 -2085212 -2027986 -2001580 -2101526 -2101728 -2052544 -2305657 -2126188 -2164246 -2161160 -2058038 -2127223 -2136867
12838 -2136867 -2200575 -2127481 -2010307 -1976131 -2017983 -2179795 -2063106 -2030286 -2041407 -1985300 -2006359 -2038472
12826 -2038472 -2107929 -2121717 -2078625 -2037047 -1920023 -2031610 -2046001 -2113616 -1999615 -2023232 -1997210 -1994216
12814 -1994216 -2054139 -1945997 -2051487 -1978635 -2011075 -1996068 -1927502 -2004908 -1943257 -2039801 -2105015 -2022513
12802 -2022513 -2056248 -2001020 -2028006 -1974558 -2049268 -2028749 -2027341 -2036041 -1977075 -1988726 -1958208 -2044252 -2005238
12789 -2005238 -1954559 -2002082 -2093998 -2138369 -2121718 -2029948 -2019218 -1950883 -2046478 -2036951 -1955639 -1898036 -1913621
12776 -1913621 -1876787 -1989975 -1982612 -1926113 -2010545 -1953960 -1951041 -2001303 -1985852 -2002041 -1938124 -1911095 -2021153
12763 -2021153 -2015208 -1888781 -1981185 -1967370 -1957873 -2079329 -1902769 -1971278 -1980628 -2072578 -2073129 -1991728 -2093715
12750 -2093715 -2013818 -1977836 -2048875 -2035965 -1984720 -1875856 -1957409 -2005424 -1874357 -1883894 -1873110 -1885824
12738 -1885824 -1952308 -2056150 -1972537 -1928562 -1872564 -1944586 -1875638 -1975162 -2006892 -1967014 -1963636 -2010898 -2012655
12725 -2012655 -1798908 -1893522 -1897901 -1955437 -2006345 -1911591 -1861906 -1872518 -1888973 -1891923 -1980464 -1875709 -1883559
12712 -1883559 -1914778 -1958218 -1848938 -1809579 -1882989 -1983707 -1908063 -1928368 -1961289 -2024181 -1940147 -1857590
12700 -1857590 -1910149 -1915577 -1898272 -1857665 -1927704 -1952907 -1857166 -1853756 -1933587 -1822101 -1872769 -1925936 -2001370
12687 -2001370 -1881383 -1858269 -1884525 -1897757 -1873682 -1794529 -1870519 -1912567 -1859682 -1903823 -1781176 -1739296
12675 -1739296 -1912117 -1903430 -1896776 -1953314 -1910812 -1840748 -1860293 -1856683 -1860363 -1766315 -1858852 -1838392 -1852779
12662 -1852779 -1865759 -1817609 -1847638 -1854624 -1861105 -1802553 -1840620 -1880800 -1866356 -1864504 -1884014 -1877078 -1792680 -1783202
12648 -1783202 -1863532 -1862081 -1840114 -1794267 -1842941 -1815929 -1812285 -1756457 -1800664 -1738323 -1848029 -1820317 -1788910
12635 -1788910 -1718544 -1712175 -1722694 -1713774 -1672914 -1723073 -1801856 -1794872 -1770221 -1722319 -1703499 -1775239 -1759704
12622 -1759704 -1775120 -1709815 -1772025 -1744542 -1785124 -1771492 -1781249 -1804078 -1766697 -1738760 -1782890 -1842847 -1698950
12609 -1698950 -1642725 -1591127 -1679668 -1687639 -1713693 -1726341 -1759471 -1727703 -1707637 -1737129 -1810784 -1796504 -1853220
12596 -1853220 -1803528 -1750256 -1637564 -1690203 -1710858 -1836869 -1714551 -1789738 -1650150 -1711600 -1707692 -1740858
12584 -1740858 -1624320 -1752284 -1698081 -1770906 -1734480 -1724005 -1744182 -1724487 -1659917 -1702299 -1661219 -1694757
12572 -1694757 -1760718 -1695890 -1724808 -1810786 -1818289 -1764529 -1767959 -1711343 -1687842 -1716941 -1753417 -1734964 -1686599
12559 -1686599 -1699853 -1795472 -1671555 -1721888 -1834124 -1680893 -1594599 -1571719 -1747155 -1728424 -1650657 -1602694
12547 -1602694 -1575818 -1608847 -1702366 -1762064 -1672411 -1621067 -1740751 -1665822 -1744775 -1699059 -1668749 -1648318 -1643352
12534 -1643352 -1633515 -1640803 -1600064 -1682286 -1839296 -1726512 -1698748 -1752803 -1725058 -1701471 -1725400 -1715162 -1677186
12521 -1677186 -1699434 -1666747 -1668126 -1716212 -1747825 -1691920 -1606309 -1633503 -1648804 -1539860 -1536220 -1592514 -1646692
12508 -1646692 -1567142 -1635929 -1652176 -1555241 -1575043 -1615552 -1603248 -1628248 -1578414 -1523551 -1538792 -1693114
12496 -1693114 -1620233 -1513402 -1585779 -1605683 -1568179 -1662192 -1606846 -1629879 -1636974 -1614607 -1619730 -1578563 -1538995
12483 -1538995 -1546617 -1616990 -1625512 -1661757 -1693548 -1664714 -1643764 -1705133 -1567395 -1697373 -1544225 -1673995
12471 -1673995 -1697133 -1785441 -1680182 -1622242 -1554211 -1607014 -1629013 -1658565 -1748900 -1761445 -1470296 -1506016
12459 -1506016 -1553069 -1656921 -1481338 -1567395 -1521470 -1494690 -1539024 -1490051 -1579182 -1528832 -1541639 -1516726
12447 -1516726 -1611426 -1615456 -1648577 -1547468 -1494906 -1535155 -1568001 -1574305 -1639723 -1492117 -1622718 -1690392
12435 -1690392 -1555964 -1579491 -1496605 -1515642 -1480279 -1604757 -1584564 -1543276 -1519495 -1500362 -1360955 -1416514
12423 -1416514 -1554390 -1472080 -1532548 -1549482 -1515417 -1466307 -1466964 -1491430 -1453424 -1474821 -1487832 -1544654 -1496754
12410 -1496754 -1544857 -1569008 -1464633 -1264294 -1472365 -1481842 -1532710 -1585900 -1531528 -1543294 -1549819 -1449819
12398 -1449819 -1473046 -1601501 -1489836 -1566653 -1518749 -1624497 -1486751 -1405322 -1280451 -1401702 -1455513
12387 -1455513 -1506989 -1561124 -1518141 -1502311 -1688423 -1573332 -1394192 -1503109 -1606036 -1313174 -1578923
12376 -1578923 -1572342 -1453573 -1599036 -1468610 -1588190 -1629988 -1534596 -1529779 -1493396 -1487200 -1348367 -1422390
12364 -1422390 -1524431 -1490870 -1521976 -1469652 -1498510 -1455968 -1460021 -1404183 -1556474 -1523937 -1448552 -1511810
12352 -1511810 -1445637 -1517628 -1467531 -1498707 -1504915 -1485911 -1433603 -1427965 -1477922 -1465098 -1497326 -1500851 -1458199
12339 -1458199 -1207838 -1409648 -1455251 -1420528 -1529834 -1379826 -1467418 -1587512 -1529792 -1438626 -1433517 -1431450
12327 -1431450 -1446057 -1341710 -1425515 -1471157 -1501423 -1447910 -1448110 -1425401 -1422990 -1404724 -1352023 -1402324 -1298061
12314 -1298061 -1461835 -1555615 -1494965 -1371830 -1435593 -1550746 -1475473 -1314416 -1173949 -1643473 -1609241
12303 -1609241 -1516425 -1432137 -1442028 -1477294 -1470216 -1484296 -1438403 -1388023 -1437057 -1375250 -1357921 -1411343 -1416592
12290 -1416592 -1403844 -1387249 -1345806 -1262522 -1325440 -1345917 -1355114 -1257919 -1329065 -1364234 -1343608 -1410773 -1373997
12277 -1373997 -1241882 -1351199 -1424702 -1426039 -1314643 -1342422 -1381112 -1356513 -1451950 -1393989 -1383738 -1380618
12265 -1380618 -1368703 -1276191 -1272470 -1299520 -1398069 -1342104 -1315655 -1359487 -1307042 -1265863 -1297573 -1236762 -1277717
12252 -1277717 -1370220 -1386991 -1338383 -1461218 -1360317 -1264524 -1300692 -1256067 -1294071 -1360133 -1330444 -1325461 -1322431
12239 -1322431 -1385395 -1321588 -1269609 -1292496 -1327680 -1211974 -1231216 -1219107 -1275360 -1373362 -1347087 -1349470 -1423644
12226 -1423644 -1289779 -1331170 -1348498 -1301011 -1408206 -1381941 -1302184 -1338438 -1308711 -1287102 -1406994 -1444971
12214 -1444971 -1340773 -1231154 -1368841 -1392882 -1384255 -1294769 -1284210 -1267860 -1224159 -1177896 -1187332 -1151294
12202 -1151294 -1174733 -1392076 -1488374 -1426041 -1332093 -1336222 -1297258 -1365217 -1339802 -1224641 -1271360 -1243376 -1241603
12189 -1241603 -1228915 -1304320 -1141029 -1224458 -1340977 -1358649 -1348939 -1262445 -1307726 -1185118 -1332099 -1256052
12177 -1256052 -1297533 -1273021 -1261062 -1152842 -1184360 -1241633 -1257639 -1304928 -1265089 -1224338 -1282676 -1257557
12165 -1257557 -1268922 -1207672 -1257360 -1376145 -1282698 -1120717 -1158820 -1246050 -1150313 -1200558 -1198347 -1290291
12153 -1290291 -1264067 -1191945 -1246649 -1188453 -1168927 -1223052 -1269327 -1273817 -1224314 -1317120 -1288966 -1313164 -1268685
12140 -1268685 -1238464 -1188535 -1264592 -1165227 -1091069 -1181352 -1211712 -1231880 -1245302 -1246401 -1222022 -1209701 -1258115
12127 -1258115 -1275334 -1281568 -1165033 -1164746 -1226277 -1166169 -1192856 -1157335 -1216575 -1306311 -1305550 -1188832 -1188260 -1161365
12113 -1161365 -1188171 -1191602 -1183742 -1135301 -1201558 -1070215 -1239243 -1193749 -1281232 -1092937 -1131804 -1101043
12101 -1101043 -1171714 -1215069 -1207443 -1149796 -1115860 -1216099 -1242490 -1277524 -1085909 -1036174 -1103175 -1034079
12089 -1034079 -1214718 -1215367 -1208081 -1110996 -1186623 -1157717 -1195941 -1264907 -1193582 -1181852 -1123461 -1207270 -1174957
12076 -1174957 -1108605 -985554 -1206815 -1238262 -1168042 -1179304 -1062968 -1189721 -1142857 -1180102 -1102619 -1101941
12064 -1101941 -1146295 -1256304 -1173838 -1203211 -1230550 -1149288 -1205799 -1119061 -1046046 -1063843 -1031979 -1149458
12052 -1149458 -1090990 -1069277 -1120658 -1124543 -1020921 -1092162 -1140835 -1106327 -979669 -1031309 -1118194 -1154626
12040 -1154626 -1092867 -1079237 -1110780 -1094191 -1015919 -970936 -943745 -1063252 -1165090 -1123692 -1207972 -1140549
12028 -1140549 -1091141 -1203254 -1116083 -1129765 -1121326 -1140497 -1217142 -1220680 -998801 -1068459 -986386 -988344 -956711
12015 -956711 -995323 -1073026 -953218 -1020640 -1115295 -980799 -960415 -1025409 -997880 -1019111 -995908 -1132517
12003 -1132517 -1064642 -973829 -968900 -1037866 -1062874 -1071364 -1092072 -985918 -962987 -1143225 -1099454 -1079575 -1126521
11990 -1126521 -1023585 -1074919 -1024023 -934180 -993681 -885698 -1158130 -1149181 -1072356 -944136 -972287 -950555
11978 -950555 -924747 -1006167 -1051218 -1025587 -1051683 -1007713 -1075143 -1000964 -981194 -1047553 -1046714 -1004526 -1033416
11965 -1033416 -951367 -965378 -1009104 -981125 -1038918 -960561 -949395 -966948 -1107677 -1080484 -1132041 -1037473
11953 -1037473 -989109 -1045132 -952671 -1079161 -1078142 -1084122 -1118362 -1075631 -977293 -1094823 -1051711 -1007269 -929245
11940 -929245 -998113 -996047 -1008058 -953720 -957684 -923419 -976114 -953284 -872822 -937693 -979591 -932161 -1018842
11927 -1018842 -1067303 -926455 -933437 -1015788 -929860 -999160 -974913 -1058558 -1048203 -968587 -1039027 -1062625 -1023678
11914 -1023678 -1052720 -1034760 -857526 -987495 -1014127 -1016779 -1010828 -889524 -935030 -977431 -976322 -1026087 -928534
11901 -928534 -952235 -911431 -919006 -951244 -978944 -962375 -938503 -871830 -896255 -983718 -923959 -848153 -900903
11888 -900903 -894215 -955799 -965459 -970877 -975454 -932765 -866533 -961990 -1004653 -1031371 -973787 -970889 -922153 -992303
11874 -992303 -926618 -995226 -969781 -962461 -985299 -1036903 -1014452 -920914 -987649 -893881 -940241 -831160 -870699
11861 -870699 -1099267 -1077728 -1031415 -895340 -1012846 -1012358 -745097 -808428 -1144120 -1094233 -1093288 -1000880 -944120
11848 -944120 -986998 -1018461 -970945 -999220 -1008944 -1025872 -1027309 -925182 -904139 -884020 -855099 -867474 -945583
11835 -945583 -945948 -937652 -967125 -915803 -919086 -984858 -949746 -971048 -1050641 -995905 -911192 -900699 -846291 -897987
11821 -897987 -992442 -1000545 -921994 -882731 -925365 -876215 -943214 -764881 -758184 -842201 -872020 -881217 -970068
11808 -970068 -830870 -943295 -848801 -942588 -831498 -804980 -870976 -818378 -839805 -853882 -924953 -928654 -924286
11795 -924286 -967365 -953024 -890146 -934255 -885497 -847154 -874926 -961596 -901847 -793210 -824420 -822342 -860494
11782 -860494 -874313 -881380 -914225 -878882 -842661 -976452 -1044804 -785096 -809908 -869998 -904416 -851170 -765608
11769 -765608 -767465 -740141 -759260 -626059 -873485 -850839 -905371 -856427 -850469 -891653 -927580 -922460 -895237
11756 -895237 -852503 -842412 -880783 -873496 -944919 -816954 -869308 -864336 -875442 -780553 -839798 -886517 -840877
11743 -840877 -804261 -832794 -859313 -849088 -936591 -859086 -835749 -747695 -794724 -792715 -888048 -839624 -798785
11730 -798785 -849860 -874711 -820124 -949088 -910704 -850456 -920261 -919718 -831230 -765610 -794392 -849403 -819526
11717 -819526 -896981 -840797 -851197 -710931 -868780 -873803 -846432 -864034 -821602 -832745 -834532 -821256 -741143
11704 -741143 -761682 -756861 -793992 -831992 -809260 -865537 -797033 -844035 -852586 -774831 -796570 -701667 -704941
11691 -704941 -819296 -791743 -809375 -799848 -853061 -898988 -897310 -860072 -734984 -729025 -662416 -654568 -746159
11678 -746159 -785633 -767264 -733670 -748625 -736113 -801870 -718592 -744393 -773652 -804326 -738197 -645933 -739197
11665 -739197 -724265 -765940 -817013 -849083 -725340 -764572 -753095 -761555 -714200 -678877 -737727 -802779 -805899
11652 -805899 -735800 -722354 -750428 -741623 -861305 -864086 -803636 -844857 -891055 -779454 -598107 -904231
11640 -904231 -629143 -744207 -776290 -786067 -817508 -789677 -757708 -699319 -753637 -736478 -585227 -600694
11628 -600694 -678233 -707375 -715391 -701126 -762862 -768173 -772223 -756415 -749599 -724122 -799809 -690312 -696281 -769085
11614 -769085 -863771 -725284 -732003 -701721 -761631 -777845 -710223 -751301 -715567 -722453 -734946 -742172 -708881
11601 -708881 -749405 -632071 -682639 -616890 -599434 -656966 -703684 -692376 -606916 -600464 -605819 -640547 -658675
11588 -658675 -562398 -713154 -706218 -633190 -663391 -645298 -682641 -707863 -771471 -704960 -697098 -755195 -798616
11575 -798616 -662864 -634449 -690416 -809338 -752331 -741109 -807806 -670275 -655227 -596607 -748128 -581998
11563 -581998 -676368 -655333 -635755 -696528 -674720 -569334 -520175 -711133 -608924 -511482 -582245 -581753 -581282
11550 -581282 -648893 -614061 -598427 -680671 -730069 -739378 -799009 -615064 -534488 -559919 -493322 -676759 -667725
11537 -667725 -682021 -678245 -679111 -725005 -601831 -497900 -621889 -670380 -630268 -547182 -583560 -587871 -605486
11524 -605486 -697105 -656238 -758836 -677312 -645050 -536824 -556585 -599333 -685943 -694583 -712872 -671768 -650660
11511 -650660 -586250 -568447 -532124 -501580 -618398 -595812 -587404 -583246 -610453 -569975 -617543 -708806 -628911
11498 -628911 -645616 -650004 -719124 -730348 -764758 -689877 -597722 -690964 -754027 -556291 -543623 -635959 -688776
11485 -688776 -661699 -519912 -502785 -511293 -582855 -496717 -585481 -760666 -644929 -454829 -609014 -545647
11473 -545647 -633033 -614504 -534428 -600266 -544022 -638135 -569458 -607569 -650733 -577423 -502230 -535494 -512195
11460 -512195 -494312 -486311 -526897 -521441 -538209 -487055 -518646 -597020 -529499 -520710 -429057 -542327 -604601
11447 -604601 -648023 -682904 -693653 -679490 -551269 -615640 -578072 -598553 -553414 -556718 -578734 -570860 -600476
11434 -600476 -558911 -628754 -599787 -599146 -597568 -570528 -576505 -589473 -494306 -578896 -541432 -531237 -560457 -503987
11420 -503987 -506048 -513998 -552576 -670052 -672022 -447242 -589388 -451062 -470154 -551533 -502305 -610746
11408 -610746 -572573 -613165 -601907 -533158 -424305 -528771 -493725 -512228 -472047 -427247 -432529 -443126
11396 -443126 -564782 -569154 -557697 -562961 -486513 -502814 -537668 -530681 -563074 -528325 -468742 -535570 -490545
11383 -490545 -514386 -558772 -496946 -459337 -518730 -527795 -589235 -513099 -457186 -618171 -545350 -571110 -524490
11370 -524490 -522865 -547112 -566843 -502512 -499343 -498130 -565265 -386539 -486672 -495404 -487685 -412718 -477884
11357 -477884 -491108 -424178 -451034 -510927 -542941 -437297 -394937 -477039 -537224 -496194 -515523 -484407 -429398
11344 -429398 -455604 -448825 -461261 -475739 -488374 -406673 -388402 -344614 -486113 -494570 -431397 -537313 -538586
11331 -538586 -464494 -292376 -502395 -425483 -479672 -445957 -478232 -548176 -546309 -473717 -494648 -380664 -386101
11318 -386101 -464674 -485441 -514849 -399570 -475142 -509844 -376421 -363774 -463506 -374739 -407814 -411803 -422807
11305 -422807 -448110 -363954 -349210 -421567 -376945 -429599 -409974 -420478 -469949 -486891 -400623 -409305 -450979
11292 -450979 -484247 -399891 -423997 -435814 -389389 -418368 -416529 -531317 -406857 -451670 -425558 -436606
11280 -436606 -621943 -431109 -469451 -454963 -377127 -411046 -450007 -489052 -438850 -481527 -470870 -356564
11268 -356564 -410507 -485658 -394441 -403473 -454239 -379662 -415218 -429789 -551002 -441740 -395253 -472911 -500516
11255 -500516 -392609 -424588 -348576 -411151 -435936 -391409 -453389 -419172 -329118 -374316 -401848 -393564 -384842
11242 -384842 -419671 -413232 -391790 -310776 -289168 -304342 -286952 -296822 -199761 -231858 -358671 -353053 -362439 -356412
11228 -356412 -375120 -397374 -466490 -438364 -414353 -463828 -442294 -334136 -338010 -449267 -395327 -383905 -400608
11215 -400608 -381581 -293596 -371905 -348979 -299103 -315255 -363035 -347811 -343790 -361775 -325874 -375374 -304294
11202 -304294 -319994 -339475 -310312 -225799 -249621 -272493 -305419 -339840 -418708 -396901 -303094 -327661 -262314
11189 -262314 -229879 -298366 -287253 -336807 -295807 -358391 -312945 -351223 -240784 -331187 -276669 -307778 -311227
11176 -311227 -369555 -365180 -376494 -373622 -305425 -225395 -282331 -313262 -222240 -294607 -297072 -293224 -331286 -372782
11162 -372782 -357627 -428419 -435665 -349855 -259923 -321968 -249115 -303979 -272954 -102941 -168165 -254873 -267915
11149 -267915 -256649 -315664 -233398 -267206 -354826 -285374 -303554 -259349 -265230 -373980 -495977 -358056 -350003
11136 -350003 -307830 -323512 -320682 -322342 -207698 -223265 -255222 -303686 -286032 -263250 -184414 -260624 -277712
11123 -277712 -295227 -311753 -159951 -223756 -312752 -261537 -127672 -268537 -235576 -290129 -296858 -281864
11111 -281864 -307960 -67271 -151690 -154184 -178755 -255816 -246457 -205325 -222994 -264860 -163041 -117078 -206848
11098 -206848 -393237 -351109 -294565 -287030 -276629 -204885 -292032 -211314 -269648 -178931 -261022 -206473 -187003
11085 -187003 -203400 -238239 -151996 -269854 -175865 -228738 -245222 -190830 -145089 -224446 -202716 -134699 -171497
11072 -171497 -188371 -246162 -375684 -328738 -272328 -225741 -225447 -173146 -216090 -256200 -290832 -275472 -256688
11059 -256688 -243101 -263303 -303882 -281609 -214897 -328806 -263694 -261495 -377489 -271826 -219984 -289202
11047 -289202 -270029 -226447 -233764 -295442 -297628 -218506 -225532 -139714 -197506 -292555 -211011 -206808 -228925 -270111
11033 -270111 -256721 -212933 -190634 -254584 -132774 -117958 33009 -275616 -207822 -152647 -288180 -233283
11021 -233283 -186574 -246092 -202328 -147142 -185767 -105115 -154225 -211071 -253969 -218864 -214094 -257745 -211172
11008 -211172 -116213 -131911 -243914 -147888 -175403 -190726 -204399 -138190 -209550 -221644 -92761 -85405
10996 -85405 -204081 -215032 -276509 -247911 -188011 -208649 -152685 -172931 -220114 -259308 -212489 -158658 -176730
10983 -176730 -131340 -169636 -168217 -125012 -261985 -181626 -186916 -159367 -164953 -128426 -73102 -100911 -226601
10970 -226601 -206212 -181256 -149926 -161168 -183815 -140848 -277782 -314215 3380 -22142 -54881 -125175
10958 -125175 -163140 -195742 -191778 -188352 -179035 -65798 -264225 -117734 -142878 -186731 -97327 -114719 -202843
10945 -202843 -235736 -144357 -96816 -170600 -141155 -103980 -78748 -72416 -118745 -129170 -116404 -137271 -234198
10932 -234198 -144556 -129013 -207352 -236097 -99550 -140613 -262269 -148570 -149348 -83851 20389 -83416
10920 -83416 -27195 -109290 -151706 -115152 -107082 -70117 -79293 -157631 -80529 -194791 -169247 -151432 -115814
10907 -115814 -129042 -7185 93049 -11997 -121335 -142503 -136355 -174246 -85923 -55068 -159891 -194685
10895 -194685 -97505 -103576 -183853 -124005 -183564 -273236 -19619 -76320 -41054 -195199 -103971 -86133 -88766
10882 -88766 -122831 -150266 -176630 -118451 -64013 -94338 -115933 -59107 -102297 -152026 -241956 -73041 -42334
10869 -42334 -33881 -28024 -63352 -44364 -99897 -32902 -41855 -104166 -107539 -108414 -159706 -59735 -80565 -66905
10855 -66905 -15054 -48813 -28322 -22309 6410 -127709 -31892 -17497 -48580 -30395 -100145 -81044 -84209
10842 -84209 -83137 -95738 -101266 -79917 -73858 -29386 -55095 -65059 -118989 -48471 56916 -19564 -101260 -26532
10828 -26532 -6333 -14136 -46180 -19851 17535 76376 42702 15773 30695 15156 76506 -68478 -16152
10815 -16152 -100790 -3956 -28494 -26138 264 -3097 -130369 -32514 428 -27963 -118442 -146856 -47063
10802 -47063 27647 354 -59552 -16261 -38554 -6852 -4716 65096 -17112 -172897 -168285 -136511 -30716
10789 -30716 -69093 -102112 -73853 -118455 -109088 -104911 -113677 -60613 -26692 -29760 -70084 8317 118005
10776 118005 -18356 -39383 -64365 -15302 98487 31250 10924 -73471 -103158 -147990 -7870 26343
10764 26343 22056 30421 -28847 26514 53225 29971 -3948 29499 -68798 -85155 -14880 90418 18791
10751 18791 -8664 -14680 8622 14419 5344 47014 144579 -43965 -3344 -89545 48948 -17968 69713
10738 69713 47035 17707 98288 52411 62256 -15921 1868 82411 76259 70660 51835 200038 124198
10725 124198 112874 22703 -16671 -44348 -19894 41675 -22197 25515 54684 61454 104037 211711 120759
10712 120759 82443 80918 74843 76219 99363 114105 29978 97105 125377 40088 -15888 -67097 -42109
10699 -42109 72836 83079 -29886 -691 121503 110782 59912 53803 63720 67266 149955 96908 21631
10686 21631 57420 84225 120949 14126 74281 58692 31583 77810 58572 -112750 53641 142931
10674 142931 118992 46846 72569 54213 95085 83683 3029 36500 32287 205037 82589 42820 38678
10661 38678 128165 190068 197674 215384 223575 58041 95246 70783 165533 118366 90686 93018 109456
10648 109456 120879 37306 42201 123866 199551 147266 135558 67528 53198 107989 68915 95714 157683
10635 157683 158778 115522 148071 121636 87137 84167 112479 106783 166506 241586 94096 54235 203450
10622 203450 448506 205986 180876 220784 134333 110898 115357 204954 290098 184109 214243 212741 126924
10609 126924 105888 184495 129760 108509 157968 -61215 88196 135454 117011 164943 156001 145686 134293
10596 134293 182305 233971 166001 195666 152589 208958 171317 204410 120312 152330 126376 78876 117295
10583 117295 135450 125852 137331 135305 180906 120642 200017 154342 100497 55497 38778 155927 184242
10570 184242 183105 112483 219181 261980 148006 191608 241326 198518 243798 233875 155419 189900 183244
10557 183244 134026 292168 218449 215383 287890 185001 224532 176157 152948 75498 236105 324374
10545 324374 151794 282863 296494 133814 269611 195125 242087 257151 282899 116216 144658 217856
10533 217856 249019 224707 269964 189155 214114 163082 254212 194404 224482 236526 192985 228639 189317
10520 189317 254893 189029 179824 376050 274449 211661 87573 91818 143825 196056 207158 260449 188402
10507 188402 200935 255916 225412 173216 158347 214826 154898 147354 186113 155274 289539 241111 227027
10494 227027 153551 144663 172853 220176 216186 181316 196576 283804 278505 180009 180299 199451 153254 149243
10480 149243 177903 244673 192322 211493 234580 202645 174379 183330 172225 221625 220724 310029 263751
10467 263751 313411 244007 188805 140557 142278 220258 195353 227166 174275 138259 108179 144675 99289
10454 99289 218669 466516 343057 243558 335296 291475 199287 298704 265467 300162 181473 321768
10442 321768 265991 266030 276958 243047 262039 247125 324130 370255 353208 238345 238369 262421 275791 259840
10428 259840 234144 245703 137792 274172 192591 237064 234842 189690 285758 178703 269774 271947 215043
10415 215043 297180 210500 312981 253596 329060 186376 206231 249732 229742 339026 230949 337234
10403 337234 344860 347532 323876 288009 297039 324436 280275 300633 308129 225297 164855 254572 235065 206069
10389 206069 162166 169923 229202 290747 241321 155953 163129 247221 397707 671923 184180 191751 301646
10376 301646 312426 371289 267505 230731 311999 334261 465491 374138 359364 307269 364100 376192
10364 376192 409620 417132 343386 393772 344226 450917 421273 323302 351309 332878 367349 368552 395150
10351 395150 420643 421014 339363 392728 434323 411533 432762 372681 414065 354793 359018 384005 381169 372367
10337 372367 387757 398526 304918 387350 446292 450500 362212 403767 293998 278336 379410 422484 429734
10324 429734 364088 383931 374423 229529 394839 369302 268880 261822 349638 351731 370581 352379 338443
10311 338443 406888 336652 343958 370034 340333 394400 457072 410770 347453 369981 328380 398732 419906
10298 419906 389294 504045 443468 354276 332469 386265 351012 305374 368950 367093 382970 477996 380855
10285 380855 403483 380272 391481 405794 473975 375804 475204 539539 457288 358481 386087 351170 436458
10272 436458 466747 447833 363864 407141 412193 448765 402281 355690 441162 468424 474641 366492 428690
10259 428690 412024 359074 394081 395070 419362 256407 309588 373380 461862 469070 303423 359033 351234
10246 351234 449503 484096 542822 491650 525138 498129 361327 416368 418082 398175 423005 430085 398821
10233 398821 369174 547490 424758 357940 277998 368778 477573 439857 496229 478787 450201 373784
10221 373784 433326 330225 383105 362708 443376 535402 499794 482930 487947 431646 390305 470846 497644
10208 497644 494729 424966 410095 491105 460464 511430 449737 280648 389017 404549 398661 476859 444396
10195 444396 426408 426499 357042 442197 428458 376791 425312 495324 526062 469431 414775 505926 468446 476793
10181 476793 498152 539037 572117 483441 448256 432370 452865 400773 474831 417933 516465 528202 534939
10168 534939 555903 453470 413147 421154 492799 483140 397308 458506 559648 635973 503034 542508 509262
10155 509262 563189 490940 552101 487222 475110 510263 586386 473684 454564 409142 362734 414913 460209
10142 460209 494513 482823 457036 483522 414159 471573 453644 455342 462333 536221 454796 500864 546769
10129 546769 513541 598913 547628 453439 519642 530418 506779 489132 514457 507210 487283 507694 508701
10116 508701 450878 460300 461516 472077 420788 444764 487017 543064 523923 370969 526295 541663 483414
10103 483414 490057 500777 521201 527416 532887 514068 445151 241919 440608 562705 575993 427094
10091 427094 548452 572973 579773 737688 540149 632348 592240 535638 521624 558252 561359 555630 648534
10078 648534 550637 278456 420233 521552 570059 608126 536304 487677 512523 514267 460139 484440 486918
10065 486918 485192 453617 409303 465919 532622 548753 577896 508684 587413 583185 508027 436316 212086
10052 212086 594537 683564 650377 754268 650634 680883 610915 551774 520785 535522 599793 778289
10040 778289 544652 460338 547551 572053 488231 568835 564951 603335 577844 548212 493440 485156 553181
10027 553181 572253 562023 609676 568508 619390 560858 569373 593409 552325 546193 650544 638923 587186
10014 587186 420899 539377 616443 603755 567457 524342 513178 577479 653517 568592 558699 577229 583177
10001 583177 650759 536070 535198 586189 583914 641693 573698 553742 530713 587125 554248 599042 642740
9988 642740 616573 572564 551823 621024 643305 563795 651438 705999 652348 651067 527960 639014 447239
9975 447239 468413 548944 644626 639383 604621 635882 537896 730230 703448 587187 631936 578228 593506
9962 593506 612267 652012 696105 630668 620726 647150 612463 625908 516122 558156 629525 590207 549126
9949 549126 566194 672715 553839 481345 371656 589379 706991 780524 668925 713394 719947 710081
9937 710081 671166 632413 717957 666127 628157 634096 576534 606572 712373 639917 717611 677253 659288
9924 659288 699840 777431 671810 638682 643417 614599 735266 682567 686935 648268 617408 691143 656023
9911 656023 691665 670110 681625 638655 670121 656620 681800 652592 669946 623894 656457 732452 655245
9898 655245 722983 654629 703863 659760 673936 694848 701391 770560 714972 662509 637520 692503 650320
9885 650320 663594 588212 590372 665332 701882 783066 750458 752151 777836 709380 751218 802431 809241 770852
9871 770852 717502 718030 709869 761402 740700 791150 688564 554458 559914 641398 733404 565835 676186
9858 676186 803623 765036 682735 723432 691308 671492 630184 625469 754484 724550 666280 602495 714177
9845 714177 597381 645395 637921 652386 709258 743468 597953 689447 650086 661115 639544 660286 640276
9832 640276 580589 750556 755172 649158 715965 711749 718082 751020 791622 696664 727513 687496 753660
9819 753660 780012 741414 647713 646679 696369 640596 678545 635247 687973 663147 837369 717896 762868
9806 762868 725078 690984 661356 683943 661408 640537 680090 840497 873212 871357 907449 788878 701290
9793 701290 753795 779628 763932 759022 767167 729728 764581 762169 783533 708152 800023 816047 813608 761031
9779 761031 788268 800684 824232 877352 910076 878734 842914 799041 886296 809032 803874 751296 782795
9766 782795 664426 662211 575511 620182 656304 638348 686718 658764 671633 611167 672913 686299 738775
9753 738775 630980 621628 665863 736694 704372 570486 742574 692671 735341 747709 604436 670234
9741 670234 573228 771440 667384 705986 737801 791320 747959 813794 819789 900224 851786 855322 703971
9728 703971 703181 695360 689921 604118 501175 570799 476651 485096 431878 393810 350020 663327 910558
9715 910558 1112597 1241559 1669803 2488313 2890183 2979942 3039730 2965050 2873473 2513671 1929392
9704 1929392 1759426 1454234 628137 408727 316198 21662 -216377 -196723 -38425 -16324 235196
9693 235196 403894 582217 692443 828873 846938 878764 870780 967672 774251 750013 671497 707512
9681 707512 748453 813492 859759 846047 727001 794303 755747 728867 710005 694017 793197 834105 767631
9668 767631 760644 825149 732127 842003 854947 836992 805035 734423 839608 766281 610504 704306 668060
9655 668060 604214 620926 634371 671634 699741 833125 733921 726717 701398 732671 670003 728631 725389
9642 725389 826035 851870 735562 725019 777796 762248 745306 884700 611927 849383 703800 741466
9630 741466 786033 852163 829294 834416 803758 841399 773587 786334 684140 791627 793487 862927 871490
9617 871490 898687 804836 750587 803033 849099 845024 905358 933464 771618 898191 907899 794080 752441
9604 752441 901300 802408 772697 732615 652364 787562 765337 1014159 736442 892706 993275 758582
9592 758582 706660 855186 785056 923696 850038 1051255 943551 934280 983158 891425 922571 898983
9580 898983 861170 873007 1046682 859267 897378 837084 897354 887504 903987 904773 967325 925367 977525
9567 977525 970717 1017237 987255 801234 947651 910386 942993 921108 941852 910736 954638 958756 1014767
9554 1014767 924652 960959 1013557 1016819 1016521 1056045 986065 951062 1065139 1013856 939878 981105 979882
$$ [...]
-2730d394617  $$ checkpoint
##END NTUPLES=
##END=
