##TITLE= S#322332
##JCAMP-DX= 5.00 $$ JEOL NMR v1.10
##DATA TYPE= NMR SPECTRUM
##DATA CLASS= NTUPLES
##NUM DIM= 1
##ORIGIN= DELTA_NMR
##OWNER= organic
##SPECTROMETER/DATA SYSTEM= DELTA_NMR
##.OBSERVE FREQUENCY= 7.5568234259928E+01
##.OBSERVE NUCLEUS= ^13C
##.DELAY= (5.13E+01,5.13E+01)
##.ACQUISITION MODE= SIMULTANEOUS
##.FIELD= 7.0586013
##.FILTER WIDTH= 8.6618213122048E-01
##.ACQUISITION TIME= 1.7334272
##.SPINNING RATE= 10
##.OBSERVE 90= 9.7
##NTUPLES= NMR SPECTRUM
##VAR NAME= FREQUENCY,    SPECTRUM/REAL, SPECTRUM/IMAG, PAGE NUMBER
##SYMBOL=   X,            R,             I,             N
##VAR TYPE= INDEPENDENT,  DEPENDENT,     DEPENDENT,     PAGE
##VAR FORM= AFFN,         ASDF,          ASDF,          AFFN
##VAR DIM=  32768, 32768, 32768, 2
##UNITS= PPM,     ARBITRARY UNITS, ARBITRARY UNITS, 
##FIRST=  2.25076309295504E+02, 7.11334070812038E-06, 1.17880485358921E-04, 1
##LAST=  -2.50686752434227E+01, -8.87927847005025E-05, 3.81111838256106E-05, 2
##FACTOR=  7.63405208102439E-03, 1.08321594985904E-06, 1.08321594985904E-06, 1
##PAGE= N=1
##DATA TABLE=(X++(R..R)), XYDATA
$$ [...]
##PAGE= N=2
##DATA TABLE=(X++(I..I)), XYDATA
$$ plain form
16279 -138095588 -132010742 -37821191 27104635 2259652 -39806214 -20153039 22269439 68367896
16271 68367896 103955710 124283611 107325715 81846580 87802167 91417892 70307879 48081712
16263 48081712 52202661 69647821 67775813 90698259 149399025 136827814 53710512 10260638
16255 10260638 8170982 26640704 70715691 117253191 116153106 97726796 66495545 -7485489
16247 -7485489 -69436466 -65760494 -34059341 -39864269 -37989734 -11082598 -14965704 -48547192
16239 -48547192 -35677682 11823749 46272347 15050534 -54377551 -88319716 -60510525 -265548
16231 -265548 44328718 31859931 701426 3782858 24052075 28204659 14916252 -21788782
16223 -21788782 -970978 43200472 24655916 16000455 59391627 82868559 68715298 2386381
$$ packed form
16279a38095588O084846R4189551O4925826k4844983m2065866J9653175M2422478M6098457
16271F8367896L5587814K0327901j6957896k5479135N955587L615725k1110013k2226167
16263D8081712M120949J7445160j872008K2922446N8700766j2571211q3117302m3449874
16255A0260638k089656J8469722M4074987M6537500j100085j8426310l1231251p3981034
16247g485489o1950977L675972L1701153n804928J874535K6907136l883106l3581488
16239d8547192J2869510M7501431L4448598l1221813o9428085l3942165K7809191O0244977
16231b65548M4594266j2468787l1158505L081432K0269217M152584j3288407l6705034
16223b1788782K0817804M4171450j8544556q655461M3391172K3476932j4153261o6328917
$$ plain form
16215 2386381 -55344735 -42876630 -2794463 35067422 72137245 104456573 122239987 124957082
16207 124957082 127943170 103694764 79840969 78393550 45172487 -2607943 -63944472 -87698048
16199 -87698048 -92248317 -76951535 -63082553 -41394600 -45799509 -68874299 -61686044 -72668075
16191 -72668075 -100444466 -122515409 -111287095 -86346558 -90998453 -79113301 -46538892 -18137329
16183 -18137329 46300579 120186918 147394539 154135095 138945116 88029880 5194842 -36128359
16175 -36128359 -25015457 6749469 56455084 92465420 82514698 89808690 111223137 134425188
16167 134425188 133875758 85106314 4311619 -58179154 -137696678 -238306744 -263822284 -223357255
16159 -223357255 -169509356 -122217595 -39580325 45610618 96195626 148757737 190598932
$$ packed form
16215B386381n7731116J2468105M0082167L7861885L7069823L2319328J7783414K717095
16207A24957082K986088k4248406k3853795j447419l3221063m7780430o1336529k3753576
16199h7698048m550269J5296782J3868982K1687953m404909k3074790P188255j0982031
16191g2668075k7776391k2070943J1228314K4940537m651895J1885152L2574409K8401563
16183a8137329O4437908P3886339K7207621O740556j5189979n0915236q2835038m1323201
16175c6128359J1112902L1764926M9705615L6010336r950722P293992K1414447K3202051
16167A34425188n49430m8769444q0794695o2490773p9517524j00610066k5515540M0465029
16159b23357255N3847899M7291761Q2637270Q5190943N0585008N2562111M1841195
$$ plain form
16152 190598932 201401759 230100861 265735399 273434849 258357288 317118035 418834445
16145 418834445 358529045 159461482 59186881 39601861 71337017 126179365 124400755
16138 124400755 59546487 18815409 36642962 64818914 62092495 60880843 46994390 1370672
16130 1370672 -23994534 48348412 157298104 167457493 128554345 96294835 51320061 36173990
16122 36173990 49929907 -327389 -64486133 -44239783 44680482 97245662 131442781 135966556
16114 135966556 146580474 147698362 111153010 57346942 69051144 140652757 198299984 262514961
16106 262514961 252814986 171647561 153690403 180936335 180768385 165452421 155040042 177941985
16098 177941985 212285609 205746378 137117106 74915219 75609147 104270225 89868604 79632080
$$ packed form
16152A90598932J0802827K8699102L5634538P699450j5077561N8760747J01716410
16145D18834445o0305400j99067563j00274601j9585020L1735156N4842348j778610
16138A24400755o4854268m0731078J7827553K8175952k726419j211652j3886453m5623718
16130A370672k5365206P2342946J08949692J0159389l8903148l2259510m4974774j5146071
16122C6173990J3755917n0257296o4158744K0246350Q8920265N2565180L4197119M523775
16114A35966556J0613918J117888l6545352n3806068J1704202P1601613N7647227O4214977
16106B62514961r699975q1167425j7957158K7245932j67950j5315964j0412379K2901943
16098A77941985L4343624o539231o8629272o2201887O93928K8661078j4401621j0236524
$$ plain form
16090 79632080 121974926 167685657 152834581 105558942 83140857 104639686 136236020 123900518
16082 123900518 94949478 106525249 117104810 152474788 207120538 230329713 196602285
16075 196602285 143076352 142994339 174885835 162290142 188925775 216147168 163237588 84512852
16067 84512852 2037672 -58477928 -120737368 -165249195 -231467376 -323313099 -316429791 -244042185
16059 -244042185 -137582767 -66066934 -77333541 -94499084 -82827823 -47615397 -17011989
16052 -17011989 -179631 -7318144 -65319119 -108314189 -126166965 -117153278 -82222053 -30822202
16044 -30822202 -1509270 -17412089 -29319353 -72392487 -107436172 -64211484 9348540 48380769
16036 48380769 54852690 52864102 71940532 81576345 42888662 -10316279 -85802292 -125339047
$$ packed form
16090G9632080M2342846M5710731j4851076m7275639k2418085K1498829L1596334j2335502
16082A23900518k8951040J1575771J0579561L5369978N4645750K3209175l3727428
16075A96602285n3525933q2013L1891496j2595693K6635633K7221393n2909580p8724736
16067H4512852q2475180o0515600o2259440m4511827o6218181r1845723O883308P2387606
16059b44042185J06459418P1515833j1266607j7165543J1671261L5212426L0603408
16052a7011989J6832358p138513n8000975m2995070j7852776R013687L4931225N1399851
16044c0822202K9312932j5902819j1907264m3073134l5043685M3224688P3560024L9032229
16036D8380769O471921j988588J9076430R635813l8687683n3204941p5486013l9536755
$$ plain form
16028 -125339047 -119822777 -108743292 -75973062 -30819617 6546751 7751156 -43401286 -115821039
16020 -115821039 -133447216 -127089333 -122167660 -113409274 -111485895 -123723925 -137797193 -95858536
16012 -95858536 1428703 77225204 124250955 107063333 24385343 -27247880 -31531053 -22885960
16004 -22885960 -65199815 -114082000 -133027771 -139370924 -127678580 -76219665 -26359483 -17102474
15996 -17102474 -45941259 -92922759 -101306262 -73096317 -48976004 -30477627 -63463865 -113437118
15988 -113437118 -118215469 -93689833 -68939644 -30657259 392736 29446703 43539066 60496474
15980 60496474 71786756 116571919 149424513 117376171 49451733 17149964 30898957 58930873
15972 58930873 91695991 88919175 68467167 44653862 11140958 -16420363 15798032 65486361
$$ packed form
16028a25339047N516270J1079485L2770230M5153445L7366368J204405n1152442p2419753
16020a15821039j7626177O357883M921673Q758386J923379j2238030j4073268M1938657
16012i5858536R7287239P5796501M7025751j7187622q2677990n1633223m283173Q645093
16004b2885960m2313855m8882185j8945771o343153J1692344N1458915M9860182R257009
15996a7102474k8838785m6981500q383503K8209945K4120313J8498377l2986238m9973253
15988a13437118m778351K4525636K4750189L8282385L1049995K9053967J4092363J6957408
15980F0496474J1290282M4785163L2852594l2048342o7924438l2301769J3748993K8031916
15972E8930873L2765118k776816k0452008k3813305l3512904k7561321L2218395M9688329
$$ plain form
15964 65486361 62454620 82314587 148620595 188437443 211868212 228963097 200062895 131340547
15956 131340547 88578415 75966524 89505318 115827957 124681920 139681653 167702413 174981126
15948 174981126 134335061 88968341 53835794 55801930 80872235 59215823 -25386356 -94460088
15940 -94460088 -104914359 -77678122 -92413165 -120659760 -126354045 -124734199 -78910715 -34420505
15932 -34420505 -34473460 -82884182 -110447974 -137389176 -133451109 -99168801 -58031348 882844
15924 882844 59854195 113504572 167341953 218494687 233543876 209748433 215219560 229313011
15916 229313011 202704017 140133732 83828667 44709623 14618008 1669358 368812 -9928248
15908 -9928248 -36581276 -31524095 -6297641 -7397698 -30836891 -64128616 -89061013 -97068954
$$ packed form
15964F5486361l031741J9859967O6306008L9816848K3430769J7094885k8900202o8722348
15956A31340547m2762132j2611891J3538794K6322639Q853963J4999733K8020760P278713
15948A74981126m0646065m5366720l5132547J966136K5070305k1656412q4602179o9073732
15940i4460088j0454271K7236237j4735043k8246595n694285J619846M5823484M4490210
15932c4420505n2955m8410722k7563792k6941202L938067L4282308M1137453N8914192
15924H82844N8971351N3650377N3837381N1152734J5049189k3795443N471127J4093451
15916B29313011k6608994o2570285n6305065l9119044l0091615j2948650j300546j0297060
15908i928248k6653028N057181K5226454j100057k3439193l3291725k4932397q007941
$$ plain form
15900 -97068954 -108445303 -90648823 -50031628 -25724922 1213669 31780978 43395155 12903507
15892 12903507 -31591549 15576118 68387519 90660408 73350535 67851590 80648053 69946424
15884 69946424 38626241 -24996106 -112436512 -154098041 -135560750 -125712471 -80727941 -27956552
15876 -27956552 -31129793 -58099071 -88426590 -111936009 -146245098 -180349872 -209154007 -203938677
15868 -203938677 -174411079 -137006085 -83065087 -26614921 40400544 86372459 42230080
15861 42230080 -16811664 -35115255 -26051832 23813638 41173072 13412902 12608862 21695794
15853 21695794 42571691 97926888 111312734 90950481 49768350 -1845767 11263819 54622064
15845 54622064 71757604 36219973 2464698 -26770398 -75448693 -110967888 -97604380 -85204354
$$ packed form
15900i7068954j1376349J7796480M0617195K4306706K6938591L0567309J1614177l0491648
15892A2903507m4495056M7167667N2811401K2272889j7309873n498945J2796463j0701629
15884F9946424l1320183o3622347q7440406m1661529J8537291R848279M4984530N2771389
15876b7956552l173241k6969278l0327519k3509419l4309089l4104774k8804135N215330
15868b03938677K9527598L7404994N3940998N6450166O7015465M5971915m4142379
15861D2230080n9041744j8303591R063423M9865470J7359434k7760170q04040R086932
15853B1695794K0875897N5355197J3385846k0362253m1182131n1614117J3109586M3358245
15845E4622064J7135540l5537631l3755275k9235096m8678295l5519195J3363508J2400026
$$ plain form
15837 -85204354 -35791484 24324335 30173114 9003652 -6002384 -10201662 -27823784 -39745413
15829 -39745413 -21546017 27470206 95269369 146912724 170450542 198855772 221845133 194237947
15821 194237947 143472671 121577034 123717032 123000753 92290741 35661091 11523851 14930469
15813 14930469 8069896 -5603076 5019235 49781633 89345584 84460037 54155917 20296604
15805 20296604 -15613052 -41579282 -28586832 6704610 66955443 167108221 219039625
15798 219039625 203006554 175999250 164311016 181030832 181604219 129895277 73703796 36829040
15790 36829040 -10279814 -48073039 -35028258 33544200 105762370 156033116 124724331 34470473
15782 34470473 336330 1943464 -3080092 9776704 20830646 -14122889 -48787869 -112848118
$$ packed form
15837h5204354M9412870O0115819N848779k1169462j5006036m199278j7622122j1921629
15829c9745413J8199396M9016223O7799163N1643355K3537818K8405230K2989361k7607186
15821A94237947n0765276k1895637K139998p16279l0710012n6629650k4137240L406618
15813A4930469o860573j3672972J0622311M4762398L9563951m885547l0304120l3859313
15805B0296604l5909656k5966230J2992450L5291442O0250833J00152778N1931404
15798B19039625j6033071k7007304j1688234J6719816N73387n1708942n6191481l6874756
15790C6829040m7108854l7793225J3044781O8572458P2218170N0270746l1308785r0253858
15782C4470473l4134143J607134n023556J2856796J1053942l4953535l4664980o4060249
$$ plain form
15774 -112848118 -193590814 -220916886 -188945024 -127134784 -70209752 -20886387 10979482 7835000
15766 7835000 -29630885 -59450358 -36490243 46255869 106020205 68199819 -47441278 -137552102
15758 -137552102 -140024674 -103475989 -89876792 -108064262 -85579990 -15025668 55257514 83060743
15750 83060743 58180271 -15739705 -44753440 -26088182 42719800 88841769 99264210 108576549
15742 108576549 116018523 108022630 68561314 26657849 27036486 67539896 102776269 138749672
15734 138749672 145957533 150531797 136066330 127505520 143624380 139074132 109684620 108739014
15726 108739014 140099806 153203413 114243650 43232382 -6724259 -18164816 10852677
15719 10852677 56087107 96250014 114138829 26097068 -88729288 -124774767 -91138143
$$ packed form
15774a12848118q0742696k7326072L1971862O1810240N6925032M9323365L1865869l144482
15766G835000l7465885k9819473K2960115Q2746112N9764336l7820386j15641097r0110824
15758a37552102k472572L6548685J3599197j8187470K2484272P0554322P0283182K7803229
15750H3060743k4880472p3919976k9013735J8665258O8807982M6121969J0422441R312339
15742A08576549P441974p995893l9461316m1903465L78637M0503410L5236373L5973403
15734A38749672P207861M574264j4465467q560810J6118860m550248k9389512r45606
15726A08739014L1360792J3103607l8959763p1011268m9956641j1440557K9017493
15719A0852677M5234430M0162907J7888815q8041761j14826356l6045479L3636624
$$ plain form
15712 -91138143 -20363967 64017684 128082627 147015538 163385681 165589553 132998057 74932256
15704 74932256 10200711 -57458824 -81812296 -117105229 -158518861 -155778955 -100635709 -59358481
15696 -59358481 -97163646 -117004568 -77086597 -31859050 31676346 94960926 135208804 151839867
15688 151839867 149037759 155878072 173080970 216157711 249733188 196025758 132827147 81905182
15680 81905182 47440056 41584025 -13641072 -90974831 -118950499 -120763661 -93343024 -39724754
15672 -39724754 -23074153 -33889092 -12181139 -3061604 -43455401 -112041650 -147586352 -117679887
15664 -117679887 -36632581 32363996 45359246 18920066 -15917762 -26467684 -25291422 -30198419
15656 -30198419 -44330372 -60325589 -38509128 13865243 41452736 33842330 9302448 8142148
$$ packed form
15712i1138143P0774176Q4381651O4064943J8932911J6370143K203872l2591496n8065801
15704G4932256o4731545o7659535k4353472l5292933m1413632K739906N5143246M1277228
15696e9358481l7805165j9840922L9917971M5227547O3535396O3284580M0247878J6631063
15688A51839867k802108O840313J7202898M3076741L3575477n3707430o3198611n0921965
15680H1905182l4465126n856031n5225097p7333759k7975668j813162K7420637N3618270
15672c9724754J6650601j0814939K1707953R119535m0393797o8586249l5544702K9906465
15664a17679887Q1047306O8996577J2995250k6439180l4837828j0549922J176262m906997
15656c0198419j4131953j5995217K1816461N2374371K7587493p610406k4539882j160300
$$ plain form
15648 8142148 23871602 44115255 81926572 94957785 95206783 89950902 85332155 91966685
15640 91966685 56319973 -55254563 -138016801 -107503071 -2662435 35105792 -16080466
15633 -16080466 -46364878 -27934049 -3189981 -7073762 -52330997 -105124552 -60335047 8253814
15625 8253814 31009667 -14115310 -115237723 -173324077 -161134147 -114162601 -78131985 -30432117
15617 -30432117 -9654516 -4491861 11079385 2901531 8544071 49164173 107741078 130546551
15609 130546551 109739248 73263443 91668866 138875680 99927011 22309031 -42666491
15602 -42666491 -131700517 -228896096 -255661000 -215778193 -179468370 -177542058 -163406860 -128920001
15594 -128920001 -93591884 -115398800 -149832779 -119204822 -52639019 -34770077 -38986907 -30609750
$$ packed form
15648H142148J5729454K0243653L7811317J3031213K48998n255881m618747O634530
15640I1966685l5646712j11574536q2762238L0513730J04840636L7768227n1186258
15633a6080466l0284412J8430829K4744068l883781m5257235n2793555M4789505O8588861
15625H253814K2755853m5124977j01122413n8086354J2189930M6971546L6030616M7699868
15617c0432117K0777601N162655J5571246q177854N642540M0620102N8576905K2805473
15609A30546551k0807303l6475805J8405423M7206814l8948669p7617980o4975522
15602d2666491q9034026r7195579k6764904L9882807L6309823J926312J4135198L4486859
15594a28920001L5328117k1806916l4433979L0627957O6565803J7868942m216830Q377157
$$ plain form
15586 -30609750 -26902909 -63306443 -117643962 -149092950 -184502022 -214987489 -184817401 -123496046
15578 -123496046 -12866472 -2155999 -65652921 -89747522 -59298628 -16765644 -1206428
15571 -1206428 37655514 100837196 130254629 127921027 132783748 93582173 24655849 -6480501
15563 -6480501 -10427946 -6059485 -19457007 -20957384 -5698666 39604486 46723474 53851191
15555 53851191 96169529 118479779 164776451 188981159 181826360 165490741 183766634 257440542
15547 257440542 293428252 221051160 143691155 127146999 79900216 12178043 20456705 83802966
15539 83802966 110194692 91088982 106611321 128369043 162462435 190775528 184355450 160176326
15531 160176326 147843036 139893501 96764909 34581072 -8725358 -53114103 -112917890 -117649754
$$ packed form
15586c0609750L706841l6403534n4337519l1448988l5409072l0485467L0170088O1321355
15578a23496046J10629574J0710473o3496922k4094601L0448894M2532984J5559216
15571a206428L8861942O3181682K9417433k333602M862721l9201575o8926324l1136350
15563f480501l947445M368461j3397522j500377J5258718M5303152P118988P127717
15555E3851191M2318338K2310250M6296672K4204708p154799j6335619J8275893P3673908
15547B57440542L5987710p2377092p7360005j6544156m7246783o7722173Q278662O3346261
15539H3802966K6391726j9105710J5522339K1757722L4093392K8313093o420078k4179124
15531A60176326j2333290p949535m3128592o2183837m3306430m4388745n9803787m731864
$$ plain form
15523 -117649754 -68583680 -16679298 66711385 146452660 159982091 135215499 77922286
15516 77922286 22262570 8392186 -16974849 -55316464 -32420631 24695177 63210955 55310822
15508 55310822 41896909 61473247 76994556 67022685 20746992 -29259149 -42222298 -7925292
15500 -7925292 28533191 84825412 139654516 135870488 68740237 -4351990 -54343643 -27126953
15492 -27126953 85853510 200842499 226323029 175361372 130205103 88605284 83171522
15485 83171522 120171570 152684630 189261285 180669540 125823810 77890101 82356929 101353870
15477 101353870 87545710 56961222 34138798 44113438 -4766936 -53770579 -60353546 -41397245
15469 -41397245 -33419367 -54068546 -67210925 -82442347 -51592741 -20368349 -50755606 -101642099
$$ packed form
15523a17649754M9066074N1904382Q3390683P9741275J3529431k4766592n7293213
15516G7922286n5659716j3870384k5367035l8341615K2895833N7115808L8515778p900133
15508E5310822j3413913J9576338J5521309r971871m6275693n0006141j2963149L4297006
15500g925292L6458483N6292221N4829104l784028o7130251p3092227m9991653K7216690
15492b7126953J12980463J14988989K5480530n0961657m5156269m1599819n433762
15485H3171522L7000048L2513060L6576655q591745n4845730m7933709M466828J8996941
15477A01353870j3808160l0584488k2822424R974640m8880374m9003643o582967J8956301
15469d1397245P977878k0649179j3142379j5231422L0849606L1224392l0387257n0886493
$$ plain form
15461 -101642099 -120147398 -93526704 -76673731 -103044154 -130716119 -119754315 -92966404 -96561938
15453 -96561938 -78795118 -23712548 39546129 31987021 27399545 62320329 114912725 114449310
15445 114449310 55463597 18190729 34909877 40158866 25408114 -3414058 -44620276 -110109881
15437 -110109881 -117795035 -77749341 -50130479 -57962931 -90468906 -101875628 -96342304 -82460575
15429 -82460575 -59818317 -20748968 35002838 89441151 89870783 86184949 48525450 -13655505
15421 -13655505 -17413844 -2492268 56255128 138160931 180958491 161124775 127980348 139820352
15413 139820352 156860607 150427036 129025573 119121403 90899921 38189266 -3459132 -27822039
15405 -27822039 -24099526 9527623 16541443 -20260129 -68227553 -119642990 -177444447 -194280312
$$ packed form
15461a01642099j8505299K6620694J6852973k6370423k7671965J0961804K6787911l595534
15453i6561938J7766820N5082570O3258677p559108m587476L4920784N2592396m63415
15445A14449310n8985713l7272868J6719148N248989j4750752k8822172m1206218o5489605
15437a10109881p685154M0045694K7618862p832452l2505975j1406722N533324J3881729
15429h2460575K2642258L9069349N5751806N4438313M29632l685834l7659499o2180955
15421a3655505l758339J4921576N8747396Q1905803M2797560j9833716l3144427J1840004
15413A39820352J7040255o433571k1401463r904170k8221482n2710655m1648398k4362907
15405b7822039L722513L3627149P013820l6801572m7967424n1415437n7801457j6835865
$$ plain form
15397 -194280312 -184041831 -165154113 -122442609 -89970249 -91903044 -73668507 -17039311 37193752
15389 37193752 59745433 42736949 -48429109 -139755752 -169123548 -152692931 -114437232 -71297741
15381 -71297741 -33317986 -39326653 -30880962 -2819482 5068382 -12016393 -22796602 -37567553
15373 -37567553 -32588701 -5226539 3621199 -56153354 -144775439 -163367508 -165953226 -138327237
15365 -138327237 -86948555 -73598495 -54654236 -22571004 56108351 110926530 129440033
15358 129440033 142627686 132721144 71213071 10503959 -47520919 -95272926 -87378501 -43044274
15350 -43044274 -38427426 904788 53254316 67505309 64276025 80680353 118615670 106438239
15342 106438239 77311304 65781909 53394862 15841008 -51790610 -96399140 -108171711
$$ packed form
15397a94280312J0238481J8887718M2711504L2472360j932795J8234537N6629196N4233063
15389C7193752K2551681j7008484r1166058r1326643k9367796J6430617L8255699M3139491
15381g1297741L7979755o008667Q445691K8061480P887864j7084775j0780209j4770951
15373c7567553M978852K7362162Q847738n9774553q8622085j8592069k585718K7625989
15365a38327237N1378682J3350060J8944259L2083232P8679355N4818179J8513503
15358A29440033J3187653r906542o1508073o0709112n8024878m7752007P894425M4334227
15350d3044274M616848L9332214N2349528J4250993l229284J6404328L7935317j2177431
15342A06438239k9126935j1529395j2387047l7553854o7631618m4608530j1772571
$$ plain form
15335 -108171711 -80891367 -51384909 -18271328 23204376 99947483 128163479 166276724
15328 166276724 203414677 177512390 148836058 148699283 145864117 58635463 -44045588 -42649367
15320 -42649367 22647151 124251170 136718110 81766941 67971619 55164033 29950198
15313 29950198 17633813 24705936 34177789 39917859 15107456 -19578170 -24052855 8621643
15305 8621643 81957218 160841118 156536893 134445401 117736211 63443071 29099172 19350217
15297 19350217 -1506818 -33377199 -27727847 -29953509 -30939830 -19171193 -35063920 -22262342
15289 -22262342 62160020 138725903 141081786 95390306 70030653 46472323 33080531 44817992
15281 44817992 44548000 19779462 -5847829 850849 29918171 65405580 68075211 84563283
$$ packed form
15335a08171711K7280344K9506458L3113581M1475704P6743107K8215996L8113245
15328A66276724L7137953k5902287k8676332j36775k835166q7228654j02681051J396221
15320d2649367O5296518J01604019J2466940n4951169j3795322j2807586k5213835
15313B9950198j2316385P072123R471853N740070k4810403l4685626m474685L2674498
15305H621643P3335575P8883900m304225k2091492j6709190n4293140l4343899r748955
15297A9350217k0857035l1870381N649352k225662r86321J1768637j5892727J2801578
15289b2262342Q4422362P6565883K355883m5691480k5359653k3558330j3391792J1737461
15281D4817992k69992k4768538k5627291O698678K9067322L5487409K669631J6488072
$$ plain form
15273 84563283 145279797 191469244 212671168 252515874 260617738 237820107 225050790 145237084
15265 145237084 30244597 -67813250 -120945371 -131010654 -130064971 -92147690 -58140945 -30573860
15257 -30573860 7765547 36720715 70799752 111527293 160824025 164239527 109200976 61167283
15249 61167283 -3990900 -72187261 -82192577 -51647211 -30724841 -45488016 -94489639 -135521780
15241 -135521780 -132266916 -96732203 -56314044 -11795056 9949640 -46740043 -39861979 -4549265
15233 -4549265 -10907503 21542072 44510776 32488011 -12169740 -64377473 -35674527 9558130
15225 9558130 56507061 110672132 150121771 138356109 72949897 35939543 54105624 42772081
15217 42772081 3626615 -19126257 -23686935 -6272975 -5946163 -20044588 -829654 40357878
$$ packed form
15273H4563283O0716514M6189447K1201924L9844706Q101864k2797631j2769317p9813706
15265A45237084j14992487r8057847n3132121j0065283R45683L7917281L4006745K7567085
15257c0573860L8339407K8955168L4079037M0727541M9296732L415502n5038551m8033693
15249F1167283o5158183o8196361j0005316L0545366K0922370j4763175m9001623m1032141
15241a35521780L254864L5534713M0418159M4518988K1744696n6689683O878064L5312714
15233d549265o358238L2449575K2968704j2022765m4657751n2207733K8702946M5232657
15225I558130M6948931N4165071L9449639j1765662o5406212l7010354J8166081j1333543
15217D2772081l9145466k2752872m560678J7413960L26812j4098425J9214934M1187532
$$ plain form
15209 40357878 35525619 5646444 -37174212 -51225335 -22155218 16469794 26464604 8334274
15201 8334274 5374971 16286087 -12764877 -51988650 -60611683 -54437288 6386013 66433593
15193 66433593 83203496 57774508 -7341641 -62193872 -67656720 -78412331 -88107201 -77611227
15185 -77611227 -51000483 -14555365 -13053357 -19114850 -15053462 7918589 27440566 26374049
15177 26374049 3687893 -23495058 -11974933 8786925 6538482 -24337522 -51155183 -49744985
15169 -49744985 -47266563 -68857423 -71224797 -49246715 -46739870 -57423933 -25070114 -2009932
15161 -2009932 -15150411 -32692280 -52263601 -47507580 -33684924 -17439489 -21262096 -32324618
15153 -32324618 -44219229 -30649969 7480191 7377649 6379878 42932529 56483110 61660298
$$ packed form
15209D0357878m832259k9879175m2820656j4051123K9070117L8625012R994810j8130330
15201H334274k959303J0911116k9050964l9223773q623033O174395O0823301O0047580
15193F6433593J6769903k5428988o5116149n4852231n462848j0755611r694870J0495974
15185g7611227K6610744L6445118J502008o061493M061388K2972051J9521977j066517
15177B6374049k2686156k7182951J1520125K0761858k248443l0876004k6817661J410198
15169d9744985K478422k1590860k367374K1978082K506845j0684063L2353819K3060182
15161b009932j3140479j7541869j9571321M756021J3822656J6245435l822607j1062522
15153c2324618j1894611J3569260L8130160j02542r97771L6552651J3550581N177188
$$ plain form
15145 61660298 70724302 61473986 73505527 121209219 127174097 109814985 96388949 84534595
15137 84534595 117998563 158515673 167185776 144590831 119753221 152856378 249736429 298545499
15129 298545499 285900721 312796037 321981558 289655163 241234764 124687873 23174367
15122 23174367 -5753446 -26194868 -52350061 -69933500 -73941468 -64028077 -56755325 -25897188
15114 -25897188 -77725272 -179600138 -204024842 -136212488 -78984588 -25012657 -14505939 -22707355
15106 -22707355 -9130796 40699625 57356128 46184643 80839874 136521062 190137295 240691319
15098 240691319 242950506 175671562 62825451 6664549 9319083 58975027 103214655 99896536
15090 99896536 70441104 23041171 -2008058 -7208983 -16943849 -19116978 -20244430 -39015878
$$ packed form
15145F1660298R064004r250316J2031541M7703692N964878j7359112j3426036j1854354
15137H4534595L3463968M0517110Q670103k2594945k4837610L3103157R6880051M8809070
15129B98545499j2644778K6895316R185521l2326395m8420399j16546891j01513506
15122B3174367k8927813k0441422k6155193j7583439m007968R913391P272752L0858137
15114b5897188n1828084j01874866k4424704O7812354N7227900N3971931J0506718q201416
15106b2707355J3576559M9830421J6656503j1171485L4655231N5681188N3616233N0554024
15098B40691319K259187o7278944j12846111n6160902K654534M9655944M4239628l318119
15090I9896536k9455432m7399933k5049229n200925r734866k173129j127452j8771448
$$ plain form
15082 -39015878 -71859736 -105265058 -92095480 -22227293 39932197 57508509 18593505 -30325823
15074 -30325823 -29807574 1668735 31137508 44187390 51843471 51528482 84958035 149694080
15066 149694080 175904388 184080068 204582236 207572160 159484871 88959978 -8413752 -110672225
15058 -110672225 -158193295 -132442530 -84319724 -64087280 -69708687 -70904525 -53476388 -50176806
15050 -50176806 -62779378 -37273713 -14400621 -6810125 30388529 70121245 77627533 93747262
15042 93747262 150891277 194206265 140440361 75249067 30822570 -10973265 -51143099 -72275398
15034 -72275398 -55161463 -44453674 -44154316 -48447372 -73912181 -74885404 -28644651 -5391568
15026 -5391568 -46030550 -75525441 -63816322 -7814687 72059465 117944496 89247323 48602781
$$ packed form
15082c9015878l2843858l3405322J3169578O9868187O2159490J7576312l8915004m8919328
15074c0325823N18249L1476309K9468773J3049882P656081l14989L3429553O4736045
15066A49694080K6210308Q175680K0502168K989924m8087289p0524893r7373730j02258473
15058a10672225m7521070K5750765M8122806K0232444n621407j195838J7428137L299582
15050e0176806j2602572K5505665K2873092P590496L7198654L9732716P506288J6119729
15042I3747262N7144015M3314988n3765904o5191294m4426497m1795835m0169834k1132299
15034g2275398J7113935J0707789K99358m293056k5464809r73223M6240753K3253083
15026e391568m0638982k9494891J1709119N6001635P9874152M5885031k8697173m0644542
$$ plain form
15018 48602781 21417942 -21881922 -77342358 -107189899 -115080495 -190093366 -262212098 -266494165
15010 -266494165 -212815088 -127049377 -30898712 17172436 38197479 19049950 -27881311
15003 -27881311 -43545058 -79106228 -142928889 -220283916 -272336561 -258745132 -207862754 -145182899
14995 -145182899 -50590604 10205852 31488945 42663092 48297017 -20007370 -135178923
14988 -135178923 -190999635 -162108226 -104820840 -43554947 9650985 61863894 63505490 12906811
14980 12906811 -61694730 -112337278 -89792407 -58867932 -65506748 -37232135 18552377 53574584
14972 53574584 55509991 57510586 32482283 -11787807 -57436284 -110556712 -146412975 -153247426
14964 -153247426 -124460735 -104039491 -115878946 -126319251 -118097280 -97212510 -98551354 -71630012
$$ packed form
15018D8602781k7184839m3299864n5460436k9847541p890596p5012871p2118732m282067
15010b66494165N3679077Q5765711R6150665M8071148K1025043j9147529m6931261
15003b7881311j5663747l5561170o3822661p7355027n2052645J3591429N0882378O2679855
14995a45182899R4592295O0796456K1283093J1174147N633925o8304387j15171553
14988a35178923n5820712K8891409N7287386O1265893N3205932N2212909J641596n0598679
14980A2906811p4601541n0642548K2544871L0924475o638816K8274613N5784512L5022207
14972E3574584J935407K000595k5028303m4270090m5648477n3120428l5856263o834451
14964a53247426K8786691K0421244j1839455j0440305Q221971K0884770j338844K6921342
$$ plain form
14956 -71630012 -36393387 -91520361 -181448233 -207179209 -204530334 -172890485 -183337551 -240295242
14948 -240295242 -286093140 -267707110 -223657056 -147962375 -58226798 -33305741 -19769513
14941 -19769513 -4863118 32105516 61850147 71073221 37752537 -29120774 -49373610 -10577232
14933 -10577232 31146640 33539310 51862250 51471316 8029771 -29550809 -47079080 -83288125
14925 -83288125 -97152487 -87326279 -112048245 -155778518 -153539888 -173700052 -173639172 -110011990
14917 -110011990 -14007616 47885269 72382908 50619141 31460010 -4737165 -4172724 46186379
14909 46186379 53227799 35536555 18244706 -8498202 -13171157 10549905 34141081 57733295
14901 57733295 63284816 26557781 23155752 28661577 8053374 3953918 43181920 78093399
$$ packed form
14956g1630012L5236625n5126974q9927872k5730976K648875L1639849j0447066n6957691
14948b40295242m5797898J8386030M4050054P5694681Q9735577K4921057J3536228
14941a9769513J4906395L6968634K9744631R223074l3320684o6873311k0252836L8796378
14933a0577232M1723872K392670J8322940l90934m3441545l7580580j7528271l6209045
14925h3288125j3864362R826208k4721966m3730273K238630k0160164O0880O3627182
14917a10011990R6004374O1892885K4497639k1763767j9159131l6197175N64441N0359103
14909D6186379P041420j7691244j7291849k6742908m672955K3721062K3591176K3592214
14901E7733295N551521l6727035l402029N505825k0608203m099456L9228002L4911479
$$ plain form
14893 78093399 41114358 -23173370 -59907322 -33595882 -12440381 -30505593 -45783489 -64303803
14885 -64303803 -37276274 17237883 6761509 -36728057 -37788413 -26534499 -35273744 -50248160
14877 -50248160 -71209262 -68380417 -11707667 54067744 114828699 144576803 107574268 78842459
14869 78842459 88541350 91771325 127112002 183024137 181973805 122981040 55455788 36240276
14861 36240276 29755277 -779024 -26174019 -44715378 -42573609 -12813810 15199204 40728421
14853 40728421 73370587 79248838 53662309 71555624 160066225 227559193 202129095 148537712
14845 148537712 147737284 159732779 133529712 96514005 107024790 138638411 133856514 99942419
14837 99942419 111774965 134671244 129648280 139455165 118575413 80442909 39179863 3692250
$$ packed form
14893G8093399l6979041o4287728l6733952K6311440K1155501j8065212j5277896j8520314
14885f4303803K7027529N4514157j0476374m3489566j060356J1253914q739245j4974416
14877e0248160k0961102K828845N6672750O5775411O0760955K9748104l7002535k8731809
14869G8842459R698891L229975L5340677N5912135j050332n8992765o7525252j9215512
14861C6240276o484999l0534301k5394995j8541359K141769K9759799K8013014K5529217
14853D0728421L2642166N878251k5586529J7893315Q8510601O7492968k5430098n3591383
14845A48537712q00428J1995495k6203067l7015707J0510785L1613621m781897l3914095
14837I9942419J1832546K2896279n022964R806885k0879752l8132504m1263046l5487613
$$ plain form
14829 3692250 -348948 24859376 41842605 24906282 2212797 -12001073 -28507308 -49275021
14821 -49275021 -22355229 25014925 20859862 -24707638 -58961470 -59002430 13079485 82983938
14813 82983938 138943846 152823727 130655627 80979572 50525939 30688644 -2500157 -16798639
14805 -16798639 -23644312 -37251204 -14015264 51573276 82348322 101636073 116661987 121930302
14797 121930302 140240234 198842849 261338725 286915065 157031983 9670164 -47452336
14790 -47452336 -72155787 -107239990 -120537026 -100470741 -44439009 -30161262 -48378268 -31350416
14782 -31350416 -8831902 -24453768 -66301201 -94580862 -114219444 -166271555 -254819707 -241268787
14774 -241268787 -159654838 -78158608 -79300827 -146983304 -181834151 -152722632 -92816124 -56285978
$$ packed form
14829C692250m041198K5208324J6983229j6936323k2693485j4213870j6506235k0767713
14821d9275021K6919792M7370154m155063m5567500l4253832m0960P2081915O9904453
14813H2983938N5959908J3879881k2168100m9676055l0453633j9837295l3188801j4298482
14805a6798639o845673j3606892K3235940O5588540L0775046J9287751J5025914N268315
14797A21930302J8309932N8602615O2495876K5576340j29883082j47361819n7122500
14790d7452336k4703451l5084203j3297036K0066285N6031732J4277747j8217006J7027852
14782c1350416K2518514j5621866m1847433k8279661j9638582n2052111q8548152J3550920
14774b41268787Q1613949Q1496230j142219o7682477l4850847K9111519N9906508L6530146
$$ plain form
14766 -56285978 -22705812 44404036 109662076 119309192 106143735 84816671 88474030 76934463
14758 76934463 74796108 97293905 72015386 38823683 30631810 39282560 45745382 95886197
14750 95886197 176612642 217626473 184054351 124796433 63567305 18857145 20211240 88804660
14742 88804660 159242865 198944037 188490602 165658711 163868436 154544731 138829487 122882680
14734 122882680 127018416 111024720 48482322 15829087 64400369 112056426 157325242 196107600
14726 196107600 152775692 77507405 -4028716 -60839879 -58900740 -91159023 -119319520 -98358303
14718 -98358303 -38029018 30533344 91868614 138898555 155574589 123940719 54398051 -24603527
14710 -24603527 -38917342 -30183143 -39848662 -35125804 -42490568 -41678046 5510861 53089307
$$ packed form
14766e6285978L3580166O7109848O5258040R647116j3165457k1327064L657359j1539567
14758G6934463k138355K2497797k5278519l3191703q191873Q650750O462822N0140815
14750I5886197Q0726445M1013831l3572122n9257918o1229128m4710160J354095O8593420
14742H8804660P0438205L9701172j0453435k2831891j790275r323705j5715244j5946807
14734A22882680M135736j5993696o2542398l2653235M8571282M7656057M5268816L8782358
14726A96107600m3331908p5268287q1536121n6811163J939139l2258283k8160497K0961217
14718i8358303O0329285O8562362O1335270M7029941J6676034l1633870o9542668p9001578
14710b4603527j4313815Q734199r665519M722858p364764Q12522M7188907M7578446
$$ plain form
14702 53089307 84110454 57185464 22730679 9065979 20663513 38903100 10658403 -27618938
14694 -27618938 -35640472 4051226 28113903 7154775 19535714 111241096 156405857 149967181
14686 149967181 187975736 240767415 251671902 192263545 93269410 -5897632 -70636947
14679 -70636947 -94027886 -100152381 -116383384 -127654745 -63431048 -6114443 -11564949 -12201395
14671 -12201395 22565586 52089967 94715797 186143589 269310642 259440438 168308665 80168277
14663 80168277 33444068 8998334 -22938916 -63220943 -101561496 -142345927 -132736319 -78110600
14655 -78110600 -30820270 -4186053 7192841 -25618649 -61874019 -47144360 10724242 70544289
14647 70544289 115638201 143987107 149842077 97411724 29289208 -250003 -38028884 -67122474
$$ packed form
14702E3089307L1021147k6924990l4454785j3664700J1597534J8239587k8244697l8277341
14694b7618938q021534L9691698K4062677k0959128J2380939R1705382M5164761o438676
14686A49967181L8008555N2791679J0904487n9408357r8994135r9167042o4739315
14679g0636947k3390939o124495j6231003j1271361O4223697N7316605n450506o36446
14671a2201395L4766981K9524381M2625830R1427792Q3167053r870204r1131773q8140388
14663H0168277m6724209k4445734l1937250m0282027l8340553m0784431R609608N4625719
14655g8110600M7290330K6634217J1378894l2811490l6255370J4729659N7868602N9820047
14647G0544289M5093912K8348906N854970n2430353o8122516k9539211l7778881k9093590
$$ plain form
14639 -67122474 -44168064 -5266966 34942306 113545109 191869273 177493894 115923680 98316025
14631 98316025 130639520 151238385 134819110 85499797 25354442 -8512157 -10440633 24856008
14623 24856008 28846300 -10262212 -46478189 -43749014 -50721813 -57608885 -40023591 -25265782
14615 -25265782 -9079380 -9554224 -58142655 -83177036 -46117686 816422 34989740 65564436
14607 65564436 91237214 81038308 11443976 -94858163 -156423469 -139169032 -89681272
14600 -89681272 -43676701 -36382347 -54350484 -24356967 52573355 118750106 88949840 -15613643
14592 -15613643 -85465045 -87786566 -79247308 -55866727 -33669786 -55204913 -100242862 -120203435
14584 -120203435 -126856881 -101546986 -52969198 -48288658 -74570503 -72051388 -80066838 -117121301
$$ packed form
14639f7122474K2954410L8901098M0209272P8602803P8324164j4375379o1570214j7607655
14631I8316025L2323495K0598865j6419275m9319313o0145355l3866599j928476L5296641
14623B4856008L990292l9108512l6215977K729175o972799o887072J7585294J4757809
14615b5265782J6186402m74844m8588431k5034381L7059350M6934108L4173318L0574696
14607F5564436K5672778j0198906o9594332j06302139o1565306J7254437M9487760
14600h9681272M6004571P294354j7968137K9993517P6930322O6176751k9800266j04563483
14592a5613643o9851402k321521Q539258K3380581K2196941k1535127m5037949j9960573
14584a20203435o653446K5309895M8577788M680540k6281845K519115q015450l7054463
$$ plain form
14576 -117121301 -125522217 -120539273 -147828893 -201816402 -218960789 -174736503 -117294952 -117739248
14568 -117739248 -147230737 -168623645 -160556187 -103807310 -30744721 -19812531 -62275210 -130647203
14560 -130647203 -159444125 -141049591 -87163144 -55289963 -26048379 10060808 21823330
14553 21823330 -18723703 -99455844 -158782328 -149596964 -120168170 -107151608 -110354145 -117130234
14545 -117130234 -108693374 -44309044 349741 -22758386 -45008185 -7316362 74645054 110806907
14537 110806907 91104286 81080997 80456351 52811305 16973179 -75588223 -147942995 -127722364
14529 -127722364 -101141925 -104727494 -106381377 -67894607 1637702 71329312 116392444 142805816
14521 142805816 116479317 71534304 61455796 69044303 77800838 87358850 85579797 77465222
$$ packed form
14576a17121301q400916M982944k7289620n3987509j7144387M4224286N7441551m44296
14568a17739248k9491489k1392908Q067458N6748877P3062589J0932190m2462679o8371993
14560a30647203k8796922J8394534N3886447L1873181K9241584L6109187J1762522
14553B1823330m0547033q0732141n9326484R185364K9428794J3016562l202537o776089
14545a17130234Q436860O4384330M4658785k3108127k2249799L7691823Q1961416L6161853
14537A10806907j9702621j0023289o24646k7645046l5838126r2561402p2354772K0220631
14529a27722364K6580439l585569j653883L8486770O9532309O9691610M5063132K6413372
14521A42805816k6326499m4945013j0078508P588507Q756535R558012j779053q114575
$$ plain form
14513 77465222 84050107 95554990 91765732 62416855 19825595 -70276516 -154807571 -180520131
14505 -180520131 -171184082 -114409623 -76024947 -110916591 -150733742 -144940747 -129848998 -94482825
14497 -94482825 -60271100 -24799927 16267959 32757532 6742530 -77992746 -170710811 -178358057
14489 -178358057 -121392812 -96218119 -91396965 -48514537 29578638 79371686 81779176 78500074
14481 78500074 52749904 507033 -39751985 -55897942 -34090849 10028772 44219128 46310880
14473 46310880 20630373 -30236955 -67028568 -74560213 -82506810 -122046156 -120553551 -99878730
14465 -99878730 -96032474 -56578178 -31178967 -38529196 -56479700 -93817291 -121730170 -138762087
14457 -138762087 -134381070 -88217245 -54024957 -65454203 -111173286 -70265392 15711455 71545833
$$ packed form
14513G7465222O584885J1504883l789258k9348877m2591260r0102111q4531055k5712560
14505a80520131R336049N6774459L8384676l4891644l9817151N792995J5091749L5366173
14497i4482825L4211725L5471173M1067886J6489573k6015002q4735276r2718065p647246
14489a78358057N6965245K5174693M821154M2882428P8093175M9793048K407490l279102
14481G8500074k5750170n2242871m0259018j6145957K1807093M4119621L4190356K091752
14473D6310880k5680507n0867328l6791613p531645p946597l9539346J492605K0674821
14465i9878730L846256L9454296K5399211p350229j7950504l7337591k7912879j7031917
14457a38762087M381017M6163825L4192288j1429246m5719083M0907894Q5976847N5834378
$$ plain form
14449 71545833 95609502 67149370 21237590 -5826609 -39219381 -51545966 -63685552 -56120900
14441 -56120900 -24683197 18147032 50187575 73592543 109319995 102304250 55474823 31460988
14433 31460988 45961603 88098289 129766394 145467028 175097880 196128823 221770207 268654568
14425 268654568 266978338 197210410 181874839 203850492 212989098 220250380 189262575 142475024
14417 142475024 119217251 113147071 93359010 59124511 32137072 16665734 30749080 79510968
14409 79510968 143100720 173305120 153886855 114859203 90196094 113488947 147514993 145655759
14401 145655759 109451567 74834145 76719439 65247970 39698570 36506086 17107691 -3043105
14393 -3043105 -8170889 -6134569 7090938 27401277 38751201 67904859 116389892 123724282
$$ packed form
14449G1545833K4063669k8460132m5911780k7064199l3392772j2326585j2139586P564652
14441e6120900L1437703M2830229L2040543K3404968L5727452p015745m6829427k4013835
14433C1460988J4500615M2136686M1668105J5700634K9630852K1030943K5641384M6884361
14425B68654568j676230o9767928j5335571K1975653R138606P261282l0987805m6787551
14417A42475024k3257773o070180j9788061l4234499k6987439j5471338J4083346M8761888
14409G9510968O3589752L0204400j9418265l9027652k4663109K3292853L4026046j859234
14401A45655759l6204192l4617422J885294j1471469k5549400l192484j9398395k0150796
14393c043105n127784K036320J3225507K0310339J1349924K9153658M8485033P334390
$$ plain form
14385 123724282 61930092 36405517 61263465 53324104 31381822 21891868 31366240 69160645
14377 69160645 87969235 75763449 67858150 74022257 82381601 118605929 192192122 198831878
14369 198831878 126009536 53250944 34539509 54558762 86041439 113293879 140802195
14362 140802195 104652619 44479910 40752877 56552505 41357291 38951094 24505165 36020707
14354 36020707 98222424 137580176 119146459 98943041 99245965 85476262 66892920 69798133
14346 69798133 65625437 64963868 73603658 55490993 47897228 43353508 22965707 -158755
14338 -158755 -55321948 -94497231 -88991223 -92991342 -113377331 -125140277 -115388410 -83716854
14330 -83716854 -61953190 -62205928 -81065427 -79629658 -95397247 -137225165 -115692269 -37260606
$$ packed form
14385A23724282o1794190k5524575K4857948p939361k1942282r489954R474372L7794405
14377F9160645J8808590j2205786p905299O164107Q359344L6224328P3586193O639756
14369A98831878p2822342p2758592j8711435K0019253L1482677K7252440K7508316
14362A40802195l6149576o0172709l727033J5799628j5195214k406197j4445929J1515542
14354C6020707O2201717L9357752j8433717k0203418L02924j3769703j8583342K905213
14346F9798133m172696o61569Q639790j8112665p593765m543720k0387801k3124462
14338a58755n5163193l9175283N506008m000119k0385989j1762946R751867L1671556
14330h3716854K1763664k52738j8859499J435769j5767589m1827918K1532896P8431663
$$ plain form
14322 -37260606 -36867178 -111299004 -133860365 -106280361 -83821673 -70428929 -17847876 50958905
14314 50958905 69921789 55161763 57810933 99524371 148112476 164339289 198410634 204410038
14306 204410038 172586492 139184931 81876052 60980078 78670154 106930467 105458660 75054405
14298 75054405 50917685 67172728 107426210 105272624 52825644 -6411040 -66391593 -85223656
14290 -85223656 -75390422 -69222900 -47505410 3565342 42297301 47694836 22728730 -2838324
14282 -2838324 -41244582 -52039265 -25612822 -9291121 16173363 26147552 3803774 -31661061
14274 -31661061 -99510856 -153917553 -190977877 -198806199 -156862091 -103050306 -36070447 11668750
14266 11668750 15993214 2201852 -14769860 -8217810 22322808 109681716 208294377 225539665
$$ packed form
14322c7260606L93428p4431826k2561361K7580004K2458688J3392744N2581053O8806781
14314E0958905J8962884j4760026K649170M1713438M8588105J6226813L4071345N999404
14306B04410038l1823546l3401561n7308879k0895974J7690076K8260313j471807l0404255
14298G5054405k4136720J6255043M0253482k153586n2446980n9236684n9980553j8832063
14290h5223656R833234O167522K1717490N1070752L8731959N397535k4966106k5567054
14282b838324l8406258j0794683K6426443J6321701K5464484R974189k2343778l5464835
14274c1661061o7849795n4406697l7060324p828322M1944108N3811785O6979859M7739197
14266A1668750M324464j3791362j6971712O552050L0540618Q7358908R8612661J7245288
$$ plain form
14258 225539665 187175046 125688269 66568907 57093081 69615856 56669630 5367551 -53383750
14250 -53383750 -98595019 -106604511 -49708421 7072044 48654307 60444594 9926404 -58678579
14242 -58678579 -91134253 -95272796 -49378093 -8966500 7558959 1551762 -37400775 -106907975
14234 -106907975 -141935853 -121915181 -95556658 -74085505 -55330060 -81101076 -61679448
14227 -61679448 42604720 96354732 115094422 128789014 147089214 151148186 115977178 68234331
14219 68234331 9866819 -49684481 -80426861 -110135250 -173045287 -207507283 -168014070 -91916100
14211 -91916100 -36172993 -1391964 14912925 -1726255 -52649381 -58144047 -9303685 54468382
14203 54468382 59314181 45468087 39378197 53317753 81798187 99657922 166921184 266495969
$$ packed form
14258B25539665l8364619o1486777n9119362r475826J2522775j2946226n1302079n8751301
14250e3383750m5211269q009492N6896090N6780465M1582263J1790287n0518190o8604983
14242e8678579l2455674m138543M5894703M0411593J6525459o007197l8952537o9507200
14234a06907975l5027878K0020672K6358523K1471153J8755445k5771016J9421628
14227f1679448J04284168N3750012J8739690J3694592J8300200M058972l5171008m7742847
14219F8234331n8367512n9551300l0742380k9708389o2910037l4461996L9493213P6097970
14211i1916100N5743107L4781029J6304889j6639180n0923126n494666M8840362O3772067
14203E4468382M845799j3846094o089890J3939556K8480434J7859735O7263262R9574785
$$ plain form
14195 266495969 301038267 254365811 189105412 151859749 118953382 89730786 20288442
14188 20288442 -30511181 13317236 73733038 68500042 11943360 -146931 -37254507 -87512623
14180 -87512623 -83923357 -52972949 -44821811 -68888513 -51842868 -21905758 -38360031 -29342778
14172 -29342778 -7345963 -7353542 -50662474 -99540058 -98724060 -62898596 -39175228 -48271093 -47632357
14163 -47632357 -74535833 -126537108 -97265450 -18314661 24584199 45741790 98264502 134708175
14155 134708175 173122073 215247488 204734565 135940541 66912362 18992804 15124493 54535995
14147 54535995 87286308 91393616 67933453 64833044 82259714 108647791 100748827 112551249
14139 112551249 111066788 88139302 51722793 32063586 51294259 45822719 54414499 120198573
$$ packed form
14195B66495969L4542298m6672456o5260399l7245663l2906367k9222596o9442344
14188B0288442n0799623M3828417O0415802n232996n6556682j2090291l7107576n0258116
14180h7512623L589266L0950408Q151138k4066702J7045645K9937110j6454273R017253
14172b9342778K1996815p579m3308932m8877584Q15998L5825464K3723368r095865O38736
14163d7632357k6903476n2001275K9271658P8950789M2898860K1157591N2522712L6443673
14155A34708175L8413898M2125415j0512923o8794024o9028179m7919558l868311L9411502
14147E4535995L2750313M107308k3460163l100409J7426670K6388077p898964J1802422
14139A12551249j484461k2927486l6416509j9659207J9230673n471540Q591780O5784074
$$ plain form
14131 120198573 159043547 140934459 76790648 10134189 9597432 77298275 119318255 127205619
14123 127205619 122751868 144462666 173378827 163029085 106485393 57086073 35342707 38517640
14115 38517640 36220590 -6539024 -32626375 11667149 53576211 13914906 -60829172 -48098708
14107 -48098708 -2644412 33755574 118612336 200503099 209224314 189315988 134556307 83099652
14099 83099652 87115970 89895584 46081989 -40295959 -135989531 -158539470 -115144988 -69600324
14091 -69600324 -54812425 -42538452 -6257300 -58840617 -176566965 -260383291 -257154610 -179254236
14083 -179254236 -44946637 34718390 36922202 30869096 -51835085 -161578124 -157943969 -117340825
14075 -117340825 -66005066 8707958 47104279 106459003 159538983 156220266 140027211 145296379
$$ packed form
14131A20198573L8844974j8109088o4143811o6656459n36757O7700843M2019980P887364
14123A27205619m453751K1710798K8916161j0349742n6543692m9399320k1743366L174933
14115C8517640k297050m2759614k6087351M4293524M1909062l9661305p4744078J2730464
14107d8098708M5454296L6399986Q4856762Q1890763Q721215j9908326n4759681n1456655
14099H3099652M016318K779614m3813595q6377948r5693572k2549939M3394482M5544664
14091f9600324J4787899J2273973L6281152n2583317j17726348q3816326L228681P7900374
14083a79254236J34307599P9665027K203812o053106q2704181j09743039L634155M0603144
14075a17340825N1335759P4713024L8396321N9354724N3079980l318717j6193055N269168
$$ plain form
14067 145296379 141582701 139568484 123555034 116377427 118055163 107056073 108142441 110162338
14059 110162338 37522247 -45053481 -49212712 -34183213 -20586455 -24644226 -38121694 -52281609
14051 -52281609 -79482443 -124280745 -145063592 -141018521 -156594097 -171336947 -172771744 -116790305
14043 -116790305 -70165760 -78492344 -101885135 -143916924 -146880039 -137699217 -128903872 -10228290
14035 -10228290 112118830 138861768 153188243 154720908 114438918 117998834 159251624 181914048
14027 181914048 189685231 189540454 192046406 172128309 145486451 118689608 78153531 20525519
14019 20525519 -6337881 32411706 19324567 -24220849 -32892548 -26289520 -35062565 -29194632
14011 -29194632 -21018364 16758819 110039733 187512697 206369847 172328558 125241167 115795027
$$ packed form
14067A45296379l713678k014217j6013450p177607J677736j0999090J086368K019897
14059A10162338p2640091q2575728m159231J5029499J3596758m057771j3477468j4159915
14051e2281609k7200834m4798302k0782847M045071j5575576j4742850j434797N5981439
14043a16790305M6624545q326584k3392791m2031789k963115R180822Q795345J18675582
14035a0228290J22347120K6742938J4326475J532665m0281990L559916M1252790K2662424
14027A81914048P771183j44777K505952j9918097k6641858k6796843m0536077n7628012
14019B0525519k6863400L8749587j3087139m3545416q671699O603028q773045N867933
14011b9194632Q176268L7777183R3280914P7472964J8857150l4041289m7087391r446140
$$ plain form
14003 115795027 116088197 100590042 19307247 -16241964 27680785 54094141 32389803 2369599
13995 2369599 15393295 54640802 66358221 48059481 10160534 779366 -2209507 4687942
13987 4687942 9554649 31912255 39851868 15754243 24513295 64325179 94621735 85066510
13979 85066510 74688694 55967719 37397006 42497580 58602618 64693002 57443011 -7407937
13971 -7407937 -76016618 -118263042 -154600315 -163509863 -120399151 -76120980 -67293223 2065911
13963 2065911 90599831 84791423 2848973 -67049851 -111794049 -95704529 -53908507 -21585110
13955 -21585110 -4357125 26452150 71308673 109780482 128687176 120109435 70413847 17087267
13947 17087267 19958282 66537768 80796360 37626403 -48501016 -112742250 -105304261 -28174978
$$ packed form
14003A15795027K93170j5498155q1282795l5549211M3922749K6413356k1704338l0020204
13995B369599J3023696L9247507J1717419j8298740l7898947r381168k988873O897449
13987D687942M866707K2357606P939613k4097625Q759052L9811884L0296556r555225
13979H5066510j0377816j8720975j8570713N100574J6105038O090384p249991o4850948
13971g407937o8608681m2246424l6337273q909548M3110712M4278171Q827757O9359134
13963B065911Q8533920n808408q1942450o9898824m4744198J6089520M1796022L2323397
13955b1585110J7227985L0809275M4856523L8471809J8906694q577741m9695588n3326580
13947A7087267K871015M6579486J4258592m3169957q6127419o4241234P437989P7129283
$$ plain form
13939 -28174978 76880730 119991045 117186501 125294765 115733665 108562777 156943993 207469068
13931 207469068 180375336 131018855 122945263 125770200 128104247 134128895 137383950 118159178
13923 118159178 76779318 29994356 32950044 82230844 149785679 234981624 296544321 271508377
13915 271508377 204950936 169425712 158616126 132078566 87122552 49140370 -34207735
13908 -34207735 -91798221 -92507751 -63260182 -28687630 -19124922 -10871431 73926986 166238918
13900 166238918 205759342 209700995 183213274 125199727 20952699 -80731205 -70696828
13893 -70696828 10655492 40055446 28197006 10268129 9548343 6242582 28273998 30902668
13885 30902668 28721849 30865022 78566414 157422044 219063950 214547844 177931311 187883089
$$ packed form
13939b8174978J05055708M3110315k804544Q108264r561100p170888M8381216N0525075
13931B07469068k7093732m9356481q073592K824937K334047O024648L255055j9224772
13923A18159178m1379860m6784962K955688M9280800O7554835Q5195945O1562697k5035944
13915B71508377o6557441l5525224j0809586k6537560m4956014l7982182q3348105
13908c4207735n7590486p09530K9247569L4572552R562708Q253491Q4798417R2311932
13900A66238918L9520424L941653k6487721n8013547j04247028j01683904J0034377
13893g0696828Q1352320K9399954j1858440j7928877p19786l305761K2031416K628670
13885C0902668k180819K143173M7701392P8855630O1641906m516106l6616533R951778
$$ plain form
13877 187883089 208830394 215623012 232369539 237461529 233218106 251935853 276303457 280753179
13869 280753179 287060379 251747795 185921721 121688151 84735079 114442363 175050903 195922311
13861 195922311 187651332 175737806 208484210 242083505 200249833 127576400 81301120 30536622
13853 30536622 -34156921 -99807230 -146479876 -176313489 -181721420 -137777556 -39819619 68036147
13845 68036147 126615571 116963193 94243162 66916961 38283895 49742051 66272097 52189228
13837 52189228 39884719 50650415 68135085 57667575 68760878 165107966 314075950
13830 314075950 468731523 596844024 570031038 339040528 152589835 42186515 -25934511
13823 -25934511 -41412557 -57048428 -78479650 -89931328 -92064873 -69515875 -71305276 -105607749
$$ packed form
13877A87883089K0947305O792618J6746527N091990m243423J8717747K4367604M449722
13869B80753179O307200l5312584o5826074o4233570l6953072K9707284O0608540K0871408
13861A95922311q270979j1913526L2746404L3599295m1833672p2673433m6275280n0764498
13853C0536622o4693543o5650309m6672646k9833613n407931M3943864R7957937J07855766
13845F8036147N8579424r652378k2720031k7326201k8633066J1458156J6530046j4082869
13837E2189228j2304509J0765696J7484670j0467510J1093303R6347088J48967984
13830C14075950J54655573J28112501k6812986k30990510j86450693j10403320o8121026
13823b5934511j5478046j5635871k1431222j1451678k133545K2548998j789401l4302473
$$ plain form
13815 -105607749 -92148692 -52629173 -21606466 -36096891 -75550536 -105473232 -78172308
13808 -78172308 -27024455 -12237479 29334266 116972830 171189127 207190885 260069936 249233219
13800 249233219 169089601 148234924 154723622 130037922 85940125 42541414 20935745 40697156
13792 40697156 82986256 120782971 131684541 127791095 128707209 137238057 125046549 58684255
13784 58684255 1196508 1081138 18830290 44622316 58524148 21891555 -16152169 10460310
13776 10460310 48839026 54637113 15399685 -34901306 -44571721 -21864355 26180969 110571766
13768 110571766 211047764 308878286 334512608 229335587 65872594 -35593985 -52677653
13761 -52677653 -9735930 8733454 13938890 13929919 38130735 74236663 93224977 62253563
$$ packed form
13815a05607749J3459057L9519519L1022707j4490425l9453645k9922696K7300924
13808g8172308N1147853J4786976M1571745Q7638564N4216297L6001758N2879051j0836717
13800B49233219q0143618k0854677O488698k4685700m4097797m3398711k1605669J9761411
13792D0697156M2289100L7796715J0901570l893446R16114Q530848j2191508o6362294
13784E8684255n7487747j15370J7749152K5792026J3901832l6632593l8043724K6612479
13776A0460310L8378716N798087l9237428n0300991r670415K2707366M8045324Q4390797
13768A10571766J00475998R7830522K5634322j05177021j63462993j01466579j7083668
13761e2677653M2941723J8469384N205436q971K4200816L6105928J8988314l0971414
$$ plain form
13753 62253563 10500216 -27996117 -4855282 51854138 139128315 213609177 232977763 203630798
13745 203630798 170657216 144595191 117438796 59803255 36776810 100648241 190895307
13738 190895307 250596429 273186612 285214376 246900001 175861172 86120720 47505353
13731 47505353 72884924 83710450 33523761 21050228 59962302 109974056 135815749 106507880
13723 106507880 29123496 -13415151 -14323217 41346261 111412022 143211729 170562686 178314001
13715 178314001 173348437 218009913 261812308 249788410 136934021 -16856062 -83477078
13708 -83477078 -63091975 -43120142 -61005422 -79411209 -21600981 48436965 68163668 81714090
13700 81714090 130962322 176803280 209123506 225951650 241621541 200983943 148127503 129833278
$$ packed form
13753F2253563n1753347l8496333K3140835N6709420Q7274177P4480862J9368586k9346965
13745B03630798l2973582k6062025k7156395n7635541k3026445O3871431R0247066
13738A90895307N9701122K2590183J2027764l8314375p1038829q9740452l8615367
13731D7505353K5379571J0825526n0186689j2473533L8912074N0011754K5841693k9307869
13723A06507880p7384384m2538647r08066N5669478P0065761L1799707K7350957P751315
13715A78314001m965564M4661476M3802395j2023898j12854389j53790083o6621016
13708h3477078K0385103J9971833j7885280j8405787N7810228P0037946J9726703J3550422
13700H1714090M9248232M5840958L2320226J6828144J5669891m0637598n2856440j8294225
$$ plain form
13692 129833278 149391780 188575816 204333849 191227733 157277397 152224476 220214421 309227556
13684 309227556 355649708 360109342 321721760 216936993 94193510 18271474 -21000081
13677 -21000081 -61095364 -82994674 -81694684 -70765094 -43343340 -11463048 -4758116 7655813
13669 7655813 66879077 95584171 109282388 136673293 123277928 99702224 65833470 2561100
13661 2561100 -25379951 17257269 82226741 110148774 108738165 83660391 64723076 75293545
13653 75293545 101262477 125920563 133743350 95729240 31713025 2482890 12537508 10476474
13645 10476474 -12587023 11061372 65542202 135325679 201240722 254317906 243689387 154363026
13637 154363026 78925613 56056225 89650371 155115514 187676665 183308352 189655022 216974832
$$ packed form
13692A29833278J9558502L9184036J5758033j3106116l3950336n052921O7989945Q9013135
13684C09227556M6422152M459634l8387582j04784767j22743483p5922036l9271555
13677b1000081m0095283k1899310J299990J0929590K7421754L1880292O704932J2413929
13669G655813N9223264K8705094J3698217K7390905j3395365k3575704l3868754o3272370
13661B561100k7941051M2637220O4969472K7922033j410609k5077774j8937315J0570469
13653G5293545K5968932K4658086P822787l8014110o4016215k9230135J0054618k061034
13645A0476474k3063497K3648395N4480830O9783477O5915043N3077184j0628519q9326361
13637A54363026p5437413k2869388L3594146O5465143L2561151m368313O346670K7319810
$$ plain form
13629 216974832 243553306 247886055 289552468 393393849 417387956 403758316 436091039
13622 436091039 393546420 -2983098 -894495282 -1166297007 -890788444 -668498737 -540284369
13615 -540284369 -460577573 -453435891 -460913155 -462297854 -438258823 -400130302 -369789313 -332097236
13607 -332097236 -306143612 -290881780 -272206449 -260109846 -290779887 -337745206 -365034728
13600 -365034728 -347059736 -287940830 -240439101 -187566257 -114679683 -42048280 32393190
13593 32393190 62485246 80661577 104089464 100349580 127368382 161392461 165035432 198046992
13585 198046992 216881149 184624037 130325300 53857161 -36593034 -112919408 -171630056
13578 -171630056 -199846975 -184444896 -155552880 -159671314 -139572845 -59956942 38053253 73265572
$$ packed form
13629B16974832K6578474M332749M1666413J03841381K3994107j3629640L2332723
13622D36091039m2544619l96529518q91512184k71801725K75508563K22289707J28214368
13615e40284369P9706796P141682p477264j384699K4039031L8128521L0340989L7692077
13607c32097236K5953624J5261832J8675331J2096603l0670041m6965319k7289522
13600c65034728J7974992N9118906M7501729N2872844P2886574P2631403P4441470
13593C2393190L0092056J8176331K3427887l739884K7018802L4024079L642971L3011560
13585A98046992J8834157l2257112n4298737p6468139r0450195p6326374n8710648
13578a71630056k8216919J5402079K8892016m118434K0098469P9615903R8010195L5212319
$$ plain form
13570 73265572 70534741 83006295 105225069 129203211 85408821 9930987 -22172196 -80785200
13562 -80785200 -134568030 -137130389 -116242212 -114267028 -122738704 -90667545 -27778850 16575412
13554 16575412 43351591 66101611 98956444 91699246 6560982 -50786476 -50281879 -65516684
13546 -65516684 -73215277 -32583662 -13211162 -36282567 -65244376 -44251164 -45235274 -86438445
13538 -86438445 -123111663 -111219665 -61591632 -69484813 -114226818 -127987405 -118026316 -46738019
13530 -46738019 29549197 67403629 55921176 -11057186 -29893698 -14450602 -23415674 -34440696
13522 -34440696 -43657120 -50116522 -75299753 -92741217 -83142649 -90472942 -111374788 -104683404
13514 -104683404 -81105076 -81084015 -105509336 -128712987 -163180812 -153659201 -83375762 -29660625
$$ packed form
13570G3265572k730831J2471554K2218774K3978142m3794390p5477834l2103183n8613004
13562h0785200n3782830k562359K0888177J975184q471676L2071159O2888695M4354262
13554A6575412K6776179K2750020L2854833p257198q5138264n7347458N04597j5234805
13546f5516684p698593M0631615J9372500k3071405k8961809K0993212r84110m1203171
13538h6438445l6673218J1891998M9628033p893181m4742005j3760587R961089P1288297
13530d6738019P6287216L7854432j1482453o6978362j8836512J5443096q965072j1025022
13522c4440696r216424o459402k5183231j7441464R598568p330293k0901846O691384
13514a04683404K3578328K1061k4425321k3203651l4467825R521611P0283439N3715137
$$ plain form
13506 -29660625 -21621602 -12382081 -3253930 -6718713 -15230573 -4157246 -730091 -22537762
13498 -22537762 -88642631 -131940908 -129672586 -124918546 -130835493 -146452071 -124341719 -42035742
13490 -42035742 13896276 19368191 45391099 81507619 82719133 62338922 22469752 -5475163
13482 -5475163 -1234542 130097 -52567769 -88091915 -54364438 3507519 37978399 54363563
13474 54363563 64396940 50299783 23374775 36338247 80266255 79586393 30804815 -36544309
13466 -36544309 -57884281 -18199387 -1303661 -16657049 -34082381 -26746902 -13010993 -30293060
13458 -30293060 -13370594 48276546 114980768 168465868 190776290 154218515 118633491 102615346
13450 102615346 93299560 64463989 44298537 52509432 50721103 22903514 -17084919 -52354992
$$ packed form
13506b9660625Q039023R239521R128151l464783q511860J1073327L427155k1807671
13498b2537762o6104869m3298277K268322M754040n916947j5616578K2110352Q2305977
13490d2035742N5932018N471915K6022908L6116520J211514k0380211l9869170k7944915
13482e475163M240621J364639n2697866l5524146L3727477N7871957L4470880J6385164
13474E4363563J0033377j4097157k6925008J2963472M3928008o79862m8781578o7349124
13466c6544309k1339972L9684894J6895726j5353388j7425332P335479J3735909j7282067
13458c0293060J6922466O1647140O6704222N3485100K2310422l6557775l5585024j6018145
13450A02615346r315786k8835571k0165452Q210895j788329k7817589l9988433l5270073
$$ plain form
13442 -52354992 -70912829 -79269651 -70964753 -37115553 26063719 92942855 92643106 46960428
13434 46960428 20844316 35065795 62003537 68875347 61625008 62703547 73816797 111776603
13426 111776603 114482707 136279315 209249318 290908780 377434738 445553747 469933076 448322513
13418 448322513 406215355 403391823 501447143 704023156 1009975102 1307189569 1122444518
13411 1122444518 559614198 293232593 199318453 142415657 103260401 76323759 41090721
13404 41090721 6008927 -13164673 -18265269 12250383 21751861 -24036116 -52629052 -44833486
13396 -44833486 2138427 73258674 58503614 -57552769 -155794749 -156966016 -117845585 -62269001
13388 -62269001 14188206 85756587 104528767 113541447 139790717 99439441 26080632 -335083
$$ packed form
13442e2354992j8557837q356822Q304898L3849200O3179272O6879136k99749m5682678
13434D6960428k6116112J4221479K6937742O871810p250339J078539J1113250L7959806
13426A11776603K706104K1796608P2970003Q1659462Q6525958O8119009K4379329k1610563
13418D48322513m2107158k823532R8055320K02576013L05951946K97214467j84745051
13411A122444518n62830320k66381605r3914140n6902796l9155256k6936642l5233038
13404D1090721l5081794j9173600n100596L0515652R501478m5787977k8592936P795566
13396d4833486M6971913P1120247j4755060j16056383r8241980j171267L9120431N5576584
13388f2269001P6457207P1568381J8772180R012680K6249270m0351276p3358809k6415715
$$ plain form
13380 -335083 -39051219 -66258667 -56966523 -13704862 24665819 51080578 37211272 6774666
13372 6774666 -17797564 -79122460 -131736432 -109476643 -33860048 42566790 77127142 62290751
13364 62290751 39336383 42551083 74887406 92514096 131679189 171674184 198045383 222667589
13356 222667589 223984705 230227534 229056598 197441065 152778842 137089602 149937168 112638942
13348 112638942 35089262 -29473289 -65089863 -79940010 -76421665 -81392767 -77603583 -40077832
13340 -40077832 1036779 2299606 -7727136 -7497869 -25373473 -82214902 -132660199 -157018815
13332 -157018815 -139734274 -102132356 -99634344 -118488969 -147810023 -159024616 -173732415 -200987953
13324 -200987953 -199455856 -164947631 -151393637 -181901546 -205778858 -189945106 -159503822 -135004662
$$ packed form
13380c35083l8716136k7207448R292144M3261661L8370681K6414759j3869306l0436606
13372F774666k4572230o1324896n2613972K2259789P5616595P6426838L4560352j4836391
13364F2290751k2954368L214700L2336323J7626690L9165093L9994995K6371199K4622206
13356B22667589J317116O242829j170936l1615533m4662223j5689240J2847566l7298226
13348A12638942p7549680o4562551l5616574j4850147L518345m971102L789184L7525751
13340d0077832M1114611J262827j0026742K29267j7875604n6841429n0445297k4358616
13332a57018815J7284541L7601918K498012j8854625k9321054j1214593j4707799k7255538
13324b00987953J532097L4508225J3553994l0507909k3877312J5833752L0441284K4499160
$$ plain form
13316 -135004662 -125528060 -64344157 32795419 111944061 139250776 121135577 64398380
13309 64398380 -50005941 -169473202 -152517626 -66526508 -22811830 -30201621 -24783686 6420979
13301 6420979 13445936 19364237 42213219 101818253 144940317 134157876 132185048 173934004
13293 173934004 178005358 137370791 91552117 63804596 69846416 97922567 91605553 90686561
13285 90686561 110325756 149404681 154250063 111780991 6317852 -86929496 -113035544 -65319781
13277 -65319781 20771370 82357897 137820100 153030134 124447221 95741851 42818854 -34080610
13269 -34080610 -73430817 -36373251 37481524 79368933 42159977 -31181574 -22912380 34999126
13261 34999126 103732312 144333456 132670198 104715202 77570038 55543785 25831885 -8773595
$$ packed form
13316a35004662R476602O1183903R7139576P9148642K7306715j8115199n6737197
13309F4398380j14404321j19467261J6955576Q5991118M3714678p389791N417935L1204665
13301F420979P024957N918301K2848982N9605034M3122064j0782441j972828M1748956
13293A73934004M071354m0634567m5818674k7747521O041820K8076151o317014r18992
13285I0686561J9639195L9078925M845382m2469072j05463139r3247348k6106048M7715763
13277f5319781Q6091151O1586527N5462203J5210034k8582913k8705370n2922997p6899464
13269c4080610l9350207L7057566P3854775M1887409l7208956p3341551Q269194N7911506
13261C4999126O8733186M0601144j1663258k7954996k7145164k2026253k9711900l4605480
$$ plain form
13253 -8773595 -33710707 -26328413 -43754919 -41747438 441150 47220165 54983782 26342051
13245 26342051 195485 -13047622 -18122671 -14010626 24754549 100978550 154859509 126652226
13237 126652226 59117111 46673668 90459767 128344751 169472153 186685873 130842419
13230 130842419 60243235 14073850 19239437 77102562 132210176 168837534 194372554 203472010
13222 203472010 181656938 176154556 165393706 132039885 126517616 173974399 251565950 292236544
13214 292236544 274474538 214834946 177494106 195197600 235031468 280814244 356415653
13207 356415653 478909398 583473551 458288015 -143060726 -686857379 -790380844 -729502028
13200 -729502028 -634595933 -533716044 -442767987 -381260892 -308655679 -244742748 -202438326
$$ packed form
13253h773595k4937112P382294j7426506K007481M2188588M6779015P763617k8641731
13245B6342051k6146566j3243107n075049M112045L8765175P6224001N3880959k8207283
13237A26652226o7535115j2443443M3786099L7884984M1127402J7213720n5843454
13230A30842419p0599184m6169385N165587N7863125N5107614L6627358K5535020R099456
13222B03472010k1815072n502382j0760850l3353821n522269M7456783P7591551M0670594
13214B92236544j7762006n9639592l7340840J7703494L9833868M5782776P5601409
13207C56415653J22493745J04564153j25185536o01348741n43796653j03523465O0878816
13200g29502028R4906095J00879889R0948057O1507095P2605213O3912931M2304422
$$ plain form
13193 -202438326 -176259289 -148314986 -102250038 -58651014 -41862207 -45122098 -79060015 -151716680
13185 -151716680 -194430668 -166795721 -114774234 -74179870 -31001032 18796173 18492019 -45710401
13177 -45710401 -106781152 -147737849 -177873038 -227993327 -292668635 -334127418 -300643013 -247666627
13169 -247666627 -229787757 -208137994 -186878150 -223415315 -282295632 -285003229 -218945537 -187573944
13161 -187573944 -209261484 -194120942 -130849213 -42352206 82948373 183012277 217203976
13154 217203976 153065745 8455315 -60229217 -37965265 652033 7329020 -36102147
13147 -36102147 -75254584 -74264309 -73082063 -94120748 -113889784 -114360731 -113203909 -126433545
13139 -126433545 -134934649 -139204150 -130469442 -79855778 -56181266 -47624609 -26133493 -19451807
$$ packed form
13193b02438326K6179037K7944303M6064948M3599024J6788807l259891l3937917p2656665
13185a51716680m2713988K7634947N2021487M0594364M3178838M9797205l04154o4202420
13177d5710401o1070751m0956697l0135189n0120289o4675308m1458783L3484405N2976386
13169b47666627J7878870K1649763K1259844l6537165n8880317k707597O6057692L1371593
13161a87573944k1687540J5140542O3271729Q8497007J25300579J00063904L4191699
13154B17203976o4138231j44610430o8684532K2263952L8617298O676987m3431167
13147c6102147l9152437R90275J182246k1038685j9769036m70947J156822j3229636
13139a26433545q501104m269501Q734708N0613664K3674512Q556657K1491116O681686
$$ plain form
13131 -19451807 -2286075 -22865046 -73070132 -94035684 -105430741 -143622015 -190778572 -171974828
13123 -171974828 -118013205 -116757289 -131795651 -102982609 -27871921 55274280 93682171 70729090
13115 70729090 -5733971 -83863318 -112304708 -78713864 -40425779 -24043565 -32247334 -20049125
13107 -20049125 28316584 34124904 -77388295 -304883937 -540633070 -674036238 -679405132
13100 -679405132 -392996707 -46630930 105770507 185396662 232749196 260470995 254826430
13093 254826430 227884192 199969394 164120921 155071180 145944948 76923263 21828505 50464869
13085 50464869 86145975 82147167 62487922 32067952 16690713 32933057 25233172 -10351468
13077 -10351468 -19240347 9184222 33325569 -7120829 -79981923 -81622649 1757574 107903979
$$ packed form
13131a9451807J7165732k0578971n0205086k0965552j1395057l8191274m7156557J8803744
13123a71974828N3961623J255916j5038362K8813042P5110688Q3146201L8407891k2953081
13115G0729090p6463061p8129347k8441390L3590844L8288085J6382214q203769J2198209
13107b0049125M8365709N808320j11513199k27495642k35749133j33403168n368894
13100f79405132K86408425L46365777J52401437P9626155M7352534K7721799n644565
13093B54826430k6942238k7914798l5848473r049741r126232o9021685n5094758K8636364
13085E0464869L5681106l998808j9659245l0419970j5377239J6242344p699885l5584640
13077a0351468q888879K8424569K4141347m0446398p2861094j640726Q3380223J06146405
$$ plain form
13069 107903979 182113863 146164245 24302778 -32451365 14564494 101986553 174697677
13062 174697677 212206591 224217283 215428919 136560086 67668421 84752866 111369062 107082431
13054 107082431 99973805 88640648 92233491 65977959 45828161 54076188 49756511 6543730
13046 6543730 -24869366 -6706104 8807267 -28476179 -44198464 4990089 81998796 116901359
13038 116901359 116335902 110153159 95034980 50489870 53050296 91982877 73119200 26000810
13030 26000810 25964925 91309515 141543791 120384981 96092261 119018847 169800285 252814111
13022 252814111 372992757 399460301 357264938 362090955 354945398 294899043 223393405 134900792
13014 134900792 48940771 2020094 -19040091 1289619 50669906 94849058 110112518
$$ packed form
13069A07903979P4209884l5949618j21861467n6754143M7015859Q7422059P2711124
13062A74697677L7508914J2010692q788364p8868833o8891665J7084445K6616196m286631
13054A07082431p108626j1333157L592843k6255532k0149798Q248027m319677m3212781
13046F543730l1413096J8163262J5513371l7283446j5722285M9188553P7008707L4902563
13038A16901359n65457o182743j5118179m4545110K560426L8932581j8863677m7118390
13030B6000810l5885O5344590N0234276k1158810k4292720K2926586N0781438Q3013826
13022B52814111J20178646K6467544m2195363M826017p145557o0046355p1505638q8492613
13014A34900792q5960021m6920677k1060185K0329710M9380287M4179152J5263460
$$ plain form
13007 110112518 128662624 170928309 176964354 210336762 285371055 398622927 515059971
13000 515059971 601206114 636448643 632821279 509644433 -29185345 -533420244 -594638159
12993 -594638159 -547275077 -503545756 -491258682 -504876614 -496618602 -463238451 -394118127 -315277476
12985 -315277476 -278399289 -248686756 -240456391 -230816962 -240163122 -252196586 -260972712 -265871080
12977 -265871080 -227565539 -173269230 -162893695 -181705632 -200468281 -203346237 -195062167 -213918310
12969 -213918310 -244612079 -286809631 -257768677 -156280970 -87299650 -48374521 -30405234
12962 -30405234 -12171136 49107294 130392144 159769452 112153064 77887769 82073515 73046605
12954 73046605 21107578 -22929439 -60246921 -111195155 -111760936 -58629961 24060296 67197227
$$ packed form
13007A10112518J8550106M2265685O036045L3372408P5034293J13251872J16437044
13000E15059971Q6146143L5242529l627364j23176846n38829778n04234899o1217915
12993e94638159M7363082M3729321J2287074j3617932Q258012L3380151O9120324P8840651
12985c15277476L6878187K9712533Q230365R639429r346160j2033464q776126m898368
12977b65871080L8305541N4296309J0375535j8811937j8762649k877956Q284070j8856143
12969b13918310l0693769m2197552K9040954J01487707O8981320L8925129J7969287
12962c0405234J8234098O1278430Q1284850K9377308m7616388l4265295M185746r026910
12954G3046605n1939027m4037017l7317482n0948234n65781N3130975Q2690257M3136931
$$ plain form
12946 67197227 58335198 37392022 -28170902 -73964958 -91247069 -119026168 -143028497 -148670194
12938 -148670194 -72106255 -2828882 8121152 -6011018 -8554441 -1229520 -20302303 -36964531
12930 -36964531 2974996 63394782 77706490 74938321 68202170 51928635 47888132 -172007
12922 -172007 -54324389 -36145837 56468385 160806881 190183752 165797729 150608386 120129280
12914 120129280 88967336 28089821 -17265854 30748036 59793785 29363488 38593244 70078255
12906 70078255 69919653 72777968 69980177 59094547 64717415 42418587 -26818738 -50509068
12898 -50509068 1475630 47039000 59632125 25680032 -14458207 -21632909 -21921033 -84318704
12890 -84318704 -126727874 -111890939 -76053102 7878670 108938289 151875075 141235570
$$ packed form
12946F7197227q862029k0943176o5562924m5794056j7282111k7779099k4002329n641697
12938a48670194P6563939O9277373J0950034j4132170k543423P324921j9072783j6662228
12930c6964531L9939527O0419786J4311708k768169o736151j6273535m040503m8060139
12922a72007n4152382J8178552R2614222J04338496K9376871k4386023j5189343l0479106
12914A20129280l1161944o0877515m5355675M8013890K9045749l0430297R229756L1485011
12906G0078255j58602K858315k797791j0885630N622868k2298828o9237325k3690330
12898e0509068N1984698M5563370J2593125l3952093m0138239p174702k88124o2397671
12890h4318704m2409170J4836935L5837837Q3931772J01059619M2936786j0639505
$$ plain form
12883 141235570 85601260 6399813 -55678829 -91096521 -109908901 -109621034 -62955866 276699
12875 276699 45479541 58452951 46458965 22211712 -35926439 -93116136 -129425613 -118604451
12867 -118604451 -71680865 -12332804 20179645 14958756 35727565 65030477 96083996 126117247
12859 126117247 85728249 46118905 55505916 126064562 191449121 183528249 114143608 51971720
12851 51971720 -12379710 -103076705 -111158889 -33775534 -3182699 -39603969 -44757380 -51005914
12843 -51005914 -70098472 -69020663 -25883494 24386222 90168662 116604148 91033549 92570256
12835 92570256 93946939 56243597 33072487 2917441 -72490918 -75884877 4979176 63403850
12827 63403850 91816838 118623200 167309128 245714305 300098522 281537276 260764751 286277082
$$ packed form
12883A41235570n5634310p9201447o2078642l5417692j8812380K87867M6665168O3232565
12875B76699M5202842J2973410j1993986k4247253n8138151n7189697l6309477J0821162
12867a18604451M6923586N9348061L2512449n220889K0768809K9302912L1053519L0033251
12859A26117247m0388998l9609344R387011P0558646O5384559p920872o9384641o2171888
12851E1971720o4351430r0696995q082184P7383355L0592835l6421270n153411o248534
12843e1005914j9092558J077809M3137169N0269716O5782440K6435486k5570599J536707
12835I2570256J376683l7703342k3171110l0155046p5408359l393959Q0864053N8424674
12827F3403850K8412988K6806362M8685928P8405177N4384217j8561246k0772525K5512331
$$ plain form
12819 286277082 299025130 264017777 213434419 203173761 224121074 248226310 233506219
12812 233506219 187362456 139629869 102831637 65044568 27038156 -1299551 42918819
12805 42918819 155813494 215719541 198988726 182902236 189036873 182750564 178033975 197982715
12797 197982715 185147603 133375651 48245297 -60798674 -109988934 -68177527 -37261443
12790 -37261443 -122720688 -404956551 -898349157 -966609309 -711216366 -522042113 -410119600
12783 -410119600 -369485987 -395317023 -379185992 -269296728 -187254936 -151998320 -190046021
12776 -190046021 -235231451 -195176540 -155613918 -137574535 -88323369 -41305689 -18898274
12769 -18898274 -7517855 -40482084 -83169131 -63694821 -57626745 -78464876 -86914657 -115581799
$$ packed form
12819B86277082J2748048l5007353n0583358j0260658K0947313K4105236j4720091
12812B33506219m6143763m7732587l6798232l7787069l8006412k8337707M4218370
12805D2918819J12894675N9906047j6730815j6086490O134637o286309m716589J9948740
12797A97982715j2835112n1771952q5130354j09043971m9190260M1811407L0916084
12790c7261443q5459245k82235863m93392606o8260152K55392943J89174253J11922513
12783d10119600M0633613k5831036J6131031J09889264Q2041792L5256616l8047701
12776a90046021m5185430M0054911L9562622J8039383M9251166M7017680K2407415
12769a8898274J1380419l2964229m2687047J9474310O068076k0838131q449781k8667142
$$ plain form
12761 -115581799 -135517548 -145533559 -171384703 -212439312 -248110573 -242271021 -218170671 -227881451
12753 -227881451 -280439596 -385752698 -430687625 -348959441 -266969150 -213530019 -175093180
12746 -175093180 -164167538 -152365490 -97555839 9830447 85942311 70006010 2406866
12739 2406866 -54888008 -86951675 -48010086 -14871063 -20569621 -49443178 -100070840 -138450898
12731 -138450898 -152739442 -120876762 -77280823 -51567073 11087876 91371117 112766510
12724 112766510 87858926 74796159 46559634 -98343 -32176199 -5954111 53376954 58800616
12716 58800616 27583661 1953824 -104802 -2847760 -52342048 -100450574 -116426908 -103345950
12708 -103345950 -75966300 -81349756 -98140477 -97643011 -132590748 -178866513 -180412913 -187295147
$$ packed form
12761a15581799j9935749j0016011k5851144m1054609l5671261N839552K4100350r710780
12753b27881451n2558145j05313102m4934927Q1728184Q1990291N3439131L8436839
12746a75093180J0925642J1802048N4809651J07386286P6111864j5936301o7599144
12739B406866n7294874l2063667L8941589L3139023n698558k8873557n0627662l8380058
12731a38450898j4288544L1862680M3595939K5713750O2654949Q0283241K1395393
12724A12766510k4907584j3062767k8236525m6657977l2077856K6222088N9331065N423662
12716E8800616l1216955k5629837k058626k742958m9494288m8108526j5976334J3080958
12708a03345950K7379650n383456j6790721M97466l4947737m6275765j546400o882234
$$ plain form
12700 -187295147 -147704917 -36791860 53992670 106349674 127402042 107797522 90095068
12693 90095068 59727399 25435787 15332471 63102515 104226663 123195181 99018754 77409556
12685 77409556 112845296 154076687 99515058 -21517113 -135691294 -228115247 -274083961
12678 -274083961 -255390652 -196518512 -118711411 -20231139 44279256 50806278 51195586 68525198
12670 68525198 90177440 106441281 74798421 43244878 31064070 12736663 25448502 102959738
12662 102959738 112807928 22198604 -41883523 -8586601 96743209 207313978 279658577
12655 279658577 288977142 203739789 136791821 124262547 113228131 105509680 134128474 144567767
12647 144567767 82108194 31641726 36610759 73119824 60420482 -12209675 -86497209 -179880205
$$ packed form
12700a87295147L9590230J10913057R0784530N2357004K1052368j9604520j7702454
12693I0095068l0367669l4291612j0103316M7770044M1124148J8968518k4176427k1609198
12685G7409556L5435740M1231391n4561629j21032171j14174181r2423953m5968714
12678b74083961J8693309N8872140P7807101R8480272O4510395O527022L89308J7329612
12670F8525198K1652242J6263841l1642860l1553543j2180808j8327407J2711839P7511236
12662A02959738R848190r0609324o4082127L3296922J05329810J10570769P2344599
12655B79658577R318565q5237353o6947968j2529274j1034416p718451K8618794J0439293
12647A44567767o2459573n0466468M969033L6509065j2699342p2630157p4287534r3382996
$$ plain form
12639 -179880205 -222454560 -192970391 -124817519 -15776202 86297753 126082106 202946797
12632 202946797 269916951 221553835 154658760 117136694 89332777 64506686 -2040573
12625 -2040573 -74579438 -97975641 -73282524 -19498070 16757537 4470497 -15891335 -13061708
12617 -13061708 -2719540 -6391083 -75305125 -143797629 -86424137 -972961 26895681 14653601
12609 14653601 -6251072 1923597 16949802 33654297 72282857 106178556 67059188 27769499
12601 27769499 39130789 56626916 61492006 102256323 187540327 241158885 250063591 247994414
12593 247994414 209114576 191898473 239562167 264909640 308743419 416951501 503490182
12586 503490182 572879353 676886680 807687978 1027138891 1433155066 1993592688 2147483647
$$ packed form
12639a79880205m2574355K9484169O8152872J09041317J02073955L9784353P6864691
12632B02946797O6970154m8363116o6895075l7522066k7803917k4826091o6547259
12625b040573p2538865k3396203K4693117N3784454L6255607j2287040k0361832K829627
12617a3061708J0342168l671543o8914042o8492504N7373492Q5451176K7868642j2242080
12609A4653601k0904673Q174669J5026205J6704495L8628560L3895699l9119368l9289689
12601B7769499J1361290J7496127M865090M0764317Q5284004N3618558Q904706k069177
12593B47994414l8879838j7216103M7663694K5347473M3833779J08208082Q6538681
12586E03490182O9389171J04007327J30801298K19450913M06016175N60437622J53890959
$$ plain form
12579 2147483647 1266490242 559958523 306449366 153894207 -2175098 -131079183 -230195064
12572 -230195064 -261061699 -227447894 -156860848 -51632983 25629912 37421631 21819348
12565 21819348 -3813293 -9813107 41049497 75922992 95373579 117156965 136319246 146787105
12557 146787105 120846315 42207818 -31165441 -88279109 -102168364 -57828493 -36301337
12550 -36301337 -66705628 -108643486 -122191754 -142906295 -218853552 -272312168 -258990641 -229070098
12542 -229070098 -220863826 -216320100 -204529130 -181523331 -154900671 -149229561 -164159515 -182115287
12534 -182115287 -203538653 -176534623 -101430107 -35047195 -61118340 -86431497 -33732867
12527 -33732867 56900362 103830085 28517365 -91105212 -171229143 -196878211 -175293396
$$ packed form
12579B147483647q80993405p06531719k53509157j52555159j56069305j28904085r9115881
12572b30195064l0866635L3613805P0587046J05227865P7262895J1791719j5602283
12565B1819348k5632641n999814N0862604L4873495J9450587K1783386J9162281J0467859
12557A46787105k5940790p8638497p3373259n7113668j3889255M4339871K1527156
12550c6301337l0404291m1937858j3548268k0714541p5947257n3458616J3321527K9920543
12542b29070098Q206272M543726J1790970K3005799K6622660N671110j4929954j7955772
12534a82115287k1423366K7004030P5104516O6382912k6071145k5313157N2698630
12527c3732867R0633229M6929723p5312720j19622577q0123931k5649068K1584815
$$ plain form
12520 -175293396 -117749017 -43209113 41170114 119548094 161558863 160019212 123636988 28389890
12512 28389890 -67195539 -100005564 -97548967 -68620559 -23099975 14166727 34045801 55062514
12504 55062514 82634094 80217864 41744221 4472988 7584091 29668437 13159651 -20059321
12496 -20059321 -77763472 -113480586 -88020143 -61576944 -67255084 -81877898 -98227943 -125948561
12488 -125948561 -119314251 -100325545 -75621000 -35582790 2605490 26335349 33140393 52524618
12480 52524618 62638895 58836638 91298591 97138887 80841904 61783534 75402336 91789786
12472 91789786 30468535 -74789415 -145834015 -137239818 -160984173 -172274924 -124732545 -121031663
12464 -121031663 -128755063 -143976631 -160277425 -167121431 -169493825 -178641291 -169711627 -146369409
$$ packed form
12520a75293396N7544379P4539904Q4379227P8377980M2010769j539651l6382224r5247098
12512B8389890r5585429l2810025K456597K8928408M5520584L7266702J9879074K1016713
12504E5062514K7571580k416230l8473643l7271233L111103K2084346j6508786l3218972
12496b0059321n7704151l5717114K5460443K6443199n678140j4622814j6350045k7720618
12488a25948561O634310J8988706K4704545M0038210L8188280K3729859O805044J9384225
12480E2524618J0114277l802257L2461953N840296j6296983j9058370J3618802J6387450
12472I1789786o1321251j05257950p1044600Q594197k3744355j1290751M7542379L700882
12464a21031663p723400j5221568j6300794o844006k372394r147466Q929664K3342218
$$ plain form
12456 -146369409 -109822774 -74375667 -71704483 -37490713 -17624912 -40378749 -35753634 -19555440
12448 -19555440 992597 10224538 14269763 19407410 20341324 -4637538 -95816638 -153331698
12440 -153331698 -147521336 -110095037 -53945368 -21027504 -46136704 -77329292 -91846349 -90729736
12432 -90729736 -64785301 -41701055 -63934826 -65853227 13101569 151974458 261517631
12425 261517631 240343052 126191646 22176054 -15302007 -52709403 -80704756 -96315475
12418 -96315475 -87558117 -81244994 -86432539 -73728345 -26811594 55005832 122287538 155330595
12410 155330595 132062767 100263921 87803361 56277920 -8254269 -72824107 -90445871 -97767389
12402 -97767389 -106093087 -92539899 -100672192 -78565681 -42365794 -17981330 16566987 56152670
$$ packed form
12456a46369409L6546635L5447107K671184L4213770J9865801k2753837M625115J6198194
12448a9555440K0548037R231941M045225N137647R33914k4978862r1179100n7515060
12440a53331698N810362L7426299N6149669L2917864k5109200l1192588j4517057J116613
12432i0729736K5944435K3084246k2233771j918401P8954796J38872889J09543173
12425B61517631k1174579j14151406j04015592l7478061l7407396k7995353j5610719
12418i6315475Q757358O313123n187545J2704194M6916751Q1817426O7281706L3043057
12410A55330595k3267828l1798846j2460560l1525441o4532189o4569838j7621764p321518
12402i7767389q325698J3553188q132293K2106511L6199887K4384464L4548317L9585683
$$ plain form
12394 56152670 116542614 103594888 46191557 41720857 56809714 56177969 33885297 25921127
12386 25921127 27461171 50717736 53362340 24964580 4931971 52268215 129814090 132179574
12378 132179574 102010105 78129245 46691442 48267942 63121651 -7353746 -216997028
12371 -216997028 -321378541 -313755877 -329037154 -306162346 -249296195 -197358962 -148049740
12364 -148049740 -126093239 -120331451 -120980215 -111109410 -103827690 -103845554 -90744429 -53257506
12356 -53257506 6388251 27916482 -463904 -30568076 -32215961 -6043707 33991737 64761178
12348 64761178 53221168 -14815766 -58002379 -56435198 -40609485 -13419336 -4038132 -10809658
12340 -10809658 10430535 44138483 79268915 120259493 156531547 175747112 147203656 75097156
$$ packed form
12394E6152670O0389944j2947726n7403331m470700J5088857o31745k2292672p964170
12386B5921127J540044K3256565K644604k8397760k0032609M7336244P7545875K365484
12378A32179574l0169469k3880860l1437803J576500J4853709p0475397k09643282
12371b16997028j04381513P622664j5281277K2874808N6866151N1937233M9309222
12364a48049740K1956501N761788o48764R870805P281720j7864J3101125L7486923
12356e3257506N9645757K1528231k8380386l0104172j647885K6172254M0035444L0769441
12348F4761178j1540010o8036934m3186613J567181J5825713K7190149R381204o771526
12340a0809658K1240193L3707948L5130432M0990578L6272054J9215565k8543456p2106500
$$ plain form
12332 75097156 -7980167 -69035063 -103736883 -114762967 -82587251 -40997943 -14832478 15518676
12324 15518676 45865642 42276022 -12722287 -63650087 -102174016 -118395864 -132029736 -143774661
12316 -143774661 -143153165 -130981622 -93440039 -79571400 -58544283 24826264 85834461 85205354
12308 85205354 80105090 62993686 13040210 -69607292 -127381496 -132953303 -133303949 -147857260
12300 -147857260 -155395777 -176626917 -225213273 -255599209 -248237170 -228067564 -194822673 -128865933
12292 -128865933 -21607849 83452888 107188539 104139176 110192153 136888441 183183258
12285 183183258 199996024 168097818 127773098 139859506 165181093 150219849 82125496
12278 82125496 62514440 101302780 133103128 155063218 153171039 107894784 35713712 -17912929
$$ packed form
12332G5097156q3077323o1054896l4701820j1026084L2175716M1589308K6165465L0351154
12324A5518676L0346966l589620n4998309n0927800l8523929j6221848j3633872j1744925
12316a43774661O21496J2171543L7541583J3868639K1027117Q3370547O1008197o29107
12308H5205354n100264j7111404m9953476q2647502n7774204n571807l50646j4553311
12300a47857260p538517k1231140m8586356l0385936P362039K0169606L3244891O5956740
12292a28865933J07258084J05060737K3735651l049363O052977K6696288M6294817
12285A83183258J6812766l1898206m0324720J2086408K5321587j4961244o8094353
12278H2125496j9611056L8788340L1800348K1960090j892179m5276255p2181072n3626641
$$ plain form
12270 -17912929 -23987899 17738028 59397346 113506482 132541130 103305697 56810601 29812061
12262 29812061 27602177 25789436 5545972 -40990987 -52933923 3997715 63132750 96559543
12254 96559543 59545513 5193856 -12418313 -28346378 -74548818 -111403742 -105118434 -52078231
12246 -52078231 17678265 68057377 99342804 118556529 88590586 73008264 79170816 50464643
12238 50464643 84788255 97573815 31762649 -7289132 -22840504 -70158864 -162948999 -212228381
12230 -212228381 -166352250 -77182707 -51252438 -95145561 -123805850 -109080360 -60803354
12223 -60803354 -3124768 42367049 67964801 58646144 12393906 -2238040 21670484 45484961
12215 45484961 50619555 35180830 9055876 -7397869 5603922 34830955 20509571 -10667325
$$ packed form
12270a7912929o074970M1725927M1659318N4109136J9034648k9235433m6495096k6998540
12262B9812061k209884j812741k0243464m6536959j1942936N6931638N9135035L3426793
12254I6559543l7014030n4351657j7612169j5928065m6202440l6854924O285308N3040203
12246e2078231O9756496N0379112L1285427J9213725k9965943j5582322O162552k8706173
12238E0464643L4323612J2785560o5811166l9051781j5551372m7318360r2790135m9279382
12230b12228381M5876131Q9169543K5930269m3893123k8660289J4725490M8277006
12223f0803354N7678586M5491817K5597752r318657m6252238j4631946K3908524K3814477
12215D5484961N134594j5438725k6124954j6453745J3001791K9227033j4321384l1176896
$$ plain form
12207 -10667325 -33563089 -84533116 -131565254 -172274776 -158025320 -106836705 -94743414 -104889064
12199 -104889064 -79030293 -30299358 21519230 58802648 66539143 50745325 65268347 95649536
12191 95649536 117404551 112905028 102369051 102315718 104155824 76706251 30742849 -8346862
12183 -8346862 1894238 25627596 34856000 21385438 23041494 33658085 -14765157 -90009884
12175 -90009884 -139474291 -179733471 -167427479 -100597233 -72998622 -88434726 -87206526 -62007409
12167 -62007409 -37138679 -13261015 42750405 82218593 -8214257 -59793958 -63582 33177668
12159 33177668 -22470449 -98754696 -73182921 -12498967 -2246097 -42199216 -104029432 -113631995
12151 -113631995 -95784846 -72420654 -52921552 -60459549 -69264155 -50608204 -15314930 8854360
$$ packed form
12207a0667325k2895764n0970027m7032138m0709522J4249456N1188615J2093291j0145650
12199a04889064K5858771M8730935N1818588L7283418P736495j5793818J4523022L0381189
12191I5649536K1755015m499523j0535977n3333J840106k7449573m5963402l9089711
12183h346862J0241100K3733358R228404j3470562J656056J0616591m8423242p5244727
12175i0009884m9464407m0259180J2305992O6830246K7598611j5436104J228200K5199117
12167f2007409K4868730K3877664N6011420L9468188r0432850n1579701N9730376L3241250
12159C3177668n5648117p6284247K5571775O0683954J0252870l9953119o1830216r602563
12151a13631995J7847149K3364192J9499102p537997q804606J8655951L5293274K4169290
$$ plain form
12143 8854360 18268594 30365223 68501285 94223156 106988352 115442115 72713747 -5675608
12135 -5675608 -57041778 -64366273 -38607259 -36935468 -68368426 -101374930 -92366909 -84795400
12127 -84795400 -89169732 -108152007 -103776303 -62128842 -29210052 -93580922 -177642833 -142932404
12119 -142932404 -77575887 -27416151 -16720822 -31204547 -33917104 1522714 23645097 25689581
12111 25689581 -5765173 398016 87239662 111975771 56602630 10908920 11648461 20931718
12103 20931718 -3856033 -82767804 -147994630 -192141206 -175174911 -118822440 -53558870 -11476369
12095 -11476369 -5635662 -41935951 -78444496 -102255542 -84276854 -17075447 65785585 146397775
12087 146397775 176335286 118468262 10533721 -58044611 -81410447 -101868139 -124532522
$$ packed form
12143H854360R414234J2096629L8136062K5721871J2765196Q453763m2728368p8389355
12135e675608n1366170p324495K5759014J671791l1432958l3006504R008021P571509
12127h4795400m374332j8982275M375704M1647461L2918790o4370870q4061911L4710429
12119a42932404O5356517N0159736J0695329j4483725k712557L5439818K2122383K044484
12111B5689581l1454754O163189Q6841646K4736109n5373141m5693710P39541R283257
12103B0931718k4787751p8911771o5226826m4146576J6966295N6352471O5263570M2082501
12095a1476369N840707l6300289l6508545k3811046J7978688O7201407Q2861032Q0612190
12087A46397775K9937511n7867024j07934541o8578332k3365836k0457692k2664383
$$ plain form
12080 -124532522 -92138568 -47512742 -32844458 -17303558 3591487 4046565 -82660965 -183795052
12072 -183795052 -228619959 -248803128 -245900526 -212718671 -191507122 -193722711 -190467288 -137444156
12064 -137444156 -51031433 31467867 58338467 54778973 42104367 57246436 101162535 124316483
12056 124316483 120025525 103337296 61109522 6439712 -2730347 36977431 40667177 19228061
12048 19228061 4043949 -13842246 -1092076 3845579 -78474270 -194364825 -254468428 -265413734
12040 -265413734 -212433446 -152392065 -111892462 -73438611 -50291327 -32486630 -36003639 -26575226
12032 -26575226 -48235337 -78158470 -50776973 -43306716 -67808451 -27600099 56249430 101082833
12024 101082833 92279869 19858681 -67721256 -82852545 -63777209 -86961920 -124886201 -103890923
$$ packed form
12080a24532522L2393954M4625826J4668284J5540900K0895045M55078q6707530j01134087
12072a83795052m4824907k0183169K902602L3181855K1211549k215589L255423N3023132
12064a37444156Q6412723Q2499300K6870600l559494j2674606J5142069M3916099K3153948
12056A24316483m290958j6688229m2227774n4669810r170059L9707778L689746k1439116
12048A9228061j5184112j7886195J2750170M937655q2319849j15890555o0103603j0945306
12040b65413734N2980288O0041381M0499603L8453851K3147284J7804697l517009R428413
12032b6575226k1660111k9923133K7381497P470257k4501735M0208352Q3849529M4833403
12024A01082833q802964p2421188q7579937j5131289J9075336k3184711l7924281K0995278
$$ plain form
12016 -103890923 -40063381 12822523 62611563 43707133 -26741871 -54179783 -14691409
12009 -14691409 29388687 46482131 32478195 -12062482 -51070947 -48190254 -41138588 -39286282
12001 -39286282 -13096666 34501163 49888983 67442924 75570295 73746426 54355189 -8781175
11993 -8781175 -101687506 -160307325 -170027954 -137694524 -92465777 -53966929 -39184430 -44887531
11985 -44887531 -79868155 -104963535 -56260107 21882554 64464394 76271164 32874719 -8975926
11977 -8975926 -11036378 -9646986 7317018 -18274320 -58211033 -69061023 -100197403 -123645427
11969 -123645427 -115744166 -71295327 -9523877 54590109 72168096 35625608 32793897 88009184
11961 88009184 105052819 61187268 19034347 11246166 12423450 778570 -13063926 -10510654
$$ packed form
12016a03890923O3827542N2885904M9789040j8904430p0449004k7437912L9488374
12009a4691409M4080096J7093444j4003936m4540677l9008465K880693P051666J852306
12001c9286282K6189616M7597829J5387820J7553941Q127371j823869j9391237o3136364
11993h781175r2906331n8619819r720629L2333430M5228747L8498848J4782499n703101
11985d4887531l4980624k5095380M8703428P8142661M2581840J1806770m3396445m1850645
11977h975926k060452J389392J6964004k5591338l9936713j0849990l1136380k3448024
11969a23645427P901261M4448839O1771450O4113986J7577987l6542488k831711N5215287
11961H8009184J7043635m3865551m2152921p788181J177284j1644880j3842496K553272
$$ plain form
11953 -10510654 -6694032 21414340 71492691 99553499 75713336 53578334 23511594 -23154084
11945 -23154084 -69355771 -123485404 -162613381 -144073022 -96500799 -110379958 -87525146 -27698731
11937 -27698731 -41090247 -110590125 -155987091 -175190335 -192810078 -202003740 -182269535 -149225134
11929 -149225134 -126911344 -96968960 -60854268 -7438189 31876235 6254823 -55458620
11922 -55458620 -88899172 -86422036 -96981411 -128097068 -105108891 -81847695 -98352238 -129148150
11914 -129148150 -162467874 -182188292 -218723582 -252598490 -265616905 -283900528 -316196173
11907 -316196173 -348125825 -325871809 -298877669 -268190602 -219941392 -162169112 -86294573
11900 -86294573 -9533134 54395351 98750095 140394489 151405487 103490358 50340463 28043116
$$ packed form
11953a0510654L816622K8108372N0078351K8060808k3840163k2135002l0066740m6665678
11945b3154084m6201687n4129633l9127977J8540359M7572223j3879159K2854812N9826415
11937b7698731j3391516o9499878m5396966j9203244j7619743r193662J9734205L3044401
11929a49225134K2313790K9942384L6114692N3416079L9314424k5621412o1713443
11922e5458620l3440552K477136j0559375l1115657K2988177K3261196j6504543l0795912
11914a29148150l3319724j9720418l6535290l3874908j3018415j8283623l2295645
11907c16196173l1929652K2254016K6994140L0687067M8249210N7772280P5874539
11900h6294573P6761439O3928485M4354744M1644394J1010998m7915129n3149895k2297347
$$ plain form
11892 28043116 53270184 92892508 100832266 75619751 62537688 56829462 47171176 31354649
11884 31354649 31773507 50326562 105400895 110456470 98099986 143473463 158934999 162891607
11876 162891607 172765597 174231426 149046042 95616506 80313697 131651227 171241472 133834717
11868 133834717 81681955 54054371 18064733 -31122756 -21842904 19972499 81032954 111900607
11860 111900607 75487006 21768320 -39605686 -89669463 -48469449 22316470 73709841
11853 73709841 60793744 -25928819 -125821386 -190446655 -194747537 -153057029 -87615869 -27028671
11845 -27028671 24326483 34164133 50243803 8663267 -53532841 -84110334 -89332050 -62743158
11837 -62743158 -41410221 -11852418 26488528 83992509 157437925 187782858 164752597 91775588
$$ packed form
11892B8043116K5227068L9622324P939758k5212515j3082063n708226r658286j5816527
11884C1354649M18858J8553055N5074333N055575j2356484M5373477J5461536L956608
11876A62891607R873990J465829k5185384n3429536j5302809N1337530L9590245l7406755
11868A33834717n2152762k7627584l5989638m9187489R279852M1815403O1060455L0867653
11860A11900607l6413601n3718686o1374006n0063777M1200014P0785919N1393371
11853G3709841j2916097q6722563r9892567o4625269m300882M1690508O5441160O0587198
11845b7028671N1355154R837650J6079670m1580536o2196108l0577493n221716K6588892
11837f2743158K1332937K9557803L8340946N7503981P3445416L0344933k3030261p2977009
$$ plain form
11829 91775588 1326774 -60429795 -67025859 -29862382 -16481040 -27755398 -1961229 69549149
11821 69549149 145898674 181720632 197707241 194133553 167162265 104657942 55009233 54415664
11813 54415664 56787335 45602220 46390764 102317037 158914033 126402920 53158669 1299229
11805 1299229 -27866859 -51850608 -54462997 -50989837 -28683410 18549832 53707279 56021504
11797 56021504 86418017 118668231 96414886 40607037 801257 -436913 -7589555 -17574107
11789 -17574107 -41883681 -73182815 -114667279 -113276948 -61918915 -9126582 28803357 70085406
11781 70085406 84296411 12397251 -39767940 -33302451 -10874583 12701738 38377729 37810146
11773 37810146 28932900 87239636 117205439 61046054 -27126000 -139122020 -203787893 -211843970
$$ packed form
11829I1775588r0448814o1756569o596064L7163477J3381342j1274358K5794169P1510378
11821F9549149P6349525L5821958J5986609l573688k6971288o2504323m9648709n93569
11813E4415664K371671j1185115P88544N5926273N6596996l2511113p3244251n1859440
11805A299229k9166088k3983749k612389L473160K2306427M7233242L5157447K314225
11797E6021504L0396513L2250214k2253345n5807849l9805780j238170p152642r984552
11789a7574107k4309574l1299134m1484464J390331N1358033N2792333L7929939M1282049
11781G0085406J4211005p1899160n2165191O465489K2427868K3576321K5675991n67583
11773C7810146q877246N8306736K9965803n6159385q8172054j11996020o4665873q056077
$$ plain form
11765 -211843970 -196549699 -186561917 -167291767 -121387962 -48152143 6287106 12036043 21008575
11757 21008575 25232985 9059809 -44022752 -104113145 -147626418 -164617123 -124402802 -73434340
11749 -73434340 60041861 361571482 575980592 468915200 290028589 186266500 150895195
11742 150895195 137457798 90621012 -7003946 -87559648 -121638614 -98240255 -37517881
11735 -37517881 3960584 8359964 13493947 -8668158 -94987093 -144307716 -108509063 -63955115
11727 -63955115 -27223114 -25091065 -68436834 -91662493 -99227822 -117703143 -130680143 -179360364
11719 -179360364 -204114687 -203028413 -240329457 -261665077 -186195482 -72695306 12117879
11712 12117879 35625315 1899692 -45764527 -88971018 -118805597 -123994952 -79745101 1872332
$$ packed form
11765b11843970J5294271R987782J9270150M5903805P3235819N4439249N748937Q972532
11757B1008575M224410j6173176n3082561o0090393m3513273j6990705M0214321N0968462
11749g3434340J33476201L01529621K14409110j07065392j78886611j03762089l5371305
11742A50895195j3437397m6836786r7624958q0555702l4078966K3398359O0722374
11735c7517881M1478465M399380N133983k2162105q6318935m9320623L5798653M4553948
11727f3955115L6732001K132049m3345769k3225659p565329j8475321j2977000m8680221
11719a79360364k4754323J086274l7301044k1335620P5469595J13500176Q4813185
11712A2117879K3507436l3725623m7664219m3206491k9834579n189355M4249851Q1617433
$$ plain form
11704 1872332 25544929 20456902 70770498 89607084 52791936 20305828 235654 -23784176
11696 -23784176 -11179400 9699955 53176446 167454638 243082848 192173520 147890606
11689 147890606 159272222 166353938 171914624 179180700 160824486 159667907 174317727 166359453
11681 166359453 126581917 57911555 -23587229 -94883078 -119266417 -91982512 -70438419 -67829664
11673 -67829664 -66262608 -67498130 -48812004 -19870269 -34775718 -40281891 -32099572 -46115238
11665 -46115238 -63573735 -55681506 -32776811 -22634375 17219930 87294591 127761697 148092502
11657 148092502 115170079 78304287 45862779 20045111 1677477 -21919440 -67834682
11650 -67834682 -98943471 -64407695 6103189 21271668 10985617 13185571 29023413 39309877
$$ packed form
11704A872332K3672597n088027N0313596J8836586l6815148l2486108k0070174k4019830
11696b3784176J2604776K0879355M3476491J14278192P5628210n0909328m4282914
11689A47890606J1381616P081716N560686P266076j8356214j156579J4649820p958274
11681A66359453l9777536o8670362q1498784p1295849k4383339K7283905K1544093K608755
11673f7829664J567056j235522J8686126K8941735j4905449n506173Q182319j4015666
11665d6115238j7458497P892229K2904695J0142436L9854305P0074661M0467106K0330805
11657A48092502l2922423l6865792l2441508k5817668j8367634k3596917m5915242
11650f7834682l1108789L4535776P0510884J5168479j0286051K199954J5837842J0286464
$$ plain form
11642 39309877 70475468 99855421 112689375 102437904 57923958 17194066 34274238 70787912
11634 70787912 110000047 155353948 180839225 166156603 97270128 63547661 105552152 131158269
11626 131158269 125988096 130682692 149761789 141511904 72410346 -18086822 -88361125 -109151397
11618 -109151397 -53333072 -11691287 -37508654 -54289436 -39625414 -36754989 -25960752 -9646399
11610 -9646399 -18697878 8387533 57667882 99320366 158660347 211473597 229979732 230867377
11602 230867377 248876367 243218076 199957111 91802481 -36787763 -85281686 -81853660
11595 -81853660 -39162741 -13520426 -29292129 -46453586 -50520909 -47114590 -16420251 1122869
11587 1122869 8167598 34558946 41256587 37082283 62352861 107990369 139248048 133326800
$$ packed form
11642C9309877L1165591K9379953J2833954j0251471m4513946m0729892J7080172L6513674
11634G0787912L9212135M5353901K5485277j4682622o8886475l3722467M2004491K5606117
11626A31158269n170173M694596J9079097q249885o9101558r0497168p0274303k0790272
11618a09151397N5818325M1641785k5817367j6780782J4664022K870425J0794237J6314353
11610i646399r051479K7085411M9280349M1652484N9339981N2813250J8506135Q87645
11602B30867377J8008990n658291m3260965j08154630j28590244m8493923L428026
11595h1853660M2690919K5642315j5771703j7161457m067323L406319L0694339J7543120
11587A122869P044729K6391348O697641m174304K5270578M5637508L1257679n921248
$$ plain form
11579 133326800 93177546 73094354 77096849 101158080 110800107 55418124 4243379 17806914
11571 17806914 86576325 184235568 284725743 369702952 410693495 370539711 269551165
11564 269551165 146496450 81006837 96507911 127281356 82958754 10454409 -47448993
11557 -47448993 -65469236 -26447151 18655476 26990678 6584110 -18321244 -60828407 -68763623
11549 -68763623 -35474066 755035 57806057 102140606 116044409 79073139 27110807 5474658
11541 5474658 66377970 114710072 102940705 101792739 116116363 81681064 25362108 5907719
11533 5907719 19087559 11196849 -27561749 -80442300 -122259240 -107126179 -60432957 -27484632
11525 -27484632 -33020064 -48721689 -82163837 -120986203 -111903844 -22102847 64459505 99725137
$$ packed form
11579A33326800m0149254k0083192M002495K4061231R642027n5381983n1174745J3563535
11571A7806914O8769411R7659243J00490175Q4977209M0990543m0153784j00988546
11564B69551165j23054715o5489613J5501074L0773445m4322602p2504345n7903402
11557d7448993j8020243L9022085M5102627Q335202k0406568k4905354m2507163p935216
11549f8763623L3289557L6229101N7051022M4334549J3903803l6971270n1962332k1636149
11541E474658O0903312M8332102j1769367j147966J4323624l4435299n6318956j9454389
11533E907719J3179840p890710l8758598n2880551m1816940J5133061M6693222L2948325
11525b7484632n535432j5701625l3442148l8822366R082359Q9800997Q6562352L5265632
$$ plain form
11517 99725137 122248865 65231020 -9517022 -34484241 -66883114 -108781433 -102206394 -69444073
11509 -69444073 -44483211 -2566402 33153811 49420327 52380906 38374948 34362310 49516969
11501 49516969 52777978 33537135 5680801 12309308 19486022 -4776497 -65481054 -74025122
11493 -74025122 -42734563 -91925516 -132503758 -121123976 -119348936 -157530144 -216006612 -247812478
11485 -247812478 -244345778 -234224956 -175755867 -70332020 15767949 70067572 74113698 35198257
11477 35198257 522917 3585387 56723021 147760349 147794110 89127695 69202143 59520114
11469 59520114 45244408 38351612 15894667 -575620 -20893187 -42633658 -64067884 -47703183
11461 -47703183 -17747603 -33347689 -54738878 -87216721 -140844048 -174856892 -164673609 -112439163
$$ packed form
11517I9725137K2523728n7017845p4748042k4967219l2398873m1898319O575039L2762321
11509f9444073K4960862M1916809L5720213J6266516K960579j4005958m012638J5154659
11501D9516969L261009j9240843k7856334O628507P176714k4262519o0704557q544068
11493g4025122L1290559m9190953m0578242J1379782J775040l8181208n8476468l1805866
11485b47812478L466700J0120822N8469089J05423847Q6099969N4299623M046126l8915441
11477C5198257l4675340L062470N3137634R1037328L3761n8666415j9925552r682029
11469E9520114j4275706o892796k2456945j6470287k0317567k1740471k1434226J6364701
11461d7703183K9955580j5600086k1391189l2477843n3627327l4012844J0183283N2234446
$$ plain form
11453 -112439163 -82699533 -57964052 -24080316 -11982156 -38372399 -74011083 -73337573 -67004287
11445 -67004287 -90913756 -139641886 -159424831 -163839339 -169702807 -189164746 -167887263 -120863296
11437 -120863296 -84249122 -85573232 -101317212 -116139748 -88408661 -11007212 53041271 94853905
11429 94853905 135771343 153446383 189951997 223009026 227424847 185027159 102020083 12844314
11421 12844314 -92553295 -163161863 -189733859 -181753408 -136635116 -69440187 -21856079 -28910868
11413 -28910868 -74595378 -93403287 -57032581 -24463629 -17445362 -7026478 97595844
11406 97595844 242330072 218071865 161467672 124896310 87234205 81546456 90382638 62632973
11398 62632973 30624953 603292 -65957896 -145807829 -168263772 -143907608 -152581430 -177245144
$$ packed form
11453a12439163K9739630K4735481L3883736J2098160k6390243l5638684O73510O333286
11445f7004287k3909469m8728130j9782945m414508n863468j9461939K1277483M7023967
11437a20863296L6614174j324110j5743980j4822536K7731087P7401449O4048483M1812634
11429I4853905M0917438J7675040L6505614L3057029M415821m2397688q3007076q9175769
11421A2844314j05397609p0608568k6571996P980451M5118292O7194929M7584108p054789
11413b8910868m5684510j8807909L6370706L2568952P018267J0418884J04622322
11406I7595844J44734228k4258207n6604193l6571362l7662105n687749Q836182k7749665
11398F2632973l2008020l0021661o6561188p9849933k2455943K4356164q673822k4663714
$$ plain form
11390 -177245144 -172157211 -151995328 -114772429 -70179301 -19902161 40903984 84546821 123473876
11382 123473876 182921492 216154094 230878181 204535071 116850526 9844531 -58480504
11375 -58480504 -85325698 -82306935 -41697564 42982573 117395593 122253197 63209906 -2423022
11367 -2423022 -23736581 -18331820 28279941 121600909 215639477 219346510 137654217 83948644
11359 83948644 82513970 121417916 150591314 149318685 133719120 147474027 196084816 236218099
11351 236218099 243300049 196623191 120592983 47787526 9750403 -49152907 -131433107 -171929319
11343 -171929319 -152655045 -105455816 -40541125 41249290 40237285 3445852 -30193811 -83072238
11335 -83072238 -143265030 -128536136 -64400954 -24212636 -1535324 32895834 54772123 90882356
$$ packed form
11390a77245144N087933K0161883L7222899M4593128N0277140O0806145M3642837L8927055
11382A23473876N9447616L3232602J4724087k6343110q7684545j07005995o8325035
11375e8480504k6845194L018763M0609371Q4680137P4413020M857604n9043291o5632928
11367b423022k1313559N404761M6611761R3320968R4038568L707033q1692293n3705573
11359H3948644j434674L8903946K9173398j272629j5599565J3754907M8610789M0133283
11351B36218099P081950m6676858p6030208p2805457l8037123n8903310q2280200m0496212
11343a71929319J9274274M7199229O4914691Q1790415j012005l6791433l3639663n2878427
11335h3072238o0192792J4728894O4135182M0188318K2677312L4431158K1876289L6110233
$$ plain form
11327 90882356 118006935 120839152 121105469 141800992 146322135 121562421 92729655 87087064
11319 87087064 99125760 112215940 105413969 65694113 77159644 139690195 165923235 159452847
11311 159452847 160092032 154891679 111508177 62246700 29914270 -22801323 -65186389 -63047515
11303 -63047515 -67182867 -104055383 -132646861 -128196278 -72824369 -1260592 65234977 112483721
11295 112483721 165569763 201556134 172829233 130897467 86544143 29109560 9486090
11288 9486090 24417330 70903677 132380554 139049243 50641282 -31522769 -63862812 -83464948
11280 -83464948 -122036751 -124488597 -49391528 9467710 34943351 62833697 82787235 100992340
11272 100992340 113736542 150209316 130536431 43890521 -17542548 -25514491 22144086 85338206
$$ packed form
11327I0882356K7124579K832217K66317K0695523M521143k4759714k8832766n642591
11319H7087064J2038696J3090180o801971l9719856J1465531O2530551K6233040o470388
11311A59452847O39185n200353m3383502m9261477l2332430n2715593m2385066K138874
11303f3047515m135352l6872516k8591478M450583N5371909P1563777O6495569M7248744
11295A12483721N3086042L5986371k8726901m1931766m4353324n7434583j9623470
11288I486090J4931240M6486347O1476877O668689q8407961q2164051l2340043j9602136
11280h3464948l8571803k451846P5097069N8859238K5475641K7890346J9953538J8205105
11272A00992340J2744202L6472774j9672885q6645910o1433069p971943M7658577O3194120
$$ plain form
11264 85338206 111941253 100397547 52613422 -9549022 -60859544 -89801119 -87343676 -69430541
11256 -69430541 -26814670 15091806 53599965 100579241 104378351 80934772 52072639 24949072
11248 24949072 19880689 -3700990 -10938277 -900223 6150871 3768949 15843443 39521863
11240 39521863 18592618 -35591853 -68117289 -49594874 1265274 41305800 56040732 67018385
11232 67018385 52138285 61824698 68333958 46327397 38596070 45083209 67190362 34494564
11224 34494564 15591769 24025999 3724490 -49770620 -43832771 12259810 42222925 68028269
11216 68028269 43725923 -14527337 -18424189 7238669 16677747 -30389608 -121607830 -157551052
11208 -157551052 -159435950 -138175361 -104100921 -92612812 -75438864 -31833679 20626385 71250602
$$ packed form
11264H5338206K6603047j1543706m7784125o2162444n1310522k8941575K457443J7913135
11256f9430541M2615871M1906476L8508159M6979276L799110k3443579k8862133k7123567
11248B4949072n068383k3581679p237287J0038054P051094k381922J2074494K3678420
11240C9521863k0929245n4184471l2525436J8522415N0860148M0040526J4734932J0977653
11232F7018385j4880100R686413O509260k2006561p731327O487139K2107153l2695798
11224C4494564j8902795Q434230k0301509n3495110N937849N6092581K9963115K5805344
11216F8028269k4302346n8253260l896852K5662858R439078m7067355r1218222l5943222
11208a57551052j884898K1260589L4074440J1488109J7173948M3605185N2460064N0624217
$$ plain form
11200 71250602 119694352 145007746 121183163 42669278 -37191078 -24299966 6365872 5203355
11192 5203355 17581574 29380777 54280071 77509054 100855249 111739356 147726878 175895302
11184 175895302 130210413 82010374 49982574 -16756596 -91608545 -115582283 -151544116
11177 -151544116 -231564993 -243145468 -180452019 -164498131 -170760887 -154132438 -124185391 -104096049
11169 -104096049 -83759751 -47685110 -2571002 40825204 71810346 61468351 44542197 51631876
11161 51631876 60838533 86401409 97643874 47454547 -25920454 -59146162 -55954053 -54755131
11153 -54755131 -92428833 -138994993 -147726425 -125303849 -106765162 -61652413 -7499763 -1413228
11145 -1413228 -23217758 -83084703 -178354679 -234697275 -200605333 -129010433 -60195037 -6360203
$$ packed form
11200G1250602M8443750K5313394k3824583p8513885p9860356J2891112L0665838j162517
11192E203355J2378219J1799203K4899294K3228983K3346195J0884107L5987522K8168424
11184A75895302m5684889m8200039l2027800o6739170p4851949k3973738l5961833
11177a51544116q0020877j1580475O2693449J5953888o262756J6628449K9947047K0089342
11169a04096049K0336298L6074641M5114108M3396206L0985142j0341995j6926154P089679
11161E1631876R206657K5562876J1242465n0189327p3375001l3225708L192109J198922
11153e4755131l7673702m6566160q731432K2422576J8538687M5112749N4152650O086535
11145a413228k1804530n9866945r5269976n6342596L4091942P1594900O8815396N3834834
$$ plain form
11137 -6360203 18923911 24913257 -6535935 -14486995 2108243 -796333 -29798829 -58088849
11129 -58088849 -64839854 -99658314 -106829695 -68585179 -35681374 -8623162 22035998 -25284041
11121 -25284041 -70171289 -86540791 -98774107 -89696282 -78635456 -82530322 -73476559 -76790600
11113 -76790600 -108726130 -175980400 -240312554 -246110062 -209699074 -141562077 -67112156 -27792520
11105 -27792520 -85813308 -157206841 -140542102 -109474410 -73560761 -57516268 -68493877 -7708620
11097 -7708620 114588577 198943582 228470227 219960697 219456520 224666915 242361228 241610984
11089 241610984 222825726 241228195 251607273 165944682 64917549 -36782084 -136342299
11082 -136342299 -180739971 -203230050 -218808174 -214379552 -217529001 -184784815 -72930227
$$ packed form
11137f360203K5284114N989346l1449192p951060J6595238k904576k9002496k8290020
11129e8088849o751005l4818460p171381L8244516L2903805K7058212L0659160m7320039
11121b5284041m4887248j6369502j2233316R077825J1060826l894866R053763l314041
11113g6790600l1935530o7254270o4332154n797508L6410988O8136997P4449921L9319636
11105b7792520n8020788p1393533J6664739L1067692L5913649J6044493j0977609O0785257
11097g708620J22297197Q4355005K9526645q509530n04177N210395J7694313p50244
11089B41610984j8785258J8402469J0379078q5662591j01027133j01699633r9560215
11082a36342299m4397672k2490079j5578124M428622l149449L2744186J11854588
$$ plain form
11075 -72930227 84513935 126131726 106733794 103148750 101937716 97216546 115746100 148402705
11067 148402705 160472829 138728953 115250683 122895173 134332010 164700646 215661830 231497193
11059 231497193 214546567 194916085 190457698 181996529 171107512 159124110 137828762 75407289
11051 75407289 -23302868 -117712107 -151283241 -102846784 -18345336 24773336 10749906 -46324036
11043 -46324036 -90878169 -94933210 -41161826 19822478 55075223 74909244 95381885 102035684
11035 102035684 58379821 -47724320 -128125379 -138808017 -100089882 -34039469 37983577
11028 37983577 76639927 125268632 184827991 220246967 212459697 180635026 105964098 8109241
11020 8109241 -40874615 -35720635 -11236550 -8010526 7873140 59936142 111141351 135755200
$$ packed form
11075g2930227J57444162M1617791j9397932l585044j211034m721170J8529554L2656605
11067A48402705J2070124k1743876k3478270P644490J1436837L0368636N0961184J5835363
11059B31497193j6950626j9630482m458387q461169j0889017j1983402k1295348o2421473
11051G5407289r8710157r4409239l3571134M8436457Q4501448M3118672j4023430n7073942
11043d6324036m4554133m055041N3771384O0984304L5252745J9834021K0472641O653799
11035A02035684m3655863j06104141q0401059j0682638L8718135O6050413P2023046
11028C7983577L8656350M8628705N9559359L5418976p787270l1824671p4670928r7854857
11020H109241m8983856N153980K4484085L226024J5883666N2063002N1205209K4613849
$$ plain form
11012 135755200 120066724 43034005 -5007011 -21218443 -44518318 -38347451 -10036909 22171752
11004 22171752 20995143 21306228 19276608 30381236 34540708 17417949 -28470158 -66628965 -66534519
10995 -66534519 -69323865 -76544473 -95818577 -103552165 -113261887 -113898605 -56078127 -29377663
10987 -29377663 -77510279 -63135302 -24410222 -55840417 -72641741 -35835942 -28089958 -58466994
10979 -58466994 -64128573 -76076228 -108763385 -103797788 -71085725 -55524738 -32639649 30593489
10971 30593489 126714283 202096740 232638608 228976263 185589029 142597132 141486146 151358947
10963 151358947 164598605 166079920 139713107 64664112 -27786941 -63198562 -79754034 -126827899
10955 -126827899 -150876960 -80102300 50159905 134543669 164773503 194592637 213376861
$$ packed form
11012A35755200j5688476p7032719m8041016j6211432k3299875O170867K8310542L2208661
11004B2171752j176609L11085k029620J1104628M159472j7122759m5888107l8158807R4446
10995f6534519k789346p220608j9274104p733588r709722o36718N7820478K6700464
10987b9377663m8132616J4374977L8725080l1430195j6801324L6805799P745984l0377036
10979e8466994n661579j1947655l2687157M965597L2712063J5560987K2885089O3233138
10971C0593489R6120794P5382457L0541868l662345m3387234m2991897j110986R872801
10963A51358947J3239658J481315k6366813p5048995r2451053l5411621j6555472m7073865
10955a26827899k4049061P0774660J30262205Q4383764L0229834K9819134J8784224
$$ plain form
10948 213376861 234519682 245443818 237700580 166568701 64185838 24679895 15457656 -21692440
10940 -21692440 -16645654 37104958 73932532 73189137 64511304 53798828 66681916 109121678
10932 109121678 129483381 101663722 90591215 107169746 111045330 79051237 29462810 7085215
10924 7085215 32596954 53438196 64181614 44986751 -25080879 -66036439 -49043542 10003670
10916 10003670 95547928 128970182 113801451 123744167 126566306 109017380 104689582 123326999
10908 123326999 133908376 76394496 -23031398 -80691201 -86817235 -23871066 62654241 96447630
10900 96447630 76243274 46822678 32101760 73508377 135401503 199811437 231111884 227332081
10892 227332081 181294186 158946511 206152531 242216417 258936790 257894975 227863669 191062300
$$ packed form
10948B13376861K1142821J0924136p743238p1131879j02382863l9505943r222239l7150096
10940b1692440N046786N3750612L6827574p43395q677833j0712476J2883088M2439762
10932A09121678K0361703k7819659j1072507J6578531L875584l1994093m9588427k2377595
10924G085215K5511739K0841242J0743418j9194863p0067630m0955560J6992897N9047212
10916A0003670Q5544258L3422254j5168731R942716K822139j7548926m327798J8637417
10908A23326999J0581377n7513880r9425894n7659803o126034O2946169Q6525307L3793389
10900I6447630k0204356k9420596j4720918M1406617O1893126O4409934L1300447l779803
10892B27332081m6037895k2347675M7206020L6063886J6720373j041815l0031306l6801369
$$ plain form
10884 191062300 141205194 81239008 66745179 54662869 22540096 27253725 60417811 70884553
10876 70884553 56708192 47860776 76632238 110718624 96333928 67516109 87345281 128981335
10868 128981335 113543156 76420267 14232561 -89792840 -158363551 -212762386 -226024894
10861 -226024894 -218312526 -207709439 -161618771 -102698657 -64584385 -28752501 12178620 64806112
10853 64806112 89552337 77398222 57286257 17769664 -7910463 -19669076 -22725835 -34676201
10845 -34676201 17659908 85977740 80308007 1215923 -55051419 -59075218 12889465 102783697
10837 102783697 146808786 139514227 117215970 58545792 -12710122 -42125260 -63512130 -72404811
10829 -72404811 -31670818 -7505823 -31284335 -55911539 -26092371 46239042 108323186 104570464
$$ packed form
10884A91062300m9857106n9966186j4493829j2082310l2122773M713629L3164086J0466742
10876G0884553j4176361q847416K8771462L4086386j4384696k8817819J9829172M1636054
10868A28981335j5438179l7122889o2187706j04025401o8570711n4398835j3262508
10861b26024894P712368J0603087M6090668N8920114L8114272L5831884M0931121N2627492
10853F4806112K4746225j2154115k0111965l9516593k5680127j1758613l056759j1950366
10845c4676201N2336109O8317832n669733p9092084n6267342m023799P1964683Q9894232
10837A02783697M4025089p294559k2298257n8670178p1255914k9415138k1386870q892681
10829g2404811M0733993K4164995k3778512k4627204K9819168P2331413O2084144l752722
$$ plain form
10821 104570464 86715548 89003432 91704020 63393296 10291219 -72977879 -112606789 -30702550
10813 -30702550 56692044 76292864 54714221 31210969 31619934 50847616 49144771 19311761
10805 19311761 41169725 77812953 100106056 98471423 101625473 113988586 109729359 123323526
10797 123323526 147383318 161836784 167247522 157401604 161004834 173549965 155266404 140104686
10789 140104686 135740822 158775774 205126604 221104473 183176570 177176800 227494633 277397975
10781 277397975 276614969 261496368 233439242 201229485 197757906 226629386 252126409 269395909
10773 269395909 234998765 179154673 207805983 256873728 229637827 149060794 98062631
10766 98062631 73575426 83520583 102854951 93122787 40453570 15186831 59170486 113070906
$$ packed form
10821A04570464j7854916K287884K700588k8310724n3102077q3269098l9628910Q1904239
10813c0702550Q7394594J9600820k1578643k3503252M08965J9227682j702845k9833010
10805A9311761K1857964L6643228K2293103j634633L154050J2363113m259227J3594167
10797A23323526K4059792J4453466N410738r845918L603230J2545131j8283561j5161718
10789A40104686m363864K3034952M6350830J5977869l7927903n999770N0317833M9903342
10781B77397975p83006j5118601k8057126l2209757l471579K8871480K5497023J7269500
10773B69395909l4397144n5844092K8651310M9067745k7235901q0577033n0998163
10766I8062631k4487205R945157J9334368r732164n2669217k5266739M3983655N3900420
$$ plain form
10758 113070906 181628703 211020982 113524928 -35285741 -45180826 44269930 134053765
10751 134053765 145099659 119251473 140206200 144972900 94647892 47060910 54004773 57007139
10743 57007139 56181238 49605642 51884548 77998441 104832271 76717085 1193939 -84597167
10735 -84597167 -95755424 -3556079 116564817 209561508 214488575 170769924 118720697 100605902
10727 100605902 82372354 101953147 118299353 119411011 144920095 130634852 52986094
10720 52986094 -53435367 -67894895 3779098 71445790 103341124 122170519 133560485
10713 133560485 146705389 142364129 102154235 69574082 63305078 75061773 135447295 206446384
10705 206446384 230496074 203333551 149212433 105982001 88526808 53563753 -14714103
$$ packed form
10758A13070906O8557797K9392279r7496054j48810669r895085Q9450756Q9783835
10751A34053765J1045894k5848186K0954727M766700n0325008m7586982O943863L002366
10743E7007139q25901o575596K278906K6113893K6833830k8115186p5523146q5791106
10735h4597167j1158257R2199345J20120896R2996691M927067m3718651n2049227j8114795
10727A00605902j8233548J9580793J6346206J111658K5509084j4285243p7648758
10720E2986094j06421461j4459528P1673993O7666692L1895334J8829395J1389966
10713A33560485J3144904m341260m0209894l2580153o269004J1756695O0385522P0999089
10705B06446384K4049690k7162523n4121118m3230432j7455193l4963055o8277856
$$ plain form
10698 -14714103 -83444832 -95511234 -64772754 -34619016 -25739067 -61639937 -113176420 -139601870
10690 -139601870 -133182293 -113200878 -75780833 -23451499 16521749 22213089 -33999579 -113520782
10682 -113520782 -122221744 -101299001 -119319248 -161335423 -198056002 -218225371 -221082338 -153435672
10674 -153435672 -39664493 34094813 62446997 98996161 144664009 180430501 178959490
10667 178959490 151987058 114335049 64143500 22698334 57921878 135599749 156291334
10660 156291334 106845987 47820741 76652559 184647430 263404597 290597252 228086007
10653 228086007 135813940 58964631 13408720 17426206 55171281 98238825 124142328 133572401
10645 133572401 165907210 230035697 270197641 287060389 247917039 197329541 154817327
$$ packed form
10698a4714103o8730729j2066402L0738480L0153738Q879949l5900870n1536483k6425450
10690a39601870O419577J9981415L7420045N2329334L9973248N691340n6212668p9521203
10682a13520782q700962K0922743j8020247m2016175l6720579k0169369k856967O7646666
10674a53435672J13771179P3759306K8352184L6549164M5667848L5766492j471011
10667A78959490k6972432l7652009n0191549m1445166L5223544P7677871K0691585
10660A56291334m9445347n9025246K8831818J07994871P8757167K7192655o2511245
10653B28086007r2272067p6849309m5555911M017486L7745075M3067544K5903503R430073
10645A33572401L2334809O4128487M0161944J6862748l9143350n0587498m2512214
$$ plain form
10638 154817327 88311239 47025626 26221717 28271356 49280843 57969099 56205410 28684417
10630 28684417 -1767238 -38697283 -59951326 -25586564 33066340 128186500 191379567 210974812
10622 210974812 244972596 229771049 135681848 43076431 18694717 43361589 60453955 52977605
10614 52977605 44421699 14777612 6901963 53418608 84807216 107460427 145388624 163321539
10606 163321539 138153774 94008306 66643361 67111914 57260383 14282210 -27214598 -38047239
10598 -38047239 -54530899 -66044081 -54469443 -18486377 49120689 95732779 120115012 97413978
10590 97413978 24292605 -2609944 15919021 54206577 63539300 25858206 -17369806 -53976336
10582 -53976336 -47742976 6486610 51847825 82381294 90004120 48852914 8330581 7967421
$$ packed form
10638A54817327o6506088m1285613k0803909K049639K1009487Q688256j763689k7520993
10630B8684417l0451655l6930045k1254043L4364762N8652904R5120160O3193067J9595245
10622B10974812L3997784j5201547r4089201r2605417k4381714K4666872J7092366p476350
10614E2977605q555906k9644087p875649M6516645L1388608K2653211L7928197J7932915
10606A63321539k5167765m4145468k7364945M68553r851531m2978173m1496808j0832641
10598c8047239j6483660j1513182J1574638L5983066O7607066M6612090K4382233k2701034
10590I7413978p3121373k6902549J8528965L8287556R332723l7681094m3228012l6606530
10582e3976336O233360N4229586M5361215L0533469P622826m1151206m0522333l63160
$$ plain form
10574 7967421 19039767 51897042 58515355 39038329 -31703816 -112093017 -104979789 -19979556
10566 -19979556 47727371 20884284 -31740047 -26092186 9614563 29815595 52725124 86918122
10558 86918122 119007910 146569157 166873168 176088206 194651658 196216892 131394618 68252678
10550 68252678 56024993 21657846 -16541028 -18435170 -50500134 -89359874 -95661704 -86674520
10542 -86674520 -99600479 -119702571 -114841325 -92392230 -60582295 -32506120 -12393879 -27675994
10534 -27675994 -58067561 -57432972 -44077992 -15075925 35652667 55527082 62448942 92285121
10526 92285121 147616854 175205929 135966443 62045567 58685800 133700339 164004486 115744390
10518 115744390 88032054 63555910 75255567 96106171 71231145 38134820 4911923
$$ packed form
10574G967421J1072346L2857275O618313j9477026p0742145q0389201P113228Q5000233
10566a9979556O7706927k6843087n2624331N647861L5706749K0201032K2909529L4192998
10558H6918122L2089788K7561247K0304011R215038J8563452J565234o4822274o3141940
10550F8252678j2227685l4367147l8198874j894142l2064964l8859740o301830Q987184
10542h6674520j2925959k0102092M861246K2449095L1809935K8076175K0112241j5282115
10534b7675994l0391567O34589J3354980K9002067N0728592J9874415O921860K9836179
10526I2285121N5331733K7589075l9239486p3920876l359767P5014539L0304147m8260096
10518A15744390k7712336k4476144J1699657K0850604k4875026l3096325l3222897
$$ plain form
10511 4911923 -8747188 40927695 124149327 153726241 105867834 44962177 17710273 40550054
10503 40550054 86734266 128957734 135523377 94673141 48002173 43332617 102219039 117383558
10495 117383558 67433000 41867877 49753424 58768387 67669482 90499943 111985423 107606726
10487 107606726 77285558 48539693 16453408 -25456357 -58351501 -101746273 -139466184
10480 -139466184 -173600583 -226541569 -238726758 -182432659 -103363467 -72020403 -36272319
10473 -36272319 77818255 175834224 223825623 236820499 230216106 213065339 152654123 87590271
10465 87590271 24023200 -34409649 -61139386 -65306269 -66356871 -64031931 -72285082 -73960544
10457 -73960544 -71480008 -94287686 -135070425 -182601348 -198163422 -151392411 -71084739 -2484366
$$ packed form
10511D911923j3659111M9674883Q3221632K9576914m7858407o0905657k7251904K2839781
10503D0550054M6184212M2223468O565643m0850236m6670968m669556N8886422J5164519
10495A17383558m9950558k5565123P885547R014963Q901095K2830461K1485480m378697
10487A07606726l0321168k8745865l2086285m1909765l2895144m3394772l7719911
10480a39466184l4134399n2940986j2185189N6294099P9069192L1343064L5748084
10473c6272319J14090574R8015969M7991399J2994876o604393j7150767o0411216o5063852
10465H7590271o3567071n8432849k6729737m166883j050602K324940q253151j675462
10457g3960544K480536k2807678m0782739m7530923j5562074M6771011Q0307672O8600373
$$ plain form
10449 -2484366 -8563994 -35373251 2122372 57666659 82641404 68967067 18238850 -20213561
10441 -20213561 -52665403 -76717074 -104129378 -120852548 -99488758 -77400900 -48966665 -38646958
10433 -38646958 -45434087 -15812193 37145136 56407671 47793575 46571145 75585420 95731427
10425 95731427 68974543 36403007 36389302 55044487 63009276 47140614 23965936 10237398
10417 10237398 -42898500 -68864986 -45054128 7711502 51608206 46638566 10690576 -28062012
10409 -28062012 3667067 107741647 146854182 155933923 173794293 152829353 147833443 124583976
10401 124583976 27414499 -53559168 -77627398 -61500104 -9947363 31510904 10703124
10394 10703124 -31763380 -23140183 27772439 76413207 146707711 190363248 203411794 227393039
$$ packed form
10449b484366o079628k6809257L7495623N5544287K4974745j3674337n0728217l8452411
10441b0213561l2451842k4051671k7412304j6723170K1363790K2087858K8434235J0319707
10433c8646958o787129K9621894N2957329J9262535q614096j222430K9014275K0146007
10425I5731427k6756884l2571536j3705J8655185P964789j5868662k3174678j3728538
10417A0237398n3135898k5966486K3810858N2765630M3896704m969640l5947990l8752588
10409b8062012L1729079J04074580L9112535R079741J7860370k0964940m995910k3249467
10401A24583976r7169477q0973667k4068230J6127294N1552741M1458267k0807780
10394A0703124m2466504Q623197N0912622M8640768P0294504M3655537J3048546K3981245
$$ plain form
10386 227393039 210398586 153247731 113792374 133731552 144301748 150841002 205729668 230471994
10378 230471994 219645363 205078847 164414890 135962177 153896330 167697606 166284650 142410743
10370 142410743 83514700 28572089 36487597 30109159 4125656 -71099 -13407258 -25101540
10362 -25101540 3439878 74252295 111171345 133938002 146607891 185655328 235771258 259842580
10354 259842580 265339803 235515735 171678875 125583932 111258674 79338344 20457955 -46344605
10346 -46344605 -88117340 -103819717 -123577193 -103884308 -78838861 -69287519 -33581852 37768569
10338 37768569 106460065 165921859 217840783 224954834 229341962 227892041 214492527 174441879
10330 174441879 145179591 151597352 155344262 104104575 47749903 -11696496 -59262355 -77613961
$$ packed form
10386B27393039j6994453n7150855l9455357J9939178J0570196O539254N4888666K4742326
10378B30471994j0826631j4566516m0663957k8452713J7934153J3801276j412956k3873907
10370A42410743n8896043n4942611P915508o378438k5983503m196755j3336159j1694282
10362b5101540K8541418P0812417L6919050K2766657J2669889L9047437N0115930K4071322
10354B59842580N497223k9824068o3836860m6094943j4325258l1920330n8880389o6802560
10346d6344605m1772735j5702377j9757476J9692885K5045447R551342L5705667P1350421
10338C7768569O8691496N9461794N1918924P114051M387128j449921j3399514m0050648
10330A74441879k9262288O417761L746910n1239687n6354672n9446399m7565859j8351606
$$ plain form
10322 -77613961 -81214396 -72786692 -58401831 -42222783 -46551449 -6747885 106856770 187372201
10314 187372201 184797802 156124859 145439159 170034916 199348938 187918899 151248404 153965411
10306 153965411 144740759 133833884 146433891 146453246 133723189 142462296 155838111 145161335
10298 145161335 93443766 33327981 -27538294 -76588481 -109258213 -112292969 -62628921 -9203738
10290 -9203738 52868457 109271086 164291038 149846534 101279812 79625482 61023362 67335261
10282 67335261 97686415 100595334 49793906 -23700711 -60368134 -57736823 -100733578 -115671796
10274 -115671796 -88600672 -72893217 -41939932 15290902 79538880 110559891 111364414 79906843
10266 79906843 52076337 53977427 77561617 104283211 130851060 154477035 156132643 146938121
$$ packed form
10322g7613961l600435Q427704J4384861J6179048m328666L9803564J13604655Q0515431
10314A87372201k574399k8672943j0685700K4595757K9314022j1430039l6670495K717007
10306A53965411r224652j0906875J2600007J9355j2730057Q739107J3375815j0676776
10298A45161335n1717569o0115785o0866275m9050187l2669732l034756M9664048N3425183
10290i203738O2072195N6402629N5019952j4444504m8566722k1654330j8602120O311899
10282F7335261L0351154K908919n0801428p3494617l6667423K631311m2996755j4938218
10274a15671796K7071124J5707455L0953285N7230834O4247978L1021011Q04523l1457571
10266G9906843k7830506J901090K3584190K6721594K6567849K3625975J655608r194522
$$ plain form
10258 146938121 132141968 133030782 169799345 186662718 214128613 262403775 285965723 245806497
10250 245806497 174429646 83549087 21580372 27037730 79504154 131538001 138021369 141022381
10242 141022381 153731939 128225695 106273172 96458947 111075614 145009593 171158500 172304911
10234 172304911 139767484 129420266 116157662 92077080 56966881 44130009 41277172 46588507
10226 46588507 33041026 20631953 59198535 111908516 198022534 277021570 257219191 210363439
10218 210363439 205939742 203587789 186728392 179017142 187931949 204708129 199382237 175574649
10210 175574649 187011363 191425565 205086036 258933811 310904250 344592804 394556104 470525389
10202 470525389 546906527 539037206 447213952 381784409 384576518 431722153 428714853 378760598
$$ packed form
10258A46938121j4796153Q88814L6768563J6863373K7465895M8275162K3561948m0159226
10250B45806497p1376851r0880559o1968715N457358N2466424N2033847O483368L001012
10242A41022381J2709558k5506244k1952523r814225J4616667L3933979K6148907J146411
10234A72304911l2537427j0347218j3262604k4080582l5110199j2836872k852837N311335
10226D6588507j3547481j2409073L8566582N2709981Q6114018P8999036j9802379m6855752
10218B10363439m423697k351953j6859397p711250Q914807J6776180n325892k3807588
10210A75574649J1436714M414202J3660471N3847775N1970439L3688554M9963300P5969285
10202D70525389P6381138p869321r1823254o5429543K792109M7145635l007300m9954255
$$ plain form
10194 378760598 375950519 432629869 497759464 464469923 381195043 371471908 390925588 396177056
10186 396177056 390014685 360063030 305700341 247964628 244206779 277092418 276672429 259056712
10178 259056712 286803780 347018128 403991984 500143430 595169905 622963148 592236590
10171 592236590 552506360 528702416 479444868 423637638 386122266 295873883 169413322
10164 169413322 28109093 -151496543 -330660287 -539147560 -798988665 -944164333 -918831122
10157 -918831122 -825782343 -775159500 -739662028 -632103550 -494612151 -382691620 -335514035
10150 -335514035 -343603474 -301615607 -244275708 -212575153 -200524816 -206180648 -192365500 -183225275
10142 -183225275 -154619189 -88956015 -34751232 63023357 169622119 227984773 289778383
$$ packed form
10194C78760598k810079N6679350O5129595l3289541q3274880r723135J9453680N251468
10186C96177056o162371k9951655n4362689n7735713l757849L2885639m19989j7615717
10178B59056712K7747068O0214348N6973856R6151446R5026475K7793243l0726558
10171E92236590l9730230k3803944m9257548n5807230l7515372r0248383j26460561
10164A69413322j41304229j79605636j79163744k08487273k59841105j45175668K5333211
10157i18831122R3048779N0622843L5497472J07558478J37491399J11920531M7177585
10150c35514035q089439M1987867N7339899L1700555J2050337n655832J3815148R140225
10142a83225275K8606086O5663174N4204783R7774589J06598762N8362654O1793610
$$ plain form
10135 289778383 326235815 301756590 255676122 195591354 160361149 114157061 56595977 48576186
10127 48576186 99384502 120012769 99201567 85200772 126733740 164942078 128857545 84840913
10119 84840913 87305120 169153426 265758596 330701176 387192625 408758810 349442075 259085366
10111 259085366 155514098 17422462 -99660288 -157339881 -218442570 -405204886 -711596766
10104 -711596766 -997796472 -1140652641 -1132861240 -1016449629 -871914480 -758733622 -666233147
10097 -666233147 -553781029 -442584690 -379469274 -368307401 -392398520 -393512241 -387788285
10090 -387788285 -366388134 -333164287 -314035191 -302472676 -296516886 -269853131 -194393066 -136461168
10082 -136461168 -109181852 -94172848 -57021785 -11834109 33234296 49926849 -20743728
$$ packed form
10135B89778383L6457432k4479225m6080468o0084768l5230205m6204088n7561084q019791
10127D8576186N0808316K0628267k0811202j4000795M1532968L8208338l6084533m4016632
10119H4840913K464207Q1848306R6605170O4942580N6491449K1566185n9316735r0356709
10111B59085366j03571268j38091636j17082750n7679593o1102689j86762316l06391880
10104g11596766k86199706j42856169P791401J16411611J44535149J13180858R2500475
10097f66233147J12452118J11196339O3115416J1161873k4091119j113721N723956
10090c87788285K1400151L3223847J9129096J1562515N955790K6663755P5460065N7931898
10082a36461168K7279316J5009004L7151063M5187676M5068405J6692553p0670577
$$ plain form
10075 -20743728 -119948308 -182926676 -161680718 -117723203 -62667218 -3776804 35971570 70228204
10067 70228204 89245733 71996531 75460722 107280867 180011015 212725216 215889447 237936158
10059 237936158 273188122 304658533 328128032 348868627 402053011 371089779 201121697
10052 201121697 -46567208 -334896796 -601665378 -803455001 -896885040 -907265598 -844949544
10045 -844949544 -740350145 -622137012 -484003570 -378590058 -344825604 -292396492 -175398173
10038 -175398173 -71602317 -78742621 -137414006 -213954449 -282795396 -296295688 -274273791 -269776784
10030 -269776784 -315648941 -379279504 -424096853 -422627359 -383405427 -323767235 -287040067 -286356922
10022 -286356922 -304211427 -310446987 -283539985 -239255653 -216988326 -267750994 -343282032 -375911644
$$ packed form
10075b0743728r9204580o2978368K1245958M3957515N5055985N8890414L9748374L4256634
10067G0228204J9017529j7249202L464191L1820145P2730148L2714201L164231K2046711
10059B37936158L5251964L1470411K3469499K0740595N3184384l0963232j69968082
10052B01121697k47688905k88329588k66768582k01789623r3430039j0380558O2316054
10045h44949544J04599399J18213133J38133442J05413512L3764454N2429112J16998319
10038a75398173J03795856p140304n8671385p6540443o8840947j3500292K2021897M497007
10030b69776784m5872157o3630563m4817349J469494L9221932N9638192L6727168O83145
10022b86356922j7854505o235560K6907002M4284332K2267327n0762668p5531038l2629612
$$ plain form
10014 -375911644 -349141092 -284785384 -226339336 -209486814 -221414068 -183430837 -134212391
10007 -134212391 -165641574 -214534289 -250740747 -274317796 -258116970 -220418535 -172699475
10000 -172699475 -153444776 -191137792 -235960378 -303070640 -343393711 -335957901 -298876905 -268305215
9992 -268305215 -253800561 -221294438 -195962489 -208141621 -214759333 -165885139 -132318838 -139657730
9984 -139657730 -145607723 -178341359 -196789033 -172120315 -170792497 -209484668 -217915011 -179988735
9976 -179988735 -159231461 -158920055 -185631487 -188303563 -158538370 -132631397 -133531860 -123910864
9968 -123910864 -90819618 -82769794 -110372160 -104049135 -66515176 -10081984 -11865010 -54120666
9960 -54120666 -58915593 -59597689 -64131271 -56286469 -35201300 -104155 927216 -23401513
$$ packed form
10014c75911644K6770552O4355708N8446048J6852522j1927254L7983231M9218446
10007a34212391l1429183m8892715l6206458k3577049J6200826L7698435M7719060
10000a72699475J9254699l7693016m4822586o7110262m0323071P435810L7080996L0571690
9992b68305215J4504654L2506123K5331949j2179132o617712M8874194L3566301p338892
9984a39657730n949993l2733636j8447674K4668718J327818l8692171q430343L7926276
9976a79988735K0757274L11406k6711432k672076K9765193K5906973r00463R620996
9968a23910864L3091246Q049824k7602366O323025L7533959N6433192j783026m2255656
9960e4120666m794927o82096m533582P844802K1085169L5097145J031371k4328729
$$ plain form
9952 -23401513 -10672403 16489100 -5079179 -59375414 -49071707 3888608 27385551 25100884
9944 25100884 33194040 87273152 139123456 125204836 40340146 -22753719 -22141837 -6420351
9936 -6420351 -25414905 -88963780 -144836136 -163341113 -107453267 -16686786 54467819 67619047
9928 67619047 63402038 67430510 40977562 30287467 68480714 82463119 53174495 59509618
9920 59509618 73740995 65691528 54607146 27187217 -1057951 -43950479 -114914858 -170712635
9912 -170712635 -187720137 -206682270 -198704153 -187845290 -190306054 -194907843 -198562674 -192795297
9904 -192795297 -174535649 -168739799 -174272970 -236306596 -329599361 -371279610 -321458381 -227663527
9896 -227663527 -187017077 -179142673 -142003282 -115590495 -96704522 -63487810 -45350518 -10263870
$$ packed form
9952b3401513J2729110K7161503k1568279n4296235J0303707N2960315K3496943k284667
9944B5100884Q093156N4079112N1850304j3918620q4864690o3093865O11882J5721486
9936f420351j8994554o3548875n5872356j8504977N5887846R0766481P1154605J3151228
9928F7619047m217009M028472k6452948j0690095L8193247J3982405k9288624O335123
9920E9509618J4231377q049467j1084382k7419929k8245168m2892528p0964379n5797777
9912a70712635j7007502j8962133P978117J0858863k460764m601789l654831N767377
9904a92795297J8259648N795850n533171o2033626r3292765m1680249M9821229R3794854
9896b27663527M0646450P874404L7139391K6412787J8885973L3216712J8137292L5086648
$$ plain form
9888 -10263870 23429694 32321942 37520348 60080939 46138261 -30695435 -123370008 -145432603
9880 -145432603 -123280581 -99332506 -57130235 -48723416 -107779814 -151057783 -165563568 -184513915
9872 -184513915 -183065991 -137282795 -68434568 -18558667 -35659997 -93077437 -119433702 -109453801
9864 -109453801 -84727281 -92977881 -114688696 -105849308 -64943134 -15435010 -3586223 -30406464
9856 -30406464 -30831680 -34430444 -78524416 -107380888 -130577078 -185596984 -182318204 -155325451
9848 -155325451 -154805129 -179153173 -198833906 -209754561 -196182894 -153867580 -134381004 -153817143
9840 -153817143 -151000750 -117543451 -61578506 -474509 55212003 66103712 36480286 1418872
9832 1418872 -31812537 -40403586 -18247113 32661828 101436969 119885140 111457405 95565531
$$ packed form
9888a0263870L3693564Q892248N198406K2560591j3942678p6833696r2674573k2062595
9880a45432603K2152022K3948075M2202271Q406819n9056398m3277969j4505785j8950347
9872a84513915J447924M5783196O8848227M9875901j7101330n7417440k6356265R979901
9864a09453801K4726520q250600k1710815Q839388M0906174M9508124J1848787k6820241
9856c0406464m25216l598764m4093972k8856472k3196190n5019906L278780K6992753
9848a55325451N20322k4348044j9680733j0920655J3571667M2315314J9486576j9436139
9840a53817143K816393L3457299N5964945O1103997N5686512J0891709k9623426l5061414
9832A418872l3231409q591049K2156473N0908941O8775141J8448171q427735j5891874
$$ plain form
9824 95565531 95228707 67607289 -580095 -102867596 -200460734 -235172215 -239073093 -275695977
9816 -275695977 -302267028 -270002336 -184169158 -125037758 -109857946 -74137358 -20360324 4545092
9808 4545092 14077039 -26299863 -119593832 -150320262 -138387851 -110075200 -86051484 -116059320
9800 -116059320 -156361949 -165269646 -136965836 -89575137 -72337650 -75394973 -66351474 -14083549
9792 -14083549 48276540 62357765 48474410 31305118 4802311 -32101959 -30389504 -31473155
9784 -31473155 -64407376 -78222235 -80483416 -110463249 -103923439 -16832454 56106646 27223960
9776 27223960 -43547613 -68100795 -87759793 -157833013 -232401643 -229425825 -175926028 -124698660
9768 -124698660 -119279674 -140352335 -127628145 -93105063 -74505215 -85310651 -79418113 -77640643
$$ packed form
9824I5565531l36824k7621418o8187384j02287501r7593138l4711481l900878l6622884
9816b75695977k6571051L2264692Q5833178N9131400J5179812L5720588N3777034K4905416
9808D545092R531947m0376902r3293969l0726430J1932411K8312651K4023716l0007836
9800a16059320m0302629q907697K8303810M7390699J7237487l057323R043499N2267925
9792a4083549O2360089J4081225j3883355j7169292k6502807l6904270J712455j083651
9784c1473155l2934221j3814859k261181k9979833O539810Q7090985P2939100k8882686
9776B7223960p0771573k4553182j9658998p0073220p4568630K975818N3499797N1227368
9768a24698660N418986k1072661J2724190L4523082J8599848j0805436N892538J777470
$$ plain form
9760 -77640643 -108731544 -158825525 -186096612 -161458126 -90502012 -20685277 4783820 -11694213
9752 -11694213 -36355890 16037458 106660200 78180297 -66669780 -159214837 -171044447 -139950576
9744 -139950576 -91315065 -46419323 -37909524 -24394178 -33037248 -85431132 -77028707 -20462939
9736 -20462939 22294001 34913777 24472709 -1750084 -43259783 -70562630 -46766669 -34540131
9728 -34540131 -89605626 -138395136 -177305322 -191125476 -122034321 -32465705 -8091442 -36541177
9720 -36541177 -66057874 -68172932 -15904670 2343912 -35028981 -71354079 -101764068 -95981428
9712 -95981428 -30962322 14466288 7250654 -7521193 766856 -10403485 -7117992 15553641
9704 15553641 43396229 38094838 1338999 -2386831 12378860 2551804 -3133038 9243842
$$ packed form
9760g7640643l1090901n0093981k7271087K4638486P0956114O9816735K5469097j6478033
9752a1694213k4661677N2393348R0622742k8479903j44850077r2545057j1829610L1093871
9744a39950576M8635511M4895742Q509799J3515346q643070n2393884Q402425N6565768
9736b0462939M2756940J2619776j0441068k6222793m1509699k7302847K3795961J2226538
9728c4540131n5065495m8789510l8910186j3820154O9091155Q9568616K4374263k8449735
9720c6541177k9516697k115058N2268262J8248582l7372893l6325098l0409989N782640
9712i5981428O5019106M5428610p215634j4771847Q288049j1170341L285493K2671633
9704A5553641K7842588n301391l6755839l725830J4765691r827056n684842J2376880
$$ plain form
9696 9243842 -32015410 -101043291 -119208736 -114647794 -101506108 -82291335 -69320039 -103213246
9688 -103213246 -140978753 -137052800 -171168303 -205676551 -165124959 -103420810 -66239833 -48936504
9680 -48936504 -96280466 -193164294 -244436546 -213334304 -165156170 -123690018 -53277447 -9052123
9672 -9052123 -12631340 -21367657 -23322198 -35056768 -61815804 -110141119 -172904760 -240016485
9664 -240016485 -254403600 -221360427 -157944328 -133042309 -175353649 -208528592 -209341497 -200895666
9656 -200895666 -169659096 -108975597 -58361406 -42980659 -57282726 -38806696 18392363 60843901
9648 60843901 25079261 -50776421 -88645929 -101947558 -87576561 -103810103 -105937995 -115607632
9640 -115607632 -140818714 -173784123 -171709348 -143509008 -79048998 -56919927 -86027101 -117920491
$$ packed form
9696I243842m1259252o9027881j8165445M560942J3141686J9214773J2971296l3893207
9688a03213246l7765507L925953l4115503l4508248M0551592O1704149L7180977J7303329
9680d8936504m7343962r6883828n1272252L1102242M8178134M1466152P0412571M4225324
9672i052123l579217q736317j954541j1734570k6759036m8325315o2763641o7111725
9664b40016485j4387115L3043173O3416099K4902019m2311340l3174943q12905Q445831
9656b00895666L1236570O0683499N0614191J5380747j4302067J8476030N7199059M2451538
9648F0843901l5764640p5855682l7869508j3301629J4370997j6233542k127892r669637
9640a15607632k5211082l2965409K074775K8200340O4460010K2129071k9107174l1893390
$$ plain form
9632 -117920491 -186943694 -221594791 -162679919 -60050417 26902143 54392550 30479792 26054087
9624 26054087 45554144 59709575 43606777 11911610 -25361655 -22838570 11969641 26719601
9616 26719601 45115594 62777363 60844146 31636638 -6907755 -21521720 -13604940 -2570717
9608 -2570717 -21492581 -60946470 -68685665 -13102982 42170094 79373567 77485578 39578226
9600 39578226 -1091108 -65752204 -125491386 -114844109 -93236413 -75151176 -19869277 416580
9592 416580 -1963590 -13546286 -45085535 -60281719 -39776625 10504682 39095239 32400077
9584 32400077 57733929 104643546 91862738 44022825 25600054 46816822 28475748 -15452797
9576 -15452797 -62483087 -67381679 14051478 81630890 64725873 11081720 -47142956 -79496287
$$ packed form
9632a17920491o9023203l4651097N8914872J02629502Q6952560K7490407k3912758m425705
9624B6054087J9500057J4155431j6102798l1695167l7273265K523085L4808211J4749960
9616B6719601J8395993J7661769j933217k9207508l8544393j4613965P916780J1034223
9608b570717j8921864l9453889p739195N5582683N5273076L7203473j887989l7907352
9600C9578226m0669334o4661096n9739182J0647277K1607696J8085237N5281899K0285857
9592D16580k380170j1582696l1539249j5196184K0505094N0281307K8590557o695162
9584C2400077K5333852M6909617j2780808m7839913j8422771K1216768j8341074m3928545
9576a5452797m7030290m898592Q1433157O7579412j6905017n3644153n8224676l2353331
$$ plain form
9568 -79496287 -76357825 -69511783 -103818876 -163938096 -218381387 -228086246 -202162682 -149953745
9560 -149953745 -112562980 -105690953 -105536467 -66579935 -48932661 -46048058 -55274428 -98437518
9552 -98437518 -114786811 -83620342 -29454617 35525316 101586936 172542136 192359757 164377895
9544 164377895 101080054 38142164 51046824 61401045 44384249 23791819 28728264 46130801
9536 46130801 39122078 -734861 1622803 56696277 133404569 193196376 180729474 128119736
9528 128119736 90317632 72543018 56189597 47798931 36135324 8607634 -29343002 -73320491
9520 -73320491 -89996052 -5644272 83121472 73570554 52706199 63222692 26462034 -22846446
9512 -22846446 -61137250 -71609100 -85275348 -106704939 -118245223 -101626079 -69788612 -36334559
$$ packed form
9568g9496287L138462O846042l4307093o0119220n4443291r704859K5923564N2208937
9560a49953745L7390765O872027J54486L8956532J7647274K884603r226370m3163090
9552i8437518j6349293L1166469N4165725O4979933O6061620P0955200J9817621k7981862
9544A64377895o3297841o2937890J2904660J0354221j7016796k0592430M936445J7402537
9536D6130801p008723l9856939K357664N5073474P6708292N9791807j2466902n2609738
9528A28119736l7802104j7774614j6353421q390666j1663607k7527690l7950636m3977489
9520g3320491j6675561Q4351780Q8765744r550918k0864355J0516493l6760658m9308480
9512b2846446l8290804j0471850j3666248k1429591j1540284J6619144L1837467L3454053
$$ plain form
9504 -36334559 -18194660 -18158765 -22892431 -3821772 40272576 54640189 24196187 -26773214
9496 -26773214 -71732727 -70311291 -26300169 18457303 64117529 95798834 101943931 96502581
9488 96502581 44026362 -4023954 -1461531 -9244461 -36432607 -33285982 19424477 51355443
9480 51355443 45855553 33642559 15773990 7378367 -13032893 -61575550 -102784686 -119328360
9472 -119328360 -90948431 -55915266 -44922106 -29867561 -21186567 11578203 78100808 101079471
9464 101079471 5694665 -108081918 -100055962 -2072185 77885170 115694073 124857245 69196789
9456 69196789 21100296 -7546807 13991765 82753323 65163160 -8370485 -24629288 14246545
9448 14246545 36312092 -23390993 -100708989 -105099948 -65055745 -49475502 -29830461 30461059
$$ packed form
9504c6334559J8139899L5895m733666J9070659M4094348J4367613l0444002n0969401
9496b6773214m4959513J421436M4011122M4757472M5660226L1681305O145097n441350
9488I6502581n2476219m8050316K562423p782930k7188146L146625N2710459L1930966
9480E1355443n499890j2212994j7868569q395623k0411260m8542657m1209136j6543674
9472a19328360K8379929L5033165J0993160J5054545Q680994L2764770O6522605K2978663
9464A01079471r5384806j13776583Q025956R7983777P9957355L7808903R163172n5660456
9456F9196789m8096493k8647103K1538572O8761558j7590163p3533645j6258803L8875833
9448A4246545K2065547n9703085p7317996m390959M0044203J5580243J9645041O0291520
$$ plain form
9440 30461059 104430060 166809208 175939081 148068670 106745352 69446411 41201766 -6334822
9432 -6334822 -81627662 -128523382 -126426162 -93296102 -77989782 -70085761 -53369646 -34169238
9424 -34169238 -19212873 -35868868 -66395496 -49318795 19274077 45488858 20669973 -17029055
9416 -17029055 -49602839 -13397788 70933367 116966368 100203096 47880154 -343196 -22660053
9408 -22660053 228520 53141631 83450650 64661851 33678104 48214979 58398309 13514201
9400 13514201 -40728262 -24625514 18964155 -18184018 -100495141 -124443959 -97253759 -85851071
9392 -85851071 -97433237 -96253164 -56102675 -37972653 -79716194 -109660369 -88503386 -34594525
9384 -34594525 -37368504 -83381403 -131918483 -155850184 -135496964 -112692788 -63011224 -14910462
$$ packed form
9440C0461059P3969001O2379148R129873k7870411m1323318l7298941k8244645m7536588
9432f334822p5292840m6895720K097220L3130060J5306320P904021J6716115J9200408
9424c4169238J4956365j6655995l0526628J7076701O8592872K6214781k4818885l7699028
9416a7029055l2573784L6205051Q4331155M6033001j6763272n2322942m8223350k2316857
9408b2660053K2888573N2913111L0309019j8788799l0983747J4536875J0183330m4884108
9400A3514201n4242463J6102748M3589669l7148173q2311123k3948818K7190200J1402688
9392h5851071j1582166J180073M0150489J8130022m1743541k9944175K1156983N3908861
9384c4594525k773979m6012899m8537080k3931701K0353220K2804176M9681564M8100762
$$ plain form
9376 -14910462 -47102027 -84147825 -43165324 8007661 2313310 -21069301 -62626593 -105011876
9368 -105011876 -87075064 -19493857 15240134 -5684663 -64410826 -94773016 -142644502 -186227740
9360 -186227740 -160440242 -151797923 -232217697 -294289587 -247768932 -169690145 -65986380 21429626
9352 21429626 72295920 83772253 78308561 67355692 38724085 -10435560 -51251929 -86347791
9344 -86347791 -73626540 -12488310 53130644 84109584 65477356 18715636 8134327 56396843
9336 56396843 158228983 211243342 173943243 124903177 102793173 64161817 31624556 46107090
9328 46107090 109911473 176727714 161408794 100871392 43188909 7242891 2922391 45629408
9320 45629408 67963496 33392748 9308986 -17539993 -27486815 -4931093 45144288 57345067
$$ packed form
9376a4910462l2191565l7045798M0982501N1172985n694351k3382611m1557292m2385283
9368a05011876J7936812O7581207L4733991k0924797n8726163l0362190m7871486m3583238
9360a86227740K5787498Q642319q0419774o2071890M6520655P8078787J03703765Q7416006
9352B1429626N0866294J1476333n463692j0952869k8631607m9159645m0816369l5095862
9344h6347791J2721251O1138230O5618954L0978940j8632228m6761720j0581309M8262516
9336E6396843J01832140N3014359l7300099m9040066k2110004l8631356l2537261J4482534
9328D6107090O3804383O6816241j5318920o0537402n7682483l5946018m320500M2707017
9320D5629408K2334088l4570748k4083762k6848979r946822K2555722N0075381J2200779
$$ plain form
9312 57345067 27389587 22217617 57712446 93592110 83639796 67997050 62604266 25599494
9304 25599494 -4105751 -13503036 -27039580 -40746039 -61091410 -99220183 -139682972 -146266086
9296 -146266086 -126427847 -133625063 -129286949 -99372899 -78983718 -93007029 -110051989 -89395305
9288 -89395305 -19785111 64111660 96768225 74417044 61827408 37035550 12805686 2431632
9280 2431632 3491309 4926988 -11818865 -40317603 -69292848 -99462155 -95441041 -54348733
9272 -54348733 -37233726 -52756826 -55670661 -44046003 -13453742 -15722980 -46039376 -36333896
9264 -36333896 2682831 27374819 50538612 71906676 110400834 142559902 153855075 127998004
9256 127998004 76965972 3723817 -75268488 -119656943 -142089612 -141288890 -91914940 -51301293
$$ packed form
9312E7345067k9955480n171970L5494829L5879664r952314j5642746n392784l7004772
9304B5599494k9705245r397285j3536544j3706459k0345371l8128773m0462789o583114
9296a46266086J9838239p197216M338114K9914050K0389181j4023311j7044960K0656684
9288h9395305O9610194Q3896771L2656565k2351181j2589636k4791858k4229864j0374054
9280B431632J059677J435679j6745853k8498738k8975245l0169307M021114M1092308
9272e4348733J7115007j5523100k913835J1624658L0592261k269238l0316396R705480
9264c6333896L9016727K4691988K3163793K1368064L8494158L2159068J1295173k5857071
9256A27998004n1032032p3242155p8992305m4388455k2432669Q00722M9373950M0613647
$$ plain form
9248 -51301293 -69726252 -109099888 -77696737 -22288252 7976560 23323959 22233003 47693267
9240 47693267 97580084 157009592 214322766 213422016 163238508 110305980 102214031 101940177
9232 101940177 40218126 -34209206 -74425770 -104268650 -87123744 -38081880 -47658131 -86266870
9224 -86266870 -74926393 -102206792 -125304157 -94780982 -75141755 -8002572 68236551 118944893
9216 118944893 142803299 116228678 43408994 16575583 -28577990 -114432725 -169332078 -139838939
9208 -139838939 -108141626 -87202473 -58136781 -32728408 -15246515 13785253 45972652 63120515
9200 63120515 87698814 102949951 72634182 54321226 81011222 124480026 163827432 166116865
9192 166116865 137752139 115443630 74445085 41218285 23044736 -35668284 -104167585 -90744375
$$ packed form
9248e1301293j8424959l9373636L1403151N5408485L0264812J5347399j090956K5460264
9240D7693267M9886817N9429508N7313174r00750n0183508n2932528q091949k73854
9232A01940177o1722051p4427332m0216564k9842880J7144906M9041864r576251l8608739
9224h6266870J1340477k7280399k3097365L0523175J9639227O7139183P6239123N0708342
9216A18944893K3858406k6574621p2819684k6833411m5153573q5854735n4899353K9493139
9208a39838939L1697313K0939153K9065692K5408373J7481893K9031768L2187399J7147863
9200F3120515K4578299J5251137l0315769j8312956K6689996M3468804L9347406K289433
9192A66116865k8364726k2308509m0998545l3226800j8173549n8713020o8499301J3423210
$$ plain form
9184 -90744375 -31945854 -9850455 -38272806 -86819972 -103745775 -80850709 -24124892 15440504
9176 15440504 22586961 26753198 91931304 184004385 222979520 176858133 82428059 -18670960
9168 -18670960 -42936815 -7496197 -22689466 -82835396 -130232250 -121262539 -71768140 -45572430
9160 -45572430 -63451371 -90158910 -95620797 -106498015 -124982057 -142567765 -115716852 -66366698
9152 -66366698 -42191816 -75091896 -91684849 -58095671 -33490419 -27201010 -27875207 -46576794
9144 -46576794 -74235552 -88892905 -85126060 -80577046 -68551872 -15705816 13042643 10069189
9136 10069189 21004902 27633689 -120381 -61127885 -108544825 -117248821 -131393341 -135962629
9128 -135962629 -99804965 -46937898 -76941687 -153638692 -180978695 -135127529 -56459502 -23211842
$$ packed form
9184i0744375N8798521K2095399k8422351m8547166j6925803K2895066N6725817L9565396
9176A5440504P146457M166237O5178106R2073081L8975135m6121387r4430074j01099019
9168a8670960k4265855L5440618j5193269o0145930m7396854Q969711M9494399K6195710
9160d5572430j7878941k6707539n461887j0877218j8484042j7585708K6850913M9350154
9152f6366698K4174882l2900080j6592953L3589178K4605252O289409o74197j8701587
9144d6576794k7658758j4657353L766845M549014J2025174N2846056K8748459k973454
9136A0069189J0935713O628787k7754070o1007504m7416940q703996j4144520m569288
9128a35962629L6157664N2867067l0003789p6697005k7340003M5851166P8668027L3247660
$$ plain form
9120 -23211842 -31163150 -34870971 -5387354 2450553 -27679069 -87885089 -164308688 -242088625
9112 -242088625 -266021040 -263294874 -224007666 -135646755 -59173859 -5648602 5431892 6368837
9104 6368837 15299189 64540139 96615991 108506201 94672265 80710266 72728610 107658960
9096 107658960 131807135 162518417 169400217 107537828 95841988 132473514 147306277 166550916
9088 166550916 141482252 94762634 65650305 -11429896 -52312066 -29419141 -32971253 -75057556
9080 -75057556 -98580706 -62767436 -18064700 12005260 64280165 95500186 84099858 84722140
9072 84722140 62399912 51304692 71491208 75328367 39273572 -6169417 -19452599 1447299
9064 1447299 46049466 103599136 130250672 114770724 94086246 105012338 142145892 138572228
$$ packed form
9120b3211842p951308l707821K9483617P837907l0129622o0206020p6423599p7779937
9112b42088625k3932415K726166L9287208Q8360911P6472896N3525257J1080494R36945
9104F368837Q930352M9240950L2075852J1890210j3833936j3961999p981656L4930350
9096A07658960K4148175L0711282O881800o1862389j1695840L6631526J4832763J9244639
9088A66550916k5068664m6719618k9112329p7080201m0882170K2892925l552112m2086303
9080g5057556k3523150L5813270M4702736L0069960N2274905L1220021j1400328O22282
9072H4722140k2322228j1095220K0186516L837159l6054795m5442989j3283182K0899898
9064A447299M4602167N7549670K6651536j5479948k0684478J0926092L7133554l573664
$$ plain form
9056 138572228 82084922 25218318 -35976285 -89850622 -82255473 -29431815 45934456 101394665
9048 101394665 118771538 122579299 100586081 11261698 -67809571 -99700427 -109752876 -100324061
9040 -100324061 -33860901 32339439 56363739 45988642 53511778 88729886 81853951 64638291
9032 64638291 71344904 58565679 32316773 10218391 38009464 64674296 78371889 92039475
9024 92039475 86643928 32673454 -43090596 -60352548 -49036799 -59080778 -82892537 -104643038
9016 -104643038 -154073638 -186706475 -206721816 -198007881 -156188079 -106688432 -18410190 60223881
9008 60223881 32953689 -7806194 -4549912 35183124 54256916 44251146 17013162 -24781757
9000 -24781757 -20861445 6743077 50968097 69927564 28241602 20789691 78175529 137136415
$$ packed form
9056A38572228n6487306n6866604o1194603n3874337P595149N2823658P5366271N5460209
9048A01394665J7376873L807761k1993218q9324383p9071269l1890856j0052449R428815
9040a00324061O6463160O6200340K4024300j0375097P523136L5218108o875935j7215660
9032F4638291O706613j2779225k6248906k2098382K7791073K6664832J3697593J3667586
9024I2039475n395547n3970474p5764050j7261952J1315749j0043979k3811759k1750501
9016a04643038m9430600l2632837k0015341Q713935M1819802M9499647Q8278242P8634071
9008F0223881k7270192m0759883L256282L9733036J9073792j0005770k7237984m1794919
9000b4781757L920312K7604522M4225020J8959467m1685962p451911N7385838N8960886
$$ plain form
8992 137136415 118536801 36440129 -65494597 -114397601 -123900517 -136106988 -140145451 -128289410
8984 -128289410 -85538037 -59242340 -40499830 -18786295 -4366146 -6187132 -23507430 -30259558
8976 -30259558 -8779631 -3231706 -5989076 13916715 6359146 26925297 101431908 159287055
8968 159287055 149702519 86966100 39685863 26992880 47534557 92111702 138897677 162374912
8960 162374912 100584691 23961736 27439233 46493552 45526070 30131836 3626033 -272238
8952 -272238 45387256 77640581 107332266 133692081 132761007 159042994 186065009 204579440
8944 204579440 142165613 38770633 866076 -17265032 -30154845 -10057590 37464261
8937 37464261 51162914 50092336 63618344 85195510 86905936 50076378 -4573936 -59624277
$$ packed form
8992A37136415j8599614q2096672j01934726m8903004r502916j2206471m038463J1856041
8984a28289410M2751373K6295697J8742510K1713535J4420149j820986j7320298o752128
8976c0259558K1479927N547925k757370J9905791p557569K0566151P4506611N7855147
8968A59287055r584536o2736419m7280237j2692983K0541677M4577145M6785975K3477235
8960A62374912o1790221p6622955L477497J9054319r67482j5394234k6505803l898271
8952b72238M5659494L2253325K9691685K6359815r31074K6281987K7022015J8514431
8944B04579440o2413827j03394980l7904557j8131108j2889813K0097255M7521851
8937C7464261J3698653j070578J3526008K1577166J710426l6829558n4650314n5050341
$$ plain form
8929 -59624277 -52152939 -3323023 -23303207 -100962565 -148487330 -129198612 -65662429 4286944
8921 4286944 65305175 94662390 65158936 46303790 47335604 12174377 -35741052 -66244127
8913 -66244127 -89713035 -129913085 -210809533 -240554726 -190859428 -148041827 -133982344 -139418140
8905 -139418140 -136013410 -133516780 -134264130 -123197820 -108534254 -100478498 -109689865 -137970559
8897 -137970559 -149154929 -143893523 -120843592 -135586034 -177849727 -202944237 -191605496 -156956035
8889 -156956035 -148015317 -144917761 -154013424 -195014656 -210656866 -178224689 -162152178 -214041215
8881 -214041215 -287981252 -317402715 -354794349 -357992893 -285567404 -207399216 -152133087 -84668378
8873 -84668378 -9392134 13881932 10766079 25594846 57976539 63958012 36218641 6315437
$$ packed form
8929e9624277P471338M8829916j9980184p7659358m7524765J9288718O3536183O9949373
8921D286944O1018231K9357215k9503454j8855146J031814l5161227m7915429l0503075
8913f6244127k3468908m0200050q0896448k9745193M9695298M2817601J4059483n435796
8905a39418140L404730K496630p47350J1066310J4663566Q055756r211367k8280694
8897a37970559j1184370N261406K3049931j4742442m2263693k5094510J1338741L4649461
8889a56956035Q940718L097556r095663m1001232j5642210L2432177J6072511n1889037
8881b14041215p3940037k9421463l7391634l198544P2425489P8168188N5266129O7464709
8873h4668378P5276244K3274066l115853J4828767L2381693N981473k7739371k9903204
$$ plain form
8865 6315437 -27260080 -44432475 -52282931 -81535034 -118993459 -123078390 -72543963 -23265549
8857 -23265549 -26757425 -84531861 -187363364 -291656589 -331784234 -302197663 -253820549 -219491450
$$ packed form
8865F315437l3575517j7172395p850456k9252103l7458425m084931N0534427M9278414
8857b3265549l491876n7774436j02831503j04293225m0127645K9586571M8377114L4329099
$$ [...]
-3284C2480473  $$ checkpoint
##END NTUPLES=
##END=
