##TITLE= S#336633
##JCAMP-DX= 5.00 $$ JEOL NMR v1.10
##DATA TYPE= NMR SPECTRUM
##DATA CLASS= NTUPLES
##NUM DIM= 1
##ORIGIN= DELTA_NMR
##OWNER= organic
##SPECTROMETER/DATA SYSTEM= DELTA_NMR
##.OBSERVE FREQUENCY= 3.00529655924288E+02
##.OBSERVE NUCLEUS= ^1H
##.DELAY= (2.194E+02,2.194E+02)
##.ACQUISITION MODE= SIMULTANEOUS
##.FIELD= 7.0586013
##.FILTER WIDTH= 1.81675738660864
##.ACQUISITION TIME= 3.6339712
##.SPINNING RATE= 15
##.OBSERVE 90= 9.6
##NTUPLES= NMR SPECTRUM
##VAR NAME= FREQUENCY,    SPECTRUM/REAL, SPECTRUM/IMAG, PAGE NUMBER
##SYMBOL=   X,            R,             I,             N
##VAR TYPE= INDEPENDENT,  DEPENDENT,     DEPENDENT,     PAGE
##VAR FORM= AFFN,         ASDF,          ASDF,          AFFN
##VAR DIM=  16384, 16384, 16384, 2
##UNITS= PPM,     ARBITRARY UNITS, ARBITRARY UNITS, 
##FIRST=  1.2501033903057E+01, -1.56288171087865E+02, -1.27781889270485E+02, 1
##LAST=  -2.50011824950436, -1.29866430034144E+02, -1.56680197693189E+02, 2
##FACTOR=  9.1565355261926E-04, 4.7080335551374E-03, 4.7080335551374E-03, 1
##PAGE= N=1
##DATA TABLE=(X++(R..R)), XYDATA
$$ [...]
5923e837645J39239k12086L1344K9176L5356q4340j7869k427J53495j06078n9056O907
$$ -5837645 -5698406 -5910492 -5879148 -5849972 -5814616 -5898956 -5916825 -5919252 -5765757 -5871835 -5930891 -5923984
5911e923984L0647M5760J352M1180r2829J25989k13396N1049R460L1441q6542k9086n3510
$$ -5923984 -5893337 -5847577 -5846225 -5805045 -5897874 -5771885 -5985281 -5934232 -5924772 -5893331 -5979873 -6008959 -6062469
5898f062469m9729J99310l4617p0785J86049j4494R910J19875q9314J6198j67386p1843
$$ -6062469 -6112198 -5912888 -5947505 -6018290 -5832241 -5846735 -5836825 -5716950 -5806264 -5790066 -5957452 -6029295
5886f029295Q1712J33157O0135j15074k8740j1893p1715M2049k8819l3373L7317O8608L35
$$ -6029295 -5947583 -5814426 -5754291 -5869365 -5898105 -5909998 -5981713 -5939664 -5968483 -6001856 -5964539 -5895931 -5895596
5873e895596Q5166j49699J88415j12103L3540J13739m1835p5659m1802M9363j66432J52947
$$ -5895596 -5810430 -5960129 -5771714 -5883817 -5850277 -5736538 -5778373 -5854032 -5895834 -5846471 -6012903 -5859956
5861e859956k1106m2282Q8055l3683j1939J22387j17365k9379n4978J79460J19776k33026
$$ -5859956 -5881062 -5923344 -5835289 -5868972 -5880911 -5758524 -5875889 -5905268 -5960246 -5780786 -5661010 -5894036
5849e894036k919Q4507K3655l2972n0054J03727k2314j40188P4133L2151p8889k7580
$$ -5894036 -5896955 -5812448 -5788793 -5821765 -5871819 -5768092 -5790406 -5930594 -5856461 -5824310 -5903199 -5930779
5837e930779J15516p8217K0878P3078p3121k5006j05816n0472J27402L4484J08225p8118
$$ -5930779 -5815263 -5893480 -5872602 -5799524 -5872645 -5897651 -6003467 -6053939 -5926537 -5892053 -5783828 -5861946
5825e861946k0888N3475K686L9940N0240j73568J12437j19882J9581l56521K42156O1418
$$ -5861946 -5882834 -5829359 -5826673 -5786733 -5736493 -5910061 -5797624 -5917506 -5897925 -6254446 -6012290 -5950872
5813e950872Q53M0672r3892L3878m305M7237n210Q8789Q551J26840k19287j5292N6542L805
$$ -5950872 -5950019 -5909347 -6003239 -5969361 -5973666 -5926429 -5931639 -5842850 -5834299 -5707459 -5926746 -5942038 -5885496 -5881691
5799e881691m9376J22231j46643J11796k7162k1376j232q9080K5887J03061p7492p9916
$$ -5881691 -5931067 -5808836 -5955479 -5843683 -5870845 -5892221 -5893453 -5982533 -5956646 -5853585 -5931077 -6010993
5787f010993O5342K9190k4447J27387o9055q0956L9155M8646O8981J79968k08785k4189
$$ -6010993 -5945651 -5916461 -5940908 -5813521 -5882576 -5963532 -5924377 -5875731 -5806750 -5626782 -5835567 -5859756
5775e859756n3645r941J06878l64j43774J5101k3104J4408P3184r6280J08554K9760m3368
$$ -5859756 -5913401 -5923342 -5816464 -5816828 -5960602 -5945501 -5968605 -5954197 -5881013 -5977293 -5868739 -5838979 -5882347
5762e882347m4741j6636K4414J34590L6445j14047l6030j40958J12544R101j51443J90799
$$ -5882347 -5927088 -5943724 -5919310 -5784720 -5748275 -5862322 -5898352 -6039310 -5926766 -5917665 -6069108 -5878309
5750e878309j0309k4658k0200L9796O0887p2983m5793M2639o4243Q6307K8641j00341k3716
$$ -5878309 -5888618 -5913276 -5933476 -5893680 -5832793 -5905776 -5951569 -5908930 -5973173 -5886866 -5858225 -5958566 -5982282
5737e982282r626L0873j29384J87353m6622K45262j63845p5943m9249O1508P113m5792
$$ -5982282 -5991908 -5961035 -6090419 -5903066 -5949688 -5704426 -5868271 -5944214 -5993463 -5931955 -5924842 -5970634
5725e970634r2059J23715j26373q0938J90173l6950Q634j39694M3031J11273j52398J06581
$$ -5970634 -6062693 -5938978 -6065351 -6146289 -5956116 -5993066 -5984432 -6124126 -6081095 -5969822 -6122220 -6015639
5713f015639k2378j2876P3634k7363M1065j05506R9826m9984j30272J18834J69637p6068
$$ -6015639 -6038017 -6050893 -5977259 -6004622 -5963557 -6069063 -5969237 -6019221 -6149493 -6030659 -5861022 -5937090
5701e937090j08177n6153J00179l4632M0558n2300P110j12651J696Q2693K5826j78859
$$ -5937090 -6045267 -6101420 -6001241 -6035873 -5995315 -6047615 -6040505 -6153156 -6151460 -6068767 -6042941 -6221800
5689f221800R4002j35475k6898J97364r3322j84659L1665l90134m60083K550871M63605
$$ -6221800 -6127798 -6263273 -6290171 -6092807 -6186129 -6370788 -6339123 -6729257 -7189340 -4638469 -4174864
5678d174864j035024j78977k39172P0574m8761l6109o5859m6526o2249J00958K5465j07607
$$ -4174864 -5209888 -5388865 -5628037 -5557463 -5606224 -5642333 -5708192 -5754718 -5816967 -5716009 -5690544 -5798151
5666e798151j37046l0420K1965J35327j06023K3224P5879n5641j24322M5981o0247L69405
$$ -5798151 -5935197 -5965617 -5943652 -5808325 -5914348 -5891124 -5815245 -5870886 -5995208 -5949227 -6009474 -5640069
5654e640069r0148j58142k6694l6642P6239O559L3170K0274q8318k5816k2892K17074
$$ -5640069 -5730217 -5888359 -5915053 -5951695 -5875456 -5868897 -5835727 -5815453 -5903771 -5929587 -5952479 -5735405
5642e735405j72177J69096o0017j17841j45295k9313L33152k9531l4924J2011q4826R0947
$$ -5735405 -5907582 -5738486 -5798503 -5916344 -6061639 -6090952 -5757800 -5787331 -5822255 -5810244 -5895070 -5804123
5630e804123P7808m6131K1974p7608n6594P4440m8282R3316J16871k07972m0275O1064
$$ -5804123 -5726315 -5772446 -5750472 -5828080 -5884674 -5810234 -5858516 -5765200 -5648329 -5856301 -5896576 -5835512
5618e835512K9645k55703J59336N0507J8470N9054K0378n3359j77361Q7440J8999N2389
$$ -5835512 -5805867 -6061570 -5902234 -5851727 -5833257 -5774203 -5753825 -5807184 -5984545 -5897105 -5878106 -5825717
5606e825717l1064M8551j7931O4976k763j20492M3428p6684L6198J30210O0411n9739J0901
$$ -5825717 -5856781 -5808230 -5826161 -5761185 -5763948 -5884440 -5841012 -5917696 -5881498 -5751288 -5690877 -5750616 -5739715
5593e739715p9977j7304n3402Q692j3546O3739k40815K09196K7119j82355K48696j40896
$$ -5739715 -5819692 -5836996 -5890398 -5881706 -5895252 -5831513 -6072328 -5863132 -5836013 -6018368 -5769672 -5910568
5581e910568J2783L4628j6921P0398J3237m6130P0899N456k0025m7448J71589j96342
$$ -5910568 -5897785 -5863157 -5880078 -5809680 -5796443 -5842573 -5771674 -5766218 -5786243 -5833691 -5662102 -5858444
5569e858444j64268P6327J08011j82959K27461m07299L20189l4183n5952M6467J13912
$$ -5858444 -6022712 -5946385 -5838374 -6021333 -5793872 -6201171 -5880982 -5915165 -5971117 -5924650 -5810738
5558e810738q2939J7103j27474J23740l8143L6981O7180N862k24328O5910M7234K0349R39
$$ -5810738 -5893677 -5876574 -6004048 -5880308 -5918451 -5881470 -5814290 -5808428 -6032756 -5966846 -5919612 -5899263 -5898324
5545e898324K29000k38259l0623J04952P315J7182j09334K19230n3296j71269j08233
$$ -5898324 -5669324 -5907583 -5938206 -5833254 -5825939 -5808757 -5918091 -5698861 -5752157 -5923426 -6031659
5534f031659J13622m325r9q5520J2833K5595k9627O1971l3400L6649R2098l5073j1941
$$ -6031659 -5918037 -5922362 -5922461 -6007981 -5995148 -5969553 -5999180 -5937209 -5970609 -5933960 -5841862 -5876935 -5888876
5521e888876r3463J56763n4447j9665L3272M7438j70748n198K9882N9433O990N9823r0963
$$ -5888876 -5982339 -5825576 -5880023 -5899688 -5866416 -5818978 -5989726 -5994924 -5965042 -5905609 -5898619 -5838796 -5929759
5508e929759P7016j49746j6862k5808K0138N8931L337n4672O8865J07964j49327P9688
$$ -5929759 -5852743 -6002489 -6019351 -6045159 -6025021 -5966090 -5962753 -6017425 -5948560 -5840596 -5989923 -5910235
5496e910235j6053J11885o4694m4734j29747L7110J85110j17404J3730L5621r9631L5359
$$ -5910235 -5926288 -5814403 -5879097 -5923831 -6053578 -6016468 -5831358 -5948762 -5935032 -5899411 -5999042 -5963683
5484e963683j90149J65047o3864R2031r841N4512j45038J10881l9413R4208L9453k01400
$$ -5963683 -6153832 -5988785 -6052649 -5960618 -5970459 -5915947 -6060985 -5950104 -5989517 -5895309 -5855856 -6057256
5472f057256q5529Q0990l3316J3502L33978k83474L1711q5356J78887K94808m37254q68306
$$ -6057256 -6142785 -6061795 -6095111 -6081609 -5747631 -6031105 -5999394 -6084750 -5905863 -5611055 -6048309 -6916615
5460f916615Q43907J50639n4920j90332k3328K37115K6094J13081J8923J0458k67919
$$ -6916615 -6072708 -5922069 -5976989 -6167321 -6190649 -5953534 -5927440 -5814359 -5795436 -5784978 -6052897
5449f052897J84901j58462j19576R7664j6439K21834q8490J37717j24818j21502J49139
$$ -6052897 -5867996 -6026458 -6146034 -6048370 -6064809 -5842975 -5931465 -5793748 -5918566 -6040068 -5890929
5438e890929K2352j12222Q6972j6380Q324j00972n735J8438J37158k19158L1191M3115
$$ -5890929 -5868577 -5980799 -5893827 -5910207 -5901883 -6002855 -6008590 -5990152 -5852994 -6072152 -6040961 -5997846
5426e997846j10414J21846k9753Q9343J3126r7910M3912K10819j61157q6813J4433J57488
$$ -5997846 -6108260 -5986414 -6016167 -5926824 -5913698 -6011608 -5967696 -5756877 -5918034 -6004847 -5990414 -5832926
5414e832926j35188K2169J62656k8033k2733j21838j75145J45612O208o8092Q421K8983
$$ -5832926 -5968114 -5945945 -5783289 -5811322 -5834055 -5955893 -6131038 -5985426 -5979218 -6047310 -6038889 -6009906
5402f009906K0356Q4529P8964o8804J3963j10207M5362m7965K1724J00100j17835K50205
$$ -6009906 -5989550 -5905021 -5826057 -5894861 -5880898 -5991105 -5945743 -5993708 -5971984 -5871884 -5989719 -5739514
5390e739514k00874j09131j4526r2048J54174J14969K3492j814m1518P4319J0816m2974
$$ -5739514 -5940388 -6049519 -6064045 -6156093 -6001919 -5886950 -5863458 -5865272 -5906790 -5832471 -5821655 -5864629
5378e864629j20900n2644O542J05621O3948J27727o7205n6218p2048J13505n0190n2261
$$ -5864629 -5985529 -6038173 -6031631 -5926010 -5862062 -5734335 -5801540 -5857758 -5929806 -5816301 -5866491 -5918752
5366e918752P8721q1401k4386N12N007o3688j51750O0568J05482J6104N8221n5405l3675
$$ -5918752 -5840031 -5921432 -5945818 -5945306 -5940299 -6003987 -6155737 -6095169 -5989687 -5973583 -5915362 -5970767 -6004442
5353f004442J01243o1186k5211L054m6756N8002o3596K2531J97407j83553R0683p5274O744
$$ -6004442 -5903199 -5964385 -5989596 -5986542 -6033298 -5975296 -6038892 -6016361 -5818954 -6002507 -5911824 -5987098 -5980354
5340e980354j5602j3617j28494j10416L45429J7407R1862k5088J43m5971j6120N4744q4635
$$ -5980354 -5995956 -6009573 -6138067 -6248483 -5903054 -5885647 -5793785 -5818873 -5818730 -5864701 -5880821 -5826077 -5910712
5327e910712L8718j77186N5358N4963P387J05376r413k49613K34392n3236r4648K4013
$$ -5910712 -5871994 -6049180 -5993822 -5938859 -5931472 -5826096 -5835509 -6085122 -5850730 -5903966 -5998614 -5974601
5315e974601Q8112M5355K6063o2728K8263j45180J40961J4708j21907k67273K09201J03536
$$ -5974601 -5886489 -5841134 -5815071 -5877799 -5849536 -5994716 -5853755 -5839047 -5960954 -6228227 -6019026 -5915490
5303e915490n4808J7511J7675M6695j331M8378o8673M5095L5678j1897Q7525j61705n9472
$$ -5915490 -5970298 -5952787 -5935112 -5888417 -5889748 -5841370 -5910043 -5864948 -5829270 -5841167 -5753642 -5915347 -5974819
5290e974819M2054P829k4992L50188q9335M1758l7576r0219L9617q3690P5923J7176L3085
$$ -5974819 -5932765 -5924936 -5949928 -5599740 -5689075 -5647317 -5684893 -5775112 -5735495 -5819185 -5743262 -5726086 -5693001
5277e693001J7574o6808J22326r6628r0920j9756l6051l6612n5694J86585O6918j54839
$$ -5693001 -5675427 -5742235 -5619909 -5716537 -5807457 -5827213 -5863264 -5899876 -5955570 -5768985 -5702067 -5856906
5265e856906K2060q7806P562N943K4182m1967o7978j11563Q0616o1120j80134J77481J9488
$$ -5856906 -5834846 -5922652 -5915090 -5909147 -5884965 -5926932 -5994910 -6106473 -6025857 -6086977 -6267111 -6089630 -6070142
5252f070142q8555M090k8936q1921j39478k04186m92523l74853J395837J462386n20609
$$ -6070142 -6158697 -6154607 -6183543 -6265464 -6404942 -6609128 -7101651 -7476504 -6080667 -4618281 -5138890
5241e138890l18584r1697j47796k57500K68200O5682r5658J1550j41110j2439O0499L1429
$$ -5138890 -5457474 -5549171 -5696967 -5954467 -5686267 -5620585 -5716243 -5704693 -5845803 -5858242 -5797743 -5766314
5229e766314k7272j28680n0227J57615J1491o7292m3358k2938N0381J17259J61772k82200
$$ -5766314 -5793586 -5922266 -5972493 -5814878 -5803387 -5870679 -5914037 -5936975 -5886594 -5769335 -5607563 -5889763
5217e889763p138Q046K2995M2076m5819O8878q0286J1143J3885J060q2481k9476K8456
$$ -5889763 -5896901 -5888855 -5865860 -5823784 -5869603 -5800725 -5881011 -5869868 -5855983 -5854923 -5937404 -5966880 -5938424
5204e938424l8885P1356K1924J46589k09006N6184L2232q7049j0656J347o602K7543o1190
$$ -5938424 -5977309 -5905953 -5884029 -5737440 -5946446 -5890262 -5858030 -5945079 -5955735 -5954388 -5960990 -5933447 -5994637
5191e994637J31317j3053N7524j25909K1677Q7337r2341J10755p4710q1896R599J1681
$$ -5994637 -5863320 -5876373 -5818849 -5944758 -5923081 -5835744 -5928085 -5817330 -5892040 -5973936 -5964337 -5952656
5179e952656o5305J46609L3277l0862r5332L5741R4916p077P2128l9546k0931J6871J3160
$$ -5952656 -6017961 -5871352 -5838075 -5868937 -5964269 -5928528 -5833612 -5840689 -5768561 -5808107 -5829038 -5812167 -5799007
5166e799007N0378j1151m1837j1239m2496Q9985l569j34358J96150n2761K9959j23038
$$ -5799007 -5748629 -5759780 -5801617 -5812856 -5855352 -5765367 -5768936 -5903294 -5707144 -5759905 -5729946 -5852984
5154e852984J61025J0140m5081Q9668P40l7045j10510O1000K65362j89486J2673N969
$$ -5852984 -5691959 -5681819 -5726900 -5637232 -5636492 -5673537 -5784047 -5723047 -5457685 -5647171 -5634498 -5628529
5142e628529k22430J36443N5014N275j66755Q3423j57056O68m0882Q4389j10988l7540
$$ -5628529 -5850959 -5714516 -5659502 -5654227 -5820982 -5737559 -5894615 -5893947 -5934829 -5850440 -5961428 -5998968
5130e998968m4656M2698q362n1275M5382k445J56376q8464K4034j09106J43426j12846
$$ -5998968 -6043624 -6000926 -6009288 -6060563 -6015181 -6017626 -5861250 -5949714 -5925680 -6034786 -5891360 -6004206
5118f004206j08331L0119J42800N3654n6765m9466o9089J08025j9456m1089L06185k10515
$$ -6004206 -6112537 -6082418 -5939618 -5885964 -5942729 -5992195 -6061284 -5953259 -5972715 -6013804 -5707619 -5918134
5106e918134J16739r8051j54173j3427J8072L6546o8897N2156j3718J36060k05268N4342
$$ -5918134 -5801395 -5899446 -6053619 -6067046 -6048974 -6012428 -6081325 -6029169 -6042887 -5906827 -6112095 -6057753
5094f057753j61602o7005M10181j25567m5355l2112J6094L311K5882k8619k1934p0710
$$ -6057753 -6219355 -6286360 -5876179 -6001746 -6047101 -6079213 -6063119 -6059808 -6033926 -6062545 -6084479 -6155189
5082f155189M0291M8116P1348j0219Q482M0774p2412p8137P9009q9504Q7060L6454r1444
$$ -6155189 -6114898 -6066782 -5995434 -6005653 -5997171 -5956397 -6028809 -6106946 -6027937 -6117441 -6030381 -5993927 -6085371
5069f085371P7634j7657M0172n6170J7482P1393n0502j07749r993P2221l2907r2322K55881
$$ -6085371 -6007737 -6025394 -5985222 -6041392 -6023910 -5952517 -6003019 -6110768 -6120761 -6048540 -6081447 -6173769 -5917888
5056e917888j20925J09542m2109J8851o5771j486j01925j464N2904J25852n8048k2844M73
$$ -5917888 -6038813 -5929271 -5971380 -5952529 -6018300 -6019786 -6121711 -6123175 -6070271 -5944419 -6002467 -6025311 -6024838
5043f024838N2404M060m5622Q3416o0802O2895l66j5613O2388n3507j1317K2430M6148
$$ -6024838 -5972434 -5968374 -6013996 -5930580 -5991382 -5928487 -5928853 -5944466 -5882078 -5935585 -5946902 -5924472 -5878324
5030e878324k01774M9190R1319k13312L75574n5012k20354M5678L6578J10641Q352m4329
$$ -5878324 -6080098 -6030908 -5939589 -6152901 -5777327 -5832339 -6052693 -6007015 -5970437 -5859796 -5851444 -5895773
5018e895773j09103q3195L9538m3548J58221r2018l7884Q5963n624n2684N7247r6198M4395
$$ -5895773 -6004876 -6088071 -6048533 -6092081 -5933860 -6025878 -6063762 -5977799 -5983423 -6036107 -5978860 -6075058 -6030663
5005f030663j7391J3804J11769M6258k38605q742J6773R8596L2817l5890L9959K699n9710
$$ -6030663 -6048054 -6034250 -5922481 -5876223 -6114828 -6123570 -6106797 -6008201 -5975384 -6011274 -5971315 -5968616 -6028326
4992f028326r4151O2735o6236J17656p1404K3142P9291n5561j67627J48090J38256p806
$$ -6028326 -6122477 -6059742 -6125978 -6008322 -6079726 -6056584 -5977293 -6032854 -6200481 -6052391 -5914135 -5921941
4980e921941o9544M4661k9700Q9233q5351m6388j87233R4890P6169Q3533O6705j59200
$$ -5921941 -5991485 -5946824 -5976524 -5887291 -5972642 -6019030 -6206263 -6111373 -6035204 -5951671 -5884966 -6044166
4968f044166k3072J27264j84901Q2548R5409L60673m64109K1157l3286n6578K1685K00504
$$ -6044166 -6067238 -5939974 -6124875 -6042327 -5946918 -5586245 -6050354 -6029197 -6062483 -6119061 -6097376 -5896872
4956e896872j16562J09184j02793o9617m7630M590J97038q3893n1365K8122p0884O8727
$$ -5896872 -6013434 -5904250 -6007043 -6076660 -6124290 -6119700 -5922662 -6006555 -6057920 -6029798 -6100682 -6031955
4944f031955j8723Q6786r7255K0624R8934r0536k45591J87760R0753j246j85075J53382
$$ -6031955 -6050678 -5963892 -6061147 -6040523 -5941589 -6032125 -6277716 -6089956 -5999203 -6000449 -6185524 -6032142
4932f032142o6805p936R641L0040Q2673j96487N9114J18169Q0866m4793j17558N4679l8195
$$ -6032142 -6098947 -6106883 -6097242 -6067202 -5984529 -6181016 -6121902 -6003733 -5922867 -5967660 -6085218 -6030539 -6068734
4919f068734L1772P6115R1557M2997k43640J5455J41218q2386K80997l03467j689J28241
$$ -6068734 -6036962 -5960847 -5869290 -5826293 -6069933 -6054478 -5913260 -5995646 -5714649 -6018116 -6019805 -5891564
4907e891564m1548o8898j1780J9927M1358n1403o4574L1024j15794J59056j9767q8863
$$ -5891564 -5933112 -6002010 -6013790 -5993863 -5952505 -6003908 -6068482 -6037458 -6153252 -5994196 -6013963 -6102826
4895f102826m0208J02567j47967n9809M1401J41912M3105n7096O1352k7198O4546q4427
$$ -6102826 -6143034 -6040467 -6188434 -6248243 -6206842 -6064930 -6021825 -6078921 -6017569 -6044767 -5980221 -6064648
4883f064648n6836N101k9983P9442J8060J1996J9518J35105j42705m9731J31427O0818
$$ -6064648 -6121484 -6116383 -6146366 -6066924 -6048864 -6036868 -6017350 -5882245 -6024950 -6074681 -5943254 -5882436
4871e882436k13080K5545L4156l212r4439J18894P9270O5989r1099l7502J35617p9578
$$ -5882436 -6095516 -6069971 -6035815 -6039027 -6133466 -6014572 -5935302 -5869313 -5960412 -5997914 -5862297 -5941875
4859e941875o0962j8210K1533L1240o1758O626L5287o4809n8126N0957n7170O0674O2650
$$ -5941875 -6002837 -6021047 -5999514 -5968274 -6030032 -6023406 -5988119 -6052928 -6111054 -6060097 -6117267 -6056593 -5993943
4846e993943j08477N3379Q954q1306L8078J8194R4618q5231M8143j89528R9470J30523
$$ -5993943 -6102420 -6049041 -6040087 -6121393 -6083315 -6065121 -5970503 -6055734 -6007591 -6197119 -6097649 -5967126
4834e967126q9391j1583k6734J06208M4664o9116k1138r7627J52040q214J2081L8871p9974
$$ -5967126 -6056517 -6068100 -6094834 -5988626 -5943962 -6013078 -6034216 -6131843 -5979803 -5988017 -5975936 -5937065 -6017039
4821f017039j64558L00029K5815j85508Q5707j07653J18120J69133j36381J55286K93568
$$ -6017039 -6181597 -5881568 -5855753 -6041261 -5955554 -6063207 -5945087 -5775954 -5912335 -5757049 -5463481
4810e463481J92550N45913K462698n088031L22573L28153J26021O2168J02403O7104q5089
$$ -5463481 -5270931 -4725018 -2262320 -7350351 -7027778 -6699625 -6573604 -6511436 -6409033 -6341929 -6427018
4799f427018Q1844J39340r6223J2751j0145P9765k06045K09996P8598j04366k8216J67885
$$ -6427018 -6345174 -6205834 -6302057 -6289306 -6299451 -6219686 -6425731 -6215735 -6137137 -6241503 -6269719 -6101834
4787f101834q6276n9108L5098r7470J44361m2696L5271M4751R8745j30092R7415l187J4708
$$ -6101834 -6188110 -6247218 -6212120 -6309590 -6165229 -6207925 -6172654 -6127903 -6029158 -6159250 -6061835 -6065022 -6050314
4774f050314k09546m4930Q2794m9710J12173j50867R0713Q0230p3197P0200J44058j04614
$$ -6050314 -6259860 -6304790 -6221996 -6271706 -6159533 -6310400 -6219687 -6139457 -6212654 -6142454 -5998396 -6103010
4762f103010P8244j43284m4660J92845L2090n1502j07106K422M4383J14414j98455l3084
$$ -6103010 -6024766 -6168050 -6212710 -6019865 -5987775 -6039277 -6146383 -6143961 -6099578 -5985164 -6183619 -6216703
4750f216703J33719j20389J79198j07268J61755l53089N5706K03391J753l4732L8647q2355
$$ -6216703 -6082984 -6203373 -6024175 -6131443 -5969688 -6322777 -6267071 -6063680 -6061927 -6096659 -6058012 -6140367
4738f140367K48982k79387p7795J94757q4405o612J13133Q4054j15806k7537r123N8741
$$ -6140367 -5891385 -6170772 -6248567 -6053810 -6138215 -6144827 -6031694 -5947640 -6063446 -6090983 -6100106 -6041365
4726f041365l4782O4274j72403J02922j08008Q7862o5990N8030M0616m2946q7628k3520n72
$$ -6041365 -6076147 -6011873 -6184276 -6081354 -6189362 -6101500 -6167490 -6109460 -6068844 -6111790 -6199418 -6222938 -6223510
4713f223510j6671j6287J56300N7928l8753j15780p4233M5873K50945l2866j10279j0150
$$ -6223510 -6240181 -6256468 -6100168 -6042240 -6080993 -6196773 -6271006 -6225133 -5974188 -6007054 -6117333 -6127483
4701f127483J65876n0218o7461j13O4739J5441j44900j508O9961l414j1656j5194l4234
$$ -6127483 -5961607 -6011825 -6079286 -6079399 -6014660 -5999219 -6144119 -6145627 -6075666 -6079080 -6090736 -6105930 -6140164
4688f140164N8382n2455R5970j02456P262J09297n4192o0615K0803Q1486j25033P6892
$$ -6140164 -6081782 -6134237 -6038267 -6140723 -6133461 -6024164 -6078356 -6138971 -6118168 -6036682 -6161715 -6084823
4676f084823l7328l6968l1630l1163k2258Q5536Q5850j05143j6137R3502l4535O3550
$$ -6084823 -6122151 -6159119 -6190749 -6221912 -6244170 -6158634 -6072784 -6177927 -6194064 -6100562 -6135097 -6071547
4664f071547J06841k7860j5388k2154p2091P7332P969K9462l4663k0652p523N6579M8644
$$ -6071547 -5964706 -5992566 -6007954 -6030108 -6102199 -6024867 -6016898 -5987436 -6022099 -6042751 -6050274 -5993695 -5945051
4651e945051k04657J51117j54838J25563r1123R302l0626l953j10761M8915M9786n0297
$$ -5945051 -6149708 -5998591 -6153429 -6027866 -6118989 -6109687 -6140313 -6144266 -6255027 -6206112 -6156326 -6206623
4639f206623l2751O8679P4585j02878L609P444j50066L15076o175j1505j11031P4641L5285
$$ -6206623 -6239374 -6170695 -6096110 -6198988 -6195379 -6187935 -6338001 -6022925 -6029100 -6040605 -6151636 -6076995 -6041710
4626f041710j03220K26028j37390q2919P0603l4817m220j2017p5822o218k9384P4045J5353
$$ -6041710 -6144930 -5918902 -6056292 -6139211 -6068608 -6103425 -6107645 -6119662 -6195484 -6201702 -6231086 -6157041 -6141688
4613f141688p003l4836P4538j29623j07884J06391J54591J8886O835n3362M5038p1333
$$ -6141688 -6148691 -6183527 -6108989 -6238612 -6346496 -6240105 -6085514 -6066628 -6059793 -6113155 -6068117 -6139450
4601f139450K8521k0573L3869l4794O7691j39972O5236j2122M4285L1585m7173K9853l5745
$$ -6139450 -6110929 -6131502 -6097633 -6132427 -6064736 -6204708 -6139472 -6151594 -6107309 -6075724 -6122897 -6093044 -6128789
4588f128789k682r7876O41m4495Q3675K973o9382J0458N3923O2940j12102P9463J06357
$$ -6128789 -6131471 -6229347 -6228706 -6273201 -6189526 -6186553 -6255935 -6245477 -6191554 -6128614 -6240716 -6161253 -6054896
4575f054896k3952m8061r9958l6770J3611J06162o333Q1025J840k13713j3458J6341M0896
$$ -6054896 -6078848 -6126909 -6226867 -6263637 -6250026 -6143864 -6150197 -6069172 -6067332 -6281045 -6294503 -6278162 -6237266
4562f237266J31624J14602j04104j19610K4488k801O1965N4816p8385r3456J10568L2360
$$ -6237266 -6105642 -5991040 -6095144 -6214754 -6190266 -6193067 -6131102 -6076286 -6154671 -6248127 -6137559 -6105199
4550f105199n6329N7217l1078n2700J22045j16697J24155M0131k4757q170P5898o3177
$$ -6105199 -6161528 -6104311 -6135389 -6188089 -6066044 -6182741 -6058586 -6018455 -6043212 -6051382 -5975484 -6038661
4538f038661r4696l3452j0237O0604J59L7275m7646M5519M985M0026q3941L3198k3992
$$ -6038661 -6133357 -6166809 -6177046 -6116442 -6116283 -6079008 -6126654 -6081135 -6076150 -6036124 -6120065 -6086867 -6110859
4525f110859j31125J22589j29712o2403L9796k7969P3214Q3489j08555M6751j0245J7026
$$ -6110859 -6241984 -6119395 -6249107 -6311510 -6271714 -6299683 -6226469 -6142980 -6251535 -6204784 -6215029 -6198003
4513f198003P0502j21218p4227J63945J00922j57052o1871P2218J28191J7480J2046r7119
$$ -6198003 -6127501 -6248719 -6322946 -6159001 -6058079 -6215131 -6277002 -6204784 -6076593 -6059113 -6047067 -6144186
4501f144186K55q8711l8983J2184m9422J06823p2102J62022R4741R783k31790o2637r8566
$$ -6144186 -6143931 -6232642 -6271625 -6259441 -6308863 -6202040 -6274142 -6112120 -6017379 -6007596 -6239386 -6302023 -6400589
4488f400589K37096J00430J0123o6243o5042l4806P8327l8752Q6799j39015L7049O4786
$$ -6400589 -6163493 -6063063 -6052940 -6119183 -6184225 -6219031 -6140704 -6179456 -6092657 -6231672 -6194623 -6129837
4476f129837k450J34981J2108j13541j07882n8933m618J4937J350m9908M5130R5195p6258
$$ -6129837 -6132287 -5997306 -5985198 -6098739 -6206621 -6265554 -6270172 -6255235 -6253885 -6303793 -6258663 -6163468 -6239726
4463f239726N6490M1530L322M27j4018k9557O1360m5012k9728O7614p0734J4820n2489
$$ -6239726 -6183236 -6141706 -6138384 -6137957 -6151975 -6181532 -6120172 -6165184 -6194912 -6127298 -6198032 -6183212 -6235701
4450f235701J50411j71300J52116p8408m9287P255L0637J36999M561O7612o1851j50068
$$ -6235701 -6085290 -6256590 -6104474 -6182882 -6232169 -6224914 -6194277 -6057278 -6052717 -5985105 -6046956 -6197024
4438f197024k8734R792Q8714j57274m0703J65571P1255R6354j36109o656n0381M605P0345
$$ -6197024 -6225758 -6215966 -6127252 -6284526 -6325229 -6159658 -6088403 -5992049 -6128158 -6134814 -6185195 -6180590 -6110245
4425f110245o1881J52451j25402m9059j22514m847J95955k2873J19496p5764L2285J1433
$$ -6110245 -6172126 -6019675 -6145077 -6194136 -6316650 -6321497 -6125542 -6148415 -6028919 -6104683 -6072398 -6060965
4413f060965n2586L9512l7979J0456k7m4653J68756l4282j10982l0528m5156P6767J49087
$$ -6060965 -6113551 -6074039 -6112018 -6101562 -6101589 -6146242 -5977486 -6011768 -6122750 -6153278 -6198434 -6121667 -5972580
4400e972580k55189R9895P2985r5089k3258O2639P6612j76265P8231k8700j13326J59241
$$ -5972580 -6227769 -6127874 -6054889 -6149978 -6173236 -6110597 -6033985 -6210250 -6132019 -6160719 -6274045 -6114804
4388f114804k8651o5983Q1335K8784q7735j214k0307q731M383N0348m4183K6801o1975
$$ -6114804 -6143455 -6209438 -6128103 -6099319 -6187054 -6188268 -6208575 -6217306 -6212923 -6162575 -6206758 -6179957 -6241932
4375f241932M3351j19916l87443k396172K996368J06962j15482N1762J88834j53284j7666
$$ -6241932 -6198581 -6318497 -6705940 -9102112 -6105744 -5998782 -6114264 -6062502 -5873668 -6026952 -6044618
4364f044618m5222n6248j7702J7744N7216K5679j6028o8489O9690K9005r9896l5430P9933
$$ -6044618 -6089840 -6146088 -6163790 -6146046 -6088830 -6063151 -6079179 -6147668 -6077978 -6048973 -6148869 -6184299 -6104366
4351f104366J59865k20059Q6408J06838j88320J19268j10583J21052J27835l41418n061
$$ -6104366 -5944501 -6164560 -6078152 -5971314 -6159634 -6040366 -6150949 -6029897 -5902062 -6243480 -6248541
4340f248541K5556N5767l9082M3072J29259j37306n7672j01610K90703q3317n597J3188
$$ -6248541 -6222985 -6167218 -6206300 -6163228 -6033969 -6171275 -6228947 -6330557 -6039854 -6123171 -6128768 -6115580
4328f115580j58275J47143o882m9070M4071m5069R1012o1625n2457m2364j2462O8647o6462
$$ -6115580 -6273855 -6126712 -6133594 -6182664 -6138593 -6183662 -6092650 -6154275 -6206732 -6249096 -6261558 -6192911 -6259373
4315f259373O9300J39645J4484j12100k6622R6789j02504J854q9350K25219j76798n1603
$$ -6259373 -6190073 -6050428 -6035944 -6148044 -6174666 -6077877 -6180381 -6178527 -6267877 -6042658 -6219456 -6271059
4303f271059J21257J51740j82615r260J42677q0056O3959m8023L8750q7314L5230K9836
$$ -6271059 -6149802 -5998062 -6180677 -6189937 -6047260 -6127316 -6063357 -6111380 -6072630 -6159944 -6124714 -6094878
4291f094878n7752l3623J24917l3267j29076J0934J31571m0277P5858p4208N3355J08175
$$ -6094878 -6152630 -6186253 -6061336 -6094603 -6223679 -6212745 -6081174 -6121451 -6045593 -6119801 -6066446 -5958271
4279e958271k94570j01510J20198k04061j3105L10826J8342j3028k30952Q472O9560J42350
$$ -5958271 -6252841 -6354351 -6234153 -6438214 -6451319 -6140493 -6122151 -6135179 -6366131 -6357659 -6288099 -6145749
4267f145749j22567Q9488J8838p1774J67322k23420J06067j39242J18744L1039J25051
$$ -6145749 -6268316 -6178828 -6159990 -6231764 -6064442 -6287862 -6181795 -6321037 -6202293 -6171254 -6046203
4256f046203j09810j55039R8752J44840o5277r1325J78361o0431n7596j68868J53800o4195
$$ -6046203 -6156013 -6311052 -6212300 -6067460 -6132737 -6224062 -6045701 -6106132 -6163728 -6332596 -6178796 -6242991
4244f242991j0965j4910O9995O8809O2353q8079L7271j5769j9002N624K9629k42350J44824
$$ -6242991 -6253956 -6268866 -6198871 -6130062 -6067709 -6155788 -6118517 -6134286 -6153288 -6147664 -6118035 -6360385 -6215561
4231f215561M3816l6848O4283O0508J5586k00957J45969j35523K31545K96662o44473
$$ -6215561 -6171745 -6208593 -6144310 -6083802 -6068216 -6269173 -6123204 -6258727 -6027182 -5730520 -6374993
4220f374993J13865L426Q0652q1390M0357J12350p7243J2057K2706L4586n3207K3168r185
$$ -6374993 -6261128 -6257702 -6177050 -6258440 -6218083 -6105733 -6182976 -6170919 -6148213 -6113627 -6166834 -6143666 -6152851
4207f152851o5349O1677R4157L475p0386k3344N310r0972J01202J6563r4661J01169p3952
$$ -6152851 -6218200 -6156523 -6062366 -6058891 -6129277 -6152621 -6147311 -6238283 -6137081 -6120518 -6215179 -6114010 -6187962
4194f187962j03531J31333N2612l0630J6411M7136j13169P3671q429n3713J8615J53263
$$ -6187962 -6291493 -6160160 -6107548 -6138178 -6121767 -6074631 -6187800 -6114129 -6122558 -6176271 -6157656 -6004393
4182f004393j63985m322N4370J9868j09829J3231M643J0813M4925p4074R8917J0709m7392
$$ -6004393 -6168378 -6172700 -6118330 -6098462 -6208291 -6195060 -6190417 -6179604 -6134679 -6208753 -6109836 -6099127 -6146519
4169f146519n6299R2083m4449k8206L1681K27153o3232r6210k03461J71622l3027l2103
$$ -6146519 -6202818 -6110735 -6155184 -6183390 -6151709 -5924556 -5987788 -6083998 -6287459 -6115837 -6148864 -6180967
4157f180967J29376q3219l2538j96271K59246r9665J30594j27339Q2369m8225J14092k1629
$$ -6180967 -6051591 -6134810 -6167348 -6363619 -6104373 -6204038 -6073444 -6200783 -6118414 -6166639 -6052547 -6074176
4145f074176K0735o8350r8350n3395J0294J92020j17143j11801J27031J82655j71432q2613
$$ -6074176 -6053441 -6121791 -6220141 -6273536 -6263242 -6071222 -6188365 -6300166 -6173135 -5990480 -6161912 -6244525
4133f244525L0861J02920k7842m4701l6489n5586Q1541p5183j16341M64433j33770q1305
$$ -6244525 -6213664 -6110744 -6138586 -6183287 -6219776 -6275362 -6193821 -6269004 -6385345 -5920912 -6054682 -6135987
4121f135987l9535q5631L0406M5842L7089j54613J07744M2169m4442L5220n2360J9218
$$ -6135987 -6175522 -6261153 -6230747 -6184905 -6147816 -6302429 -6194685 -6152516 -6196958 -6161738 -6214098 -6194880
4109f194880l4331J13728n9835l2567O9370j02699K5782k0839R3569p031j07561q6576
$$ -6194880 -6229211 -6115483 -6175318 -6207885 -6138515 -6241214 -6215432 -6236271 -6142702 -6149733 -6257294 -6343870
4097f343870L36436j47179J14836j29491M6130j06610l904N2511q60Q6165k48518J35855
$$ -6343870 -6007434 -6154613 -6039777 -6169268 -6123138 -6229748 -6233652 -6181141 -6182001 -6095836 -6344354 -6208499
4085f208499p6170P6733P3550m544j0301L2128J18918k71730M8678Q9615k05775R4880
$$ -6208499 -6284669 -6207936 -6134386 -6138930 -6149231 -6117103 -5998185 -6269915 -6221237 -6131622 -6337397 -6242517
4073f242517j01686J37072j31467L00041l1257j28033J33589j04385m263n3906l6818
$$ -6242517 -6344203 -6207131 -6338598 -6038557 -6069814 -6197847 -6064258 -6168643 -6172906 -6226812 -6263630
4062f263630K17841p2303r4555N7688L1516n0898O0485j14783l597J43565j27387o6738
$$ -6263630 -6045789 -6118092 -6212647 -6154959 -6123443 -6174341 -6113856 -6228639 -6232236 -6088671 -6216058 -6282796
4050f282796Q3018r9366P073Q9129j7813n0899M9254O4847P2340j66576k3197k6660J6787
$$ -6282796 -6199778 -6299144 -6292071 -6202942 -6220755 -6271654 -6222400 -6157553 -6085213 -6251789 -6274986 -6301646 -6284859
4037f284859J29934m9584K8357o1707J38088M346r7203p6800j01684K43411k6652j12181
$$ -6284859 -6154925 -6204509 -6176152 -6237859 -6099771 -6095425 -6192628 -6269428 -6371112 -6127701 -6154353 -6266534
4025f266534N6261r69j0363J3914Q0453n9348q0245R2515J48491n7964L9231r2526o2827
$$ -6266534 -6210273 -6211242 -6221605 -6207691 -6127238 -6186586 -6266831 -6174316 -6025825 -6083789 -6044558 -6137084 -6199911
4012f199911L6170J6026J56j92686O5348M4720o1169Q3932N8770Q7637j12963N2180N5249
$$ -6199911 -6163741 -6147715 -6147559 -6340245 -6274897 -6230177 -6291346 -6207414 -6148644 -6061007 -6173970 -6121790 -6066541
3999f066541J64711l50204r2743K16959k2165m8711l8748P8160J25271j61536J2414J4957
$$ -6066541 -5901830 -6252034 -6344777 -6127818 -6149983 -6198694 -6237442 -6159282 -6034011 -6195547 -6183133 -6168176
3987f168176O3925K5841r3858q4841P684L8986m1863N997Q4381Q3787J1432j17727M0158
$$ -6168176 -6104251 -6078410 -6172268 -6257109 -6249425 -6210439 -6252302 -6246305 -6161924 -6078137 -6066705 -6184432 -6144274
3974f144274j13028L4750p9491J17469N4127N6768M0700k40396K1405J18583n8785m3844
$$ -6144274 -6257302 -6222552 -6302043 -6184574 -6130447 -6073679 -6032979 -6273375 -6251970 -6133387 -6192172 -6236016
3962f236016Q8114K3351q4413J18265j29260p9145J40351L9503j26905K3210p7050R2138
$$ -6236016 -6147902 -6124551 -6208964 -6090699 -6219959 -6299104 -6158753 -6119250 -6246155 -6222945 -6299995 -6207857
3950f207857Q2107p3090K3914L848l905j492j40151O6857k5364P6571Q5024Q0243q9053
$$ -6207857 -6125750 -6198840 -6174926 -6171078 -6174983 -6176475 -6316626 -6249769 -6275133 -6198562 -6113538 -6033295 -6122348
3937f122348M7469N11323p21730J35471k9331O2238j12925n7096r5856P1624k0979K14077
$$ -6122348 -6074879 -5563556 -6285286 -6149815 -6179146 -6116908 -6229833 -6286929 -6382785 -6311161 -6332140 -6118063
3925f118063R3750q9832j60114Q4744P9253q4014J2125p4639J23304l2163q140n7149o7561
$$ -6118063 -6024313 -6114145 -6274259 -6189515 -6110262 -6194276 -6182151 -6256790 -6133486 -6165649 -6173789 -6230938 -6298499
3912f298499Q7293L930M3905J53962L5378j72585p3845J24141p7667N0797p1751J2089
$$ -6298499 -6211206 -6207276 -6163371 -6009409 -5974031 -6146616 -6220461 -6096320 -6173987 -6123190 -6194941 -6182852
3900f182852k5941l6683P2130J2974k00272K0199J21758Q4085O4032M8027j02183N1618
$$ -6182852 -6208793 -6245476 -6173346 -6160372 -6360644 -6340445 -6218687 -6134602 -6070570 -6022543 -6124726 -6073108
3888f073108l3320O7631K10592k20372Q0923m00081Q931J14672M2369l99j37102J34570
$$ -6073108 -6106428 -6038797 -5828205 -6048577 -5967654 -6367735 -6358804 -6244132 -6201763 -6202162 -6339264 -6204694
3876f204694o863M1207j22176J52098J12198n7806J0410k65120J22864o5509N3552J39240
$$ -6204694 -6211557 -6170350 -6292526 -6140428 -6028230 -6086036 -6075626 -6340746 -6217882 -6283391 -6229839 -6090599
3864f090599k5371m0221J53139j21835J694q1392k0598j51830J69206j40659M5707P5440
$$ -6090599 -6115970 -6156191 -6003052 -6124887 -6123193 -6204585 -6225183 -6377013 -6207807 -6348466 -6302759 -6227319
3852f227319j51075m4409K23868j37800O7591J2282n3478K1397P4613m2539k5710k181
$$ -6227319 -6378394 -6422803 -6198935 -6336735 -6269144 -6256862 -6310340 -6288943 -6214330 -6256869 -6282579 -6284760
3840f284760J28200k92018L50664j21211P0179L6345k5988p9474Q012O4257J9355j03282
$$ -6284760 -6156560 -6448578 -6097914 -6219125 -6148946 -6112601 -6138589 -6218063 -6210051 -6145794 -6126439 -6229721
3828f229721p7297j3628K57678l5695j03432n9091J17900N8579p0498k13761M7613J46714
$$ -6229721 -6307018 -6320646 -6062968 -6098663 -6202095 -6261186 -6143286 -6084707 -6155205 -6368966 -6321353 -6174639
3816f174639j4869o4087Q4020j04008J01152l2034O992l0288J8739j42560K762R1016M5075
$$ -6174639 -6189508 -6253595 -6169575 -6273583 -6172431 -6204465 -6197473 -6227761 -6209022 -6351582 -6348820 -6257804 -6212729
3803f212729p7237Q7879r6002j7988Q8220J25540o5382j5054l2394l9066Q6088n4020n7713
$$ -6212729 -6289966 -6202087 -6298089 -6316077 -6227857 -6102317 -6167699 -6182753 -6215147 -6254213 -6168125 -6222145 -6279858
3790f279858l8255j17429P8271J90629j39841l3144L05583K5956q9694j92616P3947m4862
$$ -6279858 -6318113 -6435542 -6357271 -6166642 -6306483 -6339627 -6034044 -6008088 -6097782 -6290398 -6216451 -6261313
3778f261313O0084O0175m8726j41450R0536K0386j10700J31146J60202n9592j32958L5167
$$ -6261313 -6201229 -6141054 -6189780 -6331230 -6240694 -6220308 -6331008 -6199862 -6039660 -6099252 -6232210 -6197043
3766f197043j2871N9016M9414q8293o8507J22558j14045J28851p984m9680L906R529l1405
$$ -6197043 -6209914 -6150898 -6101484 -6189777 -6258284 -6135726 -6249771 -6120920 -6128904 -6178584 -6174678 -6165149 -6196554
3753f196554j08454N2837R0491j25013l7348q1968J79164Q8848m1315J8024q4432N6930n48
$$ -6196554 -6305008 -6252171 -6161680 -6286693 -6324041 -6406009 -6226845 -6137997 -6179312 -6161288 -6245720 -6188790 -6189338
3740f189338L3679q0433J15385r7907M2948r2992J05763m6167J6746j4873k617p6016q3971
$$ -6189338 -6155659 -6236092 -6120707 -6218614 -6175666 -6268658 -6162895 -6209062 -6192316 -6207189 -6209806 -6285822 -6369793
3727f369793M1814J28853j01529J56069n8936l1444j14138P298p1362J89783p7678j30517
$$ -6369793 -6327979 -6199126 -6300655 -6144586 -6203522 -6234966 -6349104 -6341806 -6413168 -6223385 -6301063 -6431580
3715f431580J00970k4176J09308K5976p4581m6777R0689j61098J23009o8495J41684M6440
$$ -6431580 -6330610 -6354786 -6245478 -6219502 -6294083 -6340860 -6250171 -6411269 -6288260 -6356755 -6215071 -6168631
3703f168631j81724P4367j4848o8457L1924K3874L1688l480q4243J144m641O9738N792
$$ -6168631 -6350355 -6275988 -6290836 -6359293 -6327369 -6303495 -6271807 -6275287 -6359530 -6358386 -6363027 -6293289 -6287497
3690f287497k3933m1798l7371j2229J27718j2651r350k7658j077K0338m514K8119P4117
$$ -6287497 -6311430 -6353228 -6390599 -6402828 -6275110 -6287761 -6297111 -6324769 -6325846 -6305508 -6310022 -6281903 -6207786
3677f207786J9290k5906J1301q6087N3126K6437m7982o6350K1690K7940j43805J67853
$$ -6207786 -6188496 -6214402 -6203101 -6289188 -6236062 -6209625 -6257607 -6323957 -6302267 -6274327 -6418132 -6250279
3665f250279o6557p2181o9140J15383L9149j32459J76011J5051M2874o2549j20491M1013
$$ -6250279 -6316836 -6389017 -6458157 -6342774 -6303625 -6436084 -6260073 -6245022 -6202148 -6264697 -6385188 -6344175
3653f344175O5205q7647J86889J9436M884k1520M8012j10279N535K2481l3098k9456N4295
$$ -6344175 -6278970 -6366617 -6179728 -6160292 -6155408 -6176928 -6128916 -6239195 -6233660 -6211179 -6244277 -6273733 -6219438
3640f219438p0668J5731j6606k2329m939k3246k6290N3401o9863o8104k05082L71688Q9464
$$ -6219438 -6290106 -6274375 -6290981 -6313310 -6318249 -6341495 -6367785 -6314384 -6384247 -6452351 -6657433 -6285745 -6196281
3627f196281j6585M7959k30624l315R3878r4340q7238L05796n8075N2445J0785j50086K678
$$ -6196281 -6212866 -6164907 -6395531 -6398846 -6304968 -6399308 -6486546 -6180750 -6238825 -6186380 -6175595 -6325681 -6323003
3614f323003m4099J41671k3048p7198J16759J64368q8753m8417L1556J45977o6639J15375
$$ -6323003 -6367102 -6225431 -6248479 -6325677 -6208918 -6044550 -6133303 -6181720 -6150164 -6004187 -6070826 -5955451
3602e955451l95733n223K5400Q9426N2307j47948N6193l5551m1998P8776L8014K3157J9062
$$ -5955451 -6351184 -6356407 -6331007 -6241581 -6189274 -6337222 -6281029 -6316580 -6358578 -6279802 -6241788 -6218631 -6199569
3589f199569j08883J14190m3433K6722n0193j3062j35994J02650L604k5147J5502M4810
$$ -6199569 -6308452 -6194262 -6237695 -6210973 -6261166 -6274228 -6410222 -6307572 -6303968 -6329115 -6313613 -6268803
3577f268803l6659J20369q6014L3417N0990p7094J9951o8530N969m778l512J06943m2794
$$ -6268803 -6305462 -6185093 -6271107 -6237690 -6186700 -6263794 -6243843 -6312373 -6306404 -6311182 -6314694 -6207751 -6250545
3564f250545k5491k0273q6751K6821k0065k5329L1172P2924r3385k5813J37758j11626
$$ -6250545 -6276036 -6296309 -6383060 -6356239 -6376304 -6401633 -6370461 -6297537 -6390922 -6416735 -6278977 -6390603
3552f390603O5244j24171J00487l7893J23017M4233n859M2748r7938N2120N3790j40227
$$ -6390603 -6325359 -6449530 -6349043 -6386936 -6263919 -6219686 -6225545 -6182797 -6280735 -6228615 -6174825 -6315052
3540f315052j19576J30053q3692J4946N4258O3505j6245j72437q308J58730r274j8184
$$ -6315052 -6434628 -6304575 -6388267 -6373321 -6319063 -6255558 -6271803 -6444240 -6452548 -6293818 -6303092 -6321276
3528f321276P4673l7559j06278J44152K3381j66007J6866J9095P3873K4377j23406O4477
$$ -6321276 -6246603 -6284162 -6390440 -6246288 -6222907 -6388914 -6372048 -6352953 -6279080 -6254703 -6378109 -6313632
3516f313632p0733m8322J72090j1080J156j83117M5242P8986Q8003r0798j3669Q2310o5045
$$ -6313632 -6384365 -6432687 -6260597 -6271677 -6270521 -6453638 -6408396 -6329410 -6241407 -6332205 -6345874 -6263564 -6328609
3503f328609p930l9756o6111k33901M99336p3492q5668N8019M4599j19513l9389J61576
$$ -6328609 -6336539 -6376295 -6442406 -6676307 -6176971 -6250463 -6336131 -6278112 -6233513 -6353026 -6392415 -6230839
3491f230839l0669j19426N0881q4269R471Q1713p1502o1630R1636O6085n5378p5809K1908
$$ -6230839 -6261508 -6380934 -6330053 -6414322 -6404851 -6323138 -6394640 -6456270 -6364634 -6298549 -6353927 -6429736 -6407828
3478f407828r604Q1354m5431n0109J1789L4088m2156m5181q2562J63440Q398K11759r3228
$$ -6407828 -6417432 -6336078 -6381509 -6431618 -6419829 -6385741 -6427897 -6473078 -6555640 -6392200 -6383802 -6172043 -6265271
3465f265271j21811Q4119O6640j14266K61516r1033k5809j09903J318j729q1923N1802
$$ -6265271 -6387082 -6302963 -6236323 -6350589 -6089073 -6180106 -6205915 -6315818 -6314500 -6316229 -6398152 -6346350
3453f346350l1241K00582m6870Q7263j24587M9679n5476Q1429q8453j2286m3077J7492
$$ -6346350 -6377591 -6177009 -6223879 -6136616 -6261203 -6211524 -6267000 -6185571 -6274024 -6286310 -6329387 -6311895
3441f311895j10560P5059J16992k02641J52134j27149o0936j39709J45736Q7161P3889
$$ -6311895 -6422455 -6347396 -6230404 -6433045 -6280911 -6408060 -6468996 -6608705 -6462969 -6375808 -6301919
3430f301919q3746P5241J4640K8821K08709k03236n9753J28667j03631l9041k3838n9687
$$ -6301919 -6385665 -6310424 -6295784 -6266963 -6058254 -6261490 -6321243 -6192576 -6296207 -6335248 -6359086 -6418773
3418f418773J34J05573k2354J02876o5403j46619l087J50896l4170K7588j45990P1948
$$ -6418773 -6418639 -6313066 -6335420 -6232544 -6297947 -6444566 -6447653 -6296757 -6330927 -6303339 -6449329 -6377381
3406f377381k5034L0418N0256j09793M4697L4815o397j05769O9927J53092j44927L6027
$$ -6377381 -6402415 -6371997 -6321741 -6431534 -6386837 -6352022 -6358419 -6464188 -6394261 -6241169 -6386096 -6350069
3394f350069j1174o6419P1694l8417Q233j87831J37970J02914K8524M2936J745n5835p3323
$$ -6350069 -6361243 -6427662 -6355968 -6394385 -6386152 -6573983 -6436013 -6333099 -6304575 -6261639 -6259894 -6315729 -6389052
3381f389052K5527q5934J84532j14644n6834m8828Q0818J71753j13579J4484l9541J98384
$$ -6389052 -6363525 -6449459 -6264927 -6379571 -6436405 -6485233 -6404415 -6232662 -6346241 -6331757 -6371298 -6172914
3369f172914j59141l1035j7867K8757l8913Q2820m8443K0294j0233J13473j37884J5232
$$ -6172914 -6332055 -6363090 -6380957 -6352200 -6391113 -6308293 -6356736 -6336442 -6346675 -6233202 -6371086 -6355854
3357f355854M0030r9013Q4376k1619M6600l6451J16620L1228j21917J7888O929L7399l7510
$$ -6355854 -6315824 -6414837 -6330461 -6352080 -6305480 -6341931 -6225311 -6194083 -6316000 -6298112 -6291183 -6253784 -6291294
3344f291294R7060k36647N7230j7807K30293k85167L15251j0187r3787k8261O2785j40242
$$ -6291294 -6194234 -6430881 -6373651 -6391458 -6161165 -6446332 -6131081 -6141268 -6235055 -6263316 -6200531 -6340773
3332f340773N8543J06260J02484R114q4539j2687m614N5179j01201N7635n3497j03727
$$ -6340773 -6282230 -6175970 -6073486 -6064372 -6148911 -6161598 -6166212 -6111033 -6212234 -6154599 -6208096 -6311823
3320f311823Q6977j8930M3504r2641K7547J59134j55895l8426L31O9407r6983J29957R2104
$$ -6311823 -6224846 -6243776 -6200272 -6292913 -6265366 -6106232 -6262127 -6300553 -6300222 -6230815 -6327798 -6197841 -6105737
3307f105737M6962N0252k2529q7197P9549K8826o9011q4142P9995P486o6564N8523O5936
$$ -6105737 -6058775 -6008523 -6031052 -6118249 -6038700 -6009874 -6078885 -6163027 -6083032 -6075546 -6142110 -6083587 -6017651
3294f017651l9184L275o8196P9830j7855P3232P4384q236Q994l0066P7238Q567J24762
$$ -6017651 -6056835 -6053560 -6121756 -6041926 -6059781 -5986549 -5912165 -5920401 -5911407 -5941473 -5864235 -5855668 -5730906
3281e730906j10461O6811Q228O001J36811L1572N2466k8025R4184k43L284M389n6946
$$ -5730906 -5841367 -5774556 -5766328 -5760327 -5623516 -5591944 -5539478 -5567503 -5473319 -5473562 -5470278 -5465889 -5522835
3268e522835j18841K2920j05877j97144q3528j52322K0707j20119m7696j02879N1593
$$ -5522835 -5641676 -5618756 -5724633 -5921777 -6005305 -6157627 -6136920 -6257039 -6304735 -6407614 -6356021
3257f356021J39557m0932j36068K7326M661n1666L1240P2181j6388j330Q2561Q2924j28692
$$ -6356021 -6216464 -6257396 -6393464 -6366138 -6361477 -6413143 -6381903 -6309722 -6326110 -6327440 -6244879 -6161955 -6290647
3244f290647J51197m7380q87k0736m9252j98400l6434J02086P4458j4247l16473Q3030
$$ -6290647 -6139450 -6186830 -6187717 -6208453 -6257705 -6456105 -6492539 -6390453 -6315995 -6330242 -6646715 -6563685
3232f563685J3054P3045M8976J7596J515j59157N89620k89535j04370j9020o5683L2649
$$ -6563685 -6550631 -6477586 -6428610 -6411014 -6409499 -6568656 -5979036 -6268571 -6372941 -6391961 -6457644 -6424995
3220f424995J00247j617j31098J32342J57220k82055j13666L2057P0475J27278r4235K5126
$$ -6424995 -6324748 -6326365 -6457463 -6325121 -6167901 -6449956 -6563622 -6531565 -6461090 -6333812 -6428047 -6402921
3208f402921j21863J06759Q330p4745K6829j17595J43179j30051M2435N5391O8883j82915
$$ -6402921 -6524784 -6418025 -6409695 -6484440 -6457611 -6575206 -6432027 -6562078 -6519643 -6464252 -6395369 -6578284
3196f578284L1511L1173N5502p9883O9154R5216J1875j9265l6842N581j36386L9445J10437
$$ -6578284 -6546773 -6515600 -6460098 -6539981 -6470827 -6375611 -6363736 -6383001 -6419843 -6414262 -6550648 -6511203 -6400766
3183f400766R718j07438K920N2599Q4916m2131k9749p1490J5798R6513j69209k5332J80279
$$ -6400766 -6391048 -6498486 -6495566 -6442967 -6358051 -6400182 -6429931 -6501421 -6485623 -6389110 -6558319 -6583651 -6403372
3170f403372P729l779M4027J2375m4565O0154q8594k1265J50790j54882j3909j02799R8982
$$ -6403372 -6395643 -6399422 -6355395 -6343020 -6387585 -6327431 -6416025 -6437290 -6286500 -6441382 -6455291 -6558090 -6459108
3157f459108p5510j7215K04112k88171R7523o1826K17686p6894j029o8853R9861j71022
$$ -6459108 -6534618 -6551833 -6347721 -6635892 -6538369 -6600195 -6382509 -6459403 -6460432 -6529285 -6429424 -6600446
3145f600446J08815K1369M624j71170K12015J4605j9364j06968P6256P2785j42691N9850
$$ -6600446 -6491631 -6470262 -6465638 -6636808 -6424793 -6410188 -6429552 -6536520 -6460264 -6387479 -6530170 -6470320
3133f470320j07622L6550J55809L1766m7960J7385r3580J11194j9502j9074K9255Q1403
$$ -6470320 -6577942 -6541392 -6385583 -6353817 -6401777 -6384392 -6477972 -6366778 -6386280 -6405354 -6376099 -6294696
3121f294696q8476j44820R4601p5693R9847l1443o6313J5J5893R2514n3426n6724m688
$$ -6294696 -6383172 -6527992 -6433391 -6509084 -6409237 -6440680 -6506993 -6506978 -6491085 -6398571 -6451997 -6508721 -6513409
3108f513409J88218q9462L9958j37588N8202o369J3550j00471N3738J06383J1576N4289
$$ -6513409 -6325191 -6414653 -6374695 -6512283 -6454081 -6460450 -6446900 -6547371 -6493633 -6387250 -6375674 -6321385
3096f321385Q3630p6268j7983j0244k2590j09244J59039k68073O8753J17555Q1813k6629
$$ -6321385 -6237755 -6314023 -6332006 -6342250 -6364840 -6474084 -6315045 -6583118 -6514365 -6396810 -6314997 -6341626
3084f341626K0511j6448p2765j27331J51802o3318o9961L1677n9733P9613Q4764L5793
$$ -6341626 -6321115 -6337563 -6410328 -6537659 -6385857 -6449175 -6519136 -6487459 -6547192 -6467579 -6382815 -6347022
3072f347022l9447j49Q1214j03395j27442M5815R9784j0727L19886k49629k71744J36209
$$ -6347022 -6386469 -6386618 -6305404 -6408799 -6536241 -6490426 -6390642 -6401369 -6081483 -6331112 -6602856 -6466647
3060f466647J56899r5980o7175J8250l4547j85528J23026J30167r815j15143m2884J16998
$$ -6466647 -6309748 -6405728 -6472903 -6454653 -6489200 -6674728 -6551702 -6421535 -6431350 -6546493 -6589377 -6472379
3048f472379j02601k5642k700K56657o8459p2046m8307j61303K23205P5801j46767L7419
$$ -6472379 -6574980 -6600622 -6603322 -6346665 -6415124 -6487170 -6535477 -6696780 -6473575 -6397774 -6544541 -6507122
3036f507122R8845P0041j71249L9587l506q9739J28568Q2879j8433r0456J03400J96988
$$ -6507122 -6408277 -6338236 -6509485 -6469898 -6473404 -6563143 -6434575 -6351696 -6370129 -6460585 -6357185 -6160197
3024f160197k36940n9914Q316L1918O0838r6599j41217J80183j9039K3024p9673J66996
$$ -6160197 -6397137 -6457051 -6448735 -6416817 -6355979 -6452578 -6593795 -6413612 -6432651 -6409627 -6489300 -6322304
3012f322304o1206r3126j8671k8124l4326J16136j42097K18208N631j12420Q8088J6862
$$ -6322304 -6383510 -6476636 -6495307 -6523431 -6557757 -6441621 -6583718 -6365510 -6359879 -6472299 -6384211 -6367349
3000f367349q6214J07352j14178N4948k326m3167Q9770j06832R2581J00580l37136N9020
$$ -6367349 -6453563 -6346211 -6460389 -6405441 -6407767 -6450934 -6361164 -6467996 -6375415 -6274835 -6611971 -6552951
2988f552951J9467N2959J02481r3334l583R4869o3299o2256j00886J01104J20463M1595
$$ -6552951 -6533484 -6480525 -6378044 -6471378 -6474961 -6380092 -6443391 -6505647 -6606533 -6505429 -6384966 -6343371
2976f343371M4888o6462M8252j3169K215J26212j9660j2918j12656p4292J0760n2901q199
$$ -6343371 -6298483 -6364945 -6316693 -6329862 -6327647 -6201435 -6221095 -6234013 -6346669 -6420961 -6410201 -6463102 -6471301
2963f471301Q9411n4694m0801J06523n1690K2125J07058j05301J09199j75651j9830j7333
$$ -6471301 -6381890 -6436584 -6477385 -6370862 -6422552 -6400427 -6293369 -6398670 -6289471 -6465122 -6484952 -6502285
2951f502285J44632m4518J05685j57684K8995J4510k0913K8334L1335o2077n9267P2363
$$ -6502285 -6357653 -6402171 -6296486 -6454170 -6425175 -6410665 -6431578 -6403244 -6371909 -6433986 -6493253 -6420890
2939f420890k8055J5370j14840K4614P7975N7969l3752j5990J1839r8641l0052K23157
$$ -6420890 -6448945 -6433575 -6548415 -6523801 -6445826 -6387857 -6421609 -6437599 -6425760 -6524401 -6554453 -6331296
2927f331296o2971Q4176o8024p6275m1438N7897o4957J44838J7967q585j9159k8651n4874
$$ -6331296 -6394267 -6310091 -6378115 -6454390 -6495828 -6437931 -6502888 -6358050 -6340083 -6348668 -6367827 -6396478 -6451352
2914f451352J44024J959n6326k3506n2136J7315N8931J8856K8131m4500l0830p7357q5602
$$ -6451352 -6307328 -6305369 -6361695 -6385201 -6437337 -6420022 -6361091 -6342235 -6314104 -6358604 -6389434 -6466791 -6552393
2901f552393j6621P5239M9835p8085j975J925Q571J6135Q7033j66121M1887j8135J6148
$$ -6552393 -6569014 -6493775 -6443940 -6522025 -6524000 -6522075 -6513504 -6497369 -6410336 -6576457 -6534570 -6552705 -6536557
2888f536557K4612p2465m6379P1552p2948l7386K7963L7169J56407j7549o8852j859n5062
$$ -6536557 -6511945 -6584410 -6630789 -6559237 -6632185 -6669571 -6641608 -6604439 -6448032 -6465581 -6534433 -6536292 -6591354
2875f591354m0975J4798J21448N8155j06293m7363N4056j21561J43196J65554k03882
$$ -6591354 -6632329 -6617531 -6496083 -6437928 -6544221 -6591584 -6537528 -6659089 -6515893 -6350339 -6554221
2864f554221k09071k4463Q811L06457j6608J2313l4341N0703j14307Q0178L842M5788L2324
$$ -6554221 -6763292 -6787755 -6778944 -6472487 -6489095 -6476782 -6511123 -6460420 -6574727 -6494549 -6490707 -6444919 -6412595
2851f412595o5549l2704j6652j87768J19847j08096J38606Q90M9437M78J31637k15910
$$ -6412595 -6478144 -6510848 -6527500 -6715268 -6595421 -6703517 -6564911 -6564021 -6514584 -6514106 -6382469 -6598379
2839f598379m7351l3310P526O3020j8777j81035O2134J56786K7578k7296j30495N6201
$$ -6598379 -6645730 -6679040 -6671514 -6608494 -6627271 -6808306 -6746172 -6589386 -6561808 -6589104 -6719599 -6663398
2827f663398J02843L461n2330J2918m9401R0060N6964J2536l7042m7795R4164R547j37365
$$ -6663398 -6560555 -6557094 -6609424 -6596506 -6645907 -6555847 -6498883 -6486347 -6523389 -6571184 -6477020 -6467473 -6604838
2814f604838k1551J72842M8677j87531R8368j37730O3852L5909n3113J4342J0292k054
$$ -6604838 -6626389 -6453547 -6404870 -6592401 -6494033 -6631763 -6567911 -6532002 -6585115 -6570773 -6560481 -6562535
2802f562535Q3107J3966k6455L0298q4090L9951m1198j6255L3287k3173q8810P6875q7854
$$ -6562535 -6479428 -6465462 -6491917 -6461619 -6545709 -6505758 -6546956 -6563211 -6529924 -6553097 -6641907 -6565032 -6652886
2789f652886O2261K79657j37007N1851o6583q7354m9825J28644J5235m0374M2375j03N652
$$ -6652886 -6590625 -6310968 -6447975 -6396124 -6462707 -6550061 -6599886 -6471242 -6456007 -6496381 -6454006 -6454109 -6448457
2776f448457m1798q2408j13110J52885Q2548j04737R1426r3466J35449R6376j56414j45309
$$ -6448457 -6490255 -6572663 -6685773 -6532888 -6450340 -6555077 -6463651 -6557117 -6421668 -6325292 -6481706 -6627015
2764f627015Q1706J2933P400q561m2352M6721p1826n2146J66849L1739L5606j8491j46807
$$ -6627015 -6545309 -6532376 -6524976 -6533537 -6575889 -6529168 -6600994 -6653140 -6486291 -6454552 -6418946 -6437437 -6584244
2751f584244J05071j1994m1100j16964R5274j6844O1460J47778j19386j02813N8261N1902
$$ -6584244 -6479173 -6491167 -6532267 -6649231 -6553957 -6570801 -6509341 -6361563 -6480949 -6583762 -6525501 -6473599
2739f473599K57259j92170Q8684m4809j10557O3834j10666K3686J04318j79405k2037l3658
$$ -6473599 -6216340 -6408510 -6319826 -6364635 -6475192 -6411358 -6522024 -6498338 -6394020 -6573425 -6595462 -6629120
2727f629120J29368j03841l2256R2338J15985l2422j20543K63120j5959K764J8545L8599
$$ -6629120 -6499752 -6603593 -6635849 -6543511 -6427526 -6459948 -6580491 -6317371 -6333330 -6330566 -6312021 -6273422
2715f273422n7145m6044j24294M7754J5096J16843j21394j18757k9685O6048j10089N1492
$$ -6273422 -6330567 -6376611 -6500905 -6453151 -6438055 -6321212 -6442606 -6561363 -6591048 -6525000 -6635089 -6583597
2703f583597P1478Q5602L4509p665M779m7472N9680K6093M7944L4854K1093o6645M769k113
$$ -6583597 -6512119 -6426517 -6392008 -6399673 -6394894 -6442366 -6382686 -6356593 -6308649 -6273795 -6252702 -6319347 -6314578 -6316691
2689f316691K6313j6410m2093r5945J75471j18413K02816l5133j47338Q9510j12446K1135
$$ -6316691 -6290378 -6306788 -6348881 -6444826 -6269355 -6387768 -6184952 -6220085 -6367423 -6277913 -6390359 -6369224
2677f369224J05410m6328k884Q4105K7684q6667L6842j12756N1486J2936K27064j34752
$$ -6369224 -6263814 -6310142 -6313026 -6228921 -6201237 -6287904 -6251062 -6363818 -6312332 -6299396 -6072332 -6207084
2665f207084j12028R2376M2542r1731O8765o9895N05n1685N9783K4447L62O7774j923
$$ -6207084 -6319112 -6226736 -6184194 -6275925 -6207160 -6277055 -6276550 -6328235 -6268452 -6244005 -6243643 -6175869 -6177792
2652f177792j27948J07137N5875p0437J20245j07892K6044k8449k9474q420J943m4648
$$ -6177792 -6305740 -6198603 -6142728 -6213165 -6092920 -6200812 -6174768 -6203217 -6232691 -6241111 -6239168 -6283816
2640f283816j4890J37607P7891j15302m383q0513n7471N1327N7940m2642L5844o5526
$$ -6283816 -6298706 -6161099 -6083208 -6198510 -6202893 -6283406 -6340877 -6289550 -6231610 -6274252 -6238408 -6303934
2628f303934m24173O45927J87382l3870j55361M5801J35944N5332l0080l8312k7883J45299
$$ -6303934 -6728107 -6082180 -5894798 -5928668 -6084029 -6038228 -5902284 -5846952 -5877032 -5915344 -5943227 -5797928
2616e797928M1882l7225R0675O584k6343K8526K18575m01411R9420j09315k8714N2966
$$ -5797928 -5756046 -5793271 -5702596 -5696012 -5722355 -5693829 -5475254 -5876665 -5777245 -5886560 -5915274 -5862308
2604e862308R7182j3528j74795R0094J02084L900k82002R0475J45706L4142j36272J29518
$$ -5862308 -5765126 -5778654 -5953449 -5863355 -5761271 -5757371 -6039373 -5948898 -5803192 -5769050 -5905322 -5775804
2592e775804J00759j04910l2045R8340N5305k1145J2777J6869K15866J90532K21210R1098
$$ -5775804 -5675045 -5779955 -5812000 -5713660 -5658355 -5679500 -5666723 -5649854 -5433988 -5243456 -5022246 -4931148
2580d931148o6481n0781j32284o5646j18461K02665j00590L6303k4087N4255K4767k3049
$$ -4931148 -4997629 -5048410 -5180694 -5246340 -5364801 -5162136 -5262726 -5226423 -5250510 -5196255 -5171488 -5194537
2568e194537J31823J7900j08114J38566N8107R2184m8904K06132j666K35676J01091K93593
$$ -5194537 -5062714 -5044814 -5152928 -5014362 -4956255 -4864071 -4912975 -4706843 -4708509 -4472833 -4371742 -4078149
2556d078149r2116j177J80761N2307J3052Q3174P036q0848J89550J77392j52460p6573
$$ -4078149 -4170265 -4171442 -3990681 -3938374 -3925322 -3842148 -3835112 -3915960 -3726410 -3549018 -3701478 -3778051
2544c778051L06832J25400J28333R8751M9302J54271J34861J85210J99824J25914r57
$$ -3778051 -3471219 -3345819 -3217486 -3118735 -3069433 -2915162 -2780301 -2595091 -2395267 -2269353 -2270310
2533b270310J37706L14093J71815J17031N44609K51671M21297M89282P47704Q61839
$$ -2270310 -2132604 -1818511 -1646696 -1529665 -985056 -733385 -312088 177194 924898 1786737
2523A786737J143613P37646P5506j08717O4224J82449K30921K31558K06109K04829M12421
$$ 1786737 2930350 3667996 3743502 3634785 3699009 3881458 4112379 4343937 4550046 4754875 5167296
2512E167296M18186M94324J24144L85644O60675R86144J051539R78002J063516J047205
$$ 5167296 5585482 6079806 6203950 6589594 7250269 8236413 9287952 10265954 11329470 12376675
2502A2376675N85622J027205R62441R75627P49591O76140O81646O40265M74592Q38815
$$ 12376675 12962297 13989502 14951943 15927570 16677161 17353301 18034947 18675212 19149804 19988619
2492A9988619N82467M82485M78961O36302O58239P66691O59791Q24222O09839N91000
$$ 19988619 20571086 21053571 21532532 22168834 22827073 23593764 24253555 25077777 25687616 26278616
2482B6278616M71352Q17097Q76170P94748Q68492R33588M30938O35154O54199O78649
$$ 26278616 26749968 27567065 28443235 29237983 30106475 31040063 31471001 32106155 32760354 33439003
2472C3439003O44944P01821M55435P88596P50379O32521R95238J010223R91337J506581
$$ 33439003 34083947 34785768 35241203 36029799 36780178 37412699 38407937 39418160 40409497 41916078
2462D1916078J725225J527777J754943J736087J554939J638383J037644J023471O95813
$$ 41916078 43641303 45169080 46924023 48660110 50215049 51853432 52891076 53914547 54610360
2453E4610360N05360N85768L63215L46498O28087R51562R99696J336276J747135K039066
$$ 54610360 55115720 55701488 56064703 56411201 57039288 57990850 58990546 60326822 62073957 64113023
2443F4113023K072892K424663K748690L176482L601823L793654L642057K117301l40159
$$ 64113023 66185915 68610578 71359268 74535750 78137573 81931227 85573284 87690585 87350426
2434H7350426k767625k501024j571525o10437j87802n8075M66325J037811J019784J238693
$$ 87350426 84582801 82081777 80510252 79899815 79712013 79653938 80120263 81158074 82177858 83416551
2424H3416551J515270J823793J899417K162965K597957L305054L878667M142156M925750
$$ 83416551 84931821 86755614 88655031 90817996 93415953 96721007 100599674 104741830 109667580
2415A09667580N776072O932209P852548Q906996R940579J1752194J3385607J5111992
$$ 109667580 115443652 122375861 130228409 139135405 149075984 160828178 174213785 189325777
2407A89325777J6556599J4833649R968712P227169J0479187J6042153J8776554O286317
$$ 189325777 205882376 220716025 230684737 237911906 248391093 264433246 283209800 289496117
2399B89496117j5235501k1729597j9212628j5366942j4780976k4772491l5492640k8715650
$$ 289496117 274260616 252531019 233318391 217951449 203170473 178397982 142905342 114189692
2391A14189692k0860528j7267662j5270434j5686343j5096420j0506354n958527l604543
$$ 114189692 93329164 76061502 60791068 45104725 30008305 19501951 13543424 9938881
2383I938881k368229j453402j149303r67911q07602p25661n56179n04223n85492m51469
$$ 9938881 7570652 6117250 4967947 4000036 3192434 2466773 1910594 1406371 820879 369410
2373C69410l57992k07567j92009o08434k64446N289R2058q1123j70741K30781o6406O5923
$$ 369410 11418 -196149 -388158 -996592 -1261038 -1255749 -1163691 -1244814 -1415555 -1184774 -1251180 -1185257
2361a185257J61860Q5181K42093K59674N5217J52222K33073K83342L41907M79086M539
$$ -1185257 -1023397 -938216 -696123 -436449 -381232 -229010 4063 287405 629312 1108398 1112937
2350A112937K73458O19584M81260M34183M20575M32475M39191N61301M45860K06102l2459
$$ 1112937 1386395 2005979 2487239 2921422 3341997 3774472 4213663 4774964 5220824 5426926 5394467
2339E394467k44471k20706p4160j02003r56375j348847q96279p78119p34914p33096n37792
$$ 5394467 5149996 4929290 4855130 4753127 3796752 2447905 1551626 773507 38593 -694503 -1232295
2328a232295n80729m58329k88786k13820k18833k43686j30602J97576n2048k33800j37562
$$ -1232295 -1813024 -2271353 -2560139 -2773959 -2992792 -3236478 -3367080 -3169504 -3221552 -3455352 -3592914
2317c592914k38935m0962R3510j47786r4811Q1963k45329J8285j59686K4172m9220M6087
$$ -3592914 -3831849 -3872811 -3779301 -3927087 -4021898 -3939935 -4185264 -4166979 -4326665 -4302493 -4351713 -4305626
2305d305626q93R0678K19066J23603J76295J17816K04025N5979K43864J83954J80269
$$ -4305626 -4306519 -4215841 -3996775 -3873172 -3696877 -3579061 -3375036 -3319057 -3075193 -2891239 -2710970
2294b710970L74080J61638j53714l15459k79742j87935l44322k39449k90815k63278k61949
$$ -2710970 -2336890 -2175252 -2328966 -2644425 -2924167 -3112102 -3456424 -3695873 -3986688 -4249966 -4511915
2283d511915k64482o6942j43109m9140k04596N0979P0394J78219J91265R5482L6785J09059
$$ -4511915 -4776397 -4843339 -4986448 -5035588 -5240184 -5189205 -5118811 -4940592 -4749327 -4653845 -4617060 -4508001
2271d508001Q418Q1745J60798J30491p2443K23479k756j38435K9322n704J75709J65842
$$ -4508001 -4499583 -4417838 -4257040 -4126549 -4198992 -3975513 -3978269 -4116704 -4087382 -4093086 -3917377 -3751535
2259c751535q0248K3987J37274J77179M5571J03954K9107R4024N8089Q4100q743M4791
$$ -3751535 -3831783 -3807796 -3670522 -3493343 -3447772 -3343818 -3314711 -3220687 -3162598 -3078498 -3087241 -3042450
2247c042450K55386J23018N35253P53848L0130j72525R8073L70712O28044Q58734R92292
$$ -3042450 -2787064 -2664046 -2128793 -1374945 -1344815 -1517340 -1419267 -1048555 -420511 438223 1430515
2236A430515j8526N11017P39343n40611j736193j011793l80125j00269J5929J57536O7110
$$ 1430515 1411989 1923006 2662349 2121738 385545 -626248 -1006373 -1106642 -1090713 -933177 -866067
2225h66067P4407j13024M8283j08309k73372o84367j210754q67052m10957k81238o6048
$$ -866067 -791660 -904684 -856401 -964710 -1238082 -1922449 -3133203 -4000255 -4411212 -4692450 -4758498
2214d758498q5067P3299N045J12029r9715J91447J70736P3230J85727O4501p5644K49351
$$ -4758498 -4843565 -4770266 -4765221 -4653192 -4752907 -4561460 -4390724 -4317494 -4131767 -4067266 -4142910 -3893559
2202c893559K23873Q5703K65253k2218O3605Q4513J07510j13528m10849j68925k15923
$$ -3893559 -3669686 -3583983 -3318730 -3340948 -3277343 -3192830 -3085320 -3198848 -3609697 -3778622 -3994545
2191c994545m09954n00396m57953l96152l42383l7254K2608N6281j28241K1451M9406
$$ -3994545 -4404499 -4904895 -5362848 -5759000 -6101383 -6138637 -6116029 -6059748 -6187989 -6166538 -6117132
2180f117132J02526P6491P3263K31668j75143J1978j29705J44480k90888J8351K7153q4958
$$ -6117132 -6014606 -5938115 -5864852 -5633184 -5808327 -5796349 -5926054 -5781574 -6072462 -6054111 -6026958 -6111916
2168f111916n0168O7784L7705j80780J57866P9021r1157N4361m2348j38813p1221O2285
$$ -6111916 -6162084 -6094300 -6056595 -6237375 -6079509 -6000488 -6091645 -6037284 -6079632 -6218445 -6289666 -6227381
2156f227381k2755l8948k0127J7301R1631q5791M7953K257J21615j41724j6153j09477
$$ -6227381 -6250136 -6289084 -6309211 -6291910 -6200279 -6286070 -6238117 -6235860 -6114245 -6255969 -6272122 -6381599
2144f381599l0036K5234J6205O1751J13461m7314j16074l2527Q4451L7574j57167J84075
$$ -6381599 -6411635 -6386401 -6370196 -6308445 -6194984 -6242298 -6358372 -6390899 -6306448 -6268874 -6426041 -6241966
2132f241966l8660R6472k42266p8152O2342R9998m1720K634M6307o1466Q9841j4590m4363
$$ -6241966 -6280626 -6184154 -6426420 -6504572 -6442230 -6342232 -6383952 -6381318 -6335011 -6396477 -6306636 -6321226 -6365589
2119f365589j83427J34380k29o4067r204n353J10015p4001q3957j15182O7917N2016n339
$$ -6365589 -6549016 -6414636 -6414865 -6478932 -6488136 -6493489 -6383474 -6457475 -6541432 -6656614 -6588697 -6536681 -6542020
2106f542020Q7729R468j44451r627j0274M2207J14458M4260J00407o1478q1644L2934M8581
$$ -6542020 -6454291 -6444823 -6589274 -6598901 -6609175 -6566968 -6452510 -6408250 -6307843 -6369321 -6450965 -6418031 -6369450
2093f369450l3722j04724J48026j62770Q6307q050J870J12155j44366P7145N5158m0488
$$ -6369450 -6403172 -6507896 -6359870 -6522640 -6436333 -6444383 -6442513 -6330358 -6474724 -6397579 -6342421 -6382909
2081f382909J4546j5464M0100m4007j24571L2213O3054K0906j9244K4899j17384J11649
$$ -6382909 -6368363 -6383827 -6343727 -6387734 -6512305 -6480092 -6417038 -6396132 -6415376 -6390477 -6507861 -6396212
2069f396212j31189O4158J18961N189J44362L5517k0007j11584O9670k9161R1671j53268
$$ -6396212 -6527401 -6463243 -6344282 -6339093 -6194731 -6159214 -6179221 -6290805 -6221135 -6250296 -6158625 -6311893
2057f311893m1339j59612M1771M9863J7738o7506l7192R7133L3657K2335M1588k2063N8345
$$ -6311893 -6353232 -6512844 -6471073 -6421210 -6403472 -6470978 -6508170 -6411037 -6377380 -6355045 -6313457 -6335520 -6277175
2044f277175J25720n5283k3676N5916j530l3789j15712O989N1161j37566n415J5936J62420
$$ -6277175 -6151455 -6206738 -6230414 -6174498 -6176028 -6209817 -6325529 -6318540 -6267379 -6404945 -6410360 -6394424 -6232004
2031f232004j36469j58316j50943m1856K09154j46478J61372j6152j08869j34936L1509
$$ -6232004 -6368473 -6526789 -6677732 -6719588 -6510434 -6656912 -6495540 -6511692 -6620561 -6755497 -6723988
2020f723988L2507J11044k5987l1196O2080p394P274q5757L4903n1739J98535r9291j9592
$$ -6723988 -6691481 -6580437 -6606424 -6637620 -6575540 -6582934 -6575660 -6661417 -6626514 -6678253 -6479718 -6579009 -6598601
2007f598601N1623P0850M089l6832r5304o779n3947K00825K5966j66874L1797J3874j6114
$$ -6598601 -6546978 -6476128 -6472039 -6508871 -6604175 -6610954 -6664901 -6464076 -6438110 -6604984 -6573187 -6559313 -6575427
1994f575427K39006j0372j37431J26420j5211q9308R8336j14635k4792J34327p5239P2363
$$ -6575427 -6336421 -6346793 -6484224 -6357804 -6373015 -6462323 -6363987 -6478622 -6503414 -6369087 -6444326 -6371963
1982f371963M169L8053K9179m5899N3163J25993Q037L5739Q6651j93649J28054k0408n7084
$$ -6371963 -6367794 -6329741 -6300562 -6346461 -6293298 -6167305 -6159268 -6123529 -6036878 -6230527 -6102473 -6122881 -6179965
1969f179965M7885J92504j02356P8080o517k3620j6399J50443M4996R5598j66895k9555
$$ -6179965 -6132080 -5939576 -6041932 -5963852 -5970369 -5993989 -6010388 -5859945 -5814949 -5719351 -5886246 -5915801
1957e915801r5310n7473L6050k06082K10747R9977j2755R1053o5573J27506j24399j2733
$$ -5915801 -6011111 -6068584 -6032534 -6238616 -6027869 -5927892 -5940647 -5849594 -5915167 -5787661 -5912060 -5924793
1945e924793O9328j12833n9237J67226N8489J89332L9197j35853R4085Q7946N4828J60414
$$ -5924793 -5855465 -5968298 -6027535 -5860309 -5801820 -5612488 -5573291 -5709144 -5615059 -5527113 -5472285 -5311871
1933e311871O4185K04820J57912R1555n7351J93121J33802M00451J7963J85338J31734
$$ -5311871 -5247686 -5042866 -4884954 -4793399 -4850750 -4657629 -4523827 -4123376 -4105413 -3920075 -3788341
1922c788341j1866J2867l38110l39474j89853j31556m32468l98959m84674l57422j66606
$$ -3788341 -3800207 -3787340 -4125450 -4464924 -4654777 -4786333 -5218801 -5617760 -6102434 -6459856 -6626462
1911f626462q5748j7801L1609J23625j95807J03702J05192m0144K1824j03511k9636o3227
$$ -6626462 -6712210 -6730011 -6698402 -6574777 -6770584 -6666882 -6561690 -6601834 -6580010 -6683521 -6713157 -6776384
1899f776384J18804M4667k3368m0124n3716k2471J30739n9875k5093J13405j3248J25532
$$ -6776384 -6657580 -6612913 -6636281 -6676405 -6730121 -6752592 -6621853 -6681728 -6706821 -6593416 -6606664 -6481132
1887f481132J51983k0382L1297k9487J06545p668j52544M0199k0816M2749j09465j9366
$$ -6481132 -6329149 -6349531 -6318234 -6347721 -6241176 -6248844 -6401388 -6361189 -6382005 -6339256 -6448721 -6468087
1875f468087K7281p0487q970J53694p8654k2822J8867M7419J18948o7002K1443j6782
$$ -6468087 -6440806 -6511293 -6520263 -6366569 -6445223 -6468045 -6449178 -6401759 -6282811 -6349813 -6328370 -6345152
1863f345152j10335j7292N3354L6396M0104j39410k1375J62420p9912k45352J18068N2443
$$ -6345152 -6455487 -6472779 -6419425 -6383029 -6342925 -6482335 -6503710 -6341290 -6421202 -6666554 -6548486 -6496043
1851f496043J0243M0596m8799N9299j46113Q8096N0848M6310k94116J19015O1059P6594
$$ -6496043 -6485800 -6445204 -6494003 -6434704 -6580817 -6492721 -6441873 -6395563 -6689679 -6570664 -6509605 -6433011
1839f433011j19343q938Q4623j6083l3313j0050J6238k6352J38340O7666L4226n0108
$$ -6433011 -6552354 -6561292 -6476669 -6492752 -6526065 -6536115 -6519877 -6546229 -6407889 -6340223 -6305997 -6356105
1827f356105J08934N0104q7107k3517o8707L1603j2682Q1575k3864j01314j97557j7972
$$ -6356105 -6247171 -6197067 -6284174 -6307691 -6376398 -6344795 -6357477 -6275902 -6299766 -6401080 -6598637 -6616609
1815f616609J19607p1035j27135N3794K62580M6886J88568q19l8666J45961j1102L7875
$$ -6616609 -6497002 -6568037 -6695172 -6641378 -6378798 -6331912 -6143344 -6144163 -6182829 -6036868 -6047970 -6010095
1803f010095J01004o1964j03226P8731K91217j41893N7879O9303j3397J9739l2303O2002
$$ -6010095 -5909091 -5971055 -6074281 -5995550 -5704333 -5846226 -5788347 -5719044 -5732441 -5712702 -5745005 -5683003
1791e683003q1391J29211j28970L59695J91504p5556J30999J3541Q881p1805K22304J93251
$$ -5683003 -5764394 -5635183 -5764153 -5404458 -5212954 -5288510 -5157511 -5143970 -5135089 -5206894 -4984590 -4791339
1779d791339n614P7284J83626K57819P4455o5090L172L6901j24833n2052o2071k19552
$$ -4791339 -4796953 -4719669 -4536043 -4278224 -4203769 -4268859 -4265687 -4228786 -4353619 -4405671 -4467742 -4687294
1767d687294P7391m7250j71855j6517j35413J26590n5200j30960J7747l3625m0540n3714
$$ -4687294 -4609903 -4657153 -4829008 -4845525 -4980938 -4854348 -4909548 -5040508 -5022761 -5056386 -5096926 -5150640
1755e150640j6444K25780j3873l3639O3855k0763Q1561P7742N2155J82895R6762k363M2772
$$ -5150640 -5167084 -4941304 -4955177 -4988816 -4924961 -4945724 -4864163 -4786421 -4734266 -4551371 -4454609 -4456972 -4414200
1742d414200R5266J80162R2042K05383O622K35779P4678m383k50654j46685l04118k60410
$$ -4414200 -4318934 -4138772 -4046730 -3841347 -3834725 -3598946 -3524268 -3528651 -3779305 -3925990 -4230108 -4490518
1730d490518n9258L2279n234j16436k7586l5539J03372j00712J92250J64149J01211M4087
$$ -4490518 -4549776 -4517497 -4522731 -4639167 -4666753 -4702292 -4598920 -4699632 -4507382 -4343233 -4242022 -4197935
1718d197935J87273K14945Q1737k20844R952J42403J26625J98290K27140J32064j27426n00
$$ -4197935 -4010662 -3795717 -3713980 -3934824 -3924872 -3782469 -3655844 -3457554 -3230414 -3098350 -3225776 -3226276
1706c226276k97493k68476j66538k93920J60741n5349N2289p0056N2250K627K3271k0310
$$ -3226276 -3523769 -3792245 -3958783 -4252703 -4091962 -4147311 -4095022 -4165078 -4112828 -4110201 -4086930 -4107240
1694d107240J6857O1379J635O722N3996J66498j319K24116J5962Q2874L5310R3002k3504
$$ -4107240 -4090383 -4029004 -4027369 -4020647 -3966651 -3800153 -3801472 -3577356 -3561394 -3478520 -3443210 -3350208 -3373712
1681c373712J31471k2686P2071j8554N070j19547R6155j6980Q7263J11882M2645J89774
$$ -3373712 -3242241 -3264927 -3192856 -3211410 -3206340 -3325887 -3229732 -3246712 -3159449 -3047567 -3004922 -2815148
1669b815148J05957K2082m8164R124J63922k972J43639j09490o6727K03309J27046L037
$$ -2815148 -2709191 -2687109 -2735273 -2726149 -2562227 -2565199 -2421560 -2531050 -2597777 -2394468 -2267422 -2264385
1657b264385o1700M2798K3267J23800R2010O1093j22818N2258O7157J75356K7637J78778
$$ -2264385 -2326085 -2283287 -2260020 -2136220 -2044210 -1983117 -2105935 -2053677 -1986520 -1811164 -1783527 -1604749
1645a604749K01328L52906M15059K92897L26364K82940K98881K70839Q4384k6989P4068
$$ -1604749 -1403421 -1050515 -635456 -342559 -16195 266745 565626 836465 920849 893860 967928
1634I67928R439J13414l4645J05129j00097K5711p4922n9763k06877N393k00013k44970
$$ 967928 977367 1090781 1056136 1161265 1061168 1086879 1011957 952194 745317 750710 550697 305727
1622C05727J796O8703K06630L02476M77308R09781J236209J002956R50097P28643N74941
$$ 305727 307523 376226 582856 885332 1362640 2272421 3508630 4511586 5461683 6190326 6765267
1611F765267N73059P25976P40913M58541M84402K47078K72175J83451L79017N9623J67574
$$ 6765267 7338326 8064302 8805215 9263756 9748158 9995236 10267411 10450862 10829879 10889502 11057076
1600A1057076J28664N3148O14371K82850K54754K15097M88346P54632R97241J346005
$$ 11057076 11185740 11238888 11853259 12136109 12390863 12605960 13094306 13848938 14846179 16192184
1590A6192184J519429K327849K152720J905817J747390J910738J590385J702430J753258
$$ 16192184 17711613 20039462 22192182 24097999 25845389 27756127 29346512 31048942 32802200
1581C2802200J870271J914004J933984J528406J323211J031544Q78894J400585J862096
$$ 32802200 34672471 36586475 38520459 40048865 41372076 42403620 43282514 44683099 46545195
1572D6545195J918893K041899K086882K060953J752657J764836J083559R28602J520273
$$ 46545195 48464088 50505987 52592869 54653822 56406479 58171315 59254874 60183476 61703749
1563F1703749K330591L373779L881083L907459M000787L881238L791212L552000L192135
$$ 61703749 64034340 67408119 71289202 75196661 79197448 83078686 86869898 90421898 93614033
1554I3614033L559880M020416M674792N231665O429433P038859O433021N093167M637468
$$ 93614033 97173913 101194329 105869121 111100786 117530219 124569078 131002099 136095266 140732734
1545A40732734N215342P207809Q874784R646406Q397481O204334K372161l286919r129649
$$ 140732734 145948076 153155885 162030669 171677075 180074556 186278890 188651051 185364132 176234483
1536A76234483j3456464j2768891q337230k543423J268484L227384L592778L399963
$$ 176234483 162778019 150009128 141671898 139128475 140396959 143624343 147217121 150617084
1528A50617084L276602L999379M856968O598717R160262J2749455J6180219J7940073
$$ 150617084 153893686 157893065 162750033 169348750 178509012 191258467 207438686 225378759
1520B25378759J5190086Q583458N983173J0603661J7807773K2854669K2954141J6473264
$$ 225378759 240568845 249152303 255135476 265739137 283546910 306401579 329355720 345828984
1512C45828984O598488m229964k1235725m3820834n6144310m8490376k8963298j3198163
$$ 345828984 352427472 348197508 326961783 283140949 226996639 178506263 149542965 136344802
1504A36344802m685246j333011k90409J59988R86156K173509M342670O557462J0433442
$$ 136344802 131659556 130326545 130036136 130196124 131182280 133355789 137698459 144255921 154689363
1495A54689363J5176059J7775352J6473615J0098169M966424P161143J4708652K1877822
$$ 154689363 169865422 187640774 204114389 214212558 219178982 226340125 241048777 262926599
1487B62926599K4271565K0157120J0370149j61689j5668200l9720156n9968532o0093119
$$ 262926599 287198164 307355284 317725433 317563744 301895544 262175388 202206856 142113737
1479A42113737m2489073k3037875j1189580n893456l644800k631107j756411q48764J00240
$$ 142113737 99624664 76586789 65397209 59503753 55858953 53227846 51471435 50622671 50722911
1470E0722911J268482K845331M582756O155458N587482L777356K187635K565012M876544
$$ 50722911 51991393 54836724 59419480 65574938 71162420 74939776 77127411 79692423 84568967
1461H4568967P327707Q360201P475457N650422K426250l913156j2837881k0261651
$$ 84568967 91896674 100256875 107732332 113382754 115809004 111895848 99057967 78796316
1453G8796316k1524515j6963499j1103909p507528m815879l297295k067076j383923r23207
$$ 78796316 57271801 40308302 29204393 21696865 16880986 13583691 11516615 10132692 9209485
1444I209485p41623l46230k55287j04830O9631Q0305L02819L37136N65411N07828L12531
$$ 9209485 8467862 8121632 7866345 7761515 7831146 7911451 8214270 8551406 9116817 9624645 9937176
1433I937176k5579J57353J32179N44714O85361O87540O00105M67639K19290o36553j784022
$$ 9937176 9911597 10068950 10201129 10745843 11431204 12118744 12718849 13186488 13405778 12769225 10985203
1422A0985203k215358j918965j011615l94103k02840j12461N2954J21486K11690L63420
$$ 10985203 8769845 6850880 5839265 5445162 5242322 5129861 5182815 5304301 5515991 5879411
1412E879411J24215J52925K24523K73104N47076K74689K23162J61993j6626L23862k9480
$$ 5879411 6003626 6156551 6381074 6654178 7201254 7475943 7699105 7861098 7844472 8168334 8138854
1401H138854k62418k89113j46733n1594K9484k5186l19498m00217J5356J62323M69636
$$ 8138854 7876436 7587323 7440590 7388996 7418480 7393294 7073796 6673579 6688935 6851258 7320894
1390G320894Q32228J044874J380583J305809R11641J46247j009912j782949k042007
$$ 7320894 8153122 9197996 10578579 11884388 12796029 12942276 11932364 10149415 8107408
1381H107408j581915j027591m98418n0701J04441k57232n74028j179636j250480r27505
$$ 8107408 6525493 5497902 4999484 4948783 5053224 4795992 4221964 3042328 1791848 864343
1371H64343m73795l87719k12248r2012k34099j40138P9915R9275O03518k12001K46508
$$ 864343 390548 2829 -209419 -301431 -535530 -675668 -595753 -496478 107040 -104961 141547
1360A41547K05650j85933P6932J60786K90445K17402K79713L16423J89122K25620K35539
$$ 141547 347197 161264 238196 398982 689427 906829 1186542 1502965 1692087 1917707 2153246
1349B153246L68289P635J17989j15593K25888l02011p830j03529j58977J53449o130K81191
$$ 2153246 2521535 2529170 2647159 2531566 2757454 2455443 2447613 2344084 2185107 2338556 2332426 2613617
1337B613617K69292P4555J30505M50164K45756M49914L08355J96396P9864K57120L12366
$$ 2613617 2882909 2957464 3087969 3538133 3783889 4233803 4542158 4738554 4818418 5075538 5387904
1326E387904L39168k28466J8643N08697Q58627O36150L60642J92063J26365L09662K8154
$$ 5387904 5727072 5498606 5517249 6025946 6884573 7520723 7881365 8073428 8199793 8509455 8537609
1315H537609j59528m3083J32733J36222J55294L47219J57667Q4457K51037m2777l164
$$ 8537609 8378081 8334998 8467731 8603953 8759247 9106466 9264133 9348590 9599627 9556850 9553686
1304I553686K43146Q7064L19689K04333K67609L69530P12075O74108O83486M25978L41444
$$ 9553686 9796832 9883896 10203585 10407918 10675527 11045057 11757132 12431240 13114726 13540704 13882148
1293A3882148M55132P34363Q79601J323331J390890J866076K702615J681775L73279k60888
$$ 13882148 14337280 15071643 15951244 17274575 18665465 20531541 23234156 24915931 25289210 25028322
1283B5028322j359448q58048K3378J44377j94187j579799k540033m81364J715741N4660
$$ 25028322 23668874 22810826 22834204 22978581 22784394 21204595 18664562 18183198 19898939 19953599
1273A9953599j999682l309792l395241k96984J523521k42437o6544M569406R279060
$$ 19953599 17953917 14644125 11248884 10951900 12475421 12232984 12166440 16735846 26014906
1264B6014906Q089915N163839L606311L144382K544547K498955J893920J329722J486827
$$ 26014906 34104821 39268660 42874971 46019353 48563900 51062855 52956775 54286497 55773324
1255E5773324J418577J283116J144969J360476M29410k69388k35030j67650l76479q8743
$$ 55773324 57191901 58475017 59619986 60980462 61409872 61140484 60905454 60737804 60361325 60272582
1245F0272582Q15611J528784K099205K331561K005077K962405L686832M527261M457419
$$ 60272582 61088193 62616977 64716182 67047743 69052820 72015225 75702057 80229318 84686737
1236H4686737L373229K113142L204914M569247O200736O793783Q791220J3902382J5799431
$$ 84686737 88059966 90173108 93378022 97947269 104148005 110941788 119733008 133635390 149434821
1227A49434821J2421386O460492k722997k02740P002255J2393250J6215809J2498776
$$ 149434821 161856207 168316699 165593702 165390962 172393217 184786467 201002276 213501052
1219B13501052J0321108J6263993K1540726J4421418j057219m66930P513233J2781830
$$ 213501052 223822160 240086153 261626879 276048297 274991078 274524148 282037381 294819211
1211B94819211J7787767K0684457K0478613K2065006K2388410K1600723J5743247P383182
$$ 294819211 312606978 333291435 353770048 375835054 398223464 419824187 435567434 442950616
1203D42950616O289774J0677638J2294450J1401094J0769872J1300712J1588824J2334364
$$ 442950616 449240390 459918028 472212478 483613572 494383444 505684156 517272980 529607344
1195E29607344J3878568J5196517J3444182J0710236J0371144Q751340K801686l351468
$$ 529607344 543485912 558682429 572126611 582836847 593207991 601959331 604761017 601409549
1187F01409549l279628K140012P052314J1289304J7481412K1681075K6117428K6439200
$$ 601409549 598129921 600269933 607322247 618611551 636092963 657774038 683891466 710330666
1179G10330666K0236774R631497P616490J5684479K3988214K8222004L7129813O7822103
$$ 710330666 730567440 740198937 747815427 763499906 787488120 815710124 852839937 920662040
1171I20662040J15382541J84807733J95922196K0735597o0532467K7595149J15153866
$$ 920662040 1036044581 1220852314 1416774510 1437510107 1376977640 1404572789 1519726655
1164A519726655J96597904K33455894Q6738618O886584R6159817P918175l09385579
$$ 1519726655 1716324559 1949780453 2036519071 2043405655 2139565472 2147483647 1838098068
1157A838098068n91177332n10914960k80864195j36138467p1700423m1435597k9666160
$$ 1838098068 1246920736 736005776 455141581 319003114 247302691 205867094 176200934
1150A76200934k7021145k3412719j6469560j0928433q362562o476213m724735m233182
$$ 176200934 149179789 125767070 109297510 98369077 90006515 83530302 78805567 74572385
1142G4572385m766611m542350l465026k723575k193855j894979j621831j382102r68570
$$ 74572385 69805774 65263424 61798398 59074823 56880968 54985989 53364158 51982056 51013486
1133E1013486j358803k245925j873323k218505k662348j582777P61147J578791J375781
$$ 51013486 49654683 47408758 45535435 43316930 40654582 39071805 39832952 41411743 42787524
1124D2787524Q14446R01832J193859Q66346J54915j86252r24M33479R57105R40208J579944
$$ 42787524 43601970 44503802 45697661 46564007 46718922 46532670 46531746 46965225 47922330 48862538 50442482
1113E0442482L609822O851578P772204j012489m345477k086731J902133O276798J0348871
$$ 50442482 54052304 60903882 68676086 67663597 63318120 61231389 63133522 69410320 79759191
1104G9759191P445651J807229O690688J2445922j577294k7077989k6019817j3333920
$$ 79759191 87204842 89012071 95702759 108148681 106571387 79493398 53473581 40139661
1096D0139661o799434m054124k517117j464405j410498j315979j132157p51624L12732
$$ 40139661 33340227 29286103 26768986 25304581 23894083 22578104 21445947 20694323 21007055
1087B1007055K20214R6820j6897N0768r6866o03854j284855j476260r25598m01914m23224
$$ 21007055 21227269 21324089 21307192 21357960 21261094 20657240 19372385 17896125 16970527 16568613 16145389
1076A6145389n45184o48926m59311n96430q30639j429510j368809p79890O8946M61171
$$ 16145389 15600205 14951279 14491968 13895538 13064899 11635389 10266580 9486690 9555636 10016807
1066A0016807O89588O72109J265099K274464K035155K318428j74925n71993K93261R78507
$$ 10016807 10706395 11378504 12643603 14918067 16953222 19271650 19096725 18524732 18817993 19796500
1056A9796500K119380K589932L23064q62742J31353q96858m341355p947270o572441
$$ 19796500 21915880 24505812 24828876 23966134 24097487 23200629 18859274 10912004 4339563
1047D339563l888894j733571j091091q99173n02547J37199K02110O38023J051347Q04325
$$ 4339563 450669 -1282902 -2373993 -3273166 -3775713 -3638514 -3436404 -2798381 -1747034 -942709
1037i42709N53135M11744K77502K3477J24203k83138j76379j06128J47076J51884j05830
$$ -942709 -389574 22170 299672 323149 447352 164214 -12165 -118293 28783 180667 74837
1026G4837J08281J97622L38536M9221k1015J12638M26330N12892L00601P0765J42710
$$ 74837 183118 380740 719276 768497 747482 860120 1286450 1799342 2099943 2170708 2313418
1015B313418J43924N2974L50434K43608J8484K3944n3789p7215j57454K1423K73948J58761
$$ 2313418 2457342 2510316 2860750 3104358 3122842 3146786 3092997 3015782 2858328 2879751 3153699 3312460
1003C312460R2007j38919j24205L46228M14217K39951J46436j60068J60146L30455L58293
$$ 3312460 3404467 3265548 3141343 3487571 3901788 4141739 4288175 4128107 4288253 4618708 4977001
992D977001K72132O88027J458508J106640Q69823P75836P33360P45928K97367O783l23692
$$ 4977001 5249133 5937160 7395668 8502308 9372131 10147967 10881327 11627255 11924622 11931405 11607713
981A1607713O50520J37658K57384K63059J52132m88801o62004j04488L84959J61267l49399
$$ 11607713 12258233 12395891 12653275 12916334 13068466 12579665 11917661 11813173 12198132 12359399 12010000
970A2010000o66161p71539J05385N55841K07653M88466K116830L026299K738048J626879
$$ 12010000 11343839 10572300 10677685 11233526 11441179 11929645 14046475 17072774 19810822 21437701
960B1437701J377044J356496J190264J305711J474946J804470K196245K078957J802362
$$ 21437701 22814745 24171241 25361505 26667216 28142162 29946632 32142877 34221834 36024196
951C6024196R57250M09157N18757R82669J716216K056289J834876K028897K941250L492043
$$ 36024196 36981446 37390603 37909360 38892029 40608245 42664534 44499410 46528307 49469557 52961600
941E2961600K849898J813192J441055K147452L389469M768672N364934M981234M469611
$$ 52961600 55811498 57624690 59065745 61213197 64602666 69371338 74736272 79717506 84187117
932H4187117M670203M288490L249375J687108J391618K892753K967313L588924J965273
$$ 84187117 88857320 93145810 96395185 98082293 99473911 102366664 105333977 108922901 110888174
923A10888174J127261J549498L090062M587270N845243N107803L860463N158787O562516
$$ 110888174 112015435 113564933 116654995 121242265 127087508 132195311 136055774 141214561 147777077
914A47777077M497440K37973k41514K031893M134736O369353P586910Q510700Q808760
$$ 147777077 152274517 152512490 152270976 154302869 158437605 164806958 172393868 180904568 189713328
905A89713328R134663Q398754O954826M903450N207649P075699Q838310J0823132J4665839
$$ 189713328 198847991 207246745 214201571 219105021 224312670 231388369 240226679 251049811 265715650
896B65715650K1667275K8286749K3160059O151521K152656J2030748K3299124L4551021
$$ 265715650 287382925 315669674 338829733 344981254 347133910 359164658 382463782 417014803
888D17014803L6903030K0560664R745538J0141763j4783141o2595148q3973525n9555734
$$ 417014803 453917833 474478497 484224035 494365798 479582657 416987509 333013984 273458250
880B73458250k6156200p522708O18252L130790K200136J375800K158577M901183O757812
$$ 273458250 247302050 239779342 240397594 243528384 245728520 247104320 249262897 254164080 260921892
871B60921892R592515J7326996K9506465M8923456M8350601O456405q903943P547871
$$ 260921892 270514407 287841403 317347868 366271324 414621925 421078330 412174387 419722258
863D19722258K8701969N1773130P4511850L3152015J4938555L6086087J104129r9011006
$$ 419722258 448424227 500197357 574709207 607861222 622799777 658885864 659989993 560978987
855E60978987j66248179j37516741p2783105l2840394j5092656p127239l929802l685557
$$ 560978987 394730808 257214067 184430962 151590568 136497912 129370673 125440871 121755314
847A21755314l545702j638987M27958K523935M963480J0073764J6852557J9814225
$$ 121755314 118209612 116570625 116998583 119522518 124485998 134559762 151412319 171226544
839A71226544J0710341o8239J85071Q894951J8633249K6717674K4171584J2110153
$$ 171226544 181936885 181868646 182053717 190948668 209581917 236299591 260471175 272581328
831B72581328J1176677O245454k5585540o2939677o8717557m6983425k4916594j4270615
$$ 272581328 283758005 290003459 264417919 201478242 132760685 85777260 60860666 46590051
823D6590051q631140n114920l196586k539791k133122j705498j273619p51073o23751
$$ 46590051 37958911 32843991 29647405 27107614 24974492 23268994 21995375 21244302 20620551
814B0620551k61369m68764r4191N75289J376622J085763k49521j284123o03243J810
$$ 20620551 20359182 19890418 19796227 20371516 21748138 22833901 22584380 21300257 20697014 20698824
804B0698824J329967K113561J806484N34954J345425L130434o95774o119834o299664
$$ 20698824 22028791 24142352 25948836 26483790 27829215 30959649 30263875 24144041 17844377
795A7844377l742089j883803r96585m88115l73025k30367j50437o9993K26874K78112O8211
$$ 17844377 14102288 12218485 11221900 10733785 10360760 10130393 9979956 9909963 10136837 10414949 10483160
784A0483160J68367P11114P64776M24208o3082k22791j33699L96919M46718N5233o40403
$$ 10483160 10651527 11362641 12127417 12551625 12488543 12265752 12132053 12528972 12975690 13030923 12390520
773A2390520l61280L89934M7110j778269l412804k648463j310065o53321j78635J7905
$$ 12390520 12029240 12419174 12466284 10688015 7275211 4626748 3316683 2663362 2484727 2502632
763B502632J77867K27108L66531O89870N04296k94526k78995m1037K30042M95012P16267
$$ 2502632 2680499 2907607 3274138 3964008 4468304 4173778 3894783 3853746 4083788 4578800 5295067
752E295067J00329j29740K02889k75899j449563k218922j864257j059134n03466n14699
$$ 5295067 5395396 5265656 5468545 5192646 3743083 1524161 -340096 -1399230 -1902696 -2417395
742b417395l44261l31750r0885K27530J59795K82464L72083L67399M20504M96292K63356
$$ -2417395 -2761656 -3093406 -3184291 -2956761 -2796966 -2514502 -2142419 -1775020 -1354516 -858224 -594868
731e94868K3027j14560j01335J86095K33638L05140L03137M0482m8765k45894p19000
$$ -594868 -571841 -686401 -787736 -601641 -368003 -62863 240274 280756 231991 -13903 -732903
720g32903j264042j020157n35730m81480j45519o3583j19152m0236N6574J84205M2183
$$ -732903 -1996945 -3017102 -3552832 -4034312 -4179831 -4243414 -4362566 -4402802 -4346228 -4162023 -4119840
709d119840N8200J08032J48973L4631J03666k01153j47090P1665M6655n7974p7348J75535
$$ -4119840 -4061640 -3953608 -3804635 -3770004 -3666338 -3867491 -4014581 -3942916 -3896261 -3954235 -4031583 -3856048
697c856048K35008P5948L7547k10338J43256M4919l1514J60443O0415p2347q6797n8097
$$ -3856048 -3621040 -3545092 -3507545 -3717883 -3574627 -3529708 -3561222 -3400779 -3340364 -3412711 -3499508 -3557605
685c557605m0149r63n7702k9298r3592O9802l1521L3346J20085J2418n7724q7698J52936
$$ -3557605 -3597754 -3598717 -3656419 -3685717 -3779309 -3709507 -3741028 -3707682 -3587597 -3575179 -3632903 -3720601 -3567665
672c567665m2629M8723N1909K67443P1833K32675L49737K50586K39995p8238m4500P6356
$$ -3567665 -3610294 -3561571 -3509662 -3242219 -3170386 -2937711 -2587974 -2337388 -2097393 -2175631 -2220131 -2143775
660b143775j0619K65657J94781m8832n0942M4929j86901n64343m72667l23792o6533N2338
$$ -2143775 -2154394 -1888737 -1693956 -1742788 -1793730 -1748801 -1935702 -2500045 -2972712 -3296504 -3363037 -3310699
648c310699P3082j56832o6430J59564O6584M6455P3082L2324K34131J64709N96284K56121
$$ -3310699 -3237617 -3394449 -3460879 -3301315 -3234731 -3188276 -3115194 -3082870 -2848739 -2684030 -2087746 -1831625
636a831625L7556k7432Q8020J11260L48853L29467K30500M479K51920k43114q91979r11663
$$ -1831625 -1794069 -1821501 -1733481 -1622221 -1273368 -943901 -713401 -708922 -457002 -700116 -1592095 -2503758
624b503758o00546m21742q0212n0298N0326m2767p286j3168M24o5986Q1152J1859K2571
$$ -2503758 -3104304 -3526046 -3606258 -3656556 -3606230 -3648997 -3656283 -3669451 -3669027 -3735013 -3653861 -3642002 -3619431
611c619431J45852K52640K7263n2509n1942J20853P3316J35895N8983K20874N4882R6856
$$ -3619431 -3473579 -3220939 -3193676 -3246185 -3298127 -3177274 -3103958 -2968063 -2909080 -2688206 -2633324 -2536468
599b536468k16431n24547l76522l28157j54309o2505K6000p529j10053M7135k4928l0624
$$ -2536468 -2752899 -3277446 -3653968 -3982125 -4136434 -4198939 -4172939 -4180468 -4290521 -4243386 -4268314 -4298938
587d298938k4670l2844q487k9513J80408p3933j11842Q5451J9210m0633n2020M7602L5469
$$ -4298938 -4323608 -4356452 -4364939 -4394452 -4214044 -4287977 -4399819 -4314368 -4295158 -4335791 -4387811 -4340209 -4304740
574d304740r3533o4445P9586p3008P5768n8608L6732K1199k5394j09864J10576J27102
$$ -4304740 -4398273 -4462718 -4383132 -4456140 -4380372 -4438980 -4402248 -4381049 -4406443 -4516307 -4405731 -4278629
562d278629l5683p1637p3455L3164J09876r7949k21755Q5001N7494K7921j7336j9296P3384
$$ -4278629 -4314312 -4385949 -4459404 -4426240 -4316364 -4414313 -4636068 -4551067 -4493573 -4465652 -4482988 -4502284 -4428900
549d428900j21498N7086l6496N5416k06223J70933P0278p4123N2334m4356j3757o3457
$$ -4428900 -4550398 -4493312 -4529808 -4474392 -4680615 -4509682 -4439404 -4513527 -4461193 -4505549 -4519306 -4582763
537d582763J64823P663p9267p030Q4563k17740M8199J0671L0109K05414o5060j94801
$$ -4582763 -4417940 -4410277 -4489544 -4496574 -4412011 -4629751 -4581552 -4570881 -4540772 -4335358 -4400418 -4595219
525d595219J47403j1697p5462r7019L618Q6317L9310o2780q4684K31125n277k2563L8075
$$ -4595219 -4447816 -4459513 -4534975 -4631994 -4628376 -4542059 -4502749 -4565529 -4650213 -4419088 -4424365 -4446928 -4408853
512d408853n5261M6623J20492j58358j5813J4399M8311k22367j41539m8973j64208j34718
$$ -4408853 -4464114 -4417491 -4296999 -4455357 -4471170 -4456771 -4408460 -4630827 -4772366 -4821339 -4985547 -5120265
500e120265J21720j911J03303j70959l1900N6588j22823R3719P674K8031M546M3282J13477
$$ -5120265 -4998545 -5000456 -4897153 -5068112 -5100012 -5043424 -5166247 -5072528 -5064854 -5036823 -5032277 -4988995 -4875518
487d875518o4980j43239J66026k2539n7322J18331j00295k62304J59298k846n9033J93831
$$ -4875518 -4940498 -5083737 -4917711 -4940250 -4997572 -4879241 -4979536 -5241840 -5082542 -5085388 -5144421 -4950590
475d950590K4421j6580J15759j43412J162J3328L0831K8172q8814m9647L1202j6704P5414
$$ -4950590 -4926169 -4942749 -4826990 -4970402 -4969240 -4955912 -4925081 -4896909 -4985723 -5035370 -5004168 -5020872 -4945458
462d945458k1975j44630J12977K27113j75764K9114q0390P9456j14889L23179j67860N8579
$$ -4945458 -4967433 -5112063 -4999086 -4771973 -4947737 -4918623 -4999013 -4919557 -5034446 -4711267 -4879127 -4820548
450d820548k3977l8069q2076j13333j48720m3587Q9757p0408R9327N3830N4502k8566r9917
$$ -4820548 -4844525 -4882594 -4964670 -5078003 -5226723 -5270310 -5180553 -5250961 -5151634 -5097804 -5043302 -5071868 -5171785
437e171785m4785O9231J16533J7181J16996K89308j70010J27724r643j71127l6437Q2158
$$ -5171785 -5216570 -5147339 -5030806 -5013625 -4896629 -4607321 -4777331 -4649607 -4659250 -4830377 -4866814 -4784656
425d784656J15712n0863j32424o7973J03957R882j05121j31929j09457p5450j09948J58844
$$ -4784656 -4668944 -4719807 -4852231 -4920204 -4816247 -4806365 -4911486 -5043415 -5152872 -5228322 -5338270 -5179426
413e179426N4540K76742m55454N7881R4631M4288k18334J00076P4822J75896n7890P0521
$$ -5179426 -5124886 -4848144 -5303598 -5245717 -5151086 -5106798 -5325132 -5225056 -5150234 -4974338 -5032228 -4961707
401d961707q6262M6567l0157N9887n1546q8260J14328L3555k05913o9042o7968k2423O3974
$$ -4961707 -5047969 -5001402 -5031559 -4971672 -5023218 -5111478 -4997150 -4963595 -5169508 -5238550 -5306518 -5328941 -5264967
388e264967J461k5203o5214J13703l9912q8226j1264J00488L8764l7729J5612L6552j61178
$$ -5264967 -5263506 -5288709 -5353923 -5240220 -5280132 -5368358 -5379622 -5279134 -5240370 -5278099 -5262487 -5225935 -5387113
375e387113K3410R5055M08R8859N6050q8714j43633p505Q3735L1495n4279O5603M1355
$$ -5387113 -5363703 -5268648 -5268240 -5169381 -5113331 -5202045 -5345678 -5353183 -5269448 -5237953 -5292232 -5226629 -5185274
362e185274o4288p9093M7915P4458Q6631k3816N6935m7918M3058j13793l7492o8908n2240
$$ -5185274 -5249562 -5328655 -5280740 -5206282 -5119651 -5143467 -5086532 -5134450 -5091392 -5205185 -5242677 -5311585 -5363825
349e363825K9162J099m1569J38733j84334N7093L4671k4166R3565n6478M8812j13984l4814
$$ -5363825 -5334663 -5333564 -5375133 -5236400 -5420734 -5363641 -5328970 -5353136 -5259571 -5316049 -5267237 -5381221 -5416035
336e416035M2131o0770J3185M3616Q3101n6813r9737Q3955j0674m7279Q5518M0932j43032
$$ -5416035 -5373904 -5434674 -5421489 -5377873 -5294772 -5351585 -5451322 -5367367 -5378041 -5425320 -5339802 -5298870 -5441902
323e441902Q5116r8005J3262O0196J01362J74889k74416J21604q9237j9594o713k6408O630
$$ -5441902 -5356786 -5454791 -5441529 -5381333 -5279971 -5105082 -5379498 -5257894 -5347131 -5366725 -5373438 -5399846 -5393216
310e393216j68420N7131J254K3564q23M1734P3740j02947R4879R0844j49110r4478J7152
$$ -5393216 -5561636 -5504505 -5503251 -5479687 -5480510 -5438776 -5365036 -5467983 -5373104 -5282260 -5431370 -5525848 -5508696
297e508696M7655r9304J4131q0662R6629J6502J2541j84795q862q5935k18713J43825R443
$$ -5508696 -5461041 -5560345 -5546214 -5626876 -5530247 -5513745 -5501204 -5685999 -5694861 -5780796 -5999509 -5855684 -5846241
284e846241J91108J06827r8448N5527L5250j45688J02247R124p4139J05932k2623R6616
$$ -5846241 -5655133 -5548306 -5646754 -5591227 -5555977 -5701665 -5599418 -5590294 -5664433 -5558501 -5581124 -5484508
272e484508Q5659L6544m5296l191j38452Q4102O5276Q1706R5689p0556k4784j43375O6114
$$ -5484508 -5398849 -5362305 -5407601 -5410792 -5549244 -5465142 -5399866 -5318160 -5222471 -5293027 -5317811 -5461186 -5395072
259e395072k8582l8330l6608J42519j1403Q1981p6535l4978o1893J11720K6553N6106
$$ -5395072 -5423654 -5461984 -5498592 -5356073 -5367476 -5285495 -5362030 -5397008 -5458901 -5347181 -5320628 -5264522
247e264522j26329J19826o8022k6972L698r4204J09143n9469P1734o0878J01652n7282
$$ -5264522 -5390851 -5271025 -5339047 -5366019 -5362321 -5456525 -5347382 -5406851 -5335117 -5395995 -5294343 -5351625
235e351625l3713j4759M8133r5735l4262p1049K03863j69724l947J64677l2631k4067O1558
$$ -5351625 -5385338 -5400097 -5351964 -5447699 -5481961 -5553010 -5349147 -5518871 -5522818 -5358141 -5390772 -5414839 -5353281
222e353281q1778m5315j589K9256j9283j3167J93879R8596p6661r997R955j03121o113
$$ -5353281 -5435059 -5480374 -5481963 -5452707 -5471990 -5485157 -5291278 -5192682 -5269343 -5279340 -5269385 -5372506 -5378619
209e378619j9405o6661J07470q5020n5358J96565j60643o2498Q954j9916j32028J49719
$$ -5378619 -5398024 -5464685 -5357215 -5442235 -5497593 -5301028 -5461671 -5524169 -5515215 -5535131 -5667159 -5517440
197e517440m7106o6297l7342O4249n187j456J5267q9236R2264J61108m70N3775j42553
$$ -5517440 -5564546 -5630843 -5668185 -5603936 -5609123 -5610579 -5595312 -5684548 -5592284 -5431176 -5431646 -5377871 -5520424
184e520424k9882L8161m3253J74322k34994M176M9316j8621L3732N805n6724Q237K9171
$$ -5520424 -5550306 -5512145 -5555398 -5381076 -5616070 -5611894 -5562578 -5581199 -5547467 -5541662 -5598386 -5590149 -5560978
171e560978j30407l8453R5973L4473o1782n6319K0704M7637K1865j56347M6182N6459m2465
$$ -5560978 -5691385 -5729838 -5633865 -5599392 -5661174 -5717493 -5696789 -5649152 -5627287 -5783634 -5737452 -5680993 -5723458
158e723458O1841J1243R1961M7203o8421o7337n7107N5455J10333j7006o2253j08891R3496
$$ -5723458 -5661617 -5650374 -5558413 -5511210 -5579631 -5646968 -5704075 -5648620 -5538287 -5555293 -5617546 -5726437 -5632941
145e632941R2418K7873r0500J5762j26714q756R0254k8835p5987R4050N8730M5643j31839
$$ -5632941 -5540523 -5512650 -5603150 -5587388 -5714102 -5722858 -5632604 -5661439 -5737426 -5643376 -5584646 -5539003 -5670842
132e670842p0638O0898l525p9339K8786Q3414P8221j5286j46272L20898r1390j31036R490
$$ -5670842 -5741480 -5680582 -5684107 -5763446 -5734660 -5651246 -5573025 -5588311 -5734583 -5413685 -5505075 -5636111 -5626621
119e626621J43080j46019P7303n1690L2208j0826n5597N2384m9940J62338p0045j59786
$$ -5626621 -5483541 -5629560 -5552257 -5603947 -5571739 -5582565 -5638162 -5585778 -5635718 -5473380 -5543425 -5703211
107e703211J03894K2564n8577l002J03632m4149J01631L0534p2877j7750N9738N8048
$$ -5703211 -5599317 -5576753 -5635330 -5638332 -5534700 -5578849 -5477218 -5446684 -5519561 -5537311 -5477573 -5419525
95e419525j75757l1775J4821M8347J3810r6900J37148m3000k0524j7564J20636o7728K3526
$$ -5419525 -5595282 -5627057 -5612236 -5563889 -5550079 -5646979 -5509831 -5552831 -5573355 -5590919 -5470283 -5538011 -5514485
82e514485J2962m5813j43596J15144m9527O0029M815n9719j6811j25549k5569P2229q945
$$ -5514485 -5501523 -5547336 -5690932 -5575788 -5625315 -5565286 -5560471 -5620190 -5637001 -5762550 -5788119 -5715890 -5724835
69e724835n2853j9809K2360J15973Q6792O0374j08956M954r0997j9324P7840m1510j02772
$$ -5724835 -5777688 -5797497 -5775137 -5659164 -5572372 -5511998 -5620954 -5616000 -5706997 -5726321 -5648481 -5689991 -5792763
56e792763k9972l7733J17889P8559r5848J67832l8073j1020k9000k5027R074O9561J28150
$$ -5792763 -5822735 -5860468 -5742579 -5664020 -5759868 -5592036 -5630109 -5641129 -5670129 -5695156 -5686082 -5616521 -5488371
43e488371k35424P4413j42445K12601j374j35658k0379l0939r441j07859J98412j82547
$$ -5488371 -5723795 -5649382 -5791827 -5579226 -5580600 -5716258 -5736637 -5767576 -5777017 -5884876 -5686464 -5869011
31e869011k1150O7653J26323M1688O9723p1230J8632p8580Q2804o7314k15296J13073j7018
$$ -5869011 -5890161 -5822508 -5696185 -5654497 -5584774 -5656004 -5637372 -5715952 -5633148 -5700462 -5915758 -5802685 -5819703
18e819703k1278K75894q7856k5617p0082j4472j71253J23147J6386L2871K0517j430L8169
$$ -5819703 -5840981 -5565087 -5652943 -5678560 -5748642 -5763114 -5934367 -5811220 -5794834 -5761963 -5741446 -5742876 -5704707
5e704707r4740L3740n1822l1148K10571O889M1440j57976O8019k9065K630n316N5952Q9483
$$ -5704707 -5799447 -5765707 -5817529 -5848677 -5638106 -5631217 -5589777 -5747753 -5679734 -5708799 -5706169 -5711485 -5655533 -5566050
-9e566050j82469o1826p950p394J4996k8954j4423m2564J31575k3636J40005j04743j9245
$$ -5566050 -5748519 -5810345 -5818295 -5825689 -5810693 -5839647 -5854070 -5896634 -5765059 -5788695 -5648690 -5753433 -5772678
-22e772678r9006J39100N3219j7611J6575n6134l3538p7547J576M1374l341N1467o2651
$$ -5772678 -5871684 -5732584 -5679365 -5696976 -5680401 -5736535 -5770073 -5847620 -5846044 -5804670 -5808011 -5756544 -5819195
-35e819195k9968Q9490j42569j061K9485O031k0637P9604L9330m5281O8005M5351j38036
$$ -5819195 -5849163 -5759673 -5902242 -5903303 -5873818 -5867787 -5888424 -5808820 -5769490 -5814771 -5746766 -5701415 -5839451
-48e839451O6152N8192J3451l4251l3340r1691N2093n575p468J10121L5013r2465Q592
$$ -5839451 -5773299 -5715107 -5701656 -5735907 -5769247 -5860938 -5808845 -5814420 -5821888 -5711767 -5676754 -5769219 -5760627
-61e760627L1537j0364q919J20518K5254j87965n2773N3226r065j3742L0998l7226P8233
$$ -5760627 -5729090 -5739454 -5748373 -5627855 -5602601 -5790566 -5843339 -5790113 -5799178 -5812920 -5781922 -5819148 -5740915
-74e740915j95104O6052K4833P5128N693j83951J01341p0741O0464K27052K4155q2988l616
$$ -5740915 -5936019 -5869967 -5845134 -5770006 -5764313 -5948264 -5846923 -5917664 -5857200 -5630148 -5605993 -5688981 -5692597
-87e692597j47377R6817J07273k9224l9075J2818j61798Q6620J05299k2434N5148r1810
$$ -5692597 -5839974 -5743157 -5635884 -5665108 -5704183 -5691365 -5853163 -5766543 -5661244 -5683678 -5628530 -5720340
-99e720340j31135l20531L51740J35435p5142Q7115r6088q369J15801J00485j81857k2229
$$ -5720340 -5851475 -6172006 -5820266 -5684831 -5759973 -5672858 -5768946 -5777315 -5661514 -5561029 -5742886 -5765115
-111e765115n1204J19663j607j34803k2040R8841j4577p9602L3076l4794p3767J66036
$$ -5765115 -5816319 -5696656 -5698263 -5833066 -5855106 -5756265 -5770842 -5850444 -5817368 -5852162 -5925929 -5759893
-123e759893j16666J85023j19479j80736m8267J16866R1Q4849j8874m1621o966l4074
$$ -5759893 -5876559 -5691536 -5811015 -5991751 -6040018 -5923152 -5923061 -5838212 -5857086 -5898707 -5905673 -5939747
-135e939747K25971p6967q1152o6874j07Q1392K2307r3679J11047j12704P9715o6305P5391
$$ -5939747 -5713776 -5790743 -5871895 -5938769 -5938876 -5857484 -5835177 -5928856 -5817809 -5930513 -5850798 -5917103 -5841712
-148e841712p5789O2606j21761j6558J96589M750k9042j56809Q6073P8172k6578m2831
$$ -5841712 -5917501 -5854895 -5976656 -5993214 -5796625 -5791875 -5820917 -5977726 -5891653 -5813481 -5840059 -5882890
-160e882890M2616j14192n0041J99532l0647O1084J4521j08385N9746P0450l7170o7458
$$ -5882890 -5840274 -5954466 -6004507 -5804975 -5835622 -5774538 -5760017 -5868402 -5808656 -5738206 -5775376 -5842834
-172e842834J037k19837K20725K16946q4022r9113P6137r3172M0309M7240m7961r597
$$ -5842834 -5841797 -6061634 -5840909 -5623963 -5707985 -5807098 -5730961 -5824133 -5783824 -5736584 -5784545 -5794142
-184e794142n27044N84114l0659r3100M4178P7783l7742n7107l6955j9097M879l9391
$$ -5794142 -6321186 -5737072 -5767731 -5860831 -5816653 -5738870 -5776612 -5833719 -5870674 -5889771 -5884892 -5924283
-196e924283J53966R850k8236N363j19038j2601J19076P428R7252m8306o9581o8347K9738
$$ -5924283 -5770317 -5760467 -5788703 -5783340 -5902378 -5914979 -5795903 -5788475 -5691223 -5739529 -5809110 -5877457 -5847719
-209e847719l7226P3231j15878K05216j59908j7414R6070M3239J4012j6346R9560j33891
$$ -5847719 -5884945 -5811714 -5927592 -5722376 -5882284 -5899698 -5803628 -5760389 -5746377 -5762723 -5663163 -5797054
-221e797054j28761K8718J33456o5346J65413k46576K53632o9144j29336n8876Q2696O2964
$$ -5797054 -5925815 -5897097 -5763641 -5828987 -5663574 -5910150 -5656518 -5725662 -5854998 -5913874 -5831178 -5768214
-233e768214q2888k7441l5990R0291J39304n0587j04852R2469n156j3545J44253N7200
$$ -5768214 -5851102 -5878543 -5914533 -5824242 -5684938 -5735525 -5840377 -5747908 -5753064 -5766609 -5622356 -5565156
-245e565156j22123k99239J39580J2417J71811j44587r0919J06504L1077j18146J02818
$$ -5565156 -5687279 -5986518 -5846938 -5834521 -5662710 -5807297 -5898216 -5791712 -5760635 -5878781 -5775963
-256e775963J3321j2574j42923Q9246J0149k1054P3728J15792m2263n9368n9841M4062
$$ -5775963 -5762642 -5775216 -5918139 -5828893 -5818744 -5839798 -5766070 -5650278 -5692541 -5751909 -5811750 -5767688
-268e767688J25689k9003j57421K4800k4816j2673l3219m9984N0218P3348m285j2470O9542
$$ -5767688 -5641999 -5671002 -5828423 -5803623 -5828439 -5841112 -5874331 -5924315 -5874097 -5800749 -5805034 -5817504 -5747962
-281e747962j8380l0448O854p6467k2957J4901M7233M8921l1133n0891O6757M5963q2073
$$ -5747962 -5766342 -5796790 -5789936 -5866403 -5889360 -5874459 -5827226 -5778305 -5809438 -5860329 -5793572 -5747609 -5829682
-294e829682m6027R4238k38901K08476n9005J9913P7363l2128J79147k63982M7616j86200
$$ -5829682 -5875709 -5781471 -6020372 -5811896 -5870901 -5850988 -5773625 -5805753 -5626606 -5890588 -5842972 -6029172
-306f029172P1763O9869J84318p5584K9970p863r4676j3501K3645k3316k1182K226L2695
$$ -6029172 -5957409 -5887540 -5703222 -5778806 -5748836 -5756699 -5851375 -5864876 -5841231 -5864547 -5885729 -5883503 -5850808
-319e850808O575l969r3733m4093J43529K9750M9822l8569L7178j71020K86909m57214
$$ -5850808 -5844233 -5848202 -5941935 -5986028 -5842499 -5812749 -5762927 -5801496 -5764318 -5935338 -5648429 -6105643
-331f105643J11222M1707p1054K2949J25636m2481m7812M3393K9637q0491L17126j52257
$$ -6105643 -5994421 -5952714 -6023768 -6000819 -5875183 -5917664 -5965476 -5922083 -5892446 -5972937 -5655811 -5808068
-343e808068l4537K6216n8216k1058K6620l7373m1306n2149j7144Q0733N3814O0501J41466
$$ -5808068 -5842605 -5816389 -5874605 -5895663 -5869043 -5906416 -5947722 -5999871 -6017015 -5936282 -5882468 -5821967 -5680501
-356e680501k45321k4917n1473P609K39061q5734r8913N1358k4334N4245j00578P7336
$$ -5680501 -5925822 -5950739 -6002212 -5994603 -5755542 -5841276 -5940189 -5888831 -5913165 -5858920 -5959498 -5882162
-368e882162j55525R3459K653r9800J62050J61411j91327p5669J49866j28223J52039
$$ -5882162 -6037687 -5944228 -5941575 -6041375 -5879325 -5717914 -5909241 -5984910 -5835044 -5963267 -5811228
-379e811228j66539M7507L43765k53100K6481n5571O8582p9652m7050J26633K7834j30689
$$ -5811228 -5977767 -5930260 -5586495 -5839595 -5813114 -5868685 -5800103 -5879755 -5926805 -5800172 -5772338 -5903027
-391e903027p9936Q5199P9857j95756k829j4896J41477j11954J31237J2413q5641Q3229l3
$$ -5903027 -5982963 -5897764 -5817907 -6013663 -6016492 -6031388 -5889911 -6001865 -5870628 -5858215 -5943856 -5860627 -5860660
-404e860660m5645k9946l8675N797r8639J19004O7232J8875l7934N7106r9036J4121k8635
$$ -5860660 -5906305 -5936251 -5974926 -5969129 -6067768 -5948764 -5881532 -5862657 -5900591 -5843485 -5942521 -5928400 -5957035
-417e957035Q1298m6331L5115k0562k9147l5356J17510o241m079l2733n6529J5394p121
$$ -5957035 -5875737 -5922068 -5886953 -5907515 -5936662 -5972018 -5854508 -5860749 -5864828 -5897561 -5954090 -5938696 -5945817
-430e945817L8932q0478O7746P1940o1433K2588J43373m345j18025M8796j16332K32476
$$ -5945817 -5906885 -5987363 -5919617 -5847677 -5909110 -5886522 -5743149 -5747494 -5865519 -5816723 -5933055 -5700579
-442e700579k39949R3356M0576K2838j30112N2687j07025J96590j12337q5182p878R9437
$$ -5700579 -5940528 -5847172 -5806596 -5783758 -5913870 -5861183 -5968208 -5771618 -5883955 -5969137 -5977015 -5877578
-454e877578J48397j66462M7664M1267m7529J3035q5569J16529o9197m685J51973j13095
$$ -5877578 -5729181 -5895643 -5847979 -5806712 -5854241 -5841206 -5926775 -5810246 -5879443 -5884128 -5732155 -5845250
-466e845250m2095j35345J57456K7694j32584Q6849J6671K7067p2674p2418M7371N0320
$$ -5845250 -5887345 -6022690 -5865234 -5837540 -5970124 -5883275 -5866604 -5839537 -5912211 -5984629 -5937258 -5886938
-478e886938n7440Q2139M2361j29701l2047M0914m0232q0052J64652j11849J64406r5181
$$ -5886938 -5944378 -5862239 -5819878 -5949579 -5981626 -5940712 -5980944 -6060996 -5896344 -6008193 -5843787 -5938968
-490e938968L401N2831j02564k29N408Q5133r6044J43137r5252N2376k1885K3360m9038
$$ -5938968 -5935567 -5882736 -5985300 -5985529 -5980121 -5894988 -5991032 -5847895 -5943147 -5890771 -5912656 -5889296 -5938334
-503e938334P684K9313J08705n0341P5575r3128N83L7787O5323j06083j35374O6987P4586
$$ -5938334 -5930650 -5901337 -5792632 -5842973 -5767398 -5860526 -5859943 -5822156 -5756833 -5862916 -5998290 -5931303 -5856717
-516e856717O0051j58804J7729O5154q6829O5472p4673J66855p3852k1278P2294j13384
$$ -5856717 -5796666 -5955470 -5937741 -5872587 -5959416 -5893944 -5968617 -5801762 -5875614 -5896892 -5824598 -5937982
-528e937982p9910O7653Q7813L7486l9227J34341j33989O1260J4833J03145j85332M4846
$$ -5937982 -6017892 -5950239 -5862426 -5824940 -5864167 -5729826 -5863815 -5802555 -5787722 -5684577 -5869909 -5825063
-540e825063P4583j89101M0711j07420P6247Q501M9893M9684j62225q4851J04440N5612
$$ -5825063 -5750480 -5939581 -5898870 -6006290 -5930043 -5921542 -5871649 -5821965 -5984190 -6069041 -5964601 -5908989
-552e908989m9420J12154o3405r68n7294J26984o8211o630q246p3332q0597M1784K4264
$$ -5908989 -5958409 -5846255 -5909660 -5910628 -5967922 -5840938 -5909149 -5915779 -5924025 -5997357 -6077954 -6036170 -6011906
-565f011906J13428j5197p221J1517l0785l4040l9298M7160r2882N4243l5697k974P7883
$$ -6011906 -5898478 -5913675 -5920896 -5909379 -5940164 -5974204 -6013502 -5966342 -6059224 -6004981 -6040678 -6043652 -5965769
-578e965769j20437J9554K54157j18199j12158o746l3952l9099Q5010n7181J7551L3181
$$ -5965769 -6086206 -6066652 -5812495 -5930694 -6042852 -6049598 -6083550 -6122649 -6037639 -6094820 -6077269 -6044088
-590f044088Q7566k14274J19298R5571N7431J68386j97247q2754k4751K07096k8713J9017
$$ -6044088 -5956522 -6170796 -6051498 -5955927 -5898496 -5730110 -5927357 -6010111 -6034862 -5827766 -5856479 -5837462
-602e837462o7900J4329L0074j4670p9017K4724r2598J2599k3991Q457j34545K64557
$$ -5837462 -5905362 -5891033 -5860959 -5875629 -5954646 -5929922 -6022520 -6009921 -6033912 -6025455 -6160000 -5895443
-614e895443L74607l26697j5167p6649J10317q869k1967l11683k39233K79857J79129O3652
$$ -5895443 -5520836 -5847533 -5862700 -5939349 -5829032 -5837901 -5859868 -6171551 -6410784 -6130927 -5951798 -5888146
-626e888146L2806k14614J58596j0357o4787N1175P7451K9817n2914j25165Q3928j05258
$$ -5888146 -5855340 -6069954 -5911358 -5921715 -5986502 -5935327 -5857876 -5828059 -5880973 -6006138 -5922210 -6027468
-638f027468j83280J03452J37896l3234K08155k55963J53067N0010K7812M76243j24262
$$ -6027468 -6210748 -6107296 -5969400 -6002634 -5794479 -6050442 -5897375 -5847365 -5819553 -5343310 -5467572
-649e467572r48921K39758N9141J02740k1495L9163P1607j9541J20939Q431O3086j64594
$$ -5467572 -6416493 -6176735 -6117594 -6014854 -6036349 -5997186 -5925579 -5945120 -5824181 -5815750 -5752664 -5917258
-661e917258n982J42422j12014M8430j07459N692N714j54952P5076M3888r622J06826p8132
$$ -5917258 -5923240 -5780818 -5892832 -5844402 -5951861 -5946169 -5940455 -6095407 -6020331 -5976443 -5986065 -5879239 -5957371
-674e957371O1539l7568p6624M3322O055r5481P256J1589r9409J05786o0570K19790j87082
$$ -5957371 -5895832 -5933400 -6010024 -5966702 -5960647 -6056128 -6048872 -6037283 -6136692 -6030906 -6091476 -5871686 -6058768
-687f058768l5585M1809N7581N2618q0441j16334N4692r310J207Q6514P900N9768M7275
$$ -6058768 -6094353 -6052544 -5994963 -5942345 -6022786 -6139120 -6084428 -6093738 -6092531 -6006017 -5998117 -5938349 -5891074
-700e891074m7687M6239m0214O4244p2973k27087R9225J43438o59j41641L4485M9188r1353
$$ -5891074 -5938761 -5892522 -5932736 -5868492 -5941465 -6168552 -6069327 -5925889 -5926548 -6068189 -6033704 -5984516 -6075869
-713f075869K02428J8697j28413L5204m4785r19q2117J92578q3544J8167L8904j12698
$$ -6075869 -5873441 -5854744 -5983157 -5947953 -5992738 -5993657 -6075774 -5883196 -5966740 -5948573 -5909669 -6022367
-725f022367J49706p6750j09525K9673m9417j9706J6778R7609N9263J2259K12195k04097
$$ -6022367 -5872661 -5949411 -6058936 -6029263 -6078680 -6098386 -6081608 -5983999 -5924736 -5912477 -5700282 -5904379
-737e904379l4984o2869P7679Q2042j66890Q4737j3671O8208M9899j50029R0566m3234
$$ -5904379 -5939363 -6002232 -5924553 -5842511 -6009401 -5924664 -5938335 -5870127 -5820228 -5970257 -5879691 -5922925
-749e922925k3121L5574J02782j74007J46984J2463J54818j94280j10127J92321j30899
$$ -5922925 -5946046 -5910472 -5807690 -5981697 -5834713 -5822250 -5667432 -5861712 -5971839 -5779518 -5910417
-760e910417j39789J09294j34181k0814J08858K1354n0614J22751k8892j17716J02202
$$ -5910417 -6050206 -5940912 -6075093 -6095907 -5987049 -5965695 -6016309 -5893558 -5922450 -6040166 -5937964
-771e937964L4831P239J44439j32432p4641L5059j07229M1742M262l466j38619O0126
$$ -5937964 -5903133 -5895894 -5751455 -5883887 -5958528 -5923469 -6030698 -5988956 -5984694 -5988160 -6126779 -6066653
-783f066653J13811P5710l5512l2359J5491q0J5788R4785o8831l0721J54233m3120j61837
$$ -6066653 -5952842 -5877132 -5912644 -5945003 -5929512 -5929592 -5913804 -5819019 -5887850 -5918571 -5764338 -5807458 -5969295
-796e969295O6750l2429k6891j8479M7363m1894K2555r735O9624n9815k8997J71532l7421
$$ -5969295 -5902545 -5934974 -5961865 -5980344 -5932981 -5974875 -5952320 -5962055 -5892431 -5952246 -5981243 -5809711 -5847132
-809e847132o8045J1200L2389R0035J900o1119l7286k9369m8079N3881j26199J01385R8210
$$ -5847132 -5915177 -5903977 -5871588 -5781553 -5779653 -5840772 -5878058 -5907427 -5955506 -5901625 -6027824 -5926439 -5828229
-822e828229r1536k5749K052J6405o8833J44492n39j37984K8019J34081j16286q9302M739
$$ -5828229 -5919765 -5945514 -5943462 -5927057 -5995890 -5851398 -5851937 -5989921 -5961902 -5827821 -5944107 -6033409 -6028670
-835f028670J61282j2498j45937P7317j87179K5200J01626K3637m7428J3160m5061m7831
$$ -6028670 -5867388 -5879886 -6025823 -5948506 -6135685 -6110485 -6008859 -5985222 -6032650 -6019490 -6064551 -6112382
-847f112382L3859l9840O3679J30822J0796M3859j74947j650j8369r117n5546N5642J03673
$$ -6112382 -6078523 -6118363 -6054684 -5923862 -5913066 -5869207 -6044154 -6045804 -6064173 -6073290 -6128836 -6073194 -5969521
-860e969521o3101L3376r9928L4491q5237Q6390l1218n7057j3713J31090J9516M2482k0460
$$ -5969521 -6032622 -5999246 -6099174 -6064683 -6149920 -6063530 -6094748 -6151805 -6165518 -6034428 -6014912 -5972430 -5992890
-873e992890j570J0900j45529K27712o1343K821M099j18893Q6447o3612j0122R3700P2170
$$ -5992890 -5994460 -5983560 -6129089 -5901377 -5962720 -5959899 -5955800 -6074693 -5988246 -6051858 -6061980 -5968280 -5896110
-886e896110q4739m1544K9363o5134l5473N3864J0586J00700j36188L08672j48239m7955
$$ -5896110 -5980849 -6022393 -5993030 -6058164 -6093637 -6039773 -6029187 -5928487 -6064675 -5756003 -5904242 -5952197
-898e952197n6707J26220m34095K24541j51020Q3385L7623J18895J0778p9355j1762o8726
$$ -5952197 -6008904 -5882684 -6316779 -6092238 -6243258 -6159873 -6122250 -6003355 -5992577 -6071932 -6083694 -6152420
-910f152420j3767L8897P4383r8592J22697k1238p8343Q1086r9592O0385j0610J44l8595
$$ -6152420 -6166187 -6127290 -6052907 -6151499 -6028802 -6050040 -6128383 -6047297 -6146889 -6086504 -6097114 -6096970 -6135565
-923f135565N5776J8592j04412J84403j5352k612l9961o1466Q4335m7036J52895Q8648
$$ -6135565 -6079789 -6061197 -6165609 -5981206 -5996558 -5999170 -6039131 -6100597 -6016262 -6063298 -5910403 -5821755
-935e821755j91669j20253J33466k1758l0361n1705J11877L8458n0830J6451k763o051
$$ -5821755 -6013424 -6133677 -6000211 -6021969 -6052330 -6104035 -5992158 -5953700 -6004530 -5988079 -5990842 -5996893
-947e996893k5698P7512j89751J27984j359r2100k2049n4033J52844L8673N2353k9691
$$ -5996893 -6022591 -5945079 -6134830 -6006846 -6008205 -6100305 -6122354 -6176387 -6023543 -5984870 -5932517 -5962208
-959e962208J44047j70364k3177J03526m0302L5303o7291n7866J0780N1660m1114k9367
$$ -5962208 -5818161 -5988525 -6011702 -5908176 -5948478 -5913175 -5980466 -6038332 -6027552 -5975892 -6017006 -6046373
-971f046373j5952j6907O1523n3148L5229J16022p2117O7027j30094P1256R6538k2492
$$ -6046373 -6062325 -6079232 -6017709 -6070857 -6035628 -5919606 -5991723 -5924696 -6054790 -5983534 -5886996 -5909488
-983e909488j92423P7805j9451J55042K9114q6503j7707j49491l0787P5200J7601Q6529
$$ -5909488 -6101911 -6024106 -6043557 -5888515 -5859401 -5945904 -5963611 -6113102 -6143889 -6068689 -6051088 -5964559
-995e964559M9271k7041l5211q1521J5513M5420m496n8473L8510l2365Q9699j23718M9166
$$ -5964559 -5915288 -5942329 -5977540 -6059061 -6043548 -5998128 -6002624 -6061097 -6022587 -6054952 -5965253 -6088971 -6039805
-1008f039805j97700o0069M16639m1550m6874n663R3315Q4612j79014k20551K06931L2447
$$ -6039805 -6237505 -6297574 -5880935 -5922485 -5969359 -5975022 -5881707 -5797095 -5976109 -6196660 -5989729 -5957282
-1020e957282m2323J12728j12478O6252J5475L8595j48742J50253j02377L7415o3880L4693
$$ -5957282 -5999605 -5886877 -5999355 -5933103 -5917628 -5879033 -6027775 -5877522 -5979899 -5942484 -6006364 -5971671
-1032e971671J22894j26839K3214o5340J27896K3910M2233K634k33179N7650o4352R0653
$$ -5971671 -5848777 -5975616 -5952402 -6017742 -5889846 -5865936 -5823703 -5821069 -6054248 -5996598 -6060950 -5970297
-1044e970297j50665R4009J84954N3328j54493k3333M5618n9493p0608N8999J2335l5451
$$ -5970297 -6120962 -6026953 -5841999 -5788671 -5943164 -5966497 -5920879 -5980372 -6050980 -5991981 -5979646 -6015097
-1056f015097n4998p6290k8413K69611M2764m1423J10781o4891j43722P5501j53579n6165
$$ -6015097 -6070095 -6146385 -6174798 -5905187 -5862423 -5903846 -5793065 -5857956 -6001678 -5926177 -6079756 -6135921
-1068f135921J26333L8841j22914K2193N4633r745J18849N765n2067q6844j0171N4325
$$ -6135921 -6009588 -5970747 -6093661 -6071468 -6016835 -6026580 -5907731 -5901966 -5954033 -6040877 -6051048 -5996723
-1080e996723N0152j84402J22065j5640r490P3992m5610n7920P590J5979N9203N0554n5377
$$ -5996723 -5946571 -6130973 -6008908 -6024548 -6034038 -5960046 -6005656 -6063576 -6055986 -6040007 -5980804 -5930250 -5985627
-1093e985627N456J3126n7522j18820J23314N1256O0494j33041l4411J15025l9148k7421
$$ -5985627 -5980171 -5967045 -6024567 -6143387 -6020073 -5968817 -5908323 -6041364 -6075775 -5960750 -5999898 -6027319
-1105f027319j9097J63137o4554K6697j40691J7948j8426K2925r1092J11080r666L0582
$$ -6027319 -6046416 -5883279 -5947833 -5921136 -6061827 -6043879 -6062305 -6039380 -6130472 -6019392 -6029058 -5998476
-1117e998476M5912N5926p7288k1155K1852l5215m7987Q0733M4553j7728N7301K451p0763
$$ -5998476 -5952564 -5896638 -5973926 -5995081 -5973229 -6008444 -6056431 -5975698 -5931145 -5948873 -5891572 -5889121 -5959884
-1130e959884k8688k5826K8138q252J8583p841k7600J3479m1655N3608j3426n759K4593
$$ -5959884 -5988572 -6014398 -5986260 -5994512 -5975929 -5983770 -6011370 -5997891 -6039546 -5985938 -5999364 -6005123 -5980530
-1143e980530j972J40557j15837k8043N472n1956J59257j05607q5906J1767q87q105J34409
$$ -5980530 -5982502 -5841945 -5957782 -5985825 -5980353 -6032309 -5873052 -5978659 -6064565 -6052798 -6053685 -6061790 -5927381
-1156e927381O3014p1283j80152J22197j33847R1729k5369O5188p4282J5723m465J49448
$$ -5927381 -5864367 -5935650 -6115802 -5993605 -6127452 -6035723 -6061092 -5995904 -6070186 -6054463 -6058928 -5909480
-1168e909480R7838j05255m2326q6938J51316l3301l4519N8019q784k7796J655O6918
$$ -5909480 -5811642 -5916897 -5959223 -6046161 -5894845 -5928146 -5962665 -5904646 -5913430 -5941226 -5939571 -5872653
-1180e872653j58253L63207l65052K36730o4275j09312R3580j2991j0802K2158p7269n9700
$$ -5872653 -6030906 -5667699 -6032751 -5796021 -5860296 -5969608 -5876028 -5889019 -5899821 -5877663 -5954932 -6014632
-1192f014632M9077r0843J03912j35192R4568p5737R9853n6114K4714J3705K0758q394
$$ -6014632 -5965555 -6056398 -5952486 -6087678 -5993110 -6068847 -5968994 -6025108 -6000394 -5986689 -5965931 -5974325
-1204e974325k1074Q2032j16514o0283J24014k14379J12573o1364L8671K7957K8293q6841
$$ -5974325 -5995399 -5913367 -6029881 -6090164 -5966150 -6180529 -6067956 -6129320 -6090649 -6062692 -6034399 -6121240
-1216f121240O9349o3305R4656O8104o7977K5943r8959O5911L1004M3476j1074J0398o7007
$$ -6121240 -6051891 -6115196 -6020540 -5952436 -6020413 -5994470 -6093429 -6027518 -5996514 -5953038 -5964112 -5953714 -6020721
-1229f020721J57714j98297m2956J10368M6256n0161P4228j14603j7284k4509J71747q0542
$$ -6020721 -5863007 -6061304 -6104260 -5993892 -5947636 -5997797 -5923569 -6038172 -6055456 -6079965 -5908218 -5988760
-1241e988760j55943N6404m0625l0763R4968M8460o890J14225k8495m9436M0104j35794
$$ -5988760 -6144703 -6088299 -6128924 -6159687 -6064719 -6016259 -6023149 -5908924 -5937419 -5986855 -5946751 -6082545
-1253f082545o1398l5397K4397M92J09128l9971J19980P8005n9497p0681j15869J08617
$$ -6082545 -6143943 -6179340 -6154943 -6154451 -6045323 -6085294 -5965314 -5887309 -5946806 -6017487 -6133356 -6024739
-1265f024739l0229J7999J37523r4277k1109r164Q9844j28434N7555l0829k2599L806k4546
$$ -6024739 -6054968 -6036969 -5899446 -5993723 -6014832 -6023996 -5934152 -6062586 -6005031 -6035860 -6058459 -6054653 -6079199
-1278f079199p4482J36522o0503j0462Q3367P5625j67129O0037j03467J35511N3486O4081
$$ -6079199 -6153681 -6017159 -6077662 -6088124 -6004757 -5929132 -6096261 -6036224 -6139691 -6004180 -5950694 -5886613
-1290e886613l8784P3206L1606q7055q5706L9450N6973q2885n5865J5517R1991m392j12927
$$ -5886613 -5925397 -5852191 -5820585 -5907640 -5993346 -5953896 -5896923 -5979808 -6035673 -6020156 -5928165 -5932557 -6045484
-1303f045484q9515O8625p7726J67463m3246N0392j7432j91628J55766j81899J81585O1495
$$ -6045484 -6134999 -6066374 -6144100 -5976637 -6019883 -5969491 -5986923 -6178551 -6022785 -6204684 -6023099 -5961604
-1315e961604n0353Q2647M4562j19459L1332j19479P0166j34317J28815j13001K85484
$$ -5961604 -6011957 -5929310 -5884748 -6004207 -5972875 -6092354 -6022188 -6156505 -6027690 -6140691 -5855207
-1326e855207j83321J6644J52471m6292L1696n5470o0528m8480J24716J2667j7921J20638
$$ -5855207 -6038528 -6021884 -5869413 -5915705 -5884009 -5939479 -6000007 -6048487 -5923771 -5911104 -5929025 -5808387
-1338e808387n3375n5249p5252N5179j8517n9556J244M5589p6328K1105P6054L343r652
$$ -5808387 -5861762 -5917011 -5992263 -5937084 -5955601 -6015157 -6013913 -5968324 -6044652 -6023547 -5947493 -5944150 -5953802
-1351e953802k4655j11262J71696L9947j40726n6875M640Q6614o2243O883R2145J0928
$$ -5953802 -5978457 -6089719 -5918023 -5878076 -6018802 -6075677 -6071037 -5984423 -6046666 -6039783 -5947638 -5936710
-1363e936710k12225K33076O7955r8365j84703R8347j3228m2846P6970q1270j40614J36971
$$ -5936710 -6148935 -5915859 -5847904 -5946269 -6130972 -6032625 -6045853 -6088699 -6011729 -6092999 -6233613 -6096642
-1375f096642R1201L4908j77517K16637J27656k29715o8319L1530R675J3146p6518J26046
$$ -6096642 -6005441 -5970533 -6148050 -5931413 -5803757 -6033472 -6101791 -6070261 -6060586 -6047440 -6123958 -5997912
-1387e997912l393P5532j23346p9589l6667K31625r0434r9333J26654j7734J2161j5388
$$ -5997912 -6001305 -5925773 -6049119 -6128708 -6165375 -5933750 -6024184 -6123517 -5996863 -6014597 -6002436 -6017824
-1399f017824K27779r7914p6595n5715L8011J0362m1426q9578P4851K02204J09611k90685
$$ -6017824 -5790045 -5887959 -5964554 -6020269 -5982258 -5971896 -6013322 -6102900 -6028049 -5825845 -5716234 -6006919
-1411f006919p0619P4867P6116k7618N1423j24075n4807N3540M2566Q92J09010k3906n5714
$$ -6006919 -6077538 -6002671 -5926555 -5954173 -5902750 -6026825 -6081632 -6028092 -5985526 -5984634 -5875624 -5899530 -5955244
-1424e955244q2792K0320m7247l1112J39935j12000P2684p3267Q7437m3961J39673J15454
$$ -5955244 -6038036 -6017716 -6064963 -6096075 -5956140 -6068140 -5995456 -6068723 -5981286 -6025247 -5885574 -5770120
-1436e770120n06850J2407K36544L9026j17255Q516o6927P1651R3855n1102N3391J4236
$$ -5770120 -6276970 -6264563 -6028019 -5988993 -6106248 -6097732 -6164659 -6093008 -5999153 -6050255 -5996864 -5982628
-1448e982628m0202N2045l9507j07348J97541r0846k30400K95822J00348p3330m1863N9091
$$ -5982628 -6022830 -5970785 -6010292 -6117640 -5920099 -6010945 -6241345 -5945523 -5845175 -5918505 -5960368 -5901277
-1460e901277L0122j25968j8392J40050j34920R786M8571K4595m5497R4686L62351n45862
$$ -5901277 -5871155 -5997123 -6015515 -5875465 -6010385 -6000599 -5952028 -5927433 -5972930 -5878244 -5515893 -6061755
-1472f061755J4501M4563o5393k5432J72592n3753r8311N7340o4439J32643j345j54366
$$ -6061755 -6047254 -6002691 -6068084 -6093516 -5920924 -5974677 -6072988 -6015648 -6080087 -5947444 -5948789 -6103155
-1484f103155k61873M69371j6660o467o2332M6754j3249K3811q281p2451R4216r8652k6578
$$ -6103155 -6365028 -5895657 -5912317 -5918784 -5981116 -5934362 -5947611 -5923800 -5932081 -6004532 -5910316 -6008968 -6035546
-1497f035546M374P069O3715L3676L3974j00277k8091k2431j01115O320p300J69842J3126
$$ -6035546 -6031172 -6024103 -5960388 -5926712 -5892738 -5993015 -6021106 -6043537 -6144652 -6138332 -6145632 -5975790 -5962664
-1510e962664j974q5618L5526j2915J18680j57208m562N596o2233N6309L4122J10364j7910
$$ -5962664 -5964638 -6050256 -6014730 -6027645 -5908965 -6066173 -6070735 -6065139 -6127372 -6071063 -6036941 -5926577 -5944487
-1523e944487m256l4358r4364J19018m7638J4715o005m9062J6781r5545M5573O0839L08020
$$ -5944487 -5948743 -5983101 -6077465 -5958447 -6006085 -5991370 -5997375 -6046437 -6029656 -6125201 -6079628 -6018789 -5710769
-1536e710769l55467j85151K00254n6159k3215L3953Q4625j9277K54604l4429o6275j14756
$$ -5710769 -6066236 -6251387 -6051133 -6107292 -6130507 -6096554 -6011929 -6031206 -5776602 -5811031 -5877306 -5992062
-1548e992062J5204N1625j798j1919P1337P0198m55452J91032K5800j33876O3911J35598
$$ -5992062 -5976858 -5925233 -5927031 -5938950 -5867613 -5797415 -6252867 -6061835 -6036035 -6169911 -6106000 -5970402
-1560e970402N0076j7945p4108O3903N1236r3941M7782M1929r3899j17615M0570N4828
$$ -5970402 -5920326 -5938271 -6012379 -5948476 -5897240 -5991181 -5943399 -5901470 -5995369 -6112984 -6072414 -6017586
-1572f017586N6603r0933J95307q8426j32762P3005j15657Q5941p2820M2140K2613k3966
$$ -6017586 -5960983 -6051916 -5856609 -5945035 -6077797 -6004792 -6120449 -6034508 -6107328 -6065188 -6042575 -6066541
-1584f066541J09606j31017J07568J13786j26191O6443r8794J47264q0151L737L9231J7316
$$ -6066541 -5956935 -6087952 -5980384 -5866598 -5992789 -5926346 -6025140 -5877876 -5958027 -5954290 -5915059 -5897743
-1596e897743r7616J5593j08763j26411K29907j01988J10241q4324l1781q9502Q2851
$$ -5897743 -5995359 -5979766 -6088529 -6214940 -5985033 -6087021 -5976780 -6061104 -6092885 -6182387 -6099536
-1607f099536J32390N86432p05038K06646j76809J56948k1746m6643k9349N2541L9109
$$ -6099536 -5967146 -5380714 -6085752 -5879106 -6055915 -5898967 -5920713 -5967356 -5996705 -5944164 -5905055
-1618e905055j32001Q8492q0688J53684M2422q5073K8834n3678J33771k16575N5795P2739
$$ -5905055 -6037056 -5948564 -6029252 -5875568 -5833146 -5918219 -5889385 -5943063 -5809292 -6025867 -5970072 -5897333
-1630e897333o1353k0531q4250Q9024R6838p3872n8200J23354n8838J06331m7704Q3479
$$ -5897333 -5958686 -5979217 -6063467 -5974443 -5877605 -5951477 -6009677 -5886323 -5945161 -5838830 -5886534 -5803055
-1642e803055n1046j39105O0947o6036M7408l0711K7410k4930j5363k8203P8854j3036
$$ -5803055 -5854101 -5993206 -5932259 -5998295 -5950887 -5981598 -5954188 -5979118 -5994481 -6022684 -5943830 -5956866
-1654e956866L1285k33907n3251P3541O4374l0832N7554J6282J6503J89989p1154r4161
$$ -5956866 -5925581 -6159488 -6212739 -6139198 -6074824 -6105656 -6048102 -6031820 -6015317 -5825328 -5896482 -5990643
-1666e990643r4569K1256J2714J65404j22718p1810K56550j46108O536j21856K91493
$$ -5990643 -6085212 -6063956 -6051242 -5885838 -6008556 -6080366 -5823816 -5969924 -5963388 -6085244 -5793751
-1677e793751j29396k9938j7758R7031k01562Q9784n8432J3613K1784q7419J12469m160
$$ -5793751 -5923147 -5953085 -5970843 -5873812 -6075374 -5985590 -6044022 -6030409 -6008625 -6096044 -5983575 -5987735
-1689e987735j37860R0683L3157k2023J1077j58014K23197q820Q886j54618L6873P9462
$$ -5987735 -6125595 -6034912 -6001755 -6023778 -6012701 -6170715 -5947518 -5956338 -5947452 -6102070 -6065197 -5985735
-1701e985735k6577q0734J53969k124r0296Q5480m214j5319O2501l1315J8234j20377m1077
$$ -5985735 -6012312 -6093046 -5939077 -5941201 -6031497 -5946017 -5950231 -5965550 -5903049 -5934364 -5916130 -6036507 -6077584
-1714f077584l7038J50993j1059r0408N4846k0912n1870J4909N6240P3616r9183K7874
$$ -6077584 -6114622 -5963629 -5974688 -6065096 -6010250 -6031162 -6083032 -6068123 -6011883 -5938267 -6037450 -6009576
-1726f009576L0398m1770K0674n4692J5034j5362M0483l6419j4589K7499m443j5482J4317
$$ -6009576 -5979178 -6020948 -6000274 -6054966 -6039932 -6055294 -6014811 -6051230 -6065819 -6038320 -6042763 -6058245 -6043928
-1739f043928K4176p6800k4214R1161j3525J7596P0651j16814L7194P80J33080o4100m5364
$$ -6043928 -6019752 -6096552 -6120766 -6029605 -6043130 -6025534 -5954883 -6071697 -6034503 -6033723 -5900643 -5964743 -6010107
-1752f010107k829m2425k7222M0280R6137o8672j01873Q9816n3713Q1668K02934o3509
$$ -6010107 -6012936 -6055361 -6082583 -6042303 -5946166 -6014838 -6116711 -6026895 -6080608 -5998940 -5796006 -5859515
-1764e859515j29050m1366q927j49878J22052R7600K0261M0194j9037p5757n1213j3949
$$ -5859515 -5988565 -6029931 -6038858 -6188736 -6066684 -5969084 -5948823 -5908629 -5927666 -6003423 -6054636 -6068585
-1776f068585J14102j588r4564J48156q5376J13472n5185r4590l2190J31229j14450J6717
$$ -6068585 -5954483 -5956071 -6050635 -5902479 -5987855 -5874383 -5929568 -6024158 -6056348 -5925119 -6039569 -6022852
-1788f022852J12495L0343q0262j08779J04472O4720N3417l2165j19910r127O995M2733
$$ -6022852 -5910357 -5880014 -5960276 -6069055 -5964583 -5899863 -5846446 -5878611 -5998521 -6007648 -6000653 -5957920
-1800e957920o9708J8565M0978r7393M0178m0287M4909N9140q9257R3456j5784j69889
$$ -5957920 -6027628 -6009063 -5968085 -6065478 -6025300 -6065587 -6020678 -5961538 -6050795 -5957339 -5973123 -6143012
-1812f143012Q9627N0163p2711L001O0718J30640L4460j61867r4948R2988n8391L8830
$$ -6143012 -6053385 -6003222 -6075933 -6072932 -6012214 -5881574 -5847114 -6008981 -6103929 -6010941 -6069332 -6030502
-1824f030502Q8309q5738N0623r1692N859k3179K8917l7389L6062Q3638j94598N7442
$$ -6030502 -5942193 -6027931 -5977308 -6069000 -6063141 -6086320 -6057403 -6094792 -6058730 -5975092 -6169690 -6112248
-1836f112248J47127j326j35016j7783K6705L8943M5047k1236p3923N296n249L9942N5821
$$ -6112248 -5965121 -5966447 -6101463 -6119246 -6092541 -6053598 -6008551 -6029787 -6103710 -6098414 -6103663 -6063721 -6007900
-1849f007900k5144L8420M5683k02948n2051L21909n8660J83643k28282K0262q527N5509
$$ -6007900 -6033044 -5994624 -5948941 -6151889 -6203940 -5882031 -5940691 -5757048 -5985330 -5965068 -5973595 -5918086
-1861e918086m2695j84665J15732P5104k2654J8442j7256m5313n0452R5404Q950M1953
$$ -5918086 -5960781 -6145446 -6029714 -5954610 -5977264 -5958822 -5976078 -6021391 -6071843 -5976439 -5967489 -5925536
-1873e925536k1031Q913k1794M2672k3186l7633l8828k0344p87M3859k6407p318K177
$$ -5925536 -5946567 -5937654 -5959448 -5916776 -5939962 -5977595 -6016423 -6036767 -6037554 -5993695 -6020102 -6027420 -6025243
-1886f025243J13482j0997o0379k8044O124J03768j8209l3591m0127j31231N6191P0921
$$ -6025243 -5911761 -5922758 -5983137 -6011181 -6005057 -5901289 -5919498 -5953089 -5993216 -6124447 -6068256 -5997335
-1898e997335l738K14244n8931j31193L8629K69291k25006m1256R3022j77732K080O1554
$$ -5997335 -6001073 -5786829 -5845760 -5976953 -5938324 -5669033 -5894039 -5935295 -5842273 -6020005 -6017925 -5956371
-1910e956371l9145J02073k5996K1970j04941N4260N200K0235J3674J97622j37640o2870
$$ -5956371 -5995516 -5893443 -5919439 -5897469 -6002410 -5948150 -5942950 -5922715 -5909041 -5711419 -5849059 -5911929
-1922e911929N6080j04067m15277K70753M3466J4457K7300O5203m3537q0067j2913N4459
$$ -5911929 -5855849 -5959916 -6375193 -6104440 -6060974 -6046517 -6019217 -5954014 -5997551 -6077618 -6090531 -6036072
-1934f036072L3768m291j873m6283j0830O1101p8028J23522j18037N636N6800m0889O8096
$$ -6036072 -6002304 -6006595 -6008468 -6054751 -6065581 -6004480 -6082508 -5958986 -6077023 -6071387 -6014587 -6055476 -5987380
-1947e987380j5321R628j5651L3610m1117k6115L6639J39871m1508K4196n2652l036J6188
$$ -5987380 -6002701 -5993073 -6008724 -5975114 -6016231 -6042346 -6005707 -5865836 -5907344 -5883148 -5935800 -5938836 -5922648
-1960e922648j50739K6418m6000L2463K6040K5778r4851P1770N288q6678j57289K00982
$$ -5922648 -6073387 -6046969 -6092969 -6060506 -6034466 -6008688 -6103539 -6031769 -6026481 -6113159 -6270448 -6069466
-1972f069466Q0202l7976K3300q3827K57434q8628o3392J9971N7927K0112j47062Q0547
$$ -6069466 -5989264 -6027240 -6003940 -6087767 -5830333 -5918961 -5982353 -5962382 -5904455 -5884343 -6031405 -5950858
-1984e950858j8459M7590n5881m0613n084K7511p30J05068r5819k8595l1846M5197P2698
$$ -5950858 -5969317 -5921727 -5977608 -6018221 -6023305 -5995794 -5996524 -5891456 -5987275 -6015870 -6047716 -6002519 -5929821
-1997e929821K0980n303J39417j11634j74901n7392p3300N1395J05861J20993j80939
$$ -5929821 -5908841 -5914144 -5774727 -5886361 -6061262 -6118654 -6191954 -6140559 -6034698 -5913705 -6094644
-2008f094644J27395n8150Q3300m4173J12277r0146m0658m99P9989n3476j02055o9978
$$ -6094644 -5967249 -6025399 -5942099 -5986272 -5873995 -5964141 -6004799 -6005298 -5925309 -5978785 -6080840 -6150818
-2020f150818L0519P0913J3864l2617P9895j06266R7967Q0555R385j59979J95060q098
$$ -6150818 -6120299 -6049386 -6035522 -6068139 -5988244 -6094510 -5996543 -5915988 -5906603 -6066582 -5871522 -5879620
-2032e879620j70285P2297R1457r9818j24178J03062K2691r5087M1160N3437j62745J94367
$$ -5879620 -6049905 -5977608 -5886151 -5985969 -6110147 -6007085 -5984394 -6079481 -6038321 -5984884 -6147629 -5953262
-2044e953262q343j36703q2501L8957J64081M1919k7210O6488J52074q2315j53955O9746
$$ -5953262 -5961605 -6098308 -6180809 -6141852 -5977771 -5935852 -5963062 -5896574 -5744500 -5826815 -5980770 -5911024
-2056e911024n9966O2042j18173j64075J63052M2559j7164P0156j2566Q4892M0156j32275
$$ -5911024 -5970990 -5908948 -6027121 -6191196 -6028144 -5985585 -6002749 -5932593 -5945159 -5860267 -5820111 -5952386
-2068e952386n6n0437o5640J22784J6282K4841K4063M5734m4356L2702k9808K2232j44707
$$ -5952386 -5952442 -6002879 -6068519 -5945735 -5929453 -5904612 -5880549 -5834815 -5879171 -5846469 -5876277 -5854045 -5998752
-2081e998752P4195J49275j26830o661N0750l5440k3066r499L7142k0139L8050j80623
$$ -5998752 -5924557 -5775282 -5902112 -5908773 -5858023 -5893463 -5916529 -5926028 -5888886 -5909025 -5870975 -6051598
-2093f051598O1059N1252n1567M4417Q8952q0197J85685j27392q6672L98r7740K49339
$$ -6051598 -5990539 -5939287 -5990854 -5946437 -5857485 -5937682 -5751997 -5879389 -5966061 -5965663 -6063403 -5814064
-2105e814064m1274j22280M5242q0636J87455k6380j35895R6972M5639n7529M8306o3208
$$ -5814064 -5855338 -5977618 -5932376 -6013012 -5825557 -5851937 -5987832 -5890860 -5845221 -5902750 -5854444 -5917652
-2117e917652L7700o2288M7676j6697J1643k2746K2847K174r9948K0777N8986n7310J9816
$$ -5917652 -5879952 -5942240 -5894564 -5911261 -5899618 -5922364 -5899517 -5897343 -5997291 -5976514 -5917528 -5974838 -5955022
-2130e955022l7484K4878J7096O5725m2232K2727n2316J42947m3350o2131o9406l8663
$$ -5955022 -5992506 -5967628 -5950532 -5884807 -5927039 -5904312 -5956628 -5813681 -5857031 -5919162 -5988568 -6027231
-2142f027231K3495r633O6275j588K7646m0295k8684J24163p4321n7158M4109N3794O3392
$$ -6027231 -6003736 -6013369 -5947094 -5948682 -5921036 -5961331 -5990015 -5865852 -5940173 -5997331 -5953222 -5899428 -5836036
-2155e836036k1714p8896J34595k07190J40742j18906O0742p1167Q2300J93773j27777
$$ -5836036 -5857750 -5936646 -5802051 -6009241 -5868499 -5987405 -5926663 -5997830 -5915530 -5721757 -5849534
-2166e849534j05958K3808j05418P3694P1462M6641k7223n4996N6090l2461l511k6330
$$ -5849534 -5955492 -5931684 -6037102 -5963408 -5891946 -5845305 -5872528 -5927524 -5871434 -5903895 -5907406 -5933736
-2178e933736l0049k6052J9477J12377K1398J28473J3260J7117j22242k2996k4956K28
$$ -5933736 -5963785 -5989837 -5970360 -5857983 -5836585 -5708112 -5694852 -5677735 -5799977 -5822973 -5847929 -5847701
-2190e847701o0818k922P5210q1293q4356N9539o2796J8960M2932J30849K2072N691m3723
$$ -5847701 -5908519 -5911441 -5836231 -5917524 -6001880 -5942341 -6005137 -5986177 -5943245 -5812396 -5790324 -5784633 -5828356
-2203e828356o0447m0836J4835n1396r0091O9518K2538N0604K23817k41351M1586J03416
$$ -5828356 -5888803 -5929639 -5914804 -5966200 -6056291 -5986773 -5964235 -5913631 -5689814 -5931165 -5889579 -5786163
-2215e786163p7574P710q1026J19076M1236N6273j43247r4811M8356P8755m8703o7513
$$ -5786163 -5863737 -5856027 -5937053 -5817977 -5776741 -5720468 -5863715 -5958526 -5910170 -5831415 -5880118 -5947631
-2227e947631l8072k4244J71689n6354Q923j26230L3371k9798j8666k1733j16146J64363
$$ -5947631 -5985703 -6009947 -5838258 -5894612 -5885689 -6011919 -5978548 -6008346 -6027012 -6048745 -6164891 -6000528
-2239f000528K4126q2962J56066Q871r616l077M5251R847l2743m5886q7662J02624j5802
$$ -6000528 -5976402 -6059364 -5903298 -5894427 -5904043 -5907120 -5861869 -5852022 -5884765 -5930651 -6018313 -5915689 -5931491
-2252e931491r4673l868J36642j20330o526J59707j37106n047J24167l2164n9164M4347
$$ -5931491 -6026164 -6030032 -5893390 -6013720 -6020246 -5860539 -5997645 -6002692 -5878525 -5910689 -5969853 -5925506
-2264e925506J5599j11756n6392R3193l256J84025j53143j34158J75559l126l093O9501
$$ -5925506 -5909907 -6021663 -6078055 -5984862 -5988118 -5804093 -5957236 -6091394 -5915835 -5918961 -5922054 -5852553
-2276e852553n637j75068J5748L560L9199j5250j4201R714P3286l4407Q5555j5863L8576
$$ -5852553 -5858190 -6033258 -6017510 -6013950 -5974751 -5990001 -6004202 -5994488 -5921202 -5955609 -5870054 -5885917 -5847341
-2289e847341j1589o5920p9284k0015J03896j22007J3198J25451l521J58565l82691Q0735
$$ -5847341 -5858930 -5924850 -6004134 -6024149 -5920253 -6042260 -6029062 -5903611 -5907132 -5748567 -6131258 -6050523
-2301f050523o1092M5235j401L9271p2375k9009J37059k0347J11676q8108p029P6568
$$ -6050523 -6111615 -6066380 -6067781 -6028510 -6100885 -6129894 -5992835 -6013182 -5901506 -5989614 -5996643 -5920075
-2313e920075J04105j4071p8656k2812j23317J40521J6616J8746K213m1861m633r5894
$$ -5920075 -5815970 -5830041 -5908697 -5931509 -6054826 -5914305 -5897689 -5878943 -5876730 -5918591 -5923224 -6019118
-2325f019118J80581k04118J11457j8083o1338R2620Q7373J9038j2428j11386j5172j89937
$$ -6019118 -5838537 -6042655 -5931198 -5949281 -6010619 -5917999 -5830626 -5811588 -5824016 -5935402 -5950574 -6140511
-2337f140511K73408j59261p9211J66041L1715k4809J0197q6911P3668O3415m0713J32706
$$ -6140511 -5867103 -6026364 -6105575 -5939534 -5907819 -5932628 -5922431 -6009342 -5935674 -5872259 -5912972 -5780266
-2349e780266p7214O749O6829m3569o1632q9627O7016J8336K4456o2570P3935j06549
$$ -5780266 -5857480 -5850731 -5783902 -5827471 -5889103 -5978730 -5911714 -5893378 -5868922 -5931492 -5857557 -5964106
-2361e964106J07973n6307R7074m144q7754p5207L3517K6874n1334l7175J76432o7208
$$ -5964106 -5856133 -5912440 -5815366 -5819510 -5907264 -5982471 -5948954 -5922080 -5973414 -6010589 -5834157 -5901365
-2373e901365p7980J11053k8277J3866j12571J39792n6128j01633J92211K1823k3698
$$ -5901365 -5979345 -5868292 -5896569 -5882703 -5995274 -5855482 -5911610 -6013243 -5821032 -5799209 -5822907
-2384e822907j94244L2116J32661p1596P570q8039n9814Q6821j3690r734n0849J97341
$$ -5822907 -6017151 -5985035 -5852374 -5923970 -5916400 -6004439 -6064253 -5977432 -5991122 -6000856 -6051705 -5854364
-2396e854364k8628j32235L9357o777m2343K7735J09746q2396L2444R063j1999k0920j2447
$$ -5854364 -5882992 -6015227 -5975870 -5982647 -6024990 -5997255 -5887509 -5969905 -5937461 -5928398 -5940397 -5961317 -5973764
-2409e973764L1985j65633K30004q8281r273N9224Q5101j30885J11703p7236j65979o5272
$$ -5973764 -5941779 -6107412 -5877408 -5965689 -5974962 -5915738 -5830637 -5961522 -5849819 -5927055 -6093034 -6158306
-2421f158306K08910q6226K9500n7981J69784J6027j970l6841p2146J1730j664J07440
$$ -6158306 -5949396 -6035622 -6006122 -6064103 -5894319 -5878292 -5880262 -5917103 -5989249 -5977519 -5979183 -5871743
-2433e871743k6530J0491J39385k70814m1865K4960O040J70231j61520R3669j05346m9992
$$ -5871743 -5898273 -5887782 -5748397 -6019211 -6061076 -6036116 -6030076 -5859845 -6021365 -5927696 -6033042 -6083034
-2445f083034N0093J57405P5424l5681n0907o1795J60785p6441M6677M082o2479k5518
$$ -6083034 -6032941 -5875536 -5800112 -5835793 -5886700 -5948495 -5787710 -5864151 -5817474 -5813392 -5875871 -5901389
-2457e901389p6544K8657L4240n2918Q394K9107J67093k1488j00951n1297J30281p7385
$$ -5901389 -5977933 -5949276 -5915036 -5967954 -5959560 -5930453 -5763360 -5784848 -5885799 -5937096 -5806815 -5884200
-2469e884200j0946j03284O8511L5824l4445M95p9584o7954j6178P6148K39018q9290
$$ -5884200 -5895146 -5998430 -5929919 -5894095 -5928540 -5928045 -6007629 -6075583 -6091761 -6015613 -5776595 -5865885
-2481e865885j46751r8675K44833N363j7391o962J3028J23240j38943m3212j38561K6812
$$ -5865885 -6012636 -6111311 -5866478 -5861115 -5878506 -5885468 -5872440 -5749200 -5888143 -5931355 -6069916 -6043104
-2493f043104R7299o8623Q4169J6576j13558M8375Q0794j30137Q6903J14484j08148P8563
$$ -6043104 -5945805 -6014428 -5930259 -5913683 -6027241 -5978866 -5898072 -6028209 -5941306 -5826822 -5934970 -5856407
-2505e856407o0734k6706j04861q9394J39545J11905N1499m4346j12021J31492m6260m4558
$$ -5856407 -5917141 -5943847 -6048708 -6138102 -5998557 -5886652 -5835153 -5879499 -5991520 -5860028 -5906288 -5950846
-2517e950846m0116k4183J04209R1276k9893n8854q3691k841r097R8911p8869P9540j1657
$$ -5950846 -5990962 -6015145 -5910936 -5819660 -5849553 -5908407 -5992098 -5994939 -6004036 -5905125 -5983994 -5904454 -5916111
-2530e916111R681O2841R921k4602q5273J01021K136q6560P2107L2791p6080N2087o5063
$$ -5916111 -5906430 -5843589 -5833668 -5858270 -5943543 -5842522 -5840386 -5926946 -5854839 -5822048 -5898128 -5846041 -5911104
-2543e911104m9004M4608k0233J17027n9938Q501p6990k9440J07443J15202j14307M1289
$$ -5911104 -5960108 -5915500 -5935733 -5818706 -5878644 -5870143 -5947133 -5976573 -5869130 -5753928 -5868235 -5826946
-2555e826946m1703j0011j07981N8120k4746J08305j66256J24060o0052O7940o9224M9241
$$ -5826946 -5868649 -5878660 -5986641 -5928521 -5953267 -5844962 -6011218 -5887158 -5947210 -5879270 -5948494 -5899253
-2567e899253M0059J6025L0926q5932m5993O8655N3505L689J56936k02128k19214R0470
$$ -5899253 -5859194 -5843169 -5812243 -5898175 -5944168 -5875513 -5822008 -5818319 -5661383 -5863511 -6082725 -5992255
-2579e992255L5902M0798r0778J24033j4920r2182K34682j86789o5365P7153k064L5661
$$ -5992255 -5956353 -5915555 -6006333 -5882300 -5897220 -5989402 -5754720 -5941509 -6006874 -5929721 -5931785 -5896124
-2591e896124m3291r4209n248q747p9449J85854m062R1359j52490K3116P1575k1186o0043
$$ -5896124 -5939415 -6033624 -6038872 -6047619 -6127068 -5941214 -5945276 -5853917 -6006407 -5983291 -5911716 -5932902 -5992945
-2604e992945K06843o9189p8634O9327o8664n2902j02320K28114j59146Q1383K059m8794
$$ -5992945 -5786102 -5855291 -5933925 -5864598 -5933262 -5986164 -6088484 -5860370 -6019516 -5938133 -5936074 -5984868
-2616e984868Q5560M2444j20216M6963R46r974J0084j4992o6941N7768j7724J8775J6837
$$ -5984868 -5899308 -5856864 -5977080 -5930117 -5929171 -5939145 -5929061 -5944053 -6010994 -5953226 -5970950 -5952175 -5935338
-2629e935338M8008k8519M6763r744M5888O110J7031p9315q9852Q3593k89315L34208p7384
$$ -5935338 -5887330 -5915849 -5869086 -5878830 -5832942 -5826832 -5809801 -5889116 -5978968 -5895375 -6184690 -5850482 -5927866
-2642e927866r1740P0244L6976j7361m830j2822N3847q0239L9744M2135K52811j54704
$$ -5927866 -6019606 -5949362 -5912386 -5929747 -5934577 -5947399 -5893552 -5973791 -5934047 -5891912 -5639101 -5793805
-2654e793805j3144k1528p2513k5620O3164p9496Q3234n4497n517P3721o6225j12827j2013
$$ -5793805 -5806949 -5828477 -5900990 -5926610 -5863446 -5942942 -5859708 -5914205 -5919722 -5846001 -5912226 -6025053 -6037066
-2667f037066j40479K61364j29369J65671R2096q3178k5514j24453N0930m6883Q8634j7270
$$ -6037066 -6177545 -5916181 -6045550 -5879879 -5787783 -5870961 -5896475 -6020928 -5969998 -6016881 -5928247 -5945517
-2679e945517Q5397p5091j5353L931K0188J02236o0606K0391k6671o9596p0574R8865L9615
$$ -5945517 -5860120 -5935211 -5950564 -5946633 -5926445 -5824209 -5884815 -5864424 -5891095 -5960691 -6031265 -5932400 -5892785
-2692e892785J36029j26653L4237n3160J0907O8459k11193M7944J03906j4398J48731k4320
$$ -5892785 -5756756 -5883409 -5849172 -5902332 -5891425 -5822966 -6034159 -5986215 -5882309 -5896707 -5747976 -5772296
-2704e772296m1464N3725j48708K0731o8954J9176m6521J16144l8417j16648L6235o5117
$$ -5772296 -5813760 -5760035 -5908743 -5888012 -5956966 -5937790 -5984311 -5868167 -5906584 -6023232 -5986997 -6052114
-2716f052114p8823K91694P9537n1947J32247M2613j67035j36083k0712J06262J8090m8809
$$ -6052114 -6130937 -5839243 -5759706 -5811653 -5679406 -5636793 -5803828 -5939911 -5960623 -5854361 -5836271 -5885080
-2728e885080K0747N410
$$ -5885080 -5864333 -5858923
-2730e858923  $$ checkpoint
##PAGE= N=2
##DATA TABLE=(X++(I..I)), XYDATA
13653e764879k8981k1730N0813J951L2761j11522J25395l0218N5947j756r2274R011j8044
$$ -5764879 -5793860 -5815590 -5764777 -5762826 -5730065 -5841587 -5716192 -5746410 -5690463 -5692219 -5784493 -5775482 -5793526
13640e793526r0726Q7266L0953j35108l1043J18342M9142L5054O9689m6146K9235K0741
$$ -5793526 -5884252 -5796986 -5766033 -5901141 -5932184 -5813842 -5764700 -5729646 -5659957 -5706103 -5676868 -5656127
13628e656127o0186j15207J88561q6130k7468m9336P2017J32461n6568l7733J38967k8999
$$ -5656127 -5716313 -5831520 -5642959 -5729089 -5756557 -5805893 -5733876 -5601415 -5657983 -5695716 -5556749 -5585748
13616e585748j2565o9190r2334o9206K8842Q4440Q9564K1257k085j03321J01723J8380k969
$$ -5585748 -5598313 -5667503 -5759837 -5829043 -5800201 -5715761 -5626197 -5604940 -5607025 -5710346 -5608623 -5590243 -5593212
13603e593212m6551o5776J35887L0864q2153K5052q9868q412K7736R1866o0467Q9737
$$ -5593212 -5639763 -5705539 -5569652 -5538788 -5620941 -5595889 -5685757 -5694169 -5666433 -5574567 -5635034 -5545297
13591e545297J92641k42296k4463J33075k04638O5287q627R1339n4046o4754J86748n3511
$$ -5545297 -5352656 -5594952 -5619415 -5486340 -5690978 -5625691 -5634318 -5542979 -5597025 -5661779 -5475031 -5528542
13579e528542o0498n558m8923P0641J35729M0041j2573j01571L1973N2403j6296p1186L682
$$ -5528542 -5589040 -5594598 -5643521 -5572880 -5437151 -5397110 -5409683 -5511254 -5479281 -5426878 -5443174 -5514360 -5510678
13566e510678k6612K1872j20597P8029K28561P676j27807O5568J2312j69413P7976j7979
$$ -5510678 -5537290 -5515418 -5636015 -5557986 -5329425 -5321749 -5449556 -5383988 -5371676 -5541089 -5463113 -5481092
13554e481092n4809O9599j1196r3604J46349p1795Q2604k6876m2980K7227Q5290l816q9497
$$ -5481092 -5535901 -5466302 -5477498 -5571102 -5424753 -5496548 -5413944 -5440820 -5483800 -5456573 -5371283 -5375099 -5464596
13541e464596j16501L2540J80446k2454m7328K2681l3890O5536n6160j8425J03322Q816
$$ -5464596 -5581097 -5548557 -5368111 -5390565 -5437893 -5415212 -5449102 -5383566 -5439726 -5458151 -5354829 -5346013
13529e346013J3209m7409K7486O6244j21846r3124J37591l577J4373J90892M6606m75924
$$ -5346013 -5332804 -5380213 -5352727 -5286483 -5408329 -5501453 -5363862 -5367439 -5353066 -5162174 -5115568 -5591492
13517e591492N0468J45771j08721N3494R0094j4118J25154l3723K3949l7585k1328Q8978
$$ -5591492 -5541024 -5395253 -5503974 -5450480 -5360386 -5374504 -5249350 -5283073 -5259124 -5296709 -5318037 -5229059
13505e229059j04275m4118Q3502l8045o8495M3973k6489J29472k6039j4190j14680J4924
$$ -5229059 -5333334 -5377452 -5293950 -5331995 -5400490 -5356517 -5383006 -5253534 -5279573 -5293763 -5408443 -5393519
13493e393519J10680J29375k3046j27704m2423J67261N7644r5437j01067J32703j1213
$$ -5393519 -5282839 -5153464 -5176510 -5304214 -5346637 -5179376 -5121732 -5217169 -5318236 -5185533 -5196746
13482e196746p7203J31784R9987j16797n1808M2761P2321Q4632j02988j7687j32482L853
$$ -5196746 -5273949 -5142165 -5042178 -5158975 -5210783 -5168022 -5095701 -5011069 -5114057 -5131744 -5264226 -5260373
13470e260373M229j01377J55468J5992J4020q3472J220J02595Q784J7979m577n5949J09292
$$ -5260373 -5256144 -5357521 -5202053 -5186061 -5172041 -5255513 -5254293 -5151698 -5142914 -5124935 -5129512 -5185461 -5076169
13457e076169l0213P1390j5750n1495P4456M8835j63247Q8501l8886j5463m8456R2857
$$ -5076169 -5106382 -5034992 -5050742 -5102237 -5027781 -4978946 -5142193 -5053692 -5092578 -5108041 -5156497 -5063640
13445e063640q5211K6936J67023j62568J22238R317J2332q2600n6550Q8191J6463l4204
$$ -5063640 -5148851 -5121915 -4954892 -5117460 -4995222 -4985905 -4973573 -5056173 -5112723 -5024532 -5008069 -5042273
13433e042273o9731j30088K24457n4442n8780J07051R1654l6637M1574K626j73786K35052
$$ -5042273 -5112004 -5242092 -5017635 -5072077 -5130857 -5023806 -4932152 -4968789 -4927215 -4924589 -5098375 -4863323
13421d863323j40946J02479N9223o4954r1294q8192r776N2090J50356o6997M8791j35254
$$ -4863323 -5004269 -4901790 -4842567 -4907521 -4998815 -5087007 -5096783 -5044693 -4894337 -4961334 -4912543 -5047797
13409e047797J07331q1831j750j18214J57328q0702M3322r3199Q9088J06682j7966p284
$$ -5047797 -4940466 -5022297 -5024047 -5142261 -4984933 -5065635 -5022313 -5115512 -5026424 -4919742 -4937708 -4944992
13397d944992P3839r8350P3961o5453j24082K25212j6580l4282J6645N4057M8420J97390
$$ -4944992 -4871153 -4969503 -4895542 -4960995 -5085077 -4859865 -4876445 -4910727 -4894082 -4840025 -4791605 -4594215
13385d594215j70815k29261O6909j19050m03M1518M5073Q7779k0008J07120K9750n0272
$$ -4594215 -4765030 -4994291 -4927382 -5046432 -5046835 -5005317 -4960244 -4872465 -4892473 -4785353 -4755603 -4805875
13373d805875o4047J24366l1824K8016j29513J07381J6740Q7755q4069m5085n166p0399
$$ -4805875 -4869922 -4745556 -4777380 -4749364 -4878877 -4771496 -4754756 -4667001 -4751070 -4796155 -4801321 -4871720
13361d871720N0878j58667n835J37238M4431r7958J50392q5911o498J50600r8089k4093
$$ -4871720 -4820842 -4979509 -4985344 -4848106 -4803675 -4901633 -4751241 -4837152 -4843650 -4693050 -4791139 -4815232
13349d815232p702l1902K2257k618O5587m9955L854K4757p0607Q5919K6515j0507L4055
$$ -4815232 -4822934 -4854836 -4832579 -4835197 -4769610 -4819565 -4815711 -4790954 -4861561 -4775642 -4749127 -4759634 -4725579
13336d725579L7670O4270N2734k05220l3148N5504j14327R5522R7996p8189O1477j16017
$$ -4725579 -4687909 -4623639 -4570905 -4776125 -4809273 -4753769 -4868096 -4772574 -4674578 -4752767 -4691290 -4807307
13324d807307J211J04464n2647j0665l2726J0403J65643j10585j6244K9626K9689o2289
$$ -4807307 -4806096 -4701632 -4754279 -4764944 -4797670 -4787267 -4621624 -4732209 -4748453 -4718827 -4689138 -4751427
13312d751427j7703K08176L5845P7970j49929j24526k7777n2984J97491q2407j39093
$$ -4751427 -4769130 -4560954 -4525109 -4447139 -4597068 -4721594 -4749371 -4802355 -4604864 -4687271 -4826364
13301d826364J90033K0846r3979j60669J64689J39359j16729R0232l9681q6180J13318
$$ -4826364 -4636331 -4615485 -4709464 -4870133 -4705444 -4566085 -4682814 -4592582 -4632263 -4718443 -4605125
13290d605125q1590J08186r9722P3709N2208Q798j29073J00972n4589l919l7299L0194
$$ -4605125 -4686715 -4578529 -4678251 -4604542 -4552334 -4543536 -4672609 -4571637 -4626226 -4630145 -4667444 -4637250
13278d637250P3746O8082p2071q1145J27721Q5584l41400J13733N8926R4490p5006J26491
$$ -4637250 -4563504 -4495422 -4567493 -4648638 -4520917 -4435333 -4776733 -4663000 -4604074 -4509584 -4584590 -4458099
13266d458099j08577j1518k18792J73524q122O5052M6692O8227p5767o1503Q4826N2686
$$ -4458099 -4566676 -4578194 -4796986 -4623462 -4631584 -4566532 -4519840 -4451613 -4527380 -4588883 -4504057 -4451371
13254d451371k6335p2449l8529J616O042J55245j67483J99243r6806J9663m3095Q0073
$$ -4451371 -4477706 -4550155 -4588684 -4587068 -4581026 -4425781 -4593264 -4394021 -4490827 -4471164 -4514259 -4434186
13242d434186j07170p3278J86974p6021J74197q9040j50261L1655k3989N1999J11816p762
$$ -4434186 -4541356 -4614634 -4427660 -4503681 -4329484 -4418524 -4568785 -4537130 -4561119 -4509120 -4397304 -4405066
13230d405066l9025q3077M030L4178o6764J16957r8605j7997M56437k69923L7283r3823
$$ -4405066 -4444091 -4527168 -4523138 -4488960 -4555724 -4438767 -4537372 -4555369 -4098932 -4368855 -4331572 -4425395
13218d425395N6713m2940k5242q1645J48003O8652k6342k2056j5901J10914k645o7731
$$ -4425395 -4368682 -4411622 -4436864 -4518509 -4370506 -4301854 -4328196 -4350252 -4366153 -4255239 -4257884 -4325615
13206d325615n4929q9087J60632r7277M641n0989j4538j9293J4613N2821Q0744L1480k5013
$$ -4325615 -4380544 -4469631 -4308999 -4406276 -4401635 -4452624 -4467162 -4486455 -4471842 -4419021 -4338277 -4306797 -4331810
13193d331810J0245o6981R7148j1668k1029J6758O0711N080N514Q3580l4765K548p6562
$$ -4331810 -4321565 -4388546 -4291398 -4303066 -4324095 -4307337 -4246626 -4241546 -4236032 -4152452 -4187217 -4184669 -4261231
13180d261231m7730P4890K602j08785J10568q1086O7075M1575j26087J1511K7127Q116
$$ -4261231 -4308961 -4234071 -4231469 -4340254 -4229686 -4310772 -4243697 -4202122 -4328209 -4316698 -4289571 -4281455
13168d281455M6884j4326m2196J0247M238j52506R8587J65517j34591j769q2563P1563
$$ -4281455 -4234571 -4248897 -4291093 -4280846 -4276608 -4429114 -4330527 -4165010 -4299601 -4301370 -4383933 -4312370
13156d312370J27191q0635k3080O045J13144l3077M4521p0461K0943N0768j24537M5909
$$ -4312370 -4185179 -4265814 -4288894 -4282849 -4169705 -4202782 -4158261 -4228722 -4207779 -4157011 -4281548 -4235639
13144d235639j0235r3379Q7300J28811k21761J45127j13098K7764o1868R2888k0691O0155
$$ -4235639 -4245874 -4339253 -4251953 -4123142 -4344903 -4199776 -4312874 -4285110 -4346978 -4254090 -4274781 -4214626
13132d214626k2953m8917P1701M32L7267M5553j02022J12410q4465J71362k11069P9903
$$ -4214626 -4237579 -4286496 -4214795 -4214363 -4177096 -4131543 -4233565 -4121155 -4205620 -4034258 -4245327 -4165424
13120d165424l756j07921K37737m7943p0035q6864k5218N7263j40380J26047n2037J36470
$$ -4165424 -4169180 -4277101 -4039364 -4087307 -4157342 -4244206 -4269424 -4212161 -4352541 -4226494 -4278531 -4142061
13108d142061j3750O406N4993n0352K7513o6155J79395l0065j15458J23329j70053N6722
$$ -4142061 -4155811 -4149405 -4094412 -4144764 -4117251 -4183406 -4004011 -4034076 -4149534 -4026205 -4196258 -4139536
13096d139536J1295J10914j46879O4330M5104k7081j0413P9128l8207n889m7252N9182
$$ -4139536 -4128241 -4017327 -4164206 -4099876 -4054772 -4081853 -4092266 -4013138 -4051345 -4057234 -4104486 -4045304
13084d045304j30064J54704o5686k36844K41790P2276j8767k6142O1126j31577L402J25019
$$ -4045304 -4175368 -4020664 -4086350 -4323194 -4081404 -4009128 -4027895 -4054037 -3992911 -4124488 -4121086 -3996067
13072c996067k8438O7709K4599n2861l2465L3481q0171M8856N4078l5657n6559O8230
$$ -3996067 -4024505 -3956796 -3932197 -3985058 -4017523 -3984042 -4064213 -4015357 -3961279 -3996936 -4053495 -3985265
13060c985265j34837Q5102J31580n5710k8875n7332P8806j2186N6365j34001o599K2081
$$ -3985265 -4120102 -4035000 -3903420 -3959130 -3988005 -4045337 -3966531 -3978717 -3922352 -4056353 -4062952 -4040871
13048d040871P2202J04286j10286O1457m3973j2227P1657j12150J51556j33416Q110J11503
$$ -4040871 -3968669 -3864383 -3974669 -3913212 -3957185 -3969412 -3897755 -4009905 -3858349 -3991765 -3983655 -3872152
13036c872152j44915J76003N3789q8913k09664J44619N0946K0319k07098J21104m5967
$$ -3872152 -4017067 -3841064 -3787275 -3876188 -4085852 -3941233 -3890287 -3869968 -4077066 -3955962 -4001929
13025d001929J17918Q9951q9718k9731n0682k0176K3272j071p9919P8670L9908r471J2713
$$ -4001929 -3884011 -3794060 -3883778 -3913509 -3964191 -3984367 -3961095 -3962166 -4042085 -3963415 -3923507 -3932978 -3920265
13012c920265Q7740j53387K70959p2617l4171J2605k427M8713o9789L4895J2211j56948
$$ -3920265 -3832525 -3985912 -3714953 -3787570 -3821741 -3809136 -3811563 -3762850 -3832639 -3797744 -3785533 -3942481
13000c942481Q5540N2940k1033M536k7411j78973m5326J45995L5314J5329p2825Q8893
$$ -3942481 -3856941 -3804001 -3825034 -3820498 -3847909 -4026882 -4072208 -3926213 -3890899 -3875570 -3948395 -3859502
12988c859502r2736M5361j6492J2936O7150K24p9331J65350P868q696k7596O9394k26263
$$ -3859502 -3952238 -3906877 -3923369 -3910433 -3843283 -3843059 -3922390 -3757040 -3749172 -3757868 -3785464 -3716070 -3942333
12975c942333P1577M5316j8314L9667R4641m4871Q3593j5531j47414r1660K1940J55138
$$ -3942333 -3870756 -3825440 -3843754 -3804087 -3709446 -3754317 -3670724 -3686255 -3833669 -3925329 -3903389 -3748251
12963c748251j345J5971l6753k203r3706J16267M9884K7795r1827O3386J269k2958o6757
$$ -3748251 -3749596 -3733625 -3770378 -3772581 -3866287 -3750020 -3700136 -3672341 -3764168 -3700782 -3699513 -3722471 -3789228
12950c789228Q303J08660M8506n752r7063n8652q3790M6416K2177J36406r3122j5091
$$ -3789228 -3780925 -3672265 -3623759 -3629511 -3726574 -3785226 -3869016 -3822600 -3800423 -3664017 -3757139 -3772230
12938c772230J11174l6730K6126r3974N9508O9201k5082k9361M6993o4000r3084R989J6546
$$ -3772230 -3661056 -3697786 -3671660 -3765634 -3706126 -3636925 -3662007 -3691368 -3644375 -3708375 -3801459 -3791470 -3774924
12925c774924N2241K4690j00508K25559O4042m3293j34443M1366m0836J32019j13894N0257
$$ -3774924 -3722683 -3697993 -3798501 -3572942 -3508900 -3552193 -3686636 -3645270 -3686106 -3554087 -3667981 -3617724
12913c617724q5560K0544J3698r4361J95837r4962o7395K38208n116n4931J7075p6428
$$ -3617724 -3703284 -3682740 -3669042 -3763403 -3567566 -3662528 -3729923 -3491715 -3496831 -3551762 -3534687 -3611115
12901c611115j39260P2168N5023j841n273L4482J5723J86462j19942r0805M0516M1430
$$ -3611115 -3750375 -3678207 -3623184 -3625025 -3630298 -3595816 -3580093 -3393631 -3513573 -3604378 -3563862 -3522432
12889c522432r8346o375j1580Q8884r8583P2588j39877Q6145R8613J00390k89613O8969
$$ -3522432 -3620778 -3627153 -3638733 -3549849 -3648432 -3575844 -3715721 -3629576 -3530963 -3430573 -3720186 -3651217
12877c651217j4865P1541j6987n3114O8751q6722Q9590Q2380R1377k32186J84027l4104
$$ -3651217 -3666082 -3594541 -3611528 -3664642 -3595891 -3682613 -3593023 -3510643 -3419266 -3651452 -3467425 -3501529
12865c501529N7371j09806O4098L8936M8048K67n1966m1470j8327L6872m0217m2331q5589
$$ -3501529 -3444158 -3553964 -3489866 -3450930 -3402882 -3402615 -3454581 -3496051 -3514378 -3477506 -3517723 -3560054 -3645643
12852c645643Q9079k8945J8461j58523j51389O19923j63554L7233K9718j63370N2949M1691
$$ -3645643 -3556564 -3585509 -3567048 -3725571 -3876960 -3257037 -3420591 -3383358 -3353640 -3517010 -3464061 -3422370
12840c422370n054R3190m6384M185m6511q2378q947O5199l887K3555J21075m606J0829
$$ -3422370 -3427424 -3334234 -3380618 -3376433 -3422944 -3505322 -3514269 -3449070 -3452957 -3429402 -3308327 -3312933 -3302104
12827c302104o6922p8282l5685J42557J865Q7558k5342J0440j8319j07992K4989O1l1964
$$ -3302104 -3369026 -3447308 -3482993 -3340436 -3338571 -3251013 -3276355 -3265915 -3284234 -3392226 -3367237 -3367176 -3399140
12814c399140o9669N6427p898M6097j45833m1924J30377P1282j63869J5229J05157l8902
$$ -3399140 -3468809 -3412382 -3420280 -3374183 -3520016 -3561940 -3431563 -3360281 -3524150 -3508921 -3403764 -3442666
12802c442666J01645L7889j28037r512K23805p9884j60571O853k9427M6196K6790r3771
$$ -3442666 -3341021 -3303132 -3431169 -3440681 -3216876 -3296760 -3457331 -3450478 -3479905 -3433709 -3406919 -3500690
12790c500690J55460j9867P54J056j4970M2836Q9247o3732j02601M2540J02999j37617
$$ -3500690 -3345230 -3365097 -3364343 -3363287 -3378257 -3335421 -3246174 -3309906 -3412507 -3369967 -3266968 -3404585
12778c404585o7108R2089Q3990K4237o1939k3772n3549j9601J30542q4786R1169j26653
$$ -3404585 -3471693 -3379604 -3295614 -3271377 -3333316 -3357088 -3410637 -3430238 -3299696 -3384482 -3293313 -3419966
12766c419966M9616K08824k57703J30526K1907l6534r7505P9702N5159j21962O1575K3685
$$ -3419966 -3370350 -3161526 -3419229 -3288703 -3266796 -3303330 -3400835 -3321133 -3265974 -3387936 -3326361 -3302676
12754c302676N6376k0502l7201O3836k39947J10668m2290n2711J08620m563K42277j07003
$$ -3302676 -3246300 -3266802 -3304003 -3240167 -3480114 -3369446 -3411736 -3464447 -3355827 -3360390 -3118113 -3225116
12742c225116l2404j482l0956R9316n6299K5972m4884L7625j26391M3815k794J15990j1719
$$ -3225116 -3257520 -3259002 -3289958 -3190642 -3246941 -3220969 -3265853 -3228228 -3354619 -3310804 -3313598 -3197608 -3209327
12729c209327r0004k7014o3742J06281M3658r4636J02280n3483J41672q4407J5943j3688
$$ -3209327 -3299331 -3326345 -3390087 -3283806 -3240148 -3334784 -3232504 -3285987 -3144315 -3228722 -3212779 -3226467
$$ [...]
-2730g068626  $$ checkpoint
##END NTUPLES=
##END=
