##TITLE= S#337642
##JCAMP-DX= 5.00 $$ JEOL NMR v1.10
##DATA TYPE= NMR SPECTRUM
##DATA CLASS= NTUPLES
##NUM DIM= 1
##ORIGIN= DELTA_NMR
##OWNER= organic
##SPECTROMETER/DATA SYSTEM= DELTA_NMR
##.OBSERVE FREQUENCY= 3.00529655924288E+02
##.OBSERVE NUCLEUS= ^1H
##.DELAY= (2.194E+02,2.194E+02)
##.ACQUISITION MODE= SIMULTANEOUS
##.FIELD= 7.0586013
##.FILTER WIDTH= 1.81675738660864
##.ACQUISITION TIME= 3.6339712
##.SPINNING RATE= 14
##.OBSERVE 90= 9.6
##NTUPLES= NMR SPECTRUM
##VAR NAME= FREQUENCY,    SPECTRUM/REAL, SPECTRUM/IMAG, PAGE NUMBER
##SYMBOL=   X,            R,             I,             N
##VAR TYPE= INDEPENDENT,  DEPENDENT,     DEPENDENT,     PAGE
##VAR FORM= AFFN,         ASDF,          ASDF,          AFFN
##VAR DIM=  16384, 16384, 16384, 2
##UNITS= PPM,     ARBITRARY UNITS, ARBITRARY UNITS, 
##FIRST=  1.2501033903057E+01, -1.29602260613089E+02, -1.04053374337807E+02, 1
##LAST=  -2.50011824950436, -1.04155053496608E+02, -1.28996131007031E+02, 2
##FACTOR=  9.1565355261926E-04, 3.76727818124042E-03, 3.76727818124042E-03, 1
##PAGE= N=1
##DATA TABLE=(X++(R..R)), XYDATA
$$ [...]
5899g390481N0708J39572j01881n6814l5032J05316r1346J21087m2875q6845Q4847k63900
5887g567644L9376J90177p9240O5696r0727M9645J5928n2626J1217M0532M9591R8705n0079
5874g279449j7103r2090p8056o365P1316p0434P7916J23339L0157l1400j9361j53048N5845
5861g388733q7069o4427K42590j76245l597N0840L9632j6794j52589J61144k7471J202
5849g421517n2640Q1632j39041R0900n6931K20336n0127j26907N2110K0972j18657K63587
5837g236283j68546L0514N8527M3789l3076r7610k06504J88052J63153l0482k36646m9802
5825g574914J20936m3106R6172k80043J69369K62530j67729n5607M0383n36346N02577
5814g465778K10355o4934r6401J86842j22204N8470j7415j51015Q6853n7840o5807Q0339
$$ y = [-7390481, -7339773, -7200201, -7302082, -7358896, -7393928, -7288612, -7379958, -7258871, -7301746, -7388591, -7303744, -7567644, -7528268, -7338091, -7417331, -7351635, -7442362, -7392717, -7376789, -7429415, -7418198, -7377666, -7328075, -7229370, -7279449, -7296552, -7388642, -7466698, -7473063, -7401747, -7472181, -7394265, -7270926, -7240769, -7272169, -7291530, -7444578, -7388733, -7475802, -7540229, -7297639, -7473884, -7477481, -7426641, -7387009, -7403803, -7556392, -7395248, -7422719, -7421517, -7474157, -7392525, -7531566, -7440666, -7497597, -7277261, -7327388, -7454295, -7402185, -7381213, -7499870, -7236283, -7404829, -7374315, -7315788, -7271999, -7305075, -7402685, -7609189, -7421137, -7257984, -7288466, -7525112, -7574914, -7453978, -7497084, -7400912, -7680955, -7511586, -7249056, -7416785, -7472392, -7432009, -7968355, -7465778, -7255423, -7320357, -7416758, -7229916, -7352120, -7293650, -7311065, -7462080, -7375227, -7433067, -7498874, -7418535]
5802g418535K6701k2011j60446p06J14433m8042k8380J63756R75j64048J45475j6757
5790g407585j02154K8205J58079l4752k3363p8367M187K9514K17473k1982k9416k00764
5778g460925o366L4152O4487K0741p4763n768j11526q939k5801K95772P5239j32289k2977
5765g358963k09052K7374J33577P0724q072N6025j81503j05100J01816R4215r7628j2586
5753g489173J83439j8724j37486J2785Q6628q2217J07784k2433k27782J57233P316n7546
5741g480176K5371M5980k3561k4751J4475J746j35485J13581J25226j92072L6780M7669
5729g445217R7955m4390m8690l7305o574k8676N8226j81254J38519R9256j11951o3493
5717g573594J09202q7259J84785o2887j29347J67077l0200O813n7737j62479J49469o6335
$$ y = [-7418535, -7391834, -7413845, -7574291, -7574997, -7460564, -7508606, -7536986, -7373230, -7372255, -7536303, -7390828, -7407585, -7509739, -7481534, -7323455, -7358207, -7381570, -7459937, -7455750, -7426236, -7208763, -7230745, -7260161, -7460925, -7467291, -7433139, -7368652, -7347911, -7422674, -7428442, -7539968, -7548907, -7574708, -7278936, -7203697, -7335986, -7358963, -7568015, -7540641, -7407064, -7336340, -7344412, -7288387, -7469890, -7574990, -7473174, -7378959, -7476587, -7489173, -7305734, -7324458, -7461944, -7449159, -7362531, -7444748, -7336964, -7359397, -7587179, -7429946, -7422630, -7480176, -7454805, -7408825, -7432386, -7457137, -7442662, -7440916, -7576401, -7462820, -7337594, -7529666, -7492886, -7445217, -7347262, -7391652, -7440342, -7477647, -7484221, -7512897, -7454671, -7635925, -7497406, -7398150, -7510101, -7573594, -7464392, -7551651, -7366866, -7429753, -7559100, -7392023, -7422223, -7415410, -7473147, -7635626, -7486157, -7552492]
5705g552492K03431j18627J41471j1978j83647J33157m3245j03033J96224j25902J0230
5694g454411k8741j2109N5249j28448p954l7349R8186k4816K33323p0200Q2819q9108n7992
5681g441551M05828K780942k923639m91649J66838J72259j0963j15582O2829q0085O9302
5670g405471M5996O508M9329j77446q8433J58075r2319j0071M3480j14424P6593J39326
5658g368857Q9130j87146L52060k66540L7255l9841j51740P1429P0203o0882o2841l958
5646g521728K9773J1330m536j8039j03266R3743l6854J26313k29087N856K12304o0733
5634g494924L8258J0951R2686p176J0111L7410m4800n6705p5092L4472r9051K02500m0999
5621g392359M3591j58394J99058k91841J05415J21528j93176k5373O9224J03449J5476
$$ y = [-7552492, -7349061, -7467688, -7326217, -7338195, -7521842, -7388685, -7431930, -7534963, -7338739, -7464641, -7454411, -7483152, -7495261, -7440012, -7568460, -7576414, -7613763, -7515577, -7540393, -7307070, -7377270, -7294451, -7383559, -7441551, -7035723, -4254781, -7178420, -7670069, -7503231, -7330972, -7341935, -7457517, -7394688, -7474773, -7405471, -7359475, -7352967, -7303638, -7481084, -7569517, -7411442, -7503761, -7513832, -7470352, -7584776, -7508183, -7368857, -7279727, -7466873, -7114813, -7381353, -7344098, -7383939, -7535679, -7464250, -7394047, -7454929, -7517770, -7521728, -7491955, -7480625, -7485161, -7503200, -7606466, -7512723, -7549577, -7423264, -7652351, -7646495, -7434191, -7494924, -7456666, -7445715, -7353029, -7360205, -7350094, -7312684, -7357484, -7414189, -7489281, -7454809, -7553860, -7351360, -7392359, -7348768, -7507162, -7308104, -7599945, -7494530, -7373002, -7566178, -7591551, -7522327, -7418878, -7403402]
5610g403402j2642j55497j87942J74202P9194J99533K24275k14430r6036j10804L9159
5599g464390o0303Q1070n2532n9153L2512J78782n8104O8521q5541j90611J54657K482
5587g452610K39353j45456q6481k8271m4555n6421K67724j10327o9226J30639q383p7943
5575g441957R0686j01873J29967j44870P6118m3320P3188j75623J03888M6002L306K48412
5563g136076k09639L185p3845j52245p8589J33982O7019o1265n5557Q2281L0130k24537
5551g675156r7309L66296m2222R0630k0591m7945J29091k31399n17M8143O2334L6591
5539g382054j37052j42669L36643l2508L8528o9567j541k80561J55356J1806J79141k9745
5527g354223r3868J433J36104l454j78638j9952Q4516o4564J07567q8429j2349J11179
$$ y = [-7403402, -7416044, -7571541, -7759483, -7585281, -7506087, -7306554, -7082279, -7296709, -7392745, -7503549, -7464390, -7524693, -7443623, -7496155, -7555308, -7522796, -7344014, -7402118, -7333597, -7419138, -7609749, -7455092, -7452610, -7213257, -7358713, -7445194, -7473465, -7518020, -7574441, -7306717, -7417044, -7486270, -7355631, -7364014, -7441957, -7351271, -7453144, -7323177, -7468047, -7391929, -7435249, -7362061, -7537684, -7433796, -7387794, -7384488, -7136076, -7345715, -7342530, -7416375, -7568620, -7647209, -7513227, -7446208, -7507473, -7563030, -7480749, -7450619, -7675156, -7772465, -7406169, -7448391, -7357761, -7378352, -7426297, -7297206, -7528605, -7529122, -7480979, -7418645, -7382054, -7519106, -7661775, -7325132, -7357640, -7319112, -7388679, -7390220, -7670781, -7515425, -7503619, -7324478, -7354223, -7448091, -7446658, -7310554, -7314008, -7492646, -7512598, -7428082, -7492646, -7385079, -7473508, -7485857, -7374678]
5515g374678q0943k2201K9887o3502o6098L26883P635l8086n0627r3433N148j60698K12303
5502g368410j3479k00344J13406j85495R0272K4512j88506J45542J51100m1597L0786N7701
5490g384512j89913o1090Q0338K36848j78821Q000Q1492j34090k3746J95095O4338j8222
5478g324283j99916n7754L269j9432J91676J12193k9521j64680K06979q8592j621j75173
5466g546855J69319M2316j83978N53769o87420K65529j64126j3284J38588K7040j59158
5455g558260l7783J20793O65L3428k54908j14882P2042K27339K8871k03161J45122j2753
5443g553487k4187K4301K6378J72952n6458k62793J73162r8822J59160j03618r7529K83155
5431g357786j00886m012l9645O3235O1531K9140q5183j07198n8924R4285O3720p148L7182
$$ y = [-7374678, -7455621, -7477822, -7447935, -7511437, -7577535, -7250652, -7243017, -7281103, -7331730, -7425163, -7420015, -7580713, -7368410, -7381889, -7582233, -7468827, -7654322, -7564050, -7539538, -7728044, -7582502, -7431402, -7472999, -7442213, -7384512, -7574425, -7635515, -7555177, -7318329, -7497150, -7489150, -7407658, -7541748, -7565494, -7370399, -7306061, -7324283, -7524199, -7581953, -7578684, -7598116, -7406440, -7294247, -7323768, -7488448, -7281469, -7370061, -7371682, -7546855, -7377536, -7335220, -7519198, -6965429, -7652849, -7387320, -7551446, -7564730, -7426142, -7399102, -7558260, -7596043, -7475250, -7474585, -7441157, -7696065, -7810947, -7738905, -7511566, -7482695, -7685856, -7540734, -7553487, -7577674, -7553373, -7526995, -7354043, -7410501, -7673294, -7500132, -7598954, -7439794, -7543412, -7640941, -7357786, -7458672, -7462684, -7502329, -7439094, -7377563, -7348423, -7433606, -7540804, -7599728, -7505443, -7441723, -7448871, -7411689]
5418g411689j86646J03005J15794K7268j86287J45826p6499j15857o9202J79021j14509
5407g589775L80318j48627j05338M8059j60960J53144Q614O5685o6191j84255r4077Q5076
5395g608327m2007K7785o6374L19582j27192N5603O1530J3336j14004N1444r2224P3936
5383g446912L7709L8260j42924J12827n7769r953k6785o9404J47417L7458o5501j79504
5371g625081R1738j37657J1464J12844N1223m1183p9033R8679J33459j15592p3626K94794
5359g277971j00625K2334j04722J09513k0345l6851o697N1552q91j72521J51914j50615
5347g535925J37893j20192J71754j22126M8372K256M066p5771k0090M0761R8792P757
5335g362453j14551J18896l6425j04466R2113r2477p7533J27785L159J33711J1991o7841
$$ y = [-7411689, -7598335, -7495330, -7379536, -7352268, -7538555, -7392729, -7469228, -7585085, -7654287, -7475266, -7589775, -7209457, -7358084, -7463422, -7415363, -7576323, -7423179, -7414565, -7348880, -7415071, -7599326, -7693403, -7608327, -7650334, -7622549, -7688923, -7369341, -7496533, -7440930, -7379400, -7366064, -7480068, -7428624, -7520848, -7446912, -7409203, -7370943, -7513867, -7401040, -7458809, -7468762, -7495547, -7564951, -7417534, -7380076, -7445577, -7625081, -7533343, -7671000, -7659536, -7546692, -7495469, -7536652, -7615685, -7517006, -7383547, -7499139, -7572765, -7277971, -7378596, -7356262, -7460984, -7351471, -7371816, -7408667, -7415364, -7363812, -7364703, -7537224, -7385310, -7535925, -7398032, -7518224, -7346470, -7468596, -7420224, -7417968, -7413902, -7489673, -7509763, -7469002, -7370210, -7362453, -7477004, -7358108, -7394533, -7498999, -7406886, -7499363, -7576896, -7449111, -7445952, -7312241, -7300250, -7368091]
5323g368091J22009L101P7049j64700l22116J73544N769M7766J22749J78633k94163j0426
5311g428876K09308J69619r7785p022J14577k08950J1837J30873j52284Q0836j94359
5300g372226K28634j9970l4621n9094R0018R6584j03027J31310k82497j2395R0289O923
5288g240072k0469J40250j87944M3918J18046j71786q9351q2730P9517R031j34404Q7429
5276g448565k0589J88085n6378j87125J89791l3649j17996J32658m33347K74029J02497
5265g410589M729m734q8809m1187Q3171n8033l9583o5554k9770J35793j37867m7281J65871
5252g533843j31854m0119K44861j05791j56720J66794m9537q47430k063813K920495J56893
5241g440064P8330r1629K2454j69515L3668l1267O1860M1602j6116R1347j2324O7953
$$ y = [-7368091, -7246082, -7242981, -7165932, -7330632, -7652748, -7479204, -7473435, -7425669, -7302920, -7124287, -7418450, -7428876, -7219568, -7049949, -7147734, -7154756, -7040179, -7249129, -7237292, -7106419, -7258703, -7177867, -7372226, -7143592, -7163562, -7198183, -7257277, -7167259, -7070675, -7173702, -7042392, -7324889, -7337284, -7246995, -7240072, -7260541, -7120291, -7308235, -7264317, -7146271, -7318057, -7407408, -7490138, -7410621, -7401590, -7535994, -7448565, -7469154, -7281069, -7337447, -7524572, -7334781, -7368430, -7486426, -7353768, -7787115, -7513086, -7410589, -7405860, -7410594, -7499403, -7540590, -7457419, -7515452, -7555035, -7620589, -7650359, -7514566, -7652433, -7699714, -7533843, -7665697, -7705816, -7460955, -7566746, -7723466, -7556672, -7606209, -8453639, -10517452, -7596957, -7440064, -7361734, -7453363, -7430909, -7600424, -7566756, -7598023, -7536163, -7494561, -7510677, -7419330, -7431654, -7363701]
5229g363701j38995O0848j33567L4510q695K8191R8164j25115p6746L8085j53521L03710
5217g436832R918l1665J16163K6847k9392k0767n1468k4838J96878k35845L7757l5454l831
5204g482529K2206J58291p1372N5514k15757M7128J04699O5316p8868P6290q531j33831
5192g461444N3356o9946N3845P9529M0809J1288j10136J8488p8336K9659l3577K0157r1890
5179g538198J55992N4681K8637o4722Q2488l0919J02644j88660J47975R264n1158J72225
5167g119751j36159N3058k7279O3834J13290n9213r8332j7771q0133J54225n4836m8355
5155g257422J27182p6162o4543o0963R4695n3680k2337J9811j34119O4885k12447J47081
5143g428019q0358K57839k49704O6510q9055M2735N5282o5202J05972J2638j32056L531
$$ y = [-7363701, -7502696, -7441848, -7575415, -7540905, -7549600, -7521409, -7423245, -7548360, -7625106, -7587021, -7740542, -7436832, -7426914, -7458579, -7342416, -7315569, -7344961, -7365728, -7417196, -7442034, -7245156, -7481001, -7443244, -7478698, -7482529, -7460323, -7302032, -7373404, -7317890, -7533647, -7486519, -7381820, -7316504, -7395372, -7319082, -7327613, -7461444, -7408088, -7478034, -7424189, -7344660, -7303851, -7292563, -7402699, -7384211, -7462547, -7432888, -7466465, -7446308, -7538198, -7382206, -7327525, -7298888, -7363610, -7281122, -7312041, -7209397, -7398057, -7250082, -7240818, -7291976, -7119751, -7255910, -7202852, -7230131, -7166297, -7053007, -7112220, -7210552, -7228323, -7308456, -7154231, -7209067, -7257422, -7130240, -7206402, -7270945, -7331908, -7237213, -7290893, -7313230, -7293419, -7427538, -7362653, -7575100, -7428019, -7508377, -7250538, -7500242, -7433732, -7522787, -7480052, -7424770, -7489972, -7384000, -7371362, -7503418, -7499887]
5131g499887n9769M6778N7908j4528K6658R562J34247r4784K6305k1185j05713m4403l1995
5118g570806J64285k59486J58761O6639k44676k0937R3623J84512M6586k19155L59409
5107g241245j05510j99373j67164J33070O4636k2473Q0132J25569j6509j55672j26565
5096g631104Q5030l5571J81683j69916K58940r3763k54688J29992J86888k19349J08228
5085g453630r3267J52048j42597K9164n7521L9718m5531j0173K04656K0940p2422j66082
5073g594697K79505o2687l044L2243j03504j08266N2289k5272P1127o3956j04664j5439
5061g646365J57532j42460m1152J16510j53712j03114P1495J03123p9345K5622P2331L999
5049g615536q3153k2314J04093j4185O613O103r1502O4381k566p4510O3332J09629k6157
$$ y = [-7499887, -7559656, -7512878, -7454970, -7469498, -7442840, -7433278, -7299031, -7393815, -7367510, -7388695, -7494408, -7538811, -7570806, -7406521, -7666007, -7507246, -7440607, -7685283, -7706220, -7612597, -7428085, -7381499, -7600654, -7241245, -7346755, -7546128, -7713292, -7580222, -7515586, -7538059, -7457927, -7332358, -7348867, -7504539, -7631104, -7546074, -7581645, -7399962, -7569878, -7310938, -7404701, -7659389, -7529397, -7342509, -7561858, -7453630, -7546897, -7394849, -7537446, -7508282, -7565803, -7526085, -7571616, -7581789, -7377133, -7356193, -7428615, -7594697, -7315192, -7377879, -7380923, -7348680, -7452184, -7560450, -7508161, -7533433, -7462306, -7526262, -7630926, -7646365, -7488833, -7631293, -7672445, -7555935, -7709647, -7812761, -7741266, -7638143, -7717488, -7691866, -7619535, -7615536, -7698689, -7721003, -7616910, -7631095, -7624482, -7618379, -7709881, -7645500, -7648066, -7722576, -7659244, -7549615, -7575772]
5036g575772J64006j19333n4964J18190j07996J2203j69486J10132j82574K4066q1156
5025g862684J91807j56181K10255N4039K2255j12722J63649k8288p5737o0009J54397k9769
5013g528988k6529r3374O8376l7051j5946l0036Q3344l8659N1508L3235L6422o0049m9399
5000g607146p879R1117N2570j15761J40443q5018k2139k0269J23771j00895m5917m8672
4988g645795J42187j00741J17158O9006K62133n92693K7942J38387r1839l4689K1938N6354
4976g630652j11067M4215K21353n7378N1356L7762M0794j97330L1504k8621R161j40605
4964g729508K42155J15553p21653L14078K7905j0680R701M9108l795J29389j08245J29277
4952g556715p5652j35214J20115k2797K9375j83297K77232j39779L3333q3572L8344m6442
$$ y = [-7575772, -7411766, -7531099, -7586063, -7467873, -7575869, -7563666, -7733152, -7623020, -7805594, -7781528, -7862684, -7670877, -7827058, -7616803, -7562764, -7540509, -7653231, -7489582, -7517870, -7593607, -7653616, -7499219, -7528988, -7555517, -7648891, -7580515, -7617566, -7633512, -7663548, -7580204, -7618863, -7567355, -7534120, -7497698, -7557747, -7607146, -7615025, -7523908, -7471338, -7587099, -7446656, -7531674, -7553813, -7574082, -7450311, -7551206, -7597123, -7645795, -7503608, -7604349, -7487191, -7418185, -7156052, -7748745, -7720803, -7582416, -7674255, -7708944, -7687006, -7630652, -7741719, -7697504, -7476151, -7533529, -7482173, -7444411, -7403617, -7600947, -7569443, -7598064, -7588903, -7729508, -7487353, -7371800, -8093453, -7779375, -7751470, -7762150, -7752449, -7703341, -7707136, -7577747, -7685992, -7556715, -7632367, -7767581, -7647466, -7670263, -7640888, -7824185, -7546953, -7686732, -7653399, -7736971, -7698627, -7745069]
4940g745069j9162N6004p7766L33731k07613R8103o9493j22342J34577j32883J90673L6304
4928g524936l3335m0828L0685Q7293p4885l583q2856j40461N7282K73296k14920R2257
4916g574991K60300j65837j53795K4211J75397k16611k10549K8538M8642J49846R5Q6216
4904g548538j02154k8514o236J00996j7411M7934J0626J5134l4434j85524k620O1819M0980
4891g647942P3430r9039k4074K45297k65981m0141r099J20904M212J6438O0436l4013J5528
4878g584044O2345J02475k41463J39318j26709j01646K06092m6491N9537q6117l2112N2041
4866g596774m8026M5186k38j37257J04989J07048j60691P2678P9566j1455K2260J60284
4854g362430j76253m3181L2498R3586j18493M9210k63625J51070m9309M5203J46694n0935
$$ y = [-7745069, -7764231, -7708227, -7785993, -7452262, -7659875, -7561772, -7631265, -7753607, -7619030, -7751913, -7561240, -7524936, -7558271, -7599099, -7568414, -7481121, -7556006, -7559589, -7642445, -7782906, -7725624, -7452328, -7667248, -7574991, -7314691, -7480528, -7634323, -7610112, -7434715, -7651326, -7861875, -7833337, -7784695, -7634849, -7634754, -7548538, -7650692, -7679206, -7685442, -7584446, -7601857, -7553923, -7543297, -7528163, -7562597, -7748121, -7750741, -7688922, -7647942, -7574512, -7673551, -7697625, -7452328, -7718309, -7758450, -7767549, -7646645, -7642433, -7625995, -7565559, -7599572, -7584044, -7521699, -7419224, -7660687, -7521369, -7648078, -7749724, -7543632, -7590123, -7530586, -7616703, -7648815, -7596774, -7644800, -7599614, -7599852, -7737109, -7632120, -7525072, -7685763, -7613085, -7533519, -7544974, -7522714, -7362430, -7538683, -7581864, -7549366, -7455780, -7574273, -7525063, -7788688, -7637618, -7686927, -7641724, -7495030, -7545965]
4842g545965j92206l7501J36200j40999J68430n2555J02791p27J0711j51337q9527K3855
4830g768830P1504J7798J10j46507N9542J57051J45800M9815j89728Q4826Q5266j05030
4818g538383j06029r8888Q7743p1422m3792P6153K4871o4392p5325k17394l642616L458561
4806h210913L02223N6844N3478K13366l1181M2641j61724J13335k0870p9250J85561N1586
4794g484904j51065N9885n1383N7620k06097O1560O9811O3642R8876j39763j6004L9689
4782g598133o0094j17557L0185j0601p6576J72400j86528P5884l71685L55268K0233J04458
4770g662746P3900O866M3749q6804l881K4063j03300k6289R8814L0354L7079l033j52708
4757g723936j7978q9236J16359j71832J52490J5009J76857l9398q0364p0535L5499L426
$$ y = [-7545965, -7738171, -7775672, -7639472, -7780471, -7612041, -7664596, -7561805, -7562532, -7551821, -7703158, -7792685, -7768830, -7697326, -7679528, -7679418, -7825925, -7766383, -7609332, -7463532, -7413717, -7603445, -7518619, -7433353, -7538383, -7644412, -7743300, -7655557, -7726979, -7770771, -7694618, -7669747, -7734139, -7809464, -8026858, -11669474, -8210913, -7908690, -7851846, -7798368, -7585002, -7616183, -7573542, -7735266, -7621931, -7642801, -7722051, -7536490, -7484904, -7635969, -7576084, -7627467, -7569847, -7775944, -7714384, -7644573, -7580931, -7482055, -7621818, -7637822, -7598133, -7658227, -7775784, -7745599, -7756200, -7832776, -7660376, -7846904, -7771020, -8142705, -7787437, -7767204, -7662746, -7588846, -7581980, -7538231, -7625035, -7628916, -7604853, -7708153, -7734442, -7635628, -7605274, -7568195, -7571228, -7723936, -7741914, -7831150, -7714791, -7886623, -7734133, -7719124, -7542267, -7581665, -7662029, -7732564, -7697065, -7693639]
4745g693639K52101q8487l2362p9309j03525R6402J29169j80480J20867m0538j21991o7275
4733g809067L77304j2260j14916K019q8559K123p1376J00401j16331j66842J33684J69419
4721g594401j77065j4332J37733P9976j42481o887P4057J44790k17972J03628k41725J9607
4709g835072J45703K4373r0926J47562l72478J85934O8170Q024k8168O3577J06316r0093
4697g667078P5977L1984j38177p50J13558r5212M9542m5327M4357o6563k249O1139n975
4684g644774l8260P8965k71o8463j10345J64682J18116l9431o6198k7875m034O1184l9328
4671g616032N991Q678n8518j27010M5181R4621J11517K6831j37146K40662k71070J29245
4659g547050K8953q8627N017o5582O1369j22694m2724R7138J7296L3530o8566j3732L1943
$$ y = [-7693639, -7441538, -7530025, -7562387, -7641696, -7745221, -7648819, -7519650, -7700130, -7579263, -7619801, -7741792, -7809067, -7431763, -7444023, -7558939, -7556920, -7645479, -7643356, -7714732, -7614331, -7730662, -7897504, -7763820, -7594401, -7771466, -7785798, -7648065, -7568089, -7710570, -7717457, -7643400, -7498610, -7716582, -7612954, -7854679, -7835072, -7689369, -7664996, -7755922, -7608360, -7980838, -7794904, -7726734, -7718710, -7746878, -7683301, -7576985, -7667078, -7591101, -7559117, -7697294, -7698044, -7584486, -7679698, -7630156, -7675483, -7631126, -7697689, -7699938, -7638799, -7644774, -7683034, -7604069, -7604340, -7672803, -7783148, -7618466, -7500350, -7539781, -7605979, -7633854, -7637888, -7576704, -7616032, -7610041, -7601363, -7659881, -7786891, -7741710, -7647089, -7535572, -7508741, -7645887, -7405225, -7676295, -7547050, -7518097, -7606724, -7601707, -7667289, -7605920, -7728614, -7771338, -7674200, -7656904, -7623374, -7691940, -7705672, -7673729]
4646g673729J12503Q2178r5852k4537j12673J899J7885j08972P3461J71677j50544J39713
4634g566991n9518r5644J02204j64469J9991j2104N8203Q0852j6750n7854q375K6044N257
4621g689154K5889K5260J7830M4654M3606M362r7264k6429P0651r1042M1376M527p6481
4608g702215l2085O3726J6764j22977J15598R1413j18699r652j30914J72450P005q5494
4596g735080J44693j22621J49380o5074L5669l1841k09343J04832l9790n2153R8020n4436
4584g777744J20598r0053l1558N499K4450j03692R5806O9543P1589K8209l9816k29309
4572g856478J62646o417j07463J63669k23094J44798J9567K46593k29096O6672n2311
4561g670914J38563j48908j34390m9498J51801R7327K1970j23968j75603Q8462J8314M1889
$$ y = [-7673729, -7561226, -7479048, -7574900, -7599437, -7712110, -7710211, -7692326, -7801298, -7727837, -7556160, -7706704, -7566991, -7626509, -7722153, -7619949, -7784418, -7764427, -7776531, -7718328, -7637476, -7654226, -7712080, -7720455, -7694411, -7689154, -7663265, -7638005, -7620175, -7575521, -7531915, -7527553, -7624817, -7651246, -7580595, -7671637, -7630261, -7625734, -7702215, -7734300, -7670574, -7653810, -7776787, -7661189, -7569776, -7688475, -7698127, -7829041, -7656591, -7649586, -7735080, -7590387, -7713008, -7563628, -7628702, -7593033, -7624874, -7834217, -7729385, -7769175, -7821328, -7723308, -7777744, -7657146, -7747199, -7778757, -7773258, -7748808, -7852500, -7756694, -7687151, -7615562, -7587353, -7627169, -7856478, -7693832, -7700249, -7807712, -7644043, -7867137, -7722339, -7702772, -7456179, -7685275, -7618603, -7670914, -7532351, -7681259, -7815649, -7865147, -7713346, -7616019, -7594049, -7718017, -7893620, -7805158, -7786844, -7744955]
4549g744955R8145r2725p1324L32119j29242j17197K3934R0189j21839J4444k1756n410
4537g745617P4582j27093P4257K90693j91493k6917J4052K1473j41278k4422Q1467k3780
4525g724076Q9594L8752j14342r3652J5741J6150L9061J4142O3262k0135j42002l5296
4513g852801R9964k796p0347J02560P7401j08854q0347M6494N8147J74159j36504R1560
4501g601364l7195n9543M0086j73023j46929R3147M6837J27257O6656j36100J64184j17029
4489g733016j17099J85646J07425m4137j45355J70602j15171k2998q467O1145n5707q0404
4477g797536J07365k633n0528J31730O5465k78130K36126n8411o825j26095L2275m9032
4465g796229K9437O8352J8216J1360j84432J84319o2439j81020J72994r1427j13474O8068
$$ y = [-7744955, -7646810, -7739535, -7810859, -7478740, -7607982, -7725179, -7701245, -7611056, -7732895, -7718451, -7740207, -7745617, -7671035, -7798128, -7723871, -7433178, -7624671, -7651588, -7637536, -7616063, -7757341, -7781763, -7700296, -7724076, -7634482, -7595730, -7710072, -7803724, -7787983, -7771833, -7732772, -7718630, -7655368, -7675503, -7817505, -7852801, -7752837, -7755633, -7825980, -7723420, -7646019, -7754873, -7835220, -7788726, -7730579, -7556420, -7692924, -7601364, -7638559, -7698102, -7658016, -7831039, -7977968, -7884821, -7837984, -7710727, -7644071, -7780171, -7615987, -7733016, -7850115, -7664469, -7557044, -7601181, -7746536, -7575934, -7691105, -7714103, -7722570, -7661425, -7717132, -7797536, -7690171, -7692804, -7743332, -7611602, -7546137, -7824267, -7588141, -7646552, -7653377, -7779472, -7747197, -7796229, -7766792, -7698440, -7680224, -7668864, -7853296, -7668977, -7731416, -7912436, -7739442, -7830869, -7944343, -7876275]
4453g876275J66167J3624J674o9251Q485j19478K5620j8174O4077j66868Q9719M8577
4441g832103J32629j8808N616j8261J4036j10975m9754K83022l1606l5023o6778k6422
4429g754427N5329O688n3170j2517J75525k49197J78520p3015j29825L261J61392j04940
4417g796376o5121R4824k7242l6739J24554r8603j60642J59572P6910l1660q5753K61415
4405g584861k2670l2815q1995k4841j33981K51246r8381M2901M0862r085l5546Q1839M9791
4392g557536n7269J4396m2769j03884J12918J25086N4444q4834L7367k635k89021Q9076
4380g704661M1144l878K5228l3783j06640M3512j5333o8106k492307K314589K28967Q6523
4368g684745r022J49144j22340K2524j55522n4002J80348J54876m7093J7422m8661l5741
$$ y = [-7876275, -7710108, -7696484, -7694810, -7764061, -7755576, -7875054, -7849434, -7867608, -7803531, -7970399, -7880680, -7832103, -7699474, -7718282, -7712666, -7730927, -7716891, -7827866, -7877620, -7594598, -7626204, -7661227, -7728005, -7754427, -7699098, -7692410, -7745580, -7758097, -7582572, -7831769, -7653249, -7726264, -7856089, -7852828, -7691436, -7796376, -7861497, -7766673, -7793915, -7830654, -7706100, -7804703, -7965345, -7805773, -7728863, -7760523, -7846276, -7584861, -7607531, -7640346, -7722341, -7747182, -7881163, -7629917, -7728298, -7685397, -7644535, -7653620, -7689166, -7607327, -7557536, -7614805, -7600409, -7643178, -7747062, -7634144, -7509058, -7454614, -7539448, -7502081, -7504716, -7793737, -7704661, -7663517, -7667395, -7642167, -7675950, -7782590, -7739078, -7754411, -7822517, -10314824, -8000235, -7771268, -7684745, -7693767, -7544623, -7666963, -7644439, -7799961, -7853963, -7673615, -7518739, -7565832, -7548410, -7597071, -7632812]
4356g632812n4438o2565J22585j3496j97457K84407k5500j20629l6623j14999p8484N1665
4344g878346J78054J54203q1676k2130j5377j29076l1910N6192r1678l4446k0543l0440
4332g947173O3852J75654k5025k1552O4269l0342j65098K91761j45858O4688p5386j05659
4320g855869j02585R3314K5101O4144o9407J8124j06421P8892p3572M8283L1009R794
4308g839193J20537M0386N8671j99215m3183n66q6180P8407J28816l9496J00118k17225
4296g898123q198J19905J74238j51990N068o5727j9817J22079j04358O1566K7686J12669
4284g625002k0688j25084k1285L8602K2503N64591m04274P3787J5862m33860J19732r4997
4272g890113L5604J18052p5885J24307m3905j6989k5387M9072p6873L2399q5768N1558
$$ y = [-7632812, -7687250, -7749815, -7627230, -7640726, -7838183, -7553776, -7579276, -7699905, -7736528, -7851527, -7930011, -7878346, -7700292, -7546089, -7627765, -7649895, -7665272, -7794348, -7826258, -7770066, -7861744, -7896190, -7916733, -7947173, -7883321, -7707667, -7732692, -7754244, -7689975, -7720317, -7885415, -7593654, -7739512, -7674824, -7750210, -7855869, -7958454, -7865140, -7840039, -7775895, -7845302, -7827178, -7933599, -7854707, -7928279, -7879996, -7848987, -7839193, -7718656, -7678270, -7619599, -7818814, -7861997, -7862563, -7948743, -7870336, -7741520, -7781016, -7680898, -7898123, -7906321, -7786416, -7612178, -7764168, -7759100, -7824827, -7844644, -7722565, -7826923, -7765357, -7737671, -7625002, -7645690, -7770774, -7792059, -7753457, -7730954, -7166363, -7570637, -7496850, -7480988, -7914848, -7795116, -7890113, -7854509, -7736457, -7812342, -7688035, -7731940, -7748929, -7774316, -7725244, -7802117, -7769718, -7855486, -7803928]
4260g803928j78555K43780p2670k0386R2682K10155q2741k02084R5496k7779K1124O190
4248g718716o8450O1521p5611R0281j89892R4312l9291K10603j4955k5656p209K1341P959
4235g653763o8859n0107L4058j7102j33560O114Q3823j7824J8381R4180j17443J20778
4223g701324j29027l06743K46669J79121p4635j16091q1203K9493L2010p5120J31221k4653
4211g890282R0636Q1113M8102p2062N5239q3500j08035J23132M8993j02722O74J79823
4199g628889k7934j57233m8312J1539N7878n3661j56270J13656k0980O0694n7432J553
4187g905391j04175J30622R1886R9796o5945j56333Q3645n6000k2553K14329j0140k4987
4175g725246j46426N7498J4729k2677o0516k2727P2768O1796n9914m7572J9958r022J99839
$$ y = [-7803928, -7982483, -7738703, -7811373, -7831759, -7739077, -7528922, -7611663, -7813747, -7718251, -7746030, -7724906, -7718716, -7787166, -7725645, -7801256, -7710975, -7900867, -7806555, -7845846, -7635243, -7650198, -7675854, -7683063, -7661722, -7653763, -7722622, -7772729, -7738671, -7755773, -7889333, -7883219, -7799396, -7817220, -7798839, -7704659, -7822102, -7701324, -7830351, -8137094, -7890425, -7711304, -7785939, -7902030, -7983233, -7953740, -7921730, -7996850, -7865629, -7890282, -7799646, -7718533, -7670431, -7742493, -7687254, -7770754, -7878789, -7755657, -7706664, -7809386, -7808712, -7628889, -7656823, -7814056, -7862368, -7850829, -7792951, -7846612, -8002882, -7889226, -7910206, -7849512, -7906944, -7905391, -8009566, -7878944, -7787058, -7687262, -7753207, -7909540, -7825895, -7881895, -7904448, -7690119, -7700259, -7725246, -7871672, -7814174, -7799445, -7822122, -7882638, -7905365, -7832597, -7770801, -7830715, -7878287, -7858329, -7867351, -7667512]
4162g667512P4494j40244j63624J9503k650J20620r9523j1819j63690K09834N7123J21084
4150g646404l25185K08760l5346q5615J40651K1129N8886k7594j58169k5523l4421J28053
4138g780778n86r2546O6491j18059j2167m4565J81683J7431l6112k5761L6358p8271j30347
4125h017229J26658J48618k7219j3824m0311r0829K4761M6249J89565k15292J0740J66084
4113g692029Q7641p3818j96540N124L1705J3738J09906j26491J03801l6336L3576o1940
4101g801663q9627M0592K01574k17715J60001j5918J61480r4929n9572j28590j25751o6781
4089h036899J30871J03418J69561j25174J84650l7217p4474j12008J36212q9198k2652
4078g772910L3294J22256k4761j10902q999j1089O2945J21895n2689j29678N8882O7039
$$ y = [-7667512, -7593018, -7733262, -7896886, -7877383, -7880033, -7759413, -7858936, -7870755, -8034445, -7824611, -7767488, -7646404, -7971589, -7762829, -7798175, -7883790, -7743139, -7722010, -7663124, -7690718, -7848887, -7874410, -7908831, -7780778, -7781364, -7873910, -7807419, -7925478, -7937645, -7982210, -7800527, -7783096, -7819208, -7844969, -7808611, -7886882, -8017229, -7890571, -7741953, -7769172, -7782996, -7823307, -7914136, -7889375, -7843126, -7653561, -7868853, -7858113, -7692029, -7604388, -7678206, -7874746, -7869622, -7837917, -7824179, -7714273, -7840764, -7736963, -7773299, -7739723, -7801663, -7891290, -7850698, -7649124, -7866839, -7706838, -7722756, -7561276, -7656205, -7715777, -7844367, -7970118, -8036899, -7906028, -7802610, -7633049, -7758223, -7573573, -7610790, -7685264, -7797272, -7661060, -7750258, -7772910, -7739616, -7617360, -7642121, -7753023, -7762022, -7773111, -7710166, -7588271, -7640960, -7770638, -7711756, -7644717]
4066g644717j78560o3615K12826j82616Q9769q7521Q9733p1457P8545j47414Q4207q0943
4054g901763M0285K21827j13115m6448j44269L270l992R4295J0709l5834K16341O26k72830
4041g930898R1810J02831K7383L874r7730m7129N4692q4354L03302k16930J1784q1905
4029g863270M8468M7472j73541O6220J37132q9762K5609j47278k6885P006M4606Q1465
4017g842758j48254l1144J54698M5910Q2353m3121j65211J85803k13070k2853j4834j16240
4005h128721J74018q142N6309K9218o3204J7525q1958j67025K10481J32611k9189j13943
3993g972020K23435j56514J41394j61013O5856L6363j53328m7225J24606o210K2831j27701
3981h009526M3911J1799K8066J45443o7458o6777j902n9499J64419R9802j17051j0545k314
$$ y = [-7644717, -7823277, -7886892, -7674066, -7856682, -7766913, -7854434, -7764701, -7836158, -7757613, -7905027, -7820820, -7901763, -7861478, -7639651, -7752766, -7799214, -7943483, -7940213, -7944205, -7849910, -7839201, -7875035, -7658694, -7658068, -7930898, -7839088, -7736257, -7708874, -7705000, -7802730, -7849859, -7795167, -7879521, -7576219, -7793149, -7781365, -7863270, -7814802, -7767330, -7940871, -7874651, -7737519, -7827281, -7801672, -7948950, -7975835, -7968829, -7924223, -7842758, -7991012, -8022156, -7867458, -7821548, -7739195, -7782316, -7947527, -7761724, -7974794, -7997647, -8012481, -8128721, -7954703, -7962845, -7906536, -7877318, -7940522, -7922997, -8004955, -8171980, -7961499, -7828888, -7858077, -7972020, -7748585, -7905099, -7763705, -7924718, -7858862, -7822499, -7975827, -8023052, -7898446, -7904656, -7881825, -8009526, -7965615, -7953816, -7925750, -7780307, -7847765, -7914542, -7916444, -7975943, -7811524, -7711722, -7828773, -7839318, -7841632]
3968g841632n2416O3193N0544O3195j4712j88571O0916J59353p9361K119m4977p5396p400
3955g905145O7906p4461Q7316o2348q012J4860P3049O2893k716O4097o4089J03119j89687
3942g833218j97798j3001L6563R4999Q1909o5716p62249J071168m01827J50817k4771J8746
3930g844378J72975k70683J15931P127k0269K66680r2794m8254J8230L0367l8277Q3912
3918g619433k37819j4085R5368J61033q5435j83348J37167j07283k40444k32525M95336
3907g831468O7220n5367R8927j71044J00642J43993q4546k31048M6815q673R5239k7793
3895g857103o8129j25397R7100J75019P9853j58888R218j04645j0794K21211j91237l10988
3883h244780N88426r456j96713M8435Q9267j08906O5791J0538n7069n4796n1121J65216
$$ y = [-7841632, -7894048, -7830855, -7780311, -7717116, -7731828, -7920399, -7859483, -7700130, -7779491, -7777372, -7822349, -7897745, -7905145, -7837239, -7911700, -7824384, -7886732, -7894744, -7879884, -7806835, -7743942, -7746658, -7682561, -7746650, -7643531, -7833218, -8031016, -8044017, -8007454, -7912455, -7830546, -7896262, -8658511, -7587343, -7989170, -7838353, -7863124, -7844378, -7671403, -7942086, -7826155, -7819028, -7839297, -7572617, -7665411, -7713665, -7695435, -7665068, -7703345, -7619433, -7857252, -7871337, -7775969, -7614936, -7700371, -7883719, -7746552, -7853835, -8094279, -8326804, -7831468, -7764248, -7819615, -7720688, -7891732, -7791090, -7647097, -7731643, -7962691, -7915876, -7924549, -7829310, -7857103, -7925232, -8050629, -7953529, -7778510, -7698657, -7857545, -7848327, -7952972, -7963766, -7742555, -7933792, -8244780, -7656354, -7665810, -7862523, -7814088, -7724821, -7833727, -7767936, -7757398, -7814467, -7869263, -7920384, -7755168]
3871g755168j63827J48013o340J83232q6678l1900k2428j03231K9727l8839j09077M9628
3859g906888L0170Q1071N5504p9127m0768P0157n3440M4883k0718p759J11908j02101n9694
3846g876802j3565J03467J43617L2866j33100J2679r0190J33559R1645k10403N9707O6957
3834g679563m7375l5193K046j45124R9740N3435q9475j19065O0453J30843r3823J16046
3822g747055j33563M3238J589o4739L8526K1289p0935Q8983M5544o658K6044j58701N2337
3809g864101Q0656j53877O5006o5845L13p3237J61043K4919N5304p3525k13143K05783
3797g850704o5035N2336M5643j62352O4965J510P6424L9828k82780j32081J79155J06620
3785g926471j06851K44094O773q276o7230o835j9263j38772P5911j8985J64590j06924
$$ y = [-7755168, -7918995, -7770982, -7777322, -7594090, -7680768, -7712668, -7735096, -7838327, -7808600, -7847439, -7956516, -7906888, -7876718, -7795647, -7740143, -7819270, -7860038, -7789881, -7843321, -7798438, -7819156, -7826915, -7715007, -7817108, -7876802, -7890367, -7786900, -7643283, -7610417, -7743517, -7730838, -7821028, -7687469, -7595824, -7806227, -7746520, -7679563, -7726938, -7762131, -7760085, -7905209, -7805469, -7752034, -7841509, -7960574, -7900121, -7769278, -7863101, -7747055, -7880618, -7837380, -7835791, -7900530, -7862004, -7840715, -7911650, -7822667, -7777123, -7783781, -7757737, -7916438, -7864101, -7783445, -7937322, -7872316, -7938161, -7937848, -8011085, -7850042, -7825123, -7769819, -7843344, -8056487, -7850704, -7915739, -7863403, -7817760, -7980112, -7915147, -7913637, -7837213, -7797385, -8080165, -8212246, -8033091, -7926471, -8033322, -7789228, -7782455, -7790731, -7857961, -7864796, -7884059, -8022831, -7946920, -7965905, -7801315, -7908239]
3773g908239P4215L5868o0742j5536q3732J09183j32657K8656J87941m0275o7232O6721
3761g805829n7247M5633N0953j83528j1006J20769N1469Q0994k30962n1844m1495K84837
3749g747256q8129j28150L3972l094K231m6828J20425k4725j97478J0085J99849j06568
3737g975666J36015p8484L6219k5441p8114N1694J11374J38213K21616m98862j8970N2093
3725g928313m8932N9053j08632o7495Q676p3882J45965m4403J40022p9568k0654Q0600
3713g937563r2545j0560J21088o6242l3211J15923j42956k40025K52850L5154j81654
3702h179741K46144J19398o6214N5154j04232J0687M6943o4320Q9919o4020j04128O3084
3690g951326k9398l8254M5516J05382j03227q712J8415j0443r6076O0767o2778J12286
$$ y = [-7908239, -7834024, -7798156, -7858898, -7874434, -7958166, -7848983, -7981640, -7952984, -7765043, -7805318, -7872550, -7805829, -7863076, -7817443, -7766490, -7950018, -7961024, -7840255, -7788786, -7707792, -7938754, -7990598, -8032093, -7747256, -7835385, -7963535, -7929563, -7932657, -7930426, -7977254, -7856829, -7881554, -8079032, -8068947, -7869098, -7975666, -7839651, -7918135, -7881916, -7907357, -7985471, -7933777, -7822403, -7684190, -7462574, -7961436, -7980406, -7928313, -7977245, -7918192, -8026824, -8094319, -8085643, -8159525, -8013560, -8057963, -7917941, -7997509, -8018163, -7937563, -8030108, -8040668, -7919580, -7985822, -8019033, -7903110, -8046066, -8286091, -8033241, -7998087, -8179741, -7933597, -7814199, -7880413, -7825259, -7929491, -7918804, -7871861, -7936181, -7846262, -7910282, -8014410, -7951326, -7980724, -8018978, -7973462, -7868080, -7971307, -7980019, -7961604, -7972047, -8068123, -8007356, -8070134, -7957848]
3678g957848p2013J17705l1004J17168j26405o020o9178P5746Q3782l3262p3373o271K6687
3665g954286l6069J1777J77452k13907n3556o317K32650p595J27653r8909q8798r7283
3653h007188R3294j57362L86052r6650p473j07302K5611Q9150k2931K4684q687O5955p0838
3640g793685j84263o4304K60229j29306O668n6668Q0048j395M3046j0549l51660N28539
3628g673300r8391j6050r8624j29631J14269o876n6297j32011m0312J17916L1111N6409
3616g931787O9282R8234j55272n4435m0124k14196K15669J53976j09102n2004K17920N000
3604g796839l1473q0930n721J99518j70337K4139J69498r7734K9209o4226m1156k65753
3592h131805K24444P5565N7691R8235k5979j80107J30713j10542m3534j43400L2376L26241
$$ y = [-7957848, -8029861, -7912156, -7943160, -7825992, -7952397, -7958417, -8027595, -7951849, -7868067, -7901329, -7974702, -7980973, -7954286, -7990355, -7978578, -7801126, -8015033, -8068589, -8074906, -7842256, -7849851, -7722198, -7821107, -7909905, -8007188, -7913894, -8071256, -7685204, -7781854, -7789327, -7896629, -7871018, -7781868, -7804799, -7780115, -7788802, -7722847, -7793685, -7977948, -8042252, -7782023, -7911329, -7904661, -7961329, -7881281, -7882676, -7839630, -7850179, -8201839, -7673300, -7771691, -7787741, -7886365, -8015996, -7901727, -7908603, -7964900, -8096911, -8137223, -8019307, -7988196, -7931787, -7862505, -7764271, -7919543, -7973978, -8014102, -8228298, -8012629, -7858653, -7967755, -8019759, -7801839, -7796839, -7828312, -7909242, -7914963, -7715445, -7885782, -7861643, -7692145, -7789879, -7760670, -7824896, -7866052, -8131805, -7907361, -7831796, -7774105, -7675870, -7701849, -7881956, -7751243, -7861785, -7905319, -8048719, -8016343, -7690102]
3580g690102j19906K7766Q742L999K8104o9675R8447N4014j74898m7487K27441k46464
3568g900019j8277k4199O6729j7916j17224R3069K1177j28644k0806N821J8053J45549m097
3555g880784o3146P9485j00855q923M5448Q7384j04775M4877j41009J09984Q1257j71256
3543h022313p4169R2804m9576O213J72909j19165l46o2504J14451o8947Q7466P1612j31756
3530g983321M5283m6580q5706Q1120P6068j03912N0296O7669q4023J9860K0306p3517J2777
3517h003680J8343J43965n9997k52517M467N8298j11542J18483R3037k0449j86990L42824
3505g855758k6399k66569J38478j36309o6443K33734K33172k2587k64666Q1453p3520K019
3493h023395m2287J79995j6093m7781k054K2868m0222j58062k2807L14324n9811q7434
$$ y = [-7690102, -7810008, -7782242, -7773500, -7769501, -7741397, -7811072, -7712625, -7658611, -7833509, -7880996, -7653555, -7900019, -7918296, -7942495, -7875766, -7893682, -8010906, -7917837, -7896660, -8025304, -8046110, -8040289, -8022236, -7876687, -7880784, -7943930, -7864445, -7965300, -7974223, -7928775, -7841391, -7946166, -7901289, -8042298, -7932314, -7851057, -8022313, -8096482, -8003678, -8053254, -8047041, -7874132, -7993297, -7993643, -8056147, -7941696, -8010643, -7923177, -7851565, -7983321, -7938038, -7984618, -8070324, -7989204, -7913136, -8017048, -7966752, -7899083, -7983106, -7963246, -7942940, -8016457, -8003680, -7985337, -7841372, -7901369, -8153886, -8149419, -8091121, -8202663, -8084180, -7991143, -8011592, -8198582, -7855758, -7882157, -8148726, -8010248, -8146557, -8213000, -7979266, -7746094, -7768681, -8033347, -7951894, -8025414, -8023395, -8065682, -7885687, -7901780, -7949561, -7951615, -7928747, -7968969, -8127031, -8149838, -7835514, -7895325, -7982759]
3481g982759R7125p9901n653M2096q4858J46753o4823L8709q815O737j50242J95787j98143
3468h047987R2642K0562j40812K20195J2831j3999L47793n70350J03296J08437j21027
3457g988419j07555O4898r5347m227J20802l1403J13054o2285o5461J00134j95777J46373
3445h005213J45787l2576j42324o2680n1757M3844j8905J03108K2359j26274J33153J48321
3433g843157r1428R8034L8199k2708k04161j5711J26050r4329l3858R7940r9430L8343
3421h006216J43388O526j50666N7436j9029J59500j97579n5418L2062J41382j54664p6154
3409h119432k7349J60268n0477J58164j37415O07n7163n112K2084o7642j00183J99817
3397h023833K0902J3105J8218r3412R428R0513m541j14226K1751O0432q04j8793k8317
$$ y = [-7982759, -7885634, -7965535, -7971188, -7929092, -8013950, -7867197, -7932020, -7893311, -7902126, -7895389, -8045631, -7849844, -8047987, -7955345, -7934783, -8075595, -7855400, -7842569, -7856568, -7508775, -8079125, -7975829, -7867392, -7988419, -8095974, -8031076, -8126423, -8130650, -8009848, -8041251, -7928197, -7990482, -8055943, -7955809, -8151586, -8005213, -7859426, -7892002, -8034326, -8097006, -8148763, -8104919, -8123824, -8020716, -7998357, -8124631, -7991478, -7843157, -7934585, -7836551, -7798352, -7821060, -8025221, -8040932, -7914882, -8009211, -8043069, -7945129, -8044559, -8006216, -7862828, -7856302, -8006968, -7949532, -7968561, -7809061, -8006640, -8062058, -8029996, -7888614, -8043278, -8119432, -8146781, -7986513, -8036990, -7878826, -8016241, -8015634, -8072797, -8077909, -8055825, -8123467, -8223650, -8023833, -8002931, -7989826, -7971608, -8065020, -8055592, -7965079, -7969620, -8083846, -8062095, -8001663, -8002467, -8021260, -8049577]
3384h049577J77870r0593n1158m6089q7005J25676j18384N1845j2893J9521P3768L6923
3372g970096J020q3293k03253K99983q7924j9805J48370n3582j25552J69034J41793n5804
3360g839109L3202j60002N7027l7455K2754M6370L673P791r7981J02962J68017j05459m116
3347g802326P1868j68380M2648j01609K01034M2297l5308k7263m0352k00275K38008q8537
3335g868195J0927p459J3821J04426o4091o7128M7492p1580Q147J59988R3802j7956M1567
3322g616239k7837j03006J43395m9869J13222j91370l3078O7768k5728J81080l3409p9130
3310g654201J89164r1574q7283j07418J93774n3737J32619j03078R2328Q7428o2438J9126
3298g445290J06461J06398O1645m482J50123l05340J62855J87114p0712n9884J11336
$$ y = [-8049577, -7871707, -7962300, -8013458, -8059547, -8146552, -8020876, -8139260, -8087415, -8100308, -8080787, -8007019, -7970096, -7969076, -8052369, -8255622, -7955639, -8043563, -8063368, -7914998, -7968580, -8094132, -7925098, -7783305, -7839109, -7805907, -7965909, -7908882, -7946337, -7923583, -7877213, -7873540, -7865749, -7963730, -7860768, -7692751, -7798210, -7802326, -7730458, -7898838, -7856190, -7957799, -7756765, -7714468, -7749776, -7777039, -7817391, -8017666, -7779658, -7868195, -7857268, -7864727, -7850906, -7746480, -7810571, -7877699, -7830207, -7901787, -7893640, -7733652, -7639850, -7657806, -7616239, -7644076, -7747082, -7603687, -7653556, -7540334, -7731704, -7764782, -7697014, -7722742, -7541662, -7575071, -7654201, -7465037, -7556611, -7643894, -7751312, -7557538, -7611275, -7478656, -7581734, -7489406, -7401978, -7464416, -7445290, -7338829, -7232431, -7170786, -7175268, -7025145, -7330485, -7167630, -6980516, -7051228, -7111112, -6999776]
3287f999776j48854K07159o7566j18869J9011m6925k02836j19261k5387k8444k16411n5073
3275g803232n6628k5437L2945J37715K2453r609j10674J49383l3484J55212j00043j16392
3263g757791k07646M8203j27494J08825r3358K0232M4378o4026L6214n1826o0939J44621
3251g960607j23159N2402J1400P7410J4059k20933l1911J65854K8909K9230q7409K02829
3239g841926r1181j82951J60276O9196r8515n99968O62561J00481m2917k3313m814Q1251
3227g811820J388n10968K59382J4763Q0177O4702J7435q0178j25322J40022J73113k03727
3215g981033K4782j16665P7569l6064K05746j08217J23796O9154l08883J91233j6325
3204g874907j61381l5562o5334J05291j02106J04184n5190K715l754O9035k9611j19962
$$ y = [-6999776, -7148630, -6941471, -7009037, -7127906, -7108895, -7155820, -7358656, -7477917, -7503304, -7531748, -7748159, -7803232, -7859860, -7885297, -7852352, -7714637, -7692184, -7701793, -7812467, -7663084, -7696568, -7541356, -7641399, -7757791, -7965437, -7917234, -8044728, -7935903, -8029261, -8009029, -7964651, -8028677, -7992463, -8044289, -8105228, -7960607, -8083766, -8031364, -8019964, -7942554, -7928495, -8149428, -8181339, -8015485, -7986576, -7957346, -8044755, -7841926, -7933107, -8116058, -7955782, -7886586, -7985101, -8585069, -7922508, -7822027, -7864944, -7888257, -7893071, -7811820, -7810432, -8321400, -8062018, -8047255, -7967078, -7902376, -7884941, -7965119, -8090441, -7950419, -7777306, -7981033, -7956251, -8072916, -7995347, -8031411, -7825665, -7933882, -7810086, -7740932, -8049815, -7858582, -7874907, -8036288, -8071850, -8137184, -8031893, -8133999, -8029815, -8085005, -8082290, -8086044, -8017009, -8046620, -8166582]
3192h166582Q4305P0132j5841j32204L6150L307R7890q7118K44580j73859O704n8043
3180h090579j32890Q9665M4386M9574M0821j01500r6908Q1374J47771J7045o3379j851
3168h016471j0344K11857j37543j9256N405M7557q1125O6754J2238j41457J79055q3827
3156g967157q6446L5991j32427R6403k6309r0012M5351P8691m7908M0800o2127J26882
3144g988268P7614j98804J71210M9584j35088n0635o3373J5680J1032J38203o4493p6397
3132h113735p6290l5917j7262J0029O631K98662l5943p3935J7342q8805r2605J25296k6075
3119h102607k8368J02841K5419q1858l6680p8302Q9782r7471L3309m2823O5593P0909r1904
3106h172160J79666k43208Q0251j35287K68516k95434K8832r4816K13506J38466r5741p482
$$ y = [-8166582, -8082277, -8012145, -8027986, -8160190, -8124040, -8120733, -8022843, -8109961, -7865381, -8039240, -8032536, -8090579, -8223469, -8133804, -8089418, -8039844, -7999023, -8100523, -8197431, -8116057, -7968286, -7951241, -8014620, -8016471, -8026815, -7814958, -7952501, -7971757, -7966352, -7918795, -7999920, -7933166, -7920928, -8062385, -7883330, -7967157, -8053603, -8017612, -8150039, -8053636, -8079945, -8169957, -8124606, -8045915, -8093823, -8053023, -8115150, -7988268, -7910654, -8109458, -7938248, -7888664, -8023752, -8074387, -8137760, -8122080, -8111048, -7972845, -8037338, -8113735, -8190025, -8225942, -8243204, -8233175, -8226544, -7927882, -7963825, -8037760, -8020418, -8109223, -8201828, -8076532, -8102607, -8130975, -8028134, -8002715, -8084573, -8121253, -8199555, -8109773, -8207244, -8173935, -8216758, -8151165, -8080256, -8172160, -7992494, -8235702, -8155451, -8290738, -8022222, -8317656, -8288824, -8383640, -8170134, -8031668, -8127409, -8134891]
3094h134891p8846K10144M8584j57814p2239J6059K14032L8962j00255Q5383N4166j77537
3082h054252J7968J12515p9491l1760K5421J57052m7816o6960r7995o8933O9368n7033
3070h121916J39196p1636j22397j24548J28009m8027J32623j4103J56141m603l5390l5877
3058h022528M9130p404J6177q3828K3623O1496r0939L4459j13552j47042K72571n8201
3046h066038K1078j34891P7223J8518j04750N8198N1736Q093p7318l0831L6529L0882
3034h111571J30365k60164J14526q6138R2296N5239j48804m2864L0197k74678M21519m8105
3022h128182R995m9618P1054M0568K4213k37377N8459N7985J20422q4471R1598j40214
3010h165568O9655L322N523L4139j03482m3187k7062K07490o0524m7095j35381J03233Q645
$$ y = [-8134891, -8213737, -8003593, -7955009, -8112823, -8185062, -8169003, -7954971, -7916009, -8016264, -7930881, -7876715, -8054252, -8036284, -7923769, -8003260, -8035020, -8009599, -7852547, -7900363, -7967323, -8065318, -8134251, -8064883, -8121916, -7982720, -8054356, -8176753, -8301301, -8173292, -8221319, -8088696, -8102799, -7946658, -7951261, -7986651, -8022528, -7973398, -7980802, -7964625, -8048453, -8024830, -7963334, -8054273, -8019814, -8133366, -8280408, -8007837, -8066038, -8044960, -8179851, -8102628, -8084110, -8188860, -8130662, -8078926, -8070833, -8148151, -8178982, -8142453, -8111571, -7981206, -8241370, -8126844, -8212982, -8120686, -8065447, -8214251, -8257115, -8226918, -8501596, -8080077, -8128182, -8118187, -8167805, -8096751, -8056183, -8031970, -8269347, -8210888, -8152903, -8032481, -8116952, -8025354, -8165568, -8095913, -8092591, -8087068, -8052929, -8156411, -8199598, -8226660, -8019170, -8079694, -8126789, -8262170, -8158937, -8150292]
2997h150292l2056m3498J84483l38187r336Q0003r305J41084k35955L0987P3135J06903
2985h202034j62720Q314n480J68224p3517j1540q9574O3362m5699n2998J89157Q364m550
2972h210691j49335K5499j65028K0043P0877j79170K04524J19615m0133J0809j10313
2961h403303J04960q7060o2402J00878J02499k2569J15322p7887O7380j4258o6931j53873
2949h397244p7239P769K17917q9274K19396k6682q6814j07656J9612J7906J05511o4408
2937h261206l3609k567M0183j29p1080j3672J8395J96073J079P3939j32110Q9740J46588
2924g948376j15061J5595L4099M7424n1960K779J30071k5416N1139O217q1452j36504l2852
2911h104297Q6013j41488K50706m5808J05568J18214J7430j20945j99746J08386m7240
$$ y = [-8150292, -8182348, -8225846, -8041363, -8379550, -8388886, -8308883, -8318188, -8177104, -8413059, -8382072, -8308937, -8202034, -8364754, -8356440, -8361920, -8193696, -8267213, -8278753, -8368327, -8304965, -8350664, -8403662, -8214505, -8206141, -8210691, -8360026, -8334527, -8499555, -8479512, -8408635, -8587805, -8383281, -8263666, -8303799, -8292990, -8403303, -8298343, -8385403, -8447805, -8346927, -8244428, -8266997, -8151675, -8229562, -8162182, -8176440, -8243371, -8397244, -8474483, -8466714, -8248797, -8338071, -8118675, -8145357, -8232171, -8339827, -8320215, -8302309, -8196798, -8261206, -8294815, -8297382, -8257199, -8257328, -8328408, -8342080, -8323685, -8127612, -8126533, -8052594, -8184704, -8094964, -7948376, -8063437, -8047842, -8013743, -7966319, -8018279, -8015500, -7885429, -7910845, -7859706, -7853489, -7934941, -8071445, -8104297, -8018284, -8159772, -7909066, -7954874, -7849306, -7731092, -7713662, -7834607, -8034353, -7925967, -7973207]
2900g973207q6485J50883o4719n5866J74063q7147j6419l1749O3511j14771J21082j09714
2888h030538R7740o3342O7361O9321Q6759j7532j37135Q8514o1557k1996n1036Q1141M7644
2875g844656K6277j55269k7598J31150J21365o3498J7891K8994o6295K1564M9789p6535
2863g836821O2275j6021J06141j05383l9356r0231R116K15212p2911P5343j86884O429
2851g873091J43022l7639N7786P0440r002n2557k2155j38694R3488k08112J58798p2935
2839g890651q9012J37642L3720l7801m7742R8061J46286j65703n2356P0609l5728O8984
2827g763691o3250N528l6280R0423K789L6010j90829J15343J50211k2044m3103M93025
2815g225868n96916j31202J2271L90383k01817k1603j70231J75967N0307o476J01465
$$ y = [-7973207, -8059692, -7908809, -7973528, -8029394, -7855331, -7942478, -7958897, -7990646, -7927135, -8041906, -7920824, -8030538, -7932798, -7996140, -7928779, -7859458, -7772699, -7790231, -7927366, -7838852, -7900409, -7922405, -7973441, -7892300, -7844656, -7818379, -7973648, -8001246, -7870096, -7748731, -7812229, -7794338, -7765344, -7831639, -7810075, -7760286, -7836821, -7774546, -7790567, -7684426, -7789809, -7829165, -7919396, -7910280, -7695068, -7767979, -7692636, -7879520, -7873091, -7730069, -7767708, -7709922, -7639482, -7648484, -7701041, -7723196, -7861890, -7768402, -7976514, -7817716, -7890651, -7979663, -7842021, -7808301, -7846102, -7893844, -7795783, -7649497, -7815200, -7867556, -7796947, -7832675, -7763691, -7826941, -7821413, -7857693, -7767270, -7764481, -7728471, -7919300, -7803957, -7653746, -7675790, -7718893, -7225868, -7822784, -7953986, -7941715, -7551332, -7753149, -7774752, -7944983, -7769016, -7718709, -7725185, -7623720]
2804g623720j75182J44856j50665R6812r063J804J42372k312k7570n5233J01373q2942
2792g639470j96581N8305J61031p66994N19009k5502O7283m626j00717L9405K32408Q5358
2780g571091j61861J58994M718r2038K2403j07797J49640L5020n9040l6965m4380K0412
2768g681985N0620k4522L4006j7335j9269j21562Q3908q3541j00682N8407J883l8766R7503
2755g761335l6995K2152J95593K7869o5001k03187P0029j20701P7105J09977N0193N9831
2743g574470n5269k67622J7097n6834k32797K10800J20061N0370l5783j24784J80900L9280
2731g729051K6097Q5496n719j50857J5625m6594J92343L45165j32638J09157P1565J38279
2719g081132k52449L2356j18690J27292j01537R3115O9410o8348m4441j13642M7898L8544
$$ y = [-7623720, -7798902, -7654046, -7804711, -7707899, -7716962, -7715158, -7572786, -7575098, -7602668, -7657901, -7556528, -7639470, -7836051, -7777746, -7616715, -8383709, -7864700, -7890202, -7822919, -7827545, -7928262, -7888857, -7656449, -7571091, -7732952, -7573958, -7569240, -7661278, -7638875, -7746672, -7597032, -7562012, -7621052, -7658017, -7702397, -7681985, -7631365, -7655887, -7621881, -7639216, -7658485, -7780047, -7696139, -7779680, -7880362, -7821955, -7820072, -7858838, -7761335, -7798330, -7776178, -7580585, -7552716, -7617717, -7820904, -7750875, -7871576, -7794471, -7684494, -7634301, -7574470, -7629739, -7897361, -7880264, -7937098, -8169895, -7959095, -7839034, -7788664, -7824447, -7949231, -7768331, -7729051, -7702954, -7617458, -7623177, -7774034, -7758409, -7805003, -7612660, -7267495, -7400133, -7290976, -7219411, -7081132, -7333581, -7301225, -7419915, -7292623, -7394160, -7301045, -7231635, -7299983, -7344424, -7458066, -7410168, -7371624]
2707g371624J5179L6168k5084J22902k13j9760Q0083r6958K11484r9808K07615o1168l107
2694g004291j37420J07557N8246J5863m7327K28793j24740n7245J35809j08764N9035o1882
2682f936366J0287j23580l9804k04427N2321M7745K4788j97515L5307m9929Q7444j42267
2670g435996q7446P7899N9950L91669j40403K4621k8469m9306K8775J02116j69127J24086
2658g101631R6311j0678J71407k63568m7013j21661p7990K6593n2298n5382r2711l31133
2646g859754k44460P5355L9428j44165p1659M3725J29576J33216J42434j65865J14861
2635g807308m1652N9472K4045j37624J08751m3772K8828j73133K22095m5913p273j8176
2623g831660J53663j64812K40958r933j43283L0795p3210M267q5814j0658O1033L94746
$$ y = [-7371624, -7356445, -7320277, -7345361, -7222459, -7222672, -7242432, -7162349, -7259307, -7047823, -7147631, -6940016, -7001184, -7004291, -7141711, -7034154, -6975908, -6960045, -7007372, -6778579, -6903319, -6960564, -6824755, -6933519, -6874484, -6936366, -6926079, -7049659, -7089463, -7293890, -7241569, -7193824, -7169036, -7366551, -7331244, -7381173, -7293729, -7435996, -7523442, -7445543, -7385593, -6993924, -7134327, -7109706, -7138175, -7187481, -7158706, -7056590, -7225717, -7101631, -7005320, -7015998, -6844591, -7108159, -7155172, -7276833, -7354823, -7328230, -7380528, -7435910, -7528621, -7859754, -8104214, -8028859, -7989431, -8133596, -8205255, -8161530, -8031954, -7898738, -7756304, -7922169, -7807308, -7848960, -7789488, -7765443, -7903067, -7794316, -7838088, -7809260, -7982393, -7760298, -7806211, -7813484, -7831660, -7677997, -7842809, -7601851, -7611784, -7755067, -7724272, -7797482, -7793215, -7879029, -7889687, -7828654, -7433908]
2611g433908J962L93248k52729J14151J96707K07377k19q9406O673M57689K75717J67390
2599e955348P2180K89137j43938P2976j24161j93139J13432q400o380K1706Q7711J16970
2587e657254q5338p7986R1065j78704J56061J44859o1469j24871j26667M1625R5904P2251
2575e710524n6215K6378L36945K0989J04048J80632J15201p2024j23241j38560j43094
2564e459465J05224k9549N9212j34584k06605k93659k09248K4271j07853k6910M49425
2553e829741N60889M18188L35241J63154O00857L84892L92624O90722O83563O35140Q31866
2542a32605N78701P77157R63551Q29546K83210K10595L94853Q01895Q88916J071639P19169
2531G386627P16896M06047N17188M01467O73876Q57238Q64023P38587O23563R4718n9813
$$ y = [-7433908, -7431946, -7038698, -7291427, -7177276, -6980569, -6773192, -6773411, -6862817, -6856144, -6398455, -6122738, -5955348, -5883168, -5594031, -5737969, -5664993, -5789154, -5982293, -5868861, -5877261, -5883641, -5861935, -5774224, -5657254, -5742592, -5820578, -5729513, -5908217, -5752156, -5607297, -5668766, -5793637, -5920304, -5878679, -5782775, -5710524, -5766739, -5740361, -5403416, -5382427, -5278379, -5097747, -4982546, -5054570, -5177811, -5316371, -5459465, -5354241, -5383790, -5324578, -5459162, -5665767, -5959426, -6168674, -6144403, -6252256, -6279166, -5829741, -5268852, -4850664, -4515423, -4352269, -3751412, -3366520, -2973896, -2283174, -1599611, -964471, -132605, 446096, 1223253, 2186804, 3016350, 3299560, 3510155, 3905008, 4706903, 5595819, 6667458, 7386627, 8103523, 8509570, 9026758, 9428225, 10102101, 10959339, 11823362, 12561949, 13185512, 13280230, 13220417]
2520A3220417j6037J70886K43323L89830L23323K73960j00461j75359L58292N33169M39786
2509A5661129P52587Q03013R24745N64650O33591N78626Q96249J176317J277998J226320
2499B4495225J347503J546518J189287J190536J033997J389556J035373J084939J198452
2490C5511386P24992L98483Q40100J043233J141259J108752J103091Q94655J087916R68471
2480D4822338O26103Q63040J057937J176514J220711J469388J413662J818270K050164
2471E6518127J125396P27275M52784J7617M16579J259497J575377K020563K631809K452308
2461F9197332K083669J875872J148956J276935K095749K653902K848943K463294L198745
2452H8843397M145190L644043q09848l968511l887067k439867j609316j007849j039774
$$ y = [13220417, 13204380, 13375266, 13618589, 14008419, 14331742, 14605702, 14505241, 14329882, 14688174, 15221343, 15661129, 16413716, 17216729, 18141474, 18706124, 19339715, 19918341, 20814590, 21990907, 23268905, 24495225, 25842728, 27389246, 28578533, 29769069, 30803066, 32192622, 33227995, 34312934, 35511386, 36236378, 36634861, 37474961, 38518194, 39659453, 40768205, 41871296, 42765951, 43853867, 44822338, 45448441, 46311481, 47369418, 48545932, 49766643, 51236031, 52649693, 54467963, 56518127, 57643523, 58370798, 58823582, 58841199, 59257778, 60517275, 62092652, 64113215, 66745024, 69197332, 71281001, 73156873, 74305829, 75582764, 77678513, 80332415, 83181358, 85644652, 88843397, 92988587, 96632630, 95822782, 91854271, 87967204, 85527337, 83918021, 82910172, 81870398]
2443H1870398j321062k62546j40763Q81288J439152K354276L304990L403508M404687
2434I5933928N318563N392069N983590P333991Q517512J0632941J3161046J5752888
2426A68026528J7759449J9302534K0547438J8355247J3174983Q984192Q271871Q581428
2418B83003670Q093453J0151017J2181617J4425939L088208j6481984k5083281l0159166
2410B59219473k9676153k7738421k7705300k7685797k4176500j8363187j1431565p503538
2402H4939012n969707o183968m705183j842829M22594O26863m37052j721747j892101
2393F3235882k452763k488550k866998k304648k478081k590281l174881l441267l761279
2384C7677134m727641m429172m745007m356282l783914l781570l283172k711939k421129
$$ y = [81870398, 80549336, 80286790, 80146027, 81027315, 82466467, 84820743, 88125733, 91529241, 95933928, 101252491, 106644560, 112628150, 119962141, 128479653, 139112594, 152273640, 168026528, 185785977, 205088511, 225635949, 243991196, 257166179, 266150371, 274422242, 283003670, 291097123, 301248140, 313429757, 327855696, 330943904, 314461920, 289378639, 259219473, 229543320, 201804899, 174099599, 146413802, 122237302, 103874115, 92442550, 84939012, 78969305, 72785337, 68080154, 66237325, 66659919, 67286782, 66849730, 65127983, 63235882, 60783119, 58294569, 55427571, 53122923, 50644842, 48054561, 44879680, 41438413, 37677134, 32949493, 28520321, 23775314, 19419032, 15635118, 11853548, 8570376, 5858437, 3437308]
2375C437308k203105j485311j434483j319440r62368k09647R8859P19524N28308R93340
2365a837015P01956L84858J50033r2982J31793J73821N17613Q57762L70778R10843P01730
2354B971190j69087N07476N58702n38516o37777r09586q29497l61028l58619m12608p51784
2343i31134m05487l38702p7746M3640K15264L95518J59242N87620O35713O35516M09396
2332A328840K40372O6409Q9086q1936j80723l96776n42510m99510l55652k95059l57824
2321i85283L16809m56510n04485q20683m27272q50250q47017m58208k81005j62409k47715
2310e724028n24502p41150j011002j129605j041721n62018j06079k39408l91853L8323
2300a1433043J41752L35394N33382K90118M16408L59192O16104M88984O57642K20702
$$ y = [3437308, 1234203, -251108, -1685591, -3005031, -3967399, -4177046, -4078187, -3358663, -2830355, -1837015, -1135059, -750201, -600168, -693150, -561357, -387536, 130077, 987839, 1358617, 2269460, 2971190, 2802103, 3309579, 3868281, 3329765, 2691988, 1782402, 952905, 591877, 233258, -179350, -931134, -1336621, -1675323, -1753069, -1709429, -1494165, -1098647, -939405, -351785, 283928, 919444, 1328840, 1569212, 1635621, 1724707, 1642771, 1462048, 1065272, 522762, 23252, -332400, -627459, -985283, -668474, -1124984, -1629469, -2450152, -2877424, -3727674, -4574691, -5032899, -5313904, -5476313, -5724028, -6248530, -6989680, -8000682, -9130287, -10172008, -10734026, -10840105, -11079513, -11471366, -11433043, -11291291, -10955897, -10422515, -10132397, -9715989, -9356797, -8740693, -8251709, -7594067, -7373365]
2290g373365J95004J61030J30706R7297K04538L02996K21840K58108P5395J05337K60827
2279e360287P4896o1164K24961J82232J56036J84036J80568L38036K80019K77781L45161
2268c177725J55858n5222Q7178J19369M26669K57622L17768J52495P61114N02876J80369
2257b71629k05031J05122J01345K94858P01653P89048j31298l06171N21486J12517j576461
2246A35439j478943p97487n40865k5541L10952O4361k25111j47683j86591o2869M0523
2235b913815j85948j049546r30703o52839m6824K06743K92450J07540L15523L40222J10108
2224d407089J01444J73738K74714M0493L9973L9336q5417j50295k71997j94011J6433m8745
2212d471423j27986K11864k83880k40114k27359m62537j40868l36319m18599l38408k48547
$$ y = [-7373365, -7178361, -7017331, -6886625, -6789328, -6584790, -6281794, -6059954, -5801846, -5726451, -5621114, -5360287, -5285391, -5346555, -5121594, -4939362, -4783326, -4599290, -4418722, -4080686, -3800667, -3522886, -3177725, -3021867, -3077089, -2989911, -2870542, -2443873, -2186251, -1868483, -1715988, -954874, -451998, -271629, -476660, -371538, -270193, 24665, 726318, 1515366, 1384068, 1077897, 1599383, 1711900, 135439, -1343504, -2140991, -2681856, -2707397, -2396445, -2332084, -2557195, -2704878, -2891469, -2954338, -2913815, -3099763, -4149309, -5080012, -5732851, -5779675, -5572932, -5280482, -5172942, -4857419, -4517197, -4407089, -4305645, -4131907, -3857193, -3816700, -3776727, -3737391, -3822808, -3973103, -4245100, -4439111, -4422678, -4471423, -4599409, -4387545, -4671425, -4911539, -5138898, -5601435, -5742303, -6078622, -6497221, -6835629, -7084176]
2201g084176J0526k2151j0955j48078P321P1005j83739Q6734k4710o4635M24968j43351
2189g081241r9307l20j41370j24412m8403q2959r6114j79436q2275k74456l93013k37642
2177h840948l07169q5232p467O26k50404R1090l3440r6658J18080J64564J11359J50035
2165h985564r8596J9407j66851J73713j76015j06904K05745J12995p679J32121m9265P3020
2153h873873Q0884J30385k12851p043j24573J5964O429M1006m5081N4006j26133J09407
2141h951473j05760q4047q846J67618P7422n3182J55695r6561K762K14857r6795o7962
2129h846272j28682O6402r06J57782o7763q1432j10413K9879J42648j47906R1826J85420
2117h709417J77317q7083o1698l191J31142j6929q3121J057J73095M1516Q0824p2852K9209
$$ y = [-7084176, -7073650, -7095801, -7106756, -7254834, -7247513, -7176508, -7360247, -7273513, -7298223, -7362858, -6937890, -7081241, -7180548, -7180868, -7322238, -7446650, -7495053, -7578012, -7674126, -7853562, -7935837, -8210293, -8603306, -8840948, -9148117, -9233349, -9240816, -9240190, -9490594, -9399504, -9432944, -9529602, -9411522, -9246958, -9135599, -8985564, -9084160, -9064753, -9231604, -9057891, -9233906, -9340810, -9135065, -9022070, -9029749, -8897628, -8946893, -8873873, -8792989, -8662604, -8875455, -8882498, -9007071, -8991107, -8984678, -8943672, -8988753, -8934747, -9060880, -8951473, -9057233, -9141280, -9150126, -8982508, -8905086, -8958268, -8802573, -8899134, -8896372, -8681515, -8778310, -8846272, -8974954, -8908552, -8909458, -8751676, -8819439, -8900871, -9011284, -8981405, -8838757, -8986663, -8894837, -8709417, -8532100, -8619183, -8680881, -8684072, -8552930, -8569859, -8652980, -8651923, -8478828, -8437312, -8356488, -8429340, -8400131]
2104h400131r2780j1249M4429k50768k8753R2970L09756k84966J92219m2471O395J5743
2092h449606j03087j78648o5787R5168N5668l5633K7272J38411O9792j58264P279K15796
2080h381639k206p6417m5234K73212l0818Q8731R660K2827n4717j16184n5041J90702j366
2067h178490q3963Q9170j46524J48153m0962J76893m6255q2159j05419K2044J58410j27236
2055h216338J12179Q940J3077j95215M4822K14128j69207p3685r3575P0204q1596J7536
2043h348730j21202j599P6419K18676R1495m0000p9544J32324p6802j28469K6813k3303
2031h273922N4813n1111N5589q5420p8341j35810K7576P1506J21763R0457n9789l9059
2019h301748J48552q0414j48977K33837L5718J03516j45248J56209n5254J82276K7540
$$ y = [-8400131, -8492911, -8504160, -8459731, -8710499, -8739252, -8646282, -8336526, -8621492, -8429273, -8471744, -8465349, -8449606, -8552693, -8731341, -8797128, -8701960, -8646292, -8681925, -8654653, -8516242, -8446450, -8604714, -8597435, -8381639, -8383845, -8460262, -8505496, -8232284, -8263102, -8174371, -8164711, -8141884, -8196601, -8312785, -8367826, -8177124, -8178490, -8262453, -8173283, -8319807, -8171654, -8212616, -8035723, -8081978, -8164137, -8269556, -8247512, -8089102, -8216338, -8104159, -8095219, -8082142, -8277357, -8232535, -8018407, -8187614, -8261299, -8354874, -8284670, -8366266, -8348730, -8469932, -8471531, -8395112, -8176436, -8084941, -8124941, -8204485, -8072161, -8148963, -8277432, -8250619, -8273922, -8219109, -8270220, -8214631, -8300051, -8378392, -8514202, -8486626, -8415120, -8293357, -8202900, -8262689, -8301748, -8153196, -8233610, -8382587, -8148750, -8113032, -8009516, -8154764, -7998555, -8053809, -7871533, -7843993]
2008g843993M9321J65648J26577J54316j08859j3345m5644n5645p0597P0962R1960o0034
1996g539333m7719P7113j15891K1139J43103k7496k8426l6033j45651K28817j29890L0562
1984g569705O3077k8800l422j56600K33223M21545N7314J30484M1014j82041L58009Q332
1972f627570Q9637k03306O7653K84305j17619j4416K16287j09963M7439k66160j0642
1961f644355J84930j02584K03439k0403O0863k6096K33211m926k7651k4991O3927J88176
1949e916460O7689L46259O6040P5220r0290L86470L9112K24970R1793J41234R7163J35092
1937d335708o9088k87172m18864j99848k75459j05404q1293l63895n61830l86111J25582
1926f959090J12359j74577r8470J68651j8476Q6391K6899q0252J55853j2990j67140p2444
$$ y = [-7843993, -7794672, -7629024, -7502447, -7348131, -7456990, -7470335, -7515979, -7571624, -7642221, -7571259, -7479299, -7539333, -7587052, -7509939, -7625830, -7604691, -7461588, -7489084, -7517510, -7553543, -7699194, -7470377, -7600267, -7569705, -7506628, -7535428, -7538850, -7695450, -7462227, -7040682, -6983368, -6852884, -6811870, -6993911, -6635902, -6627570, -6537933, -6741239, -6673586, -6389281, -6506900, -6521316, -6305029, -6414992, -6367553, -6633713, -6644355, -6459425, -6562009, -6358570, -6378973, -6318110, -6344206, -6110995, -6115921, -6143572, -6168563, -6104636, -5916460, -5848771, -5502512, -5436472, -5361252, -5451542, -5065072, -5025960, -4800990, -4709197, -4567963, -4470800, -4335708, -4404796, -4691968, -5110832, -5310680, -5586139, -5691543, -5772836, -6136731, -6698561, -7084672, -6959090, -6846731, -7021308, -7119778, -6951127, -6969603, -6883212, -6856313, -6936565, -6780712, -6793702, -6960842, -7033286]
1914g033286Q6524l08258P261R4310q6105j84228k57008j73195j22834l58084r8936M3336
1902h390503l6118k03168R0818K36393j78362L00886j1453K5473J2394M1010L26701j43034
1890g928963N903j2437R7814N9170J81845m9630M8730j66943j27566J00925L6914k5890
1878g780128J23861L4236j92422m6900j29197J71597J18118J9873P9695j09622R7554m0493
1866g653828J1342R7302J08521j7546O0161p2209J45222L148N5784j74222N6961j04142
1854g483506j37083K05780J1751O343k4931J33300R3241q3742M2591P2042K604J45162
1842g016448m0317L1850J7605J81184l3015R5164r8738K3741R7367J62013J44228k19962
1830f655328N1491J11404J2378k92662k18376N5096j59546K8674K4498J02000k3744J29922
$$ y = [-7033286, -6946762, -7255020, -7247759, -7153449, -7239554, -7423782, -7680790, -7853985, -7976819, -8334903, -8433839, -8390503, -8426621, -8629789, -8538971, -8302578, -8480940, -8180054, -8191507, -8166034, -8153640, -8112630, -7785929, -7928963, -7923060, -7935497, -7837683, -7778513, -7596668, -7646298, -7597568, -7764511, -7892077, -7791152, -7754238, -7780128, -7656267, -7622031, -7814453, -7861353, -7990550, -7818953, -7700835, -7680962, -7601267, -7710889, -7613335, -7653828, -7642486, -7545184, -7436663, -7454209, -7394048, -7466257, -7321035, -7317887, -7262103, -7436325, -7379364, -7483506, -7620589, -7414809, -7403058, -7396715, -7421646, -7288346, -7195105, -7278847, -7236256, -7164214, -7161610, -7016448, -7056765, -7024915, -7007310, -6826126, -6859141, -6763977, -6862715, -6838974, -6741607, -6579594, -6435366, -6655328, -6603837, -6492433, -6480055, -6772717, -6991093, -6935997, -7095543, -7066869, -7042371, -6940371, -6964115, -6834193]
1818f834193J72377M6805j16514J43128J44411K54338O7716J07066J05326k9586j21711
1807f060837M03056J12732J18315l8198J50674j73638R2467J20418P7728K07171Q1128
1796d908984j32773m9330J0664L9380j4557o418m0782j12404L84613k89767j31618l06089
1784e558065k08570M06013P7184J87855j23043O5339K14117r4787L8914M7889p9199m9378
1772e075731J94751J05261m7904o5182p8943k72009k39859J79314M3590Q0703Q4783j63147
1760e254373j21800j04486k83534l62216J7050L45489L31347K71624K5506P6423Q3518K845
1748d972607k25786m50869k05772l85098j8509J67331O4935j31403R4486M3981P6893
1737e942418J95917o9405k77739j52641J02768M880k80375J37520k0676L47190L04731
$$ y = [-6834193, -6661816, -6615011, -6731525, -6588397, -6443986, -6189648, -6121932, -6014866, -5909540, -5939126, -6060837, -5657781, -5545049, -5426734, -5464932, -5314258, -5487896, -5395429, -5275011, -5197283, -4990112, -4908984, -5041757, -5091087, -5080423, -5041043, -5055600, -5062018, -5102800, -5215204, -4830591, -5120358, -5251976, -5558065, -5766635, -5360622, -5283438, -5095583, -5218626, -5153287, -4939170, -5033957, -4995043, -4947154, -5026353, -5075731, -4880980, -4775719, -4823623, -4888805, -4967748, -5239757, -5479616, -5300302, -5256712, -5176009, -5091226, -5254373, -5376173, -5480659, -5764193, -6126409, -6109359, -5763870, -5432523, -5160899, -5135393, -5058970, -4975452, -4972607, -5198393, -5649262, -5855034, -6240132, -6258641, -6091310, -6026375, -6157778, -6063292, -6019311, -5942418, -5746501, -5815906, -6093645, -6246286, -6143518, -6138638, -6419013, -6281493, -6302169, -5954979, -5650248]
1726e650248K31569L82465K17822j7608j08621k93850m17792l32583j69876l13186L0683
1715f441225M80672K50658N74841K21949O7774J84786o079j15178q6130j30650n0795J3685
1703e035692q8037R9140j49510r3460p4960K04133L30871M64012M47758N42832J88329
1692c164584J38365k06653k69398K4918K78140M58160L59809N75056M71375P4711Q8262
1681a171839l48152k70030j84531q957K35667L65013J78093J26140j7119m24681m54375
1670a974771l55453j3555K67755N26327Q13086L40757J98040L18688q5610Q2163J6570
1659A33997J60128M19638L57438O60823K20936k20413m69187m92928k04391K9420M06198
1648A001659O08012P63988N55748J3664j93959k87427k12185k41142M56314J000099
$$ y = [-5650248, -5418679, -5036214, -4818392, -4836000, -4944621, -5238471, -5656263, -5988846, -6158722, -6471908, -6441225, -5960553, -5709895, -5135054, -4913105, -4845331, -4660545, -4666624, -4781802, -4867932, -4998582, -5049377, -5035692, -5123729, -5024589, -5174099, -5267559, -5342519, -5138386, -4807515, -4343503, -3895745, -3352913, -3164584, -3026219, -3232872, -3502270, -3477352, -3199212, -2741052, -2381243, -1806187, -1334812, -1260101, -1171839, -1519991, -1790021, -1974552, -1983509, -1747842, -1382829, -1204736, -1078596, -1095715, -1520396, -1974771, -2330224, -2343779, -2076024, -1549697, -736611, -395854, -197814, 120874, 35264, 117427, 133997, 294125, 713763, 1071201, 1732024, 1952960, 1732547, 1263360, 770432, 566041, 595461, 1001659, 1609671, 2373659, 2929407, 2943071, 2749112, 2461685, 2249500, 2008358, 2464672, 3464771]
1638C464771J045247O84518M52358J47863J75046m7336l42695j93112Q8830L25046M53309
1627F253845K73499j19962o85151j93292L33734Q93464J137351J295116J070862P84310
1617A1043776L53685J58828L19151N22238P44278J294824J620313J369132J342584O95802
1607A9464611K72800N92378O01898P78426R61204J319293J541523J547825J559487J438247
1597C0077692J756310K331059K513430K197422J710327J136032R30833R98583J006704
1588D4658392J200938J550207K081104K135729K430520K476774K425018K150008K013644
1579F3122334K690524L359644M209622M753519N178087N317498N066020M809687M955890
1570A03462825N924697P508022P846560P447682P207405P102179O905935N196060L212283
$$ y = [3464771, 4510018, 5194536, 5646894, 5794757, 5969803, 5922467, 5579772, 5386660, 5475490, 5800536, 6253845, 6527344, 6407382, 5722231, 5528939, 5862673, 6756137, 7893488, 9188604, 10259466, 11043776, 11397461, 11556289, 11875440, 12397678, 13141956, 14436780, 16057093, 17426225, 18768809, 19464611, 19737411, 20329789, 20931687, 21710113, 22671317, 23990610, 25532133, 27079958, 28639445, 30077692, 31834002, 34165061, 36678491, 38875913, 40586240, 41722272, 42653105, 43651688, 44658392, 45859330, 47409537, 49490641, 51626370, 54056890, 56533664, 58958682, 61108690, 63122334, 65812858, 69172502, 73382124, 78135643, 83313730, 88631228, 93697248, 98506935, 103462825, 109387522, 116895544, 124742104, 132189786, 139397191, 146499370, 153405305, 158601365, 161813648]
1561A61813648J284430J124655K600408M911018O274016N972132N047669L144730q25086
1552A91347620n700846r752375r830841n112983J722353O706108Q473338Q682225Q195601
1543A94730200R112243J1921538J4905422J6297991J6114421J6069864J7565116J6244767
1535C12961562R411622N24533k903317n24723N822047J2178022J4504622R263451l4835
1526C61202984p359504j7577576l5902651n0301389m5481606k6356592o563898N687623
1518A77347391R371448Q432561P528899R985535J3868223J6144280J6421324J6097300
1510B75196961J5973853J5378563J0553640N41211n323844l854967K100074R382394
1502C19947885J3693746J0119066J14848q817232j8041566l5552216n6195917o0288647
$$ y = [161813648, 163098078, 164222733, 166823141, 171734159, 178008175, 183980307, 189027976, 192172706, 191347620, 185646774, 175894399, 166063558, 160950575, 162672928, 169379036, 177852374, 186534599, 194730200, 203842443, 215763981, 230669403, 246967394, 263081815, 279151679, 296716795, 312961562, 322373184, 322897717, 319994400, 319469677, 325291724, 337469746, 351974368, 361237819, 361202984, 353843480, 336265904, 300363253, 250061864, 204580258, 178223666, 171659768, 177347391, 186718839, 195151400, 202680299, 212665834, 226534057, 242678337, 259099661, 275196961, 291170814, 306549377, 317103017, 317644228, 312320384, 308465417, 310565491, 319947885, 333641631, 343760697, 343875545, 335058313, 317016747, 281464531, 225268614, 164979967]
1494A64979967m4394909k2087051n101712L278077M570497L161687L757055O134419
1486A14298030P622311P414790O454651N121461M160626J510725p49561k921631k213267
1477A40698135k5002K319746L852604K529085k98410l164022p237126j4610495k2251286
1468A01813229k4454177k0072887j3509506p044416k834822j167351o45424j53080j8770
1459C1912796L39707K49351K16302m08555n43436J09033j12356L75586L91203M9597j59504
1448C2419724m77480p56616r50053n80148l50297q55022j071294j403334j974484k228025
1438B1772971l023048k448970j902602j526686p95020o32833j024130o44534l14507m48170
1428I012471n46939K59329P82186J170891J516560O50523O5855j48240l02556o65744
$$ y = [164979967, 120585058, 98498007, 93396295, 96674372, 101244869, 104406556, 108163611, 114298030, 121920341, 129335131, 135789782, 140911243, 145071869, 146582594, 145833033, 142911402, 140698135, 140673133, 142992879, 146845483, 149374568, 149076158, 145912136, 138675010, 124064515, 101813229, 77359052, 57286165, 43776659, 36732243, 33897421, 32730070, 32084646, 31931566, 31912796, 32252503, 32501854, 32718156, 32309601, 31766165, 31875198, 31762842, 32138428, 32529631, 32579228, 32419724, 31942244, 31185628, 30235575, 29655427, 29305130, 28450108, 27378814, 25975480, 24000996, 21772971, 18749923, 16300953, 14398351, 12871665, 12076645, 11443812, 10419682, 9775148, 9460641, 9012471, 8465532, 8724861, 9507047, 10677938, 12194498, 12845021, 12910876, 12762636, 12460080, 11794336]
1418A1794336q80537q17807o17344m6665J192195P81064m48943p46193k09727k09092
1408I791287r96894j442726p41703J68973R48605J284264J322855M70009m44928r99897
1398I359845j665934k067202k879207l236992k809970k323050j251139k45325K72910
1389f846064N76893J426963J569319J042471q8644j28230p9682P1708J98876M56794k16271
1378b015867k78802k89897l32043m96570j09946J211679J873207J794605J414921Q09933
1368C581220k35621j499895j653421j179914l11743O32825J34326J469630J784767J903945
1358D626119J068921J2650o01574r243R08329K092376J320073k46038r21521k79701k521
1347G967870m39718l89515M1662R1591J277044J047371r11626j125545M65932R6994p21793
$$ y = [11794336, 10913799, 10095992, 9478648, 9431983, 10624178, 11405242, 10956299, 10210106, 10000379, 9791287, 8794393, 7351667, 6609964, 6778937, 7727542, 9011806, 10334661, 10804670, 10359742, 9359845, 7693911, 5626709, 2747502, -489490, -3299460, -5622510, -6873649, -7118974, -6846064, -6269171, -4842208, -3272889, -2230418, -2319062, -2447292, -2526974, -2455266, -2256390, -1799596, -2015867, -2294669, -2584566, -2916609, -3413179, -3523125, -2311446, -438239, 1356366, 2771287, 3581220, 3345599, 1845704, 192283, -987631, -1299374, -666549, -532223, 937407, 2722174, 4626119, 5695040, 5707690, 5106116, 5096873, 6005202, 8097578, 9417651, 9171613, 8250092, 7970391, 7967870, 7528152, 7138637, 7180299, 7271890, 8548934, 9596305, 8684679, 7559134, 8025066, 8122060, 7400267]
1336G400267M49692K272848K462207J605573Q94030o65791k218814j576290j68621M6887
1326A0501988p73170p04652R5091l09923j440272k351683k798957j793696m29583J137332
1316A132475L348603N394950M221827K438129K473627K775572J499641M34992M12675
1307B4132491J008050J646461K847763K855003J971722o30494l637497m35206J297419
1298C1055712J724140K582845L560340O244777M395135L792275K046819k491044o138429
1289D6772570l809427M428833N799051J763892j347541l302730l797037k119319j957554
1280D2430738m690921n543204j967591J109006P39397l387709p338422m493923K07832
1271A7065203L220273M276483N051230L663550q90602l166942j843191l25540k14752
$$ y = [7400267, 7849959, 10122807, 12585014, 14190587, 15084617, 14418826, 12200012, 10623722, 10455101, 10501988, 9728818, 9024166, 9119257, 8809334, 7369062, 5017379, 2218422, 424726, -4857, 1132475, 4481078, 9876028, 14097855, 16535984, 19009611, 21785183, 23284824, 23719816, 24132491, 25140541, 26787002, 29634765, 32489768, 34461490, 33830996, 30193499, 29758293, 31055712, 32779852, 35362697, 38923037, 45167814, 49562949, 53355224, 55402043, 52910999, 46772570, 42963143, 47391976, 53191027, 54954919, 53607378, 50304648, 46507611, 44388292, 42430738, 37739817, 32196613, 30229022, 31338028, 32077425, 28689716, 21351294, 16857371, 17065203, 20285476, 24561959, 29613189, 33276739, 32386137, 29219195, 27376004, 27050464, 26835712]
1262B6835712J874306N161170N041676K622611L800679N925931O041762N692707O218166
1253F9214720N258314K257807K946939N751785O325504P751619J0026208J4023117
1245A23556013J3857138J0470428Q325568N491932j183308m367907Q83473R467425
1237A66500762J0334242J2350983J8802249J6419973Q529084J3033454J9772316P880873
1229B73623936j569847M534928J3969340J8927870K6171271K9263207K6951374K3725622
1221D15597701K1602552J9931441K6287897L3551103K8096198J8621249J1612625J3451766
1213E88752532J2985483R835842R192874M163693k93125L377833K08933k649416P271454
1204F32846103K1527493K1059130R799640J5370616K2287718K3810844K9824757M5908558
$$ y = [26835712, 28710018, 33871188, 38912864, 41535475, 45336154, 51262085, 57303847, 62996554, 69214720, 74473034, 76730841, 79677780, 85429565, 91755069, 99506688, 109532896, 123556013, 137413151, 147883579, 156209147, 161701079, 160517771, 156149864, 157033337, 166500762, 176835004, 189185987, 207988236, 224408209, 232937293, 245970747, 265743063, 273623936, 272054089, 276589017, 290558357, 309486227, 335657498, 364920705, 391872079, 415597701, 437200253, 457131694, 483419591, 516970694, 545066892, 563688141, 575300766, 588752532, 601738015, 611573857, 620766731, 624930424, 624637299, 628015132, 628224065, 625574649, 632846103, 654373596, 675432726, 685232366, 700602982, 722890700, 746701544, 776526301, 822434859]
1196H22434859N1882937M2952573L8847067K9147685J5696760L4519351Q0314749
1189A115795981J03277390Q4738480P9080238J35353415K26824448J35480921k6752923
1182A853797950p5732553n5601856K848773J21629457K28831010P1710866j18961849
1175B028521798m9885066L1210008k10045837m96822478n06023290l22912176j33095155
1168C40947804J0574597N1551948J5315100Q12018J7575798K5703693K6488564K5671278
1160E14640800P555739k0001372l0920756l0928745l6332345l3388431j7444583p141055
1152C46039252p512491o700849r103827j3343464j8930901k3511921k8852525l7047623
1144B01035651l8710918l2871786k9379706k2376515r159248k753614n344537p653722
$$ y = [822434859, 874317796, 917270369, 956117436, 985265121, 1000961881, 1035481232, 1115795981, 1219073371, 1303811851, 1382892089, 1518245504, 1745069952, 1880550873, 1853797950, 1778065397, 1722463541, 1725312314, 1846941771, 2075772781, 2147483647, 2028521798, 1978636732, 2009846740, 1799800903, 1302978425, 796955135, 474042959, 340947804, 351522401, 403074349, 418389449, 419201467, 436777265, 462480958, 488969522, 514640800, 522196539, 502195167, 471274411, 440345666, 404013321, 370624890, 353180307, 346039252, 338526761, 331825912, 322722085, 309378621, 290447720, 266935799, 238083274, 201035651, 162324733, 129452947, 100073241, 77696726, 68537478, 65783864, 60439327, 52785605]
1136E2785605o887175n770153p516395o255740k83560O115856O610319R109591J8232724
1127F6141072J2698733P17778l463137o417369j1744312l815203M054118Q677589Q048908
1118G4898177L997904J2247515J8728950j544405j8576869j6897315j3874275q281861
1110E0697821o74304k191672o979264l666162J718652K160164R71196J685912R70212
1101D4692555q19663Q95587L226214M104345K502170K964372M939232M645864J428565
1092F8579241l911599n622609o292904p143767o895903m948032k861798r45226N86149
1083C0543552J887852J172768o60788k339030n748474p940198r063530q016840j581796
1074a746484L362206M494438P10691l187338j0159387j5148471j0239506m461054o143841
$$ y = [52785605, 45898430, 40128277, 32611882, 26356142, 26072582, 32188438, 38798757, 47908348, 66141072, 78839805, 79557583, 76094446, 69677077, 57932765, 54117562, 58171680, 66849269, 74898177, 78896081, 91143596, 109872546, 108328141, 89751272, 72853957, 58979682, 50697821, 50023517, 47831845, 40852581, 37186419, 38905071, 41065235, 42036431, 43722343, 44692555, 43872892, 44768479, 47994693, 52099038, 54601208, 57565580, 62504812, 67150676, 68579241, 64667642, 59045033, 52752129, 45608362, 38712459, 33764427, 30902629, 29957403, 30543552, 32431404, 33604172, 32943384, 30604354, 24855880, 16915682, 7852152, -164688, -1746484, 1615722, 6110160, 6820851, 3633513, -6525874, -21674345, -31913851, -36374905, -42518746]
1065d2518746o400456M206679J1362722Q954370L984548m1922o76298K086005O768267
1056a2274831O976509K889606k72371j688374q59644J233656J782115l48991j745928
1047d308253k66832J422720J423804N73291K18282L11856N22484L51511M495n4480K90417
1036D89295J572373K102043K500105L162992K909620J403166L66686p85579j509400
1027A2211301k123751j706603j513948r45573P64835K019417J601037N61276k16756l72823
1017A0278412l39950k77693r72977J41692J311827M92415j056122j453189j300797j298740
1007E524878j60629J059420M36105L56928N38046M07210n88424k636070k901072n53104
997A483288J364820K201683K527055K922170K633853J529668P82612L17964k06654j140439
$$ y = [-42518746, -48919202, -44712523, -33349801, -24395431, -20410883, -20452805, -21129103, -19043098, -12274831, -5298322, -2408716, -2681087, -4369461, -5229105, -3995449, -2213334, -2562325, -4308253, -4575085, -3152365, -1728561, -1155270, -936988, -625132, -102648, 248863, 253358, 198878, 489295, 2061668, 4163711, 6663816, 9826808, 12736428, 14139594, 14506280, 13720701, 12211301, 10087550, 8380947, 6866999, 5921426, 6686261, 8705678, 10306715, 10867991, 10651235, 10278412, 9938462, 9660769, 8687792, 8829484, 10141311, 10633726, 9577604, 8124415, 6823618, 5524878, 5364249, 6423669, 6859774, 7216702, 7754748, 8161958, 7573534, 4937464, 2036392, 1483288, 2848108, 5049791, 7576846, 10499016, 13132869, 14662537, 15445149, 15763113, 15556459, 14416020]
987A4416020J54207K786709L045298J450687M93804j17640j856398n14827j42307j008259
977A8707294o95569Q06397K366483J997248J78068n76767J133076K772514K412581L319697
967C2421022L054958J424581k92008l25004R50049J375134J560207K797097L653046
958D6619082L281111L386037K868374J783900O81767J276796L353089M259567L989737
949G1499460M689410N407318M869828M003615L510783L897204L044051K608608L083796
940A06614073J634519l16001m04603J647811L747003L697576L764857O130908M914091
931A31430234K607159N433573Q244530N893775K110370L597555N708068Q354978J1069312
922A84449554J3973607J3937053J2707013J1593922R487708J0730031J6255297K1909529
$$ y = [14416020, 14570227, 17356936, 20402234, 21852921, 22346725, 22229085, 20372687, 19857860, 19715553, 18707294, 18011725, 18818122, 21184605, 23181853, 23359921, 22783154, 23916230, 26688744, 29101325, 32421022, 35475980, 36900561, 36608553, 36283549, 37233598, 38608732, 40168939, 42966036, 46619082, 49900193, 53286230, 56154604, 57938504, 58620271, 59897067, 63250156, 67509723, 71499460, 76188870, 81596188, 86466016, 90469631, 93980414, 97877618, 100921669, 103530277, 106614073, 108248592, 107932591, 107527988, 109175799, 112922802, 116620378, 120385235, 126516143, 131430234, 134037393, 139470966, 147715496, 153609271, 155719641, 159317196, 165025264, 173380242, 184449554, 198423161, 212360214, 225067227, 236661149, 246148857, 256878888, 273134185, 295043714]
914B95043714K1333664J6418148J8412286K5758653K8298706J4623716k771137o746417
906D10371333k097981O334809K0226206K9219143J5783650R7483M743460k746258m4538316
897D37393529p3537215n8186983k2049793N203303J8452713J9839083J1634211O205636
889C44954484J5084650L0374965L2533676L0676320K1622692L9713590N2339161K8074815
881E95374353j0839429j8875048j5969555K99491K6525361O2213682K7089794k0168775
873F45649874L231721J3983593p5197623j52194138j42981337q6062174l0277975R184097
865A85336038J8771412P703789L430885R249827J3991263J8474464J9316192J3380113
857B89653983Q665976J4152312J1106447l337122j1187801q557047l994760O606254
$$ y = [295043714, 316377378, 332795526, 351207812, 376966465, 405265171, 419888887, 417117750, 410371333, 408273352, 414608161, 434834367, 464053510, 479837160, 479934643, 484678103, 481931845, 437393529, 363856314, 305669331, 283619538, 288822841, 307275554, 327114637, 338748848, 344954484, 360039134, 390414099, 422947775, 453624095, 475246787, 514960377, 567299538, 595374353, 584534924, 565659876, 549690321, 549989812, 576515173, 638728855, 665818649, 645649874, 648881595, 662865188, 587667565, 435473427, 292492090, 206429916, 176151941, 185336038, 204107450, 211811239, 215242124, 224491951, 238483214, 256957678, 276273870, 289653983, 298319959, 312472271, 323578718, 320241596, 309053795, 300496748, 296501988, 303108242]
849C03108242J6861487J4171243q95181o997358l676562k2958525o1222062p4951386
841A63439898n6853398l3562476j2509594J009486J972210p34992o2424J187158J818771
832F5704639J506730J136258n86027j945178k618942j895975M4535R27525l67694o11148
822F1294723j839412l415037j536271j006097k19425j626091m030688j797806p94518
813D5029378n262963p635788n848519m792043k522910j608031k065033k901677j883093
804A0509321j276249q31021k901L43496J426551K069285K340321J607980l45108j953988
794A3887687k163944q55867N03496K44138J29386N74675J413043O97318n98213k464852
784A1366867k513428j204093q693P41058K83263q00894j233529j459511j738643k219820
$$ y = [303108242, 319969729, 334140972, 333245791, 326248433, 322571871, 299613346, 238391284, 163439898, 106586500, 73024024, 60514430, 61523916, 63496126, 62761134, 62698710, 63885868, 65704639, 67211369, 68347627, 67761600, 65816422, 63197480, 61301505, 61346040, 62273565, 61905871, 61294723, 59455311, 56040274, 54504003, 53497906, 53278481, 51652390, 47621702, 45823896, 45029378, 39766415, 32130627, 26282108, 21490065, 18967155, 17359124, 15294091, 12392414, 10509321, 9233072, 8402051, 8399150, 8742646, 10169197, 12238482, 14578803, 16186783, 15841675, 13887687, 11723743, 10867876, 11371372, 11615510, 11744896, 12319571, 13732614, 14429932, 13831719, 11366867, 8853439, 7649346, 7640653, 8381711, 8664974, 7864080, 6630551, 5171040, 3432397, 1212577]
774A212577k089840m24251J209349J602055J218480o44139k419156m051446k572727q76760
764g835858j615205j426116J267082K754890J724463N7520q90188o70620M25721J536542
754d671769J601048O95980k30726j085268j037311p41683n22585q21544p69795L32145
744g251508J097466J078449K41683o14629j451871j896302j299305n81772k46723K43763
734a0680749J250386J504394J115213O70837L54206k3992K64513N11736J15982j20697
724e038171m33386n63992l2232N31640N66422l9947J95419P6296J67723J89645K21032
713d159551L16839k81593k91915l53898l31853p95350n73969P5374K58902M96462N78818
702e061734J02502l9845j33207l98386n28349l96797o7007Q5923P23869N19590N52868
$$ y = [1212577, -877263, -1301514, -92165, 1509890, 2728370, 2084231, -334925, -4386371, -6959098, -7835858, -9451063, -10877179, -9610097, -6855207, -5130744, -5073224, -5963412, -6634032, -6208311, -4671769, -3070721, -2374741, -2605467, -3690735, -4728046, -5469729, -5992314, -6813858, -7583653, -7251508, -6154042, -5075593, -4833910, -5448539, -6900410, -8796712, -10096017, -10677789, -10924512, -10680749, -9430363, -7925969, -6810756, -6139919, -5785713, -5809705, -5545192, -5033456, -4917474, -5038171, -5471557, -6035549, -6067781, -5536141, -4969719, -5009666, -4814247, -4737951, -4570228, -4380583, -4159551, -3842712, -4124305, -4416220, -4770118, -5101971, -5897321, -6471290, -6395916, -6137014, -5640552, -5061734, -4959232, -4999077, -5132284, -5530670, -6059019, -6455816, -6522823, -6436900, -5713031, -5193441, -4640573]
691d640573K26452M13176L14767M10461N11448Q8255Q1499j08733j69330o9177m78438
680c420193l90832n10806j85508N4111J51850K55704J69747M15449J11399L8173j6455
669c327361q0901o24426l99015o1100J63370l55714j11033J13807K48359K89098J79630
658c965286L59448M16621Q3806L28195J7539j63881m88736l81058p147N8738K44830N16032
646b980899M55272L64174J41187L07615m06101j209851j307880r02139n94622l98208
636f531452k52910N0176J96737R7184M64516L16056L25411K24472R5186L07695O3310
625d643619j43253l71318k23963k07420R6378J83015K17268K55197n8211K20801l81203
614e056328n07077o55123k27349m94082n41153l10022K3595p2924J10327K9692L5841
$$ y = [-4640573, -4414121, -4000945, -3686178, -3275717, -2764269, -2676014, -2594515, -2703248, -2872578, -2941755, -3420193, -3811025, -4321831, -4507339, -4453228, -4301378, -4045674, -3875927, -3460478, -3349079, -3310906, -3327361, -3408262, -4032688, -4431703, -4492803, -4329433, -4685147, -4796180, -4682373, -4434014, -4144916, -3965286, -3605838, -3189217, -3105411, -2777216, -2759677, -2923558, -3412294, -3793352, -3800499, -3741761, -3496931, -2980899, -2525627, -2161453, -2020266, -1712651, -2118752, -3328603, -4636483, -5538622, -6133244, -6531452, -6784362, -6734186, -6537449, -6440265, -5975749, -5659693, -5334282, -5109810, -5014624, -4706929, -4643619, -4786872, -5158190, -5382153, -5589573, -5493195, -5310180, -5092912, -4837715, -4895926, -4675125, -5056328, -5563405, -6218528, -6445877, -6939959, -7481112, -7791134, -7767539, -7840463, -7730136, -7700444, -7664603]
603g664603K38017K31383K31387L9787K9326J06491M736k25579J68870k1853O1479J3054
591f787505q289K27986O7097M5840j04337O6110k7351J37007j13439k62059r1448q6975
579f937363r4571j56989r6401o9200J62059L2805R7151J86114L02156K47826K21592q4913
567f189734L17253J51718j7211q2058j52834L1818j63255r3318n9347n0044K6920p923
555f288015p6211O2788J0458l13533N7375l1562n6880J16319Q4242l8768r7269j21148
543f692204J78409n907P3297N7682J24800j1459j8248N865l45495K73r3822Q1103M1983
530f603723j37401J47194L8520o6491l32612j27340o5703k21085r335J85490K3168L0074
518g139244l661j19173J05015l2602j55683J62847J39612J90318l9906P5152j2731J10339
$$ y = [-7664603, -7426586, -7195203, -6963816, -6924029, -6894703, -6788212, -6783476, -7009055, -6840185, -6862038, -6800559, -6787505, -6795794, -6567808, -6500711, -6454871, -6559208, -6493098, -6520449, -6383442, -6496881, -6758940, -6850388, -6937363, -7031934, -7188923, -7285324, -7354524, -7192465, -7159660, -7062509, -6876395, -6574239, -6326413, -6104821, -6189734, -5872481, -5720763, -5737974, -5820032, -5972866, -5941048, -6104303, -6197621, -6256968, -6307012, -6280092, -6288015, -6364226, -6301438, -6290980, -6604513, -6547138, -6578700, -6635580, -6519261, -6435019, -6473787, -6571056, -6692204, -6513795, -6519702, -6446405, -6388723, -6263923, -6275382, -6293630, -6287765, -6633260, -6632987, -6726809, -6645706, -6603723, -6741124, -6593930, -6555410, -6621901, -6954513, -7081853, -7147556, -7368641, -7377976, -7192486, -7169318, -7139244, -7142905, -7262078, -7157063, -7189665, -7345348, -7182501, -7042889, -6852571, -6892477, -6817325, -6830056, -6719717]
506f719717k74796r3656j95517j40324J96676M3778Q5085q2886R1311P9994J64488n1239
494f896803J01452O6818j40131o1519K1759q4899j18637P0773q6427K65887J25271O7222
482f669234J534Q6531l04908r4847j94465j00160Q2099j57974J39902J73359k93072J45471
470g185764K72878L7600N3073j29328K57558j54797O478n9098Q1469L7216j0386k11254
458g004355q371K9524J6164j83602l1518M00380j72771k33130j2209m6902L3557k88186
446g501419r1535J86483r908k1236k09078O8697J12055l9100N076k2575O2742J50612
434g309186J06495K05971k47667k14191R5373J49377R4584l32072J5165J8470j29953K1798
422g525836O9522O6252j61424o2718j15431k5030Q7276J2729m3409j06627J03110J03718
$$ y = [-6719717, -6994513, -7088169, -7283686, -7424010, -7227334, -7183556, -7098471, -7181357, -7090046, -7010052, -6845564, -6896803, -6795351, -6728533, -6868664, -6930183, -6908424, -6993323, -7111960, -7041187, -7127614, -6861727, -6736456, -6669234, -6667700, -6581169, -6886077, -6980924, -7175389, -7275549, -7193450, -7351424, -7211522, -7038163, -7331235, -7185764, -6912886, -6875286, -6822213, -6951541, -6693983, -6848780, -6842302, -6901400, -6819931, -6782715, -6793101, -7004355, -7012726, -6983202, -6967038, -7150640, -7182158, -6781778, -6954549, -7187679, -7199888, -7246790, -7213233, -7501419, -7592954, -7406471, -7416379, -7437615, -7646693, -7577996, -7465941, -7505041, -7499965, -7522540, -7459798, -7309186, -7202691, -6996720, -7244387, -7458578, -7363205, -7213828, -7119244, -7451316, -7436151, -7417681, -7547634, -7525836, -7456314, -7390062, -7551486, -7614204, -7729635, -7754665, -7667389, -7654660, -7698069, -7804696, -7701586, -7597868]
410g597868O2768o7152O3118K0501R9441P0473J00750L0166r0250k5456j68830R4139q592
397g416792o2565L1482J10289J1000k9250j30445J81462L3838j99465J48369k0880K68106
385g074851j29779Q5809j3146m3735O787J17726L7440j85837r4169M519Q5219Q075L07955
372f887987j96833j00709L44061q3658q3675q3949l3182N3433n5709p5229K5476J35028
360g042933K07785R201J4378j21532L0973p2231m5029r5934K85747L8581j8799J0080k4190
347f823903q7426N8739j11397J18648K66244j95504M192K13406r7545j18356n3209K5818
335f800293R3718l4333n867J6624k09134J04894J70850k3179L7831j2718j41640P8373
323f724874q5731j28345L06244j30997o8377m26727M70234j40240o3891k06513K05466
$$ y = [-7597868, -7535100, -7602252, -7539134, -7518633, -7419192, -7348719, -7247969, -7217803, -7308053, -7333509, -7502339, -7408200, -7416792, -7479357, -7447875, -7337586, -7326586, -7355836, -7486281, -7304819, -7270981, -7470446, -7322077, -7342957, -7074851, -7204630, -7118821, -7131967, -7175702, -7168915, -7051189, -7013749, -7199586, -7293755, -7289236, -7204017, -7195942, -6887987, -7084820, -7185529, -6841468, -6925126, -7008801, -7092750, -7125932, -7072499, -7128208, -7203437, -7177961, -7042933, -6835148, -6825947, -6811569, -6933101, -6902128, -6974359, -7019388, -7115322, -6829575, -6790994, -6809793, -6799713, -6823903, -6911329, -6852590, -6963987, -6845339, -6579095, -6774599, -6770407, -6557001, -6654546, -6772902, -6826111, -6800293, -6706575, -6740908, -6746775, -6730151, -6939285, -6834391, -6663541, -6686720, -6648889, -6661607, -6803247, -6724874, -6810605, -6938950, -6632706, -6763703, -6832080, -7258807, -6788573, -6928813, -6992704, -7199217, -6993751]
312f993751j67482j7007k3256K11137k0715p4655j75530Q8517O3884j24894n2042K64443
300g021351P8712K58210j42473J4744K02726k49538J02375J3493N8094N2247r6385j22714
288f851860J55634l881o3506J70799O8244O6587j76410K0481J67436j97389q2600J01487
276f624978J4791r6363K1934J20375j15030J68889L129j12036O9322O7569R9993J71383
264f211022m19468O8115p1389K1385p0982J22975j40247n2303J05176Q1679j81134N0501
252f696714J09l6193j90184K08537q4170O1053M9574l9713J33186r42j56465J44654J0479
239f596789J81467j95051N4244q55q6105j33559l8808K6007m3681l6762J25339k8347L5583
226f737317q0205Q556o1053N4722j99417M7754j43790J03213J98572K9746l4262P9876
$$ y = [-6993751, -7161233, -7178240, -7201496, -6990359, -7011074, -7085729, -7261259, -7172742, -7108858, -7233752, -7285794, -7021351, -6942639, -6684429, -6826902, -6812158, -6609432, -6858970, -6756595, -6743102, -6685008, -6632761, -6729146, -6851860, -6696226, -6700107, -6763613, -6592814, -6524570, -6457983, -6634393, -6613912, -6446476, -6643865, -6726465, -6624978, -6610187, -6706550, -6684616, -6564241, -6679271, -6510382, -6507253, -6619289, -6549967, -6482398, -6382405, -6211022, -6630490, -6562375, -6633764, -6612379, -6683361, -6560386, -6700633, -6752936, -6647760, -6566081, -6747215, -6696714, -6696605, -6732798, -6922982, -6714445, -6798615, -6737562, -6687988, -6727701, -6594515, -6595457, -6751922, -6607268, -6596789, -6415322, -6610373, -6556129, -6556984, -6643089, -6776648, -6815456, -6789449, -6833130, -6869892, -6744553, -6772900, -6737317, -6817522, -6808966, -6870019, -6815297, -7014714, -6966960, -7110750, -7007537, -6808965, -6779219, -6813481, -6733605]
214f733605j20957q6722J35826j38769m9229J04293J58581q3536J26577j02989n0846p7206
202f918582j13520J31313Q0440p6787l8688R9931n5164n0147p8900J40297j58808Q1082
190f957533J35579j10039P6051j4511p263K1575l4728K6026J3255j42203L71732j00226
178f722285j43172N9049n4102O8196j4054m25107L03133L398j26733J69627K50257j94442
166f826235j9248j69498n3842L04521J28143k01669q7599J03919k5373j13807O7892J9228
154f873568l8641J03762o0114m1949j08443J90016J14097k8782j01874J8136j17389j21625
142g066374P4165J37472K6936j22629K7741j1611N1639r7386j1125Q6860q0461k29661
130g214434P9680J24701j43907j02780J58775j08569J45116l50291K26057l4242q0099j226
$$ y = [-6733605, -6854562, -6941284, -6805458, -6944227, -6993456, -6889163, -6730582, -6814118, -6687541, -6790530, -6841376, -6918582, -7032102, -6900789, -6820349, -6897136, -6935824, -6835893, -6891057, -6941204, -7020104, -6879807, -7038615, -6957533, -6821954, -6931993, -6855942, -6870453, -6877716, -6856141, -6890869, -6864843, -6851588, -6993791, -6622059, -6722285, -6865457, -6806408, -6860510, -6792314, -6806368, -7231475, -6928342, -6924944, -7051677, -6882050, -6631793, -6826235, -6845483, -7014981, -7068823, -6764302, -6636159, -6837828, -6925427, -6821508, -6846881, -6960688, -6892796, -6873568, -6912209, -6808447, -6868561, -6910510, -7018953, -6828937, -6714840, -6743622, -6845496, -6827360, -6944749, -7066374, -6992209, -6854737, -6827801, -6950430, -6922689, -6934300, -6882661, -6980047, -6991172, -6904312, -6984773, -7214434, -7134754, -7010053, -7153960, -7256740, -7097965, -7206534, -7061418, -7411709, -7185652, -7219894, -7299993, -7301219]
118g301219J7948Q0979r8013k311l1495R2898J04986j57639L7974N6316k5959R8084K1413
105g106038j92295J79684J42261j13680J74688k0586j92876j36620j21769J2849j9293
94g393675j69685o0568K92583j61907j63572J75799l13901j79501N0773J87168o9360r3154
82g899000J59317K58077J83210q8836k1890R6038k6776R3421P5404O7446j07437J54191
70g056835r4553j08545k36335J79071J00656L5167j81720J79281R6912K6369j06713P3517
58g093728L0177O4701R6742P608m75274J4805R8470J05663l85201K23279j26n0654N7170
45g306368K10393k53059J53434N9975r7558o5227l5199j2234J98027J7634j68491n6774
33g355447M10817j98093l53995P5614L4992N3329m7057m758J85008L5836j43215J98917
$$ y = [-7301219, -7283271, -7202292, -7300305, -7302616, -7334111, -7241213, -7136227, -7293866, -7255892, -7199576, -7225535, -7127451, -7106038, -7298333, -7118649, -6976388, -7090068, -6915380, -6935966, -7128842, -7265462, -7387231, -7374382, -7393675, -7563360, -7623928, -7331345, -7493252, -7656824, -7481025, -7794926, -7974427, -7923654, -7736486, -7805846, -7899000, -7739683, -7481606, -7298396, -7387232, -7409122, -7313084, -7339860, -7246439, -7171035, -7103589, -7211026, -7056835, -7151388, -7259933, -7496268, -7317197, -7216541, -7181374, -7363094, -7183813, -7086901, -7060532, -7167245, -7093728, -7063551, -6998850, -6902108, -6894500, -7369774, -7354969, -7256499, -7150836, -7536037, -7312758, -7312884, -7363538, -7306368, -7095975, -7349034, -7195600, -7135625, -7233183, -7298410, -7333609, -7345843, -7147816, -7130182, -7298673, -7355447, -6944630, -7142723, -7496718, -7421104, -7386112, -7332783, -7379840, -7384598, -7199590, -7163754, -7306969, -7108052]
21g108052k15322M8199m8252l1373Q3188O381N5748m8534j23848J07381O0189l2463m9594
8g296352r1113J11554K7724R6993k88563J1576J84213l37053K36673J43759N0834j0423
-4g160178Q0859M5709r1540r1732l7085k7724k3454J66309k3668k95916Q4768k0679J39860
-17g254471M440P7936j31948K0389J18645k2970J10675r3899j11734Q3094L5524O488
-29g157831j12433k7273R4822J00317j03752p0111J47537L72114m31756l9781N7867p4047
-41g244327j23172J45590K5044J5998R1463o2324j2130O3073j63892J71858j51012k3646
-53g267477J67894j52597m4905j10428K38194q8998M6917P8241j51891L0777p1951n612
-65g331836m2990M3176O414j1708P238M0633k2260n781N7232Q5797K6932L0973O884K2903
$$ y = [-7108052, -7323374, -7275175, -7323427, -7354800, -7271612, -7265231, -7209483, -7258017, -7381865, -7274484, -7214295, -7246758, -7296352, -7387465, -7275911, -7248187, -7151194, -7439757, -7428181, -7243968, -7581021, -7344348, -7200589, -7149755, -7160178, -7079319, -7033610, -7125150, -7216882, -7253967, -7281691, -7305145, -7138836, -7162504, -7458420, -7373652, -7394331, -7254471, -7250031, -7172095, -7304043, -7283654, -7165009, -7187979, -7077304, -7171203, -7282937, -7199843, -7164319, -7157831, -7270264, -7297537, -7202715, -7102398, -7206150, -7276261, -7128724, -6756610, -7188366, -7228147, -7170280, -7244327, -7367499, -7221909, -7196865, -7180867, -7089404, -7151728, -7163858, -7100785, -7264677, -7092819, -7243831, -7267477, -7099583, -7252180, -7297085, -7407513, -7169319, -7258317, -7211400, -7133159, -7285050, -7254273, -7326224, -7331836, -7374826, -7331650, -7325236, -7336944, -7329706, -7289073, -7311333, -7317114, -7259882, -7174085, -7147153, -7116180, -7109296, -7086393]
-79g086393M3540P6299m3959j53243O6833l8266J46713k37385K2361N0979Q9183j55565
-91g218903P7491j5338L467p7308m8048M1073p2488p2662N2077k23259N93554l0131q6528
-104g077003N167j48953o2042Q8424m8436J36054o3662p6288m8076o4007R8954O3313O5752
-117g130803j6857J60992k28039K17r992p9942L0793N1987J12608j77624j35356L02004
-129g120012r1490j57665J22707l15937M0873K0114o8890L9861J43191p7444j8293K2485
-141g460500J21204k23395J50746r671j34669L8688J97854j6160j0231J00637j53387
-152g398884j65475R5764k8778M4360n0367n3001p2128J64684j51262j78438J26759J71695
-164g495071n1111j51206Q1515J05399p2310j091J45320P2108p3991M3446p3156J11594
$$ y = [-7086393, -7042853, -6966554, -7010513, -7163756, -7096923, -7135189, -6988476, -7225861, -7203500, -7152521, -7063338, -7218903, -7141412, -7156750, -7153283, -7230591, -7278639, -7237566, -7310054, -7382716, -7330639, -7553898, -6960344, -6990475, -7077003, -7071836, -7220789, -7282831, -7194407, -7242843, -7106789, -7170451, -7246739, -7294815, -7358822, -7259868, -7196555, -7130803, -7147660, -6986668, -7214707, -7214490, -7224482, -7304424, -7273631, -7221644, -7109036, -7286660, -7422016, -7120012, -7211502, -7369167, -7246460, -7562397, -7521524, -7501410, -7570300, -7530439, -7387248, -7464692, -7482985, -7460500, -7339296, -7562691, -7411945, -7421616, -7556285, -7517597, -7319743, -7335903, -7346134, -7245497, -7398884, -7564359, -7468595, -7497373, -7453013, -7503380, -7556381, -7628509, -7463825, -7615087, -7793525, -7666766, -7495071, -7546182, -7697388, -7615873, -7510474, -7582784, -7583875, -7438555, -7366447, -7440438, -7396992, -7470148, -7358554]
-176g358554J96660m9464k53219J04378Q3060l01302P5468l09173K60587L80207K3190
-187g148162j75432K1690j53297K293J2663p4707M6768q8697J72000l3410m0017l7830
-199g496138M03025k40159J50104j60249M7175l7867k6616j38903J26166k3957j7596M524
-211g410491p8107K15864j77428J99929k2969j32553P8812P986m5940k125N2216l3310q282
-224g356398N8164J0488R7857l37774q3592J87929K603k835J02964N7686j20286j2511
-236g395705k8528J23456j03503J62646O7625q671j21621j4637k87112j11921L68066
-247g349905J38088k3472k76058J36288L7378M3691o3291p4597K41350J3081n3958M1572
-259g189833j12927J57605J5491j04544R5252m4708R7588k851j728M062j21725N3665K8451
$$ y = [-7358554, -7161894, -7211358, -7464577, -7360199, -7277139, -7578441, -7502973, -7812146, -7551559, -7171352, -7148162, -7323594, -7301904, -7455201, -7452908, -7440245, -7514952, -7468184, -7556881, -7384881, -7418291, -7458308, -7496138, -7093113, -7333272, -7183168, -7343417, -7296242, -7334109, -7360725, -7499628, -7373462, -7397419, -7415015, -7410491, -7488598, -7272734, -7450162, -7250233, -7273202, -7405755, -7326943, -7318957, -7364897, -7367022, -7314806, -7348116, -7356398, -7298234, -7287746, -7189889, -7527663, -7611255, -7423326, -7420723, -7423558, -7320594, -7262908, -7383194, -7395705, -7424233, -7300777, -7404280, -7241634, -7174009, -7182680, -7304301, -7318938, -7606050, -7717971, -7349905, -7211817, -7235289, -7511347, -7375059, -7337681, -7293990, -7357281, -7431878, -7190528, -7177447, -7231405, -7189833, -7302760, -7145155, -7129664, -7234208, -7138956, -7183664, -7086076, -7088927, -7090655, -7086593, -7208318, -7154653, -7126202]
-272g126202o7336K2693J09452l8867p8227n5849o1426O1350j5204J73601k03688l1226
-284g310929l8257q5666J08200L1099k779N2782K3535O1356m501J9850j53117L84875
-296f913552l81417q3529J26964Q8453J74424l47459J98605j38497Q0094j47580N1524
-307g291970r4906j5425J36266Q3603j51056J74040j3441q3700O787n9533O9337Q7242
-319g152756j49106j20367M8184q3122M3821j4076O0219r7006P9593N5535l75529L44571
-331g360039N3209n4202k244l2445r3833P6901j8747J8209k4894l5811N9299K28657k201
-344g188141n929j96691M7897K6236J89504k67950q2053q8098j60090K64863M4177o488
-356g422763Q3488j166K01410j48384l6845r4786j4714J12023m1847k0272M332q0248P7941
$$ y = [-7126202, -7193538, -7170845, -7061393, -7100260, -7178487, -7234336, -7295762, -7234412, -7249616, -7076015, -7279703, -7310929, -7349186, -7434852, -7326652, -7295553, -7298332, -7245550, -7222015, -7160659, -7165160, -7145310, -7298427, -6913552, -7294969, -7378498, -7251534, -7163081, -6988657, -7336116, -7137511, -7276008, -7195914, -7343494, -7291970, -7386876, -7402301, -7266035, -7182432, -7333488, -7159448, -7172889, -7256589, -7249802, -7309335, -7239998, -7152756, -7301862, -7422229, -7374045, -7457167, -7413346, -7427422, -7367203, -7464209, -7384616, -7329081, -7704610, -7360039, -7306830, -7361032, -7363276, -7395721, -7489554, -7412653, -7431400, -7413191, -7438085, -7473896, -7414597, -7185940, -7188141, -7194070, -7390761, -7342864, -7316628, -7127124, -7395074, -7477127, -7565225, -7725315, -7460452, -7416275, -7422763, -7339275, -7340441, -7139031, -7287415, -7324260, -7419046, -7433760, -7321737, -7363584, -7383856, -7379524, -7459772, -7381831]
-369g381831J82010j21918k08053J09716j52204K29780m9952J08261j4273o9907M1285
-380g327086N0339K02330k40068k8302P7370j08236N1561J69076m6794j10974j44053j8964
-392g473801K56509Q6063p8810k23403L7345K4004o1470l5918K21545j03960o687j6004
-404g374587j24887K16225j57719l1112p42K0852j2564J7002q5834k916J60879j01710
-416g477113J20021j6390J6318k8533j37882J77054p6932n5940O7641j22337J6472p8953
-428g596574P7725O8572O1663J44878k37397p9594K9261o8256J5943M1629n9117j5640
-440g616907L13348l9712N7247k91599R1597N2744J68961j75635r014N4633o1854O4K05773
-453g250354j0348k35747J73590k9707r1977l7198q4413M0912j7654M6077J6962j45897
$$ y = [-7381831, -7199821, -7321739, -7529792, -7420076, -7572280, -7342500, -7392452, -7284191, -7298464, -7368371, -7327086, -7276747, -7074417, -7314485, -7342787, -7265417, -7373653, -7322092, -7153016, -7199810, -7310784, -7454837, -7473801, -7217292, -7131229, -7210039, -7433442, -7396097, -7372093, -7433563, -7469481, -7247936, -7351896, -7358583, -7374587, -7499474, -7283249, -7440968, -7472080, -7472822, -7451970, -7464534, -7447532, -7533366, -7536282, -7375403, -7477113, -7357092, -7373482, -7357164, -7385697, -7523579, -7346525, -7423457, -7479397, -7411756, -7534093, -7517621, -7596574, -7518849, -7450277, -7388614, -7243736, -7481133, -7560727, -7531466, -7599722, -7583779, -7542150, -7601267, -7616907, -7303559, -7343271, -7286024, -7577623, -7486026, -7433282, -7264321, -7439956, -7448970, -7394337, -7456191, -7456127, -7250354, -7260702, -7496449, -7322859, -7352566, -7444543, -7481741, -7566154, -7525242, -7542896, -7496819, -7479857, -7625754]
-465g625754K5538J87951M2332j79893O7908k9935j36463q120J02480J17981l2020r015
-477g477010M2847q0207m2868M1863L7336p97j4961o744l7087J07615k29602J75975m6959
-490g530599N6931j13233O7308J91011k08269P4436n6304O0230Q4320j5910k09453Q8236
-502g511296p1592M7602J17924J34550j79375N5066R2014j80392J87795n0460j86807q0333
-514g625304K51078Q233l48q2546L4970L0204j21938k3900J03547L8565r0491Q3565R7105
-527g297260m5624P5409k48022K70276k87p2970M4732N8608j69635J97114j75979j92692
-539g556330J51858r8500K17177L9093j75083n1964L54613l36476R3294L6213j24848
-550g450953J35435j67765O2694j989J13792M0311J9607J55001j85449P2456o1051J12702
$$ y = [-7625754, -7600216, -7412265, -7369933, -7549826, -7481918, -7511853, -7648316, -7656436, -7553956, -7435975, -7467995, -7477010, -7434163, -7514370, -7557238, -7515375, -7478039, -7478836, -7493797, -7500541, -7537628, -7430013, -7659615, -7483640, -7530599, -7473668, -7586901, -7519593, -7328582, -7536851, -7462415, -7518719, -7458489, -7374169, -7390079, -7599532, -7511296, -7582888, -7535286, -7417362, -7282812, -7462187, -7407121, -7315107, -7495499, -7307704, -7358164, -7544971, -7625304, -7374226, -7365993, -7366341, -7448887, -7413917, -7383713, -7505651, -7529551, -7426004, -7387439, -7477930, -7394365, -7297260, -7342884, -7267475, -7515497, -7245221, -7245508, -7318478, -7273746, -7215138, -7384773, -7187659, -7363638, -7556330, -7404472, -7502972, -7285795, -7246702, -7421785, -7473749, -7119136, -7455612, -7362318, -7326105, -7450953, -7315518, -7483283, -7420589, -7422578, -7308786, -7268475, -7248868, -7093867, -7279316, -7206860, -7267911, -7155209]
-562g155209n4165L4847K39119k33542r591Q871R9543r3988J10231j37399k31212o0938
-574g483433l4699K56842n9996j91213J6729K7278J13154j56818K05588j16855J4780p2794
-586g481437r3131K60157k7549K1837j0135l9313o187N2801Q8581m95857L44635l5056
-598g420654m5665j63043R0980J90102n8786K82821j79024o111m9125J31151k08559k243
-610g438156k6382J01946p0330J88491J07231m28120M0266K74139n7681q4506N533J35864
-622g251705K96622l31202j07255p1463J75870j49459O2138N2522o2904K52227l46576
-633g481185J75867j69732j5898M2712j69046n1304N3730K01426L0206j34430L5288j43984
-645g626350Q6427n5583J51237j25465J44435j15960P43553o94510J20340k68249K8755
$$ y = [-7155209, -7209374, -7174527, -6935408, -7168950, -7178541, -7169670, -7070127, -7164115, -7053884, -7191283, -7422495, -7483433, -7518132, -7261290, -7321286, -7512499, -7495770, -7468492, -7355338, -7512156, -7306568, -7423423, -7408643, -7481437, -7574568, -7314411, -7341960, -7320123, -7330258, -7369571, -7375758, -7322957, -7234376, -7730233, -7385598, -7420654, -7466319, -7629362, -7538382, -7348280, -7407066, -7124245, -7303269, -7309380, -7358505, -7227354, -7435913, -7438156, -7464538, -7362592, -7432922, -7244431, -7137200, -7565320, -7525054, -7250915, -7308596, -7393102, -7387569, -7251705, -6955083, -7286285, -7393540, -7465003, -7289133, -7438592, -7376454, -7323932, -7386836, -7134609, -7481185, -7305318, -7475050, -7490948, -7448236, -7617282, -7668586, -7614856, -7413430, -7383224, -7517654, -7482366, -7626350, -7539923, -7595506, -7444269, -7569734, -7425299, -7541259, -6797706, -7492216, -7371876, -7640125, -7611370]
-656g611370m5111L8520l4948j3257Q5469l1412l3475M5258l6100J27080Q2408J81548
-668g245390k31219j55978K8084J5542J00435J7376L9931M9541j96018Q5441j35041J40333
-680g486963m4862O4601l651l3468Q9453m8493l8348k12862Q3205J81980P0068j97819
-692g577159J4452K00144j08237n6502j33004K5551J01932J96518j20315J64518k20098
-703g512200R0127j78159J12288m612p607K3290J50757m9583j11620n3944j45265J32999
-715g553529k22878K43560l3591O1308j32071K89391P7298j61386N893m3380N6618K2847
-727g389920r6130K8722O2146n048j63106j2092p3450Q5708L9321J53317O7603j28081
-739g431010j73175J25934J90955K0894p8061o2745r8310J6613j35273J22461R008O6861
$$ y = [-7611370, -7656481, -7617961, -7652909, -7666166, -7580697, -7612109, -7645584, -7600326, -7636426, -7509346, -7426938, -7245390, -7476609, -7632587, -7604503, -7588961, -7488526, -7471150, -7431219, -7381678, -7577696, -7492255, -7627296, -7486963, -7531825, -7467224, -7470875, -7504343, -7414890, -7463383, -7501731, -7714593, -7631388, -7449408, -7379340, -7577159, -7562707, -7362563, -7470800, -7527302, -7660306, -7634755, -7532823, -7336305, -7456620, -7292102, -7512200, -7422073, -7600232, -7487944, -7492556, -7500163, -7476873, -7326116, -7375699, -7487319, -7541263, -7686528, -7553529, -7776407, -7532847, -7566438, -7505130, -7637201, -7347810, -7270512, -7431898, -7426005, -7469385, -7412767, -7389920, -7486050, -7457328, -7395182, -7400230, -7563336, -7575428, -7648878, -7563170, -7523849, -7370532, -7302929, -7431010, -7604185, -7478251, -7287296, -7266402, -7344463, -7407208, -7505518, -7488905, -7624178, -7501717, -7492709, -7425848]
-751g425848k00383J93336j61921r1788K10778N860P9434m9111j02181J13550O8607K4518
-763g335149K06783j89139K2249o2223o7427r1703N5391R6659m7395M8769p8434J697M5868
-776g394054K7374j21971J16865k7944m4858M686J5043j57519J83235j34875n1136M0680
-788g544474Q904j12488R4992L2078m6886o8664K03298k512J381p1889Q7855j24481R0729
-801g452157K7255J2112M2483R2219o6789j08635n0365J6581K2912R2955j44338M2591
-813g473176l8746J59900r930m2797j04655j49127l6912J02402l5180J39305j51501J15420
-825g524997j0169p27l3798K29648j55077J45875l8919K0264j20806M4696j18774Q0874
-837g481910m0815O2146j27344R6920L7185p7831J08533o1151l8471J14964r6803j10463
$$ y = [-7425848, -7626231, -7432895, -7594816, -7686604, -7475826, -7469966, -7390532, -7439643, -7541824, -7428274, -7359667, -7335149, -7128366, -7317505, -7295256, -7357479, -7424906, -7516609, -7461218, -7364559, -7411954, -7363185, -7441619, -7439922, -7394054, -7366680, -7488651, -7371786, -7399730, -7444588, -7439902, -7424859, -7582378, -7399143, -7534018, -7585154, -7544474, -7535570, -7648058, -7553066, -7520988, -7567874, -7636538, -7433240, -7435752, -7434371, -7506260, -7418405, -7542886, -7452157, -7424902, -7412790, -7370307, -7278088, -7344877, -7453512, -7503877, -7487296, -7464384, -7371429, -7515767, -7473176, -7511922, -7352022, -7361952, -7404749, -7509404, -7658531, -7695443, -7593041, -7628221, -7488916, -7640417, -7524997, -7535166, -7535893, -7569691, -7340043, -7495120, -7349245, -7388164, -7367900, -7488706, -7444010, -7562784, -7481910, -7522725, -7460579, -7587923, -7491003, -7453818, -7531649, -7423116, -7484267, -7522738, -7407774, -7504577, -7615040]
-849g615040Q5106k3804J87119M1707m5751M0287j95850P5494q782m5247M8264K2241j3046
-862g447302j96655R3354j5608J09007q9192n8883q8659K89365J1288K337R0101j46871
-874g447718K7821j21848M3123p9950J06612q5822j6670j2751J25939m6951n987J01037
-886g413165j03012p3490J23807J30690M425k00018Q8170J2971L8902L65908k78462k04051
-898g507325O5732K1746j79180J25835k14600J05975k1176m3974j20763K17121p6511
-909g627120J53567k3627o9428M76k0366J55194j25868o9948P7353P7279r6391o860J21046
-922g454693j53670R5890k7575J34605l40463J95727q3383M6118n3231K5814J02889j6250
-934g528222j08609Q1266k6795K10954n0665m9681j59024p9837J00594l0376l0735J66620
$$ y = [-7615040, -7529934, -7553738, -7366619, -7324912, -7370663, -7330376, -7526226, -7450732, -7459514, -7504761, -7456497, -7434256, -7447302, -7643957, -7550603, -7566211, -7457204, -7546396, -7605279, -7693938, -7404573, -7393285, -7390948, -7300847, -7447718, -7419897, -7541745, -7498622, -7578572, -7471960, -7557782, -7574452, -7587203, -7461264, -7508215, -7514202, -7413165, -7516177, -7589667, -7465860, -7335170, -7330745, -7530763, -7442593, -7429622, -7390720, -7024812, -7303274, -7507325, -7441593, -7419847, -7599027, -7473192, -7687792, -7581817, -7602993, -7646967, -7767730, -7550609, -7627120, -7473553, -7497180, -7566608, -7566132, -7586498, -7431304, -7557172, -7627120, -7549767, -7472488, -7568879, -7575739, -7454693, -7608363, -7512473, -7540048, -7405443, -7745906, -7550179, -7633562, -7587444, -7640675, -7614861, -7511972, -7528222, -7636831, -7555565, -7582360, -7371406, -7422071, -7471752, -7630776, -7710613, -7610019, -7640395, -7671130, -7504510]
-946g504510k6615r991j88040J82998P5213j96829R3390j3454L6058Q6842k5480O5444
-958g424974J8613j27043J2841p6667M8353J1894p725o7741L4038J65300j97277N8117
-970g552271j6396L1873k1861m6610O3912M8904j21326N3551R6499j13807j26321J77109
-982g526744N278O6989q2486P1764J33554l12231Q6516j62935K24498L49612k39584k7552
-994g413321n0094l7610M6644L9881N5312L011j18606q4866M109J15333R9961j64809p6880
-1007g581935R1302J29945N0643J3778k82136k810R6686J5968o006N7218K33167j31052
-1019g315232j25024J93491k45987j4124q5243N1470p7347N6018J67817p4107O0389r2857
-1031g500736l8485O8940m4364Q3651j39407M2459P4902k06339m1930j09084L67693j5521
$$ y = [-7504510, -7531125, -7541116, -7729156, -7546158, -7470945, -7667774, -7574384, -7587838, -7551780, -7464938, -7490418, -7424974, -7406361, -7533404, -7520563, -7597230, -7548877, -7536983, -7544708, -7612449, -7578411, -7413111, -7610388, -7552271, -7568667, -7536794, -7558655, -7605265, -7541353, -7492449, -7613775, -7560224, -7463725, -7577532, -7703853, -7526744, -7521466, -7454477, -7536963, -7465199, -7331645, -7643876, -7557360, -7720295, -7495797, -7146185, -7385769, -7413321, -7463415, -7501025, -7454381, -7414500, -7359188, -7356177, -7474783, -7559649, -7555540, -7440207, -7340246, -7505055, -7581935, -7490633, -7360688, -7310045, -7296267, -7578403, -7581213, -7484527, -7468559, -7474565, -7417347, -7184180, -7315232, -7440256, -7246765, -7492752, -7506876, -7592119, -7540649, -7617996, -7561978, -7394161, -7468268, -7407879, -7500736, -7539221, -7470281, -7514645, -7430994, -7570401, -7527942, -7453040, -7659379, -7701309, -7810393, -7442700, -7458221]
-1043g458221q5150N5260K01616l1394j37038Q6322j62333P6248j1402q8306J67662n7652
-1055g444388L6463j61577j37027k8946j05133J71220j9820K77006M2905j22199N6844
-1066g434652r6806o994j04581P4250j9356J47685p7900R7010o4451j3206L6244k9709
-1078g492466J26709r3657j88389q0311K2017J63484O8814o553J9218j3815j81030J837
-1090g654142K21722j66355k5552J06012j30293m8786J10494R5064K7158k20117Q8399
-1101g596396J39974j24356M3966J23118K5590k3045Q7012M4091q1940r1311k0752j83004
-1113g657053R9078l3971J9877R6664p9256o1348J33753k23262J95508j43839J36817
-1124g517032j07846J34380R124l5246k37004K68552Q6194j7475j47034J9331m5984k3227
$$ y = [-7458221, -7543371, -7488111, -7286495, -7317889, -7454927, -7368605, -7530938, -7454690, -7466092, -7554398, -7386736, -7444388, -7407925, -7569502, -7706529, -7735475, -7840608, -7669388, -7689208, -7412202, -7369297, -7491496, -7434652, -7531458, -7538452, -7643033, -7568783, -7588139, -7440454, -7518354, -7421344, -7485795, -7499001, -7462757, -7492466, -7365757, -7459414, -7647803, -7728114, -7706097, -7542613, -7473799, -7480352, -7461134, -7474949, -7655979, -7654142, -7432420, -7598775, -7624327, -7518315, -7648608, -7697394, -7586900, -7491836, -7464678, -7684795, -7596396, -7456422, -7580778, -7536812, -7413694, -7388104, -7411149, -7324137, -7280046, -7361986, -7453297, -7474049, -7657053, -7557975, -7591946, -7572069, -7475405, -7554661, -7616009, -7482256, -7705518, -7510010, -7653849, -7517032, -7624878, -7490498, -7481374, -7516620, -7753624, -7485072, -7398878, -7416353, -7563387, -7544056, -7590040, -7613267]
-1136g613267Q6529J85379l0737M4752q1545k0461k39929J01415L0658o4281J24978k60761
-1148g737270J40316J18421j73604R3479R244K41155R6808k56932o9822N3430p9470J3664
-1160g550581J61446j30493Q1918j07368N9192n2156K7483J31547q0496j46707J20400
-1171g485815p4726j07945J88438J11721j78204l8701J81597q2325r383J21184K0993
-1182g353166j62176j32973J65983J08390j58077m070m2775R3030o4549j05746J33632
-1193g522497r4428N8963L2532l0402N3865r8346n2952R4357K28960m0839K0387r6405
-1205g446805n0983J16854k8216J85205k3368j59176R9719j83111j82226J09649J02723
-1216g459735n102Q1064j56403J09135k23658L2599j56882R6925N4979k4130J77847k7121
$$ y = [-7613267, -7526738, -7341359, -7372096, -7327344, -7408889, -7429350, -7669279, -7567864, -7537206, -7601487, -7476509, -7737270, -7596954, -7478533, -7652137, -7558658, -7549414, -7308259, -7211451, -7468383, -7538205, -7484775, -7564245, -7550581, -7389135, -7519628, -7437710, -7545078, -7485886, -7538042, -7510559, -7379012, -7459508, -7606215, -7485815, -7560541, -7668486, -7480048, -7368327, -7546531, -7585232, -7403635, -7485960, -7495343, -7374159, -7353166, -7515342, -7648315, -7482332, -7373942, -7532019, -7536089, -7578864, -7485834, -7550383, -7656129, -7522497, -7616925, -7557962, -7525430, -7555832, -7501967, -7600313, -7653265, -7558908, -7329948, -7370787, -7350400, -7446805, -7497788, -7380934, -7409150, -7223945, -7247313, -7406489, -7306770, -7489881, -7672107, -7562458, -7459735, -7464837, -7383773, -7540176, -7431041, -7654699, -7622100, -7778982, -7682057, -7627078, -7651208, -7473361, -7500482]
-1228g500482j56799j92227J72301O5993j7169N9438p5849N0236p496j06307J4315M6666
-1240g647380M913O0621p7080K3446R4436j8761j25020n9682J9930K8734J9937Q982K40372
-1253g426552l16773J93824o5028P3193K90M7480L756J18261j02149j24283K8442j0802
-1265g580341j0620P0959N4459K345J08185j56732M9874K6318k08565J41875q4191J46444
-1277g439990q1073r0783L4312R2206J44383j76427k8347J620M3066n876j4109l6802
-1289g557820j44505O5643J94558p0734q2205K5447O204j3614O9151K2904j712P2584
-1301g414099j35916N3560N1052m6083m0850j1698l4938m6918O7978P905o7125J56123
-1313g461009j14973K9071O1947o6361R1690K5348M6719J5142j1991q1251J50617j86777
$$ y = [-7500482, -7657281, -7849508, -7677207, -7611214, -7628383, -7568945, -7644794, -7594558, -7602054, -7708361, -7694046, -7647380, -7642467, -7581846, -7658926, -7635480, -7541044, -7559805, -7684825, -7744507, -7724577, -7695843, -7675906, -7666924, -7426552, -7743325, -7549501, -7614529, -7541336, -7541046, -7493566, -7489810, -7371549, -7473698, -7597981, -7569539, -7580341, -7590961, -7520002, -7465543, -7463198, -7355013, -7511745, -7461871, -7435553, -7644118, -7502243, -7586434, -7439990, -7521063, -7611846, -7577534, -7485328, -7340945, -7517372, -7545719, -7544099, -7501033, -7506909, -7521018, -7557820, -7702325, -7636682, -7442124, -7512858, -7595063, -7569616, -7563412, -7577026, -7507875, -7484971, -7486683, -7414099, -7550015, -7496455, -7445403, -7491486, -7532336, -7544034, -7578972, -7625890, -7557912, -7550007, -7617132, -7461009, -7575982, -7546911, -7484964, -7551325, -7459635, -7434287, -7387568, -7372426, -7384417, -7465668, -7315051, -7501828]
-1325g501828j60478K91974L1148j5692q8911r3585J97719j6847r6889j07542M4579o4319
-1337g580671J01757L7857j48056J87989k2144P6413M9297j33329K0997p1847j10370
-1348g592107K40458q7990q2669k8578q8417R2191L0180M7171n4022J7833J28873r3165
-1360g470242j60013l4576q6422M35828j60322Q5691k7227r6817r835O6872J39820j26246
-1372g443489r6662l1104R6271J54646L7549j08976N5643j63157P9690n9575j62590K19071
-1384g422683j5319j53323O5663R3115j30527O1621J51716k77500L7646J80201J7854n8712
-1396g450248n3397R4421p8267M8886j7702O070J7964o7888j52756Q3277J21545L7209
-1408g410886K04017k6621j23306j23976p8008Q4503j86523K02991j95247L99910R339
$$ y = [-7501828, -7662306, -7370332, -7339184, -7354876, -7443787, -7537372, -7339653, -7356500, -7453389, -7560931, -7516352, -7580671, -7478914, -7441057, -7589113, -7401124, -7423268, -7346855, -7297558, -7430887, -7409890, -7481737, -7592107, -7351649, -7439639, -7522308, -7550886, -7639303, -7547112, -7516932, -7469761, -7523783, -7505950, -7377077, -7470242, -7630255, -7664831, -7751253, -7315425, -7475747, -7390056, -7417283, -7514100, -7523935, -7457063, -7317243, -7443489, -7540151, -7571255, -7474984, -7320338, -7282789, -7391765, -7336122, -7499279, -7419589, -7479164, -7641754, -7422683, -7438002, -7591325, -7525662, -7432547, -7563074, -7501453, -7349737, -7627237, -7589591, -7409390, -7391536, -7450248, -7503645, -7409224, -7487491, -7438605, -7456307, -7450237, -7432273, -7500161, -7652917, -7569640, -7448095, -7410886, -7206869, -7233490, -7356796, -7480772, -7558780, -7474277, -7660800, -7457809, -7653056, -7253146, -7243807]
-1419g243807k05747q104L4558j16381N6477J2732j64681P1444n8906R5680P5720J127
-1431g449888k9983j65674J20742J27876k7292m14745J27423O7979Q3618p2930j27912
-1442g760786K4430J24909O8673r7100J6569J26867O5212k08668J476Q5054R8890q6665
-1454g541139j42053o8196O0691J24941J0258K2360k5455L8724j36542l3800P864k5131
-1466g707478Q6274N1050J42446j81061M80645j68505p2249k26090k757K7673J0354K0821
-1478g538877l3515k0638L9063l0320L1590j4688O122l6501J73107m673J05203o5238l9840
-1491g429205j39973J10120P3492j02590j85403J93486O8768o2150P611P7025k10433o1323
-1503g660575J57699J23515r1785j44943p9941r5534Q5253J70094N0766k1694P7905J2244
$$ y = [-7243807, -7449554, -7457658, -7423100, -7539481, -7483004, -7470272, -7634953, -7563509, -7622415, -7526735, -7451015, -7449888, -7479871, -7645545, -7524803, -7396927, -7424219, -7838964, -7711541, -7643562, -7559944, -7632874, -7760786, -7736356, -7611447, -7542774, -7639874, -7623305, -7496438, -7431226, -7639894, -7638418, -7553364, -7454474, -7541139, -7683192, -7751388, -7690697, -7565756, -7555498, -7533138, -7558593, -7519869, -7656411, -7690211, -7682347, -7707478, -7621204, -7570154, -7427708, -7608769, -7128124, -7296629, -7368878, -7594968, -7597725, -7570052, -7559698, -7538877, -7572392, -7593030, -7553967, -7584287, -7552697, -7567385, -7561263, -7597764, -7424657, -7429330, -7324127, -7389365, -7429205, -7569178, -7459058, -7385566, -7488156, -7673559, -7480073, -7411305, -7473455, -7465844, -7388819, -7599252, -7660575, -7502876, -7379361, -7471146, -7616089, -7696030, -7791564, -7706311, -7536217, -7485451, -7507145, -7429240, -7416996]
-1515g416996k6942n4801N5028j94952J15924p2058J8506P4059k5758J27677n4244k5055
-1527g479612L1747j1454j37103J59619O0819j98707k4569J53831j81100J01734M4354p531
-1539g487972q5738K7233j9995J06091L4352j22554J9571L5091J07924p005j66911K2815
-1551g537098J09592l00233k36658K54577J26499Q799L4329J2770k00851J28078j48258
-1562g748454L64763j6868K0294j89628J25957j48543j56622J2488Q0194K8551J19999
-1573g507869O0558j35494R7214k01739L03185q5753p450K5128q9651k3059k450j80618
-1585g747998K66343j69404p2380J52442p0675K16122r9161k5335J67575J29788j69036
-1596g421719j11608J1777J5776Q2685k10350m6276R3352N4199K20113k25949m4395J51414
$$ y = [-7416996, -7443938, -7498739, -7443711, -7638663, -7522739, -7594797, -7576291, -7502232, -7527990, -7400313, -7454557, -7479612, -7447865, -7459319, -7596422, -7436803, -7375984, -7574691, -7599260, -7445429, -7626529, -7524795, -7480441, -7487972, -7573710, -7546477, -7566472, -7460381, -7426029, -7548583, -7529012, -7493921, -7385997, -7393002, -7559913, -7537098, -7427506, -7727739, -7964397, -7709820, -7583321, -7574522, -7540193, -7527423, -7728274, -7600196, -7748454, -7383691, -7400559, -7380265, -7569893, -7443936, -7592479, -7749101, -7736613, -7656419, -7627868, -7507869, -7447311, -7582805, -7485591, -7687330, -7384145, -7469898, -7477348, -7452220, -7541871, -7564930, -7567380, -7747998, -7481655, -7651059, -7723439, -7570997, -7641672, -7425550, -7524711, -7550046, -7382471, -7252683, -7421719, -7533327, -7521550, -7505774, -7423089, -7633439, -7679715, -7586363, -7532164, -7312051, -7538000, -7582395, -7430981]
-1608g430981O48580o32260J84264j58477K2453N5232r1438l1979l7344L5333n7828N6579
-1620g437866j31645k7144K3860J82593m1765j0593Q7788k06818J39049p239j74158N715
-1632g598223R7386R6226P4467j61456q1916L4862j18440J01389n0775K03255p6107J06802
-1644g372530M8132J08608j00808p8111J10250K3866j14252o9131q5551J50081M2527
-1655g336919j55189R235L611J3182j60478J16073m3926r2795J51800p9282L8845J70190
-1667g365653j60763M0540J08874j17034r2203L2923K1423j7574l3574j18674J16093l2364
-1679g617986J29531r675j9826M992J33103r9643M3453L1264p7609J67487l23703j53263
-1691g791875J22549j9195L9077K60869j76458M7352j9669J8636R1818Q2956k07296O6401
$$ y = [-7430981, -6782401, -7414661, -7230397, -7388874, -7366421, -7311189, -7402627, -7434606, -7471950, -7436617, -7494445, -7437866, -7569511, -7596655, -7572795, -7390202, -7431967, -7442560, -7354772, -7561590, -7422541, -7429780, -7603938, -7598223, -7500837, -7404611, -7330144, -7491600, -7573516, -7538654, -7657094, -7555705, -7606480, -7403225, -7479332, -7372530, -7324398, -7215790, -7316598, -7394709, -7284459, -7260593, -7374845, -7443976, -7529527, -7379446, -7336919, -7492108, -7482873, -7479262, -7466080, -7626558, -7510485, -7554411, -7647206, -7495406, -7574688, -7535843, -7365653, -7526416, -7485876, -7377002, -7494036, -7586239, -7553316, -7531893, -7549467, -7583041, -7701715, -7585622, -7617986, -7488455, -7498130, -7517956, -7512964, -7379861, -7479504, -7436051, -7404787, -7482396, -7314909, -7638612, -7791875, -7669326, -7688521, -7649444, -7388575, -7565033, -7517681, -7537350, -7518714, -7426896, -7343940, -7551236, -7484835]
-1703g484835j54065J70985q656r6585o6102J4870J26958j38629K39869j36167p8930O4671
-1715g546616J11470k46763o6400J27821N4604K2014M3338P7169m6820k6200o5692O320
-1727g555755R0699r3850J08207p4967n5611o367J63583j11135k19438J1564J13402P4970
-1739g554698J39669o4895J57582k37174k0692j958J31171k59654K46801j88728L8021
-1750g614555J07749j75768k7894K32632j28109J05503Q4324p4766o4083N5666l618R6628
-1762g406291j44223J36979O6109m6179j19881K8769P563R0475j13751q2955P9178L4044
-1774g470163m2110q6640K0089k0715K9050o4314k925J39847j41236J34178J2868M6167
-1786g445904p8358l8606j5942P7931l2061L5880K7630k8962j46094O6972p2018J00582
$$ y = [-7484835, -7638900, -7467915, -7476571, -7573156, -7639258, -7624388, -7497430, -7636059, -7396190, -7532357, -7611287, -7546616, -7435146, -7681909, -7748309, -7620488, -7565884, -7543870, -7500532, -7423363, -7470183, -7496383, -7562075, -7555755, -7465056, -7558906, -7450699, -7525666, -7581277, -7587644, -7424061, -7535196, -7754634, -7743070, -7629668, -7554698, -7415029, -7479924, -7322342, -7559516, -7580208, -7582166, -7450995, -7710649, -7463848, -7652576, -7614555, -7506806, -7682574, -7710468, -7477836, -7605945, -7500442, -7416118, -7490884, -7554967, -7499301, -7502919, -7406291, -7550514, -7413535, -7347426, -7393605, -7513486, -7484717, -7477154, -7386679, -7500430, -7583385, -7504207, -7470163, -7512273, -7598913, -7578824, -7599539, -7570489, -7634803, -7637728, -7497881, -7639117, -7504939, -7492071, -7445904, -7524262, -7562868, -7578810, -7500879, -7532940, -7497060, -7469430, -7498392, -7644486, -7577514, -7649532, -7548950]
-1798g548950O0098P434J87086j59813j26867J90884j25088L0680j29460J00104j57936
-1809g671828j25336Q7443J5663J94022J7335r6804l1526R8895Q2037j29022J78100j40654
-1821g521675N0236k8626k28658J33861Q6722j30094J27400j12524R6320J31621M2537
-1832g352880p1260l2728n7871J67071p2769n1052L6198R5271o6399q8966j55682L24839
-1844g326228j91896J06189L5180O55O18j34881m1310J45367K031J1348k96097J1815M2436
-1857g634773R8052j4751j3666L1215P4687n5969N9828j16436L5409O3122R6552J9301
-1869g357429j32923J81686k12973K06820k77431J3882R4941M2273j48773O2532j08678
-1880g636073k3619J70387j64234K97488k28073k5592N0988M8550J57831q7161O760o4202
$$ y = [-7548950, -7488852, -7481418, -7294332, -7454145, -7581012, -7390128, -7515216, -7484536, -7613996, -7513892, -7671828, -7797164, -7709721, -7694058, -7500036, -7482701, -7579505, -7611031, -7512136, -7430099, -7559121, -7381021, -7521675, -7471439, -7500065, -7728723, -7594862, -7508140, -7638234, -7510834, -7623358, -7527038, -7395417, -7352880, -7424140, -7456868, -7514739, -7347668, -7420437, -7471489, -7435291, -7340020, -7406419, -7495385, -7651067, -7326228, -7518124, -7411935, -7376755, -7376100, -7375482, -7510363, -7551673, -7406306, -7404275, -7392927, -7689024, -7677209, -7634773, -7536721, -7551472, -7565138, -7533923, -7459236, -7515205, -7455377, -7571813, -7536404, -7473282, -7376730, -7357429, -7490352, -7308666, -7521639, -7314819, -7592250, -7578368, -7483427, -7441154, -7589927, -7527395, -7636073, -7659692, -7489305, -7653539, -7356051, -7584124, -7609716, -7558728, -7510178, -7352347, -7439508, -7432748, -7496950]
-1892g496950R5209j47837l914m4172j11407J81739J59985J06282r1454J1027l2490j61616
-1904g535598n5990N3794j13013L91431L8650j32429k3701L4503l8376j01406p5036N7812
-1916g499359K329O0953p9287O8114P7315k10531J27697J31904M11698n05834k36833
-1927g651834J37654N7741l9731j25252J66464J1146p7045O697J8836O3233K4873M3570
-1939g363648j24510J32994k22156J75814k7849J5267j37981K0088N4588R0237j2748q245
-1951g408149m7007J99351j79546k0628l2566J47544L1812n8221o5187q5060k0530J11366
-1963g426821M1281j53947Q4785l9721L2431o9871O4339K97196m16246j21163Q6385R4718
-1975g526634m2645M1334K8208r6746j45859k1450O5514J51864Q7161M0042j70457J20049
$$ y = [-7496950, -7401741, -7549578, -7553492, -7597664, -7709071, -7527332, -7367347, -7261065, -7352519, -7341492, -7373982, -7535598, -7591588, -7537794, -7650807, -7259376, -7220726, -7353155, -7376856, -7342353, -7380729, -7482135, -7557171, -7499359, -7497030, -7436077, -7515364, -7447250, -7369935, -7580466, -7452769, -7320865, -6909167, -7415001, -7651834, -7514180, -7456439, -7496170, -7621422, -7454958, -7443812, -7520857, -7514160, -7495324, -7432091, -7407218, -7363648, -7488158, -7355164, -7577320, -7401506, -7429355, -7414088, -7552069, -7531981, -7477393, -7387156, -7399904, -7408149, -7455156, -7255805, -7435351, -7455979, -7488545, -7341001, -7309189, -7367410, -7432597, -7517657, -7538187, -7426821, -7385540, -7539487, -7454702, -7494423, -7461992, -7531863, -7467524, -7170328, -7586574, -7707737, -7621352, -7526634, -7569279, -7527945, -7499737, -7596483, -7742342, -7763792, -7698278, -7546414, -7459253, -7419211, -7589668, -7469619]
-1987g469619j29839M9426q8362J35271q5452j11885J45581Q3374n5624j9306q3160k5657
-1999g655252J96879j6353j09081j7954q2867K02988j03772J77158j84907q588o175j18854
-2011g726778J56859O6514k3475O6633j18349o2051l4351M9299J16567j5253J02785j43175
-2023g564775q0600K51674j4610N0926P0535q7721o2239j12757R6811K3728o4780m8458
-2035g542266k6395P1457P1078l8128j25515j50891L43191l8616n9601J26822k21694l2719
-2047g623277J02864q9354J53611O5271N6439p4113O9585K6205L9442j35611Q0299k15160
-2059g543799j40336L4634J26083J27209J808R7918j83848r062J19150n9345R9565M9873
-2071g280150j35927N0521l8124j0130J6925J17068r1083o0681K21222o4577j60774J13365
$$ y = [-7469619, -7599458, -7550032, -7638394, -7503123, -7588575, -7700460, -7554879, -7471505, -7527129, -7546435, -7629595, -7655252, -7458373, -7474726, -7583807, -7601761, -7684628, -7481640, -7585412, -7408254, -7593161, -7601749, -7607924, -7726778, -7569919, -7503405, -7526880, -7460247, -7578596, -7640647, -7674998, -7625699, -7509132, -7524385, -7421600, -7564775, -7645375, -7393701, -7408311, -7357385, -7286850, -7374571, -7436810, -7549567, -7452756, -7429028, -7493808, -7542266, -7568661, -7497204, -7426126, -7464254, -7589769, -7740660, -7397469, -7436085, -7495686, -7368864, -7590558, -7623277, -7520413, -7609767, -7456156, -7390885, -7334446, -7408559, -7338974, -7312769, -7273327, -7408938, -7328639, -7543799, -7684135, -7649501, -7523418, -7396209, -7394401, -7296483, -7480331, -7489393, -7370243, -7429588, -7330023, -7280150, -7416077, -7365556, -7403680, -7413810, -7396885, -7279817, -7370900, -7431581, -7210359, -7274936, -7435710, -7322345]
-2083g322345k16864K47646o0288p1786l6426J37731q9428N7098n0114K11277q0571p5343
-2095g349413J7777L9556q9964K3207l9835o5427O4249O5516J45417j13517k50085J82855
-2107g369664p8948r2585j22004J91737j1153J6847J10948q2483j01325L8379R7152q9327
-2119g492426J997p5732J29859K9696n619j26707J52211q3993m7016N9514M232m9594
-2131g503578j81099J03157k2727O892J14188n2916p3122K07959j51523j68771O6657M1780
-2143g613103K02831R4049m5514p3659j01201K1293k7717J13910J604O1992J39357k21978
-2155g448136r2780R8357k0185J38411j71650k4781R2032k9090p0910O7385l3639j06973
-2167g601959K00915j9423L4776j52590K11515k6843M047m6921q4O0559p7843j1567q4810
$$ y = [-7322345, -7539209, -7291563, -7351851, -7423637, -7460063, -7322332, -7411760, -7354662, -7404776, -7193499, -7274070, -7349413, -7331636, -7292080, -7382044, -7358837, -7398672, -7464099, -7399850, -7334334, -7188917, -7302434, -7552519, -7369664, -7448612, -7541197, -7663201, -7471464, -7482617, -7465770, -7354822, -7437305, -7538630, -7500251, -7403099, -7492426, -7490429, -7566161, -7436302, -7406606, -7412225, -7538932, -7386721, -7470714, -7517730, -7458216, -7453984, -7503578, -7684677, -7581520, -7604247, -7597355, -7483167, -7536083, -7609205, -7401246, -7552769, -7721540, -7654883, -7613103, -7410272, -7316223, -7361737, -7435396, -7536597, -7515304, -7543021, -7429111, -7427507, -7365515, -7226158, -7448136, -7540916, -7442559, -7462744, -7324333, -7495983, -7520764, -7428732, -7457822, -7528732, -7461347, -7494986, -7601959, -7401044, -7420467, -7385691, -7538281, -7326766, -7353609, -7349562, -7396483, -7396567, -7336008, -7413851, -7425418, -7510228]
-2180g510228J76114r7509j64156P7920J87390j42238N1521j22013j67683K50209o857
-2191g467530r4594m7863l4307L01565o3489J0114P6199j60182l3463K15280r8289l1203
-2203g427762k8596J28647L3042k01101P8687p36o8975P4081n6356Q3607Q4773j92356
-2215g493045J5571O0949j42260K60629J07496o7815k03732L5820J82039K403l7693r9965
-2227g379603j41342N8958q9032m5004P0122J55902j14836J12166j50329m9350P0248
-2238g502100J07028m7716M0901J01008J6050j46058J17815j57546J00048K2614j0207
-2249g358163j0404j98703M2448j6916J867R2659J484L3918j52148L5857J23615j13924
-2261g518410M1580q1017P6396J40154n4787l8187m5939Q5619J15520q6867q0453J00474
$$ y = [-7510228, -7334114, -7431623, -7595779, -7517859, -7330469, -7472707, -7421186, -7543199, -7710882, -7460673, -7467530, -7562124, -7609987, -7644294, -7342729, -7406218, -7396104, -7319905, -7480087, -7513550, -7298270, -7396559, -7427762, -7456358, -7327711, -7294669, -7495770, -7417083, -7417819, -7486794, -7412713, -7469069, -7385462, -7300689, -7493045, -7477474, -7416525, -7558785, -7298156, -7190660, -7258475, -7462207, -7426387, -7244348, -7241945, -7279638, -7379603, -7520945, -7461987, -7551019, -7596023, -7525901, -7369999, -7484835, -7372669, -7522998, -7572348, -7502100, -7395072, -7442788, -7401887, -7300879, -7284829, -7430887, -7313072, -7470618, -7370570, -7347956, -7358163, -7368567, -7567270, -7524822, -7541738, -7539871, -7447212, -7445728, -7411810, -7563958, -7528101, -7404486, -7518410, -7476830, -7557847, -7481451, -7341297, -7396084, -7434271, -7480210, -7394591, -7279071, -7365938, -7446391, -7345917]
-2273g345917k75015J50347j4587k24013K74012o635j10396J57756p6688M2747p3539n3365
-2285g555293Q1176O2620j37444N0226J8433q124O9775q577o6893j29872o7779m8002o9405
-2298g809159R5442M55932j56415j6640m7963j09128P0932N160Q8930o5676p0976J9858
-2310g539703P5294K64437k76261o8231J16840O7672m8336r8891J54849j26945P8967
-2321g400308j48060K19744j48897l5327l03881L41183k3415J41388l2057j3695R7938
-2332g305387j42107j10198L5418l1652J341j20289K62430P0835j19534K0049J37459J291
-2344g300344l6063N1802k0041J4940j20273p1007P9750o0627j15525K24276p1993r1274
-2356g516379J79741k922k7961j78013O9814J1932N0330q5970L8131O0878p6J93528j02428
$$ y = [-7345917, -7620932, -7470585, -7485172, -7709185, -7435173, -7441808, -7552204, -7394448, -7471136, -7428389, -7501928, -7555293, -7474117, -7411497, -7548941, -7498715, -7480282, -7488406, -7418631, -7427208, -7494101, -7623973, -7691752, -7739754, -7809159, -7713717, -7257785, -7414200, -7430840, -7478803, -7587931, -7516999, -7511839, -7422909, -7488585, -7559561, -7539703, -7464409, -7199972, -7476233, -7544464, -7427624, -7359952, -7408288, -7507179, -7352330, -7479275, -7400308, -7548368, -7328624, -7477521, -7512848, -7816729, -7475546, -7498961, -7357573, -7389630, -7403325, -7305387, -7447494, -7557692, -7522274, -7553926, -7552585, -7672874, -7410444, -7339609, -7459143, -7439094, -7301635, -7300344, -7336407, -7284605, -7304646, -7289706, -7409979, -7480986, -7401236, -7461863, -7577388, -7353112, -7425105, -7516379, -7336638, -7339560, -7367521, -7545534, -7475720, -7463788, -7413458, -7499428, -7461297, -7400419, -7400495, -7206967, -7309395]
-2369g309395J5679r2335m5711n6956K8498k1773l4073j18435J94882j6377P7706o0780
-2381g439070o6042M8259N5482j19117M9203J19679K6577K0690m4998J01836j37761o4630
-2393g449892p4847J3916J80667r9235j14834Q295M0572j18694j48123K52755K9126R7250
-2405g383044j29869k431o5420J48779j83773K22191K22755j90295q9031O315O3135j7705
-2417g398393o0179n0042Q8338p9198R0541L2907M3156j67775J14410J13998j32765J31523
-2429g273479k08193N1150N2806j09520j43575K49842k29476K65702J20281j4500O9900
-2440g169062Q0490l37015j32253K12973J58223l03115l8359L9318N7576M1620P5581R964
-2452g304059M0621k68867J12559j12619L3078K4841p4219K1098J06259Q5062m3584J79716
$$ y = [-7309395, -7293716, -7386051, -7431762, -7488718, -7460220, -7481993, -7516066, -7634501, -7439619, -7455996, -7378290, -7439070, -7505112, -7456853, -7401371, -7520488, -7471285, -7351606, -7325029, -7304339, -7349337, -7247501, -7385262, -7449892, -7524739, -7510823, -7330156, -7429391, -7544225, -7535930, -7495358, -7614052, -7762175, -7509420, -7480294, -7383044, -7512913, -7515344, -7580764, -7431985, -7615758, -7393567, -7170812, -7361107, -7450138, -7443823, -7380688, -7398393, -7458572, -7508614, -7420276, -7499474, -7408933, -7376026, -7332870, -7500645, -7386235, -7272237, -7405002, -7273479, -7481672, -7430522, -7377716, -7487236, -7630811, -7380969, -7610445, -7344743, -7224462, -7238962, -7169062, -7088572, -7425587, -7557840, -7344867, -7186644, -7489759, -7528118, -7488800, -7431224, -7389604, -7314023, -7304059, -7263438, -7532305, -7419746, -7532365, -7499287, -7474446, -7548665, -7527567, -7421308, -7336246, -7379830, -7200114]
-2464g200114k93345M7608J6185k6481l5625N4316J09063l3377J22443p5212j18012L0151
-2476g402400Q1418j84844K9672m6474Q3861o4721M6555j78813L3123O8929r0466J04153
-2488g520007J64077k88211K25138J15148P506l0675j04042O0348p7439l27J60196n573
-2500g293861o3734O870K1730M8699j11293j5746N1785J2357j96177L4707o91J72552q1439
-2513g414241Q54n6194m5633K4415J34442P0221N3224k4272k64410O0017J10078j27454
-2525g478953J66093j29151m5384M6158k3006l2053j3490N4131n4515j15068J08484k9241
-2537g545995R4603K6222n7994K28963m7212K8617l03767O9576O6657M9732p8129N3109
-2549g415618K6437m6910m8418J24701O1079q0982m3068o2672O6853J2828j1548L08L5168
$$ y = [-7200114, -7493459, -7445851, -7429666, -7456147, -7491772, -7437456, -7328393, -7361770, -7239327, -7314539, -7432551, -7402400, -7320982, -7505826, -7476154, -7522628, -7438767, -7503488, -7456933, -7635746, -7602623, -7533694, -7624160, -7520007, -7355930, -7644141, -7419003, -7303855, -7296349, -7327024, -7431066, -7370718, -7448157, -7448484, -7288288, -7293861, -7357595, -7350725, -7328995, -7280296, -7391589, -7407335, -7355550, -7343193, -7539370, -7504663, -7505354, -7332802, -7414241, -7413387, -7469581, -7515214, -7490799, -7356357, -7286136, -7232912, -7257184, -7521594, -7461577, -7351499, -7478953, -7312860, -7442011, -7487395, -7441237, -7464243, -7496296, -7509786, -7455655, -7510170, -7625238, -7516754, -7545995, -7451392, -7425170, -7483164, -7254201, -7301413, -7272796, -7576563, -7506987, -7440330, -7390598, -7468727, -7415618, -7389181, -7436091, -7484509, -7359808, -7298729, -7379711, -7422779, -7485451, -7418598, -7405770, -7417318, -7417010, -7381842]
-2562g381842n140o0132R023P0185J17125p8036k04253K33859k7361m6017R737m708q2327
-2575g449887R3141K1290j83765J59995j09660k7445Q5240j46629J33649J02740N718j0587
-2587g326200m7564l8734O3055J6722N1487l8131m1023J30294j67118L9594K9367J0361
-2599g317890m9377P3783l9406k19322O2602K2705L7874N7264J2472l8264O1335j02647
-2611g438871L1149q1974R3377K2556o911j15235J09688n3737j01862J15034J30795p5145
-2623g371136j2651j79781J79587j12118J085R4237M9545p0662M4664r1445M3286J3559
-2635g411830Q908K9627O6876l2044j14757L4635p2856M3010M3906n7774j44530N0187
-2647g556642O4563Q1879j29265K87997p9759k55620K09940Q0553j33054m088L9310o5207
$$ y = [-7381842, -7386982, -7447114, -7438091, -7367906, -7250781, -7328817, -7533070, -7299211, -7326572, -7372589, -7362852, -7367560, -7449887, -7356746, -7335456, -7519221, -7359226, -7468886, -7496331, -7411091, -7557720, -7424071, -7321331, -7315613, -7326200, -7373764, -7412498, -7349443, -7332721, -7281234, -7319365, -7360388, -7230094, -7397212, -7357618, -7328251, -7317890, -7367267, -7293484, -7332890, -7552212, -7489610, -7466905, -7429031, -7371767, -7359295, -7397559, -7336224, -7438871, -7407722, -7489696, -7396319, -7373763, -7380674, -7495909, -7386221, -7439958, -7541820, -7426786, -7295991, -7371136, -7383787, -7563568, -7383981, -7496099, -7495014, -7400777, -7351232, -7421894, -7377230, -7468675, -7425389, -7411830, -7402922, -7373295, -7306419, -7338463, -7453220, -7418585, -7491441, -7448431, -7404525, -7462299, -7606829, -7556642, -7492079, -7410200, -7539465, -7251468, -7331227, -7586847, -7376907, -7296354, -7429408, -7433496, -7394186, -7459393]
-2659g459393m3449R2687J91654q1284j01217L2105P1809j15042L9523J15959j36961Q3263
-2671g310346j27501J33836m9617q2037o9643R9212M1106p3063J76816q1352j54672L454
-2683g493807N3268k6490K9440j5960j08088Q3813J51524M99J4990m123O1778q5373J41800
-2696g196729j24813j76684J79933r8414o6638P6479L7109o8004o4712J04113P0820j99039
-2708g526579J22109J2037q1377j10868j6217O3044J57232j27754l01257N95937j35248
-2719g348941j2664O1449l3080o8222M8114n7668K9164n8459O8222J34558j01272
$$ y = [-7459393, -7502842, -7410155, -7218501, -7299785, -7401002, -7368897, -7297088, -7412130, -7372607, -7256648, -7393609, -7310346, -7437847, -7304011, -7353628, -7435665, -7505308, -7406096, -7364990, -7438053, -7261237, -7342589, -7497261, -7493807, -7440539, -7467029, -7437589, -7453549, -7561637, -7477824, -7326300, -7325801, -7310811, -7314934, -7253156, -7338529, -7196729, -7321542, -7498226, -7318293, -7416707, -7483345, -7406866, -7369757, -7437761, -7502473, -7398360, -7327540, -7526579, -7404470, -7392433, -7473810, -7584678, -7600895, -7537851, -7380619, -7508373, -7809630, -7213693, -7348941, -7361605, -7300156, -7333236, -7401458, -7353344, -7411012, -7381848, -7440307, -7372085, -7237527, -7338799]
-2730g338799  $$ checkpoint
##PAGE= N=2
##DATA TABLE=(X++(I..I)), XYDATA
13653g331634J18116l0768k8141q0861K58870n4575k9596J06450Q399p1009L9102l4615
13641g130262j09343k57210K39237J33836j40214P3932Q9617p4364m7614J6312J37651J698
13629g066724n7022k2010l7545J57794k08286p202K7045P1851k5699J51506K4726k1595
13617g013161K15844j70968j49643Q2477m6020M9938n5417j71500J35694J83367j12970
13606g052359R401J18782j0540J65161k40266O5239n6546n9776J90506L296m7035k02564
13594g116701j4390J41200k3694K51631m9397q6068n7573j05757J39429J1144O9924J00181
13582f740071k33048q738R7423R7295M4595K56636k1763m12214L1347M119J15910r6339
13570f864848K1862j14135j75161J4182O3199o1172J20782K38048J58890j14067n8429
$$ y = [-7331634, -7213518, -7244286, -7272427, -7353288, -7094418, -7148993, -7178589, -7072139, -7063740, -7134749, -7095647, -7130262, -7239605, -7496815, -7257578, -7123742, -7263956, -7190024, -7100407, -7174771, -7222385, -7206073, -7068422, -7066724, -7123746, -7145756, -7183301, -7025507, -7233793, -7240995, -7213950, -7142099, -7167798, -7016292, -6991566, -7013161, -6797317, -6968285, -7117928, -7035451, -7081471, -7031533, -7086950, -7258450, -7122756, -6939389, -7052359, -7042958, -6924176, -6934716, -6769555, -7009821, -6944582, -7001128, -7060904, -6870398, -6867102, -6914137, -7116701, -7131091, -6989891, -7013585, -6761954, -6811351, -6897419, -6954992, -7060749, -6921320, -6910176, -6840252, -6740071, -6973119, -6981857, -6884434, -6787139, -6742544, -6485908, -6507671, -6919885, -6888538, -6884419, -6768509, -6864848, -6842986, -6957121, -7132282, -7118100, -7054901, -7116073, -6995291, -6757243, -6598353, -6712420, -6770849]
13559f770849O2613J90393k00545k6222k88099K81808k712n3247l8238R5546P5540p5646
13547f749658j1862r823M8523j35299k4258k293j3455J23206j54266J62824j04304J24028
13535f746637O7205n1967Q652J9713j62405J5122N7472K15029J1283j06382n3786p3448
13523f800149l6866J12588K6285M8081k19065K70114j10710J27820R5638J3204K6454
13512f446606j34627r0103L2456K2987j7032O5643Q1716n2474k5236n5658k817k8075o1435
13499f711261J38125J6800j7586O8518j28237R0460J34268j02872r0526j17028L6817
13488f682522J65869M6539j9459q4227N6904O743J25194o8523r5950Q5101O5853j45785
13476f544263j9052Q3912M0750q5709j12424K51046J9280p9907J85260j60356J46892
$$ y = [-6770849, -6708236, -6517843, -6718388, -6744610, -7032709, -6750901, -6753613, -6806860, -6845098, -6749552, -6674012, -6749658, -6761520, -6771343, -6722820, -6858119, -6882377, -6884670, -6898125, -6774919, -6929185, -6766361, -6870665, -6746637, -6679432, -6731399, -6722747, -6703034, -6865439, -6850317, -6792845, -6577816, -6566533, -6672915, -6726701, -6800149, -6837015, -6724427, -6698142, -6650061, -6869126, -6599012, -6709722, -6581902, -6486264, -6473060, -6446606, -6581233, -6671336, -6638880, -6615893, -6632925, -6567282, -6485566, -6538040, -6563276, -6618934, -6621751, -6649826, -6711261, -6573136, -6556336, -6573922, -6505404, -6633641, -6543181, -6408913, -6511785, -6602311, -6719339, -6682522, -6516653, -6470114, -6489573, -6573800, -6516896, -6510153, -6384959, -6453482, -6549432, -6464331, -6398478, -6544263, -6563315, -6479403, -6438653, -6524362, -6636786, -6385740, -6366460, -6446367, -6261107, -6421463, -6274571]
13465f274571k28962J48963R7833r2383J48910j2007j28786j10887j6561J90134k10151
13454f488468m8875P275J26923j29297Q2602Q1849J5481o3008j992J06094R3410j48032
13442f366038L338N8136j751p0985k5160M1079P6240q2292M1018k19371J03844J15656j431
13429f327717j4583J02048J00086j02986m5268Q4243j57583O6482M5629r5203p5400M19138
13417f001114m4491j29762l3262Q031J08491j47855Q2362J05256J9668p2785j54198K33235
13405f026424k00768K4618J85637j24680K16851j51541J3329K6854j35192r3930J07220
13394f158026M1007m4593j0473K0309j09488p2924K09457k18253L45714l4702p0904K3293
13382f079583j1378o0802O7741K0741k74344K11829J32116r2774Q9257p9704m1389n5982
$$ y = [-6274571, -6503533, -6354570, -6256737, -6349120, -6200210, -6212217, -6341003, -6451890, -6468451, -6278317, -6488468, -6537343, -6530068, -6403145, -6532442, -6449840, -6367991, -6352510, -6415518, -6417510, -6311416, -6218006, -6366038, -6362700, -6304564, -6306315, -6377300, -6402460, -6361381, -6285141, -6367433, -6326415, -6545786, -6441942, -6326286, -6327717, -6342300, -6240252, -6140166, -6243152, -6288420, -6204177, -6361760, -6295278, -6249649, -6344852, -6420252, -6001114, -6045605, -6175367, -6208629, -6200598, -6092107, -6239962, -6157600, -6052344, -6032676, -6105461, -6259659, -6026424, -6227192, -6202574, -6016937, -6141617, -5924766, -6076307, -6062978, -6036124, -6171316, -6265246, -6158026, -6117019, -6161612, -6172085, -6151776, -6261264, -6334188, -6124731, -6342984, -5997270, -6031972, -6102876, -6079583, -6090961, -6151763, -6084022, -6063281, -6337625, -6125796, -5993680, -6086454, -5997197, -6076901, -6118290, -6174272]
13370f174272J20592o2669J59007k64765J55577m3085M8898P6170L3961J59544J08718
13359e682324m25235J9681N4501M8247P3601r7954j7550K5812p10j1838N9414q4967k0624
13346f059946J25329k0827p6838J69431n6512J15235j24828j22306n7278R7493J45340
13335e865707O7227M4709j26873o8959P1163J49795o5097N5783l1765M6106j07439k250
13323e833307j22753J3153L6916J7668l1525Q4809L2035m4367J34661j83879l6449R2822
13311e840216j06044O8907m4092j5549O9370O9602j6613p1096M6873J32194j4967j7489
13299e739120j31692J46465n4796J06030k22222O0338J24413L7792j65044J04233J19204
13288e614399q0088k1435j8893j2688J0618J00023o5031q3701M3027j3771P6116l8229
$$ y = [-6174272, -6053680, -6116349, -5957342, -6222107, -6066530, -6109615, -6060717, -5984547, -5950586, -5791042, -5682324, -6107559, -6087878, -6033377, -5985130, -5911529, -6009483, -6027033, -6001221, -6001931, -6013769, -5954355, -6039322, -6059946, -5934617, -5955444, -6032282, -5862851, -5919363, -5804128, -5928956, -6051262, -6108540, -6011047, -5865707, -5798480, -5753771, -5880644, -5949603, -5878440, -5728645, -5793742, -5737959, -5769724, -5723618, -5831057, -5833307, -5956060, -5942907, -5905991, -5888323, -5919848, -5835039, -5803004, -5847371, -5712710, -5896589, -5933038, -5840216, -5946260, -5877353, -5921445, -5936994, -5867624, -5798022, -5814635, -5885731, -5838858, -5706664, -5721631, -5739120, -5870812, -5724347, -5779143, -5673113, -5895335, -5834997, -5710584, -5672792, -5837836, -5733603, -5614399, -5694487, -5715922, -5734815, -5747503, -5736885, -5636862, -5701893, -5785594, -5742567, -5756338, -5680222, -5718451]
13276e718451P6822l09044J27466Q066N6483R888J1449l9887L44438L0254O7051j41516
13264e476981p3242l4109K03950k66381J1453j19570O7491M440k3744o9487j7148J19373
13252e673955L5411J25380k06810M06962m6062l740l1638j65332J12416m1930J78026
13241e311272l14621j21141k5299K60865k29941J45067O9666o431P0653j54341K93357
13230e323438j64029k8396m3988o2226P5347R5196M0450j30608l81574J93942n2535M2993
13218e738866J16242m9208J6926J2179J03514L831m5466J64050j64133L2738J42947m5224
13206e450470k892R3401p3563K928J43746R1468p1623j54611o0243j9286J13837j37511
13194e524819N6413m7806J98764j06351Q0204p1211M083K2031o4864n2947P4022j28937
$$ y = [-5718451, -5641629, -5950673, -5823207, -5815141, -5758658, -5748770, -5737321, -5777208, -5432770, -5402516, -5335465, -5476981, -5550223, -5584332, -5380382, -5646763, -5635310, -5754880, -5687389, -5682949, -5706693, -5776180, -5793328, -5673955, -5638544, -5513164, -5719974, -5313012, -5359074, -5362814, -5394452, -5559784, -5447368, -5489298, -5311272, -5625893, -5747034, -5772333, -5511468, -5741409, -5596342, -5526676, -5533107, -5462454, -5616795, -5323438, -5487467, -5515863, -5559851, -5622077, -5546730, -5451534, -5411084, -5541692, -5923266, -5729324, -5781859, -5738866, -5622624, -5671832, -5654906, -5642727, -5539213, -5535382, -5580848, -5416798, -5580931, -5548193, -5405246, -5450470, -5453362, -5359961, -5433524, -5430596, -5286850, -5195382, -5267005, -5421616, -5481859, -5501145, -5387308, -5524819, -5468406, -5516212, -5317448, -5423799, -5343595, -5414806, -5410723, -5388692, -5453556, -5506503, -5432481, -5561418]
13182e561418J85580m9809k44214J65605O197L4105J62416k4959L699k21505J439J33082
13170e409782o1963q4295L04134m0579l5259j7132R6039m5769O4466q9044J14138j31650
13158e336696o1667J05223M1178k02420o7745K76253J2906K2353j85335n5397p340Q7416
13146e371271R2776q5349M1365q598j1636J61491n2447n8757P2511J0808K7902K80415
13134d900790k32911r4347R3122L3350R481p6273J30202J9672k71997J59231m0061P3189
13122e098132q4720l4733M9073M7779L9472o2472J0252J20316j54127J14342j89753o9823
13110e312526L8746K39465k35750J35254K28180k55707J09881o6064m5816j07365R8418
13099e173284p7997Q6669N3853j382k5252P3385K2845j45577P6248M5143K4970l4599J5570
$$ y = [-5561418, -5375838, -5425647, -5669861, -5504256, -5498059, -5463954, -5301538, -5326497, -5322798, -5544303, -5542864, -5409782, -5471745, -5556040, -5251906, -5292485, -5327744, -5344876, -5248837, -5294606, -5230140, -5319184, -5205046, -5336696, -5398363, -5293140, -5251962, -5454382, -5522127, -5245874, -5232968, -5210615, -5395950, -5451347, -5458687, -5371271, -5278495, -5363844, -5322479, -5331077, -5342713, -5181222, -5233669, -5292426, -5219915, -5209107, -5181205, -4900790, -5133701, -5228048, -5134926, -5101576, -5092095, -5168368, -5038166, -5018494, -5290491, -5131260, -5171321, -5098132, -5182852, -5217585, -5168512, -5120733, -5081261, -5143733, -5133481, -5013165, -5167292, -5052950, -5242703, -5312526, -5273780, -5034315, -5270065, -5134811, -4906631, -5162338, -5052457, -5118521, -5164337, -5271702, -5173284, -5251281, -5164612, -5110759, -5112141, -5137393, -5064008, -5041163, -5186740, -5110492, -5065349, -5040379, -5074978, -5059408]
13086e059408J04945m8746J38415J1162n6240j46249r1552Q3463M8738n5889J10153J19197
13074d842011j36469k40699J82751K2181J65804k66235K13962j6289r7255m4989R9998
13063d959251j91408R7545j8317J08039O8232k33170O4547O9796p7385P4901j7380K14298
13051d799553p7354l8729J25281k94964J82892j8440R395O7475J08748k40072Q9982M0779
13039d844560J3441p004J20379j88532Q7530r661R0865K19370j55457k994k05914M12633
13027d469904l70881m045K08178J3287j01817O7088m8007p4592J7076P1546r6938J94573
13015d594436k94950K9463J45188j50839L932j40713k3306K07279n7532R8944o5880j77163
13003e020013K95770j5884k1569J9858K2965j79772O9323j04649Q6833R8902k3504k2282
$$ y = [-5059408, -4954463, -5003209, -4864794, -4853632, -4909872, -5056121, -5147673, -5064210, -5015472, -5071361, -4961208, -4842011, -4978480, -5219179, -5036428, -5014247, -4848443, -5114678, -4900716, -4917005, -5014260, -5059249, -4959251, -5150659, -5053114, -5071431, -4963392, -4895160, -5128330, -5063783, -4993987, -5071372, -4996471, -5013851, -4799553, -4876907, -4915636, -4790355, -5085319, -4902427, -4920867, -4911472, -4843997, -4735249, -4975321, -4885339, -4844560, -4831119, -4838123, -4717744, -4906276, -4818746, -4828407, -4737542, -4518172, -4673629, -4676623, -4882537, -4469904, -4840785, -4844830, -4636652, -4623365, -4725182, -4658094, -4706101, -4780693, -4763617, -4692071, -4789009, -4594436, -4889386, -4859923, -4714735, -4865574, -4861642, -5002355, -5025661, -4818382, -4875914, -4776970, -4842850, -5020013, -4724243, -4740127, -4761696, -4741838, -4718873, -4898645, -4829322, -4933971, -4847138, -4748236, -4771740, -4794022]
12991d794022K32069j70779P3659l5805j27616k350N1739P8805p1522M7996j03770Q1536
12979d740060j32828J11552J69872j22407K72659k9035o6446o2479j54140N1640J0653
12968d691019p7898L8263J84355J31731k78836N5093o2720J05761l6021o2209J7260L3325
12956d642915n5108J84883j56511J4592j16002J83518q2401M122Q9344j86595J24040k8859
12944d667892P304n752J1831m1961J1876k0086q4892P1044J4079R643o7537R4819J59207
12931d508317j23878M79J42322k16167J10304K2257r6379j3029P610J40462L468P7217
12919d453651L7459L7684r5560r6941m5151J30637q2973k20121K33053N5349j21419j21353
12907d742987J69996l3601K72162l6715m3497q3878j3803j75584J08647J97809N1032
$$ y = [-4794022, -4561953, -4732732, -4659073, -4694878, -4822494, -4824844, -4773105, -4694300, -4765822, -4717826, -4821596, -4740060, -4872888, -4761336, -4591464, -4713871, -4441212, -4470247, -4536693, -4599172, -4753312, -4701672, -4691019, -4768917, -4730654, -4546299, -4414568, -4693404, -4638311, -4701031, -4595270, -4631291, -4693500, -4676240, -4642915, -4698023, -4513140, -4669651, -4655059, -4771061, -4587543, -4669944, -4665822, -4576478, -4763073, -4639033, -4667892, -4660588, -4666340, -4654509, -4696470, -4684594, -4704680, -4789572, -4718528, -4704449, -4694806, -4762343, -4667524, -4508317, -4632195, -4631716, -4489394, -4705561, -4595257, -4573000, -4669379, -4682408, -4674798, -4534336, -4530868, -4453651, -4416192, -4378508, -4474068, -4571009, -4616160, -4485523, -4568496, -4788617, -4555564, -4500215, -4621634, -4742987, -4572991, -4606592, -4334430, -4371145, -4414642, -4498520, -4512323, -4687907, -4579260, -4381451, -4330419]
12896d330419j48517j40265j33172J99757K9596L4837j50887J69131q9346L7064m2759
12885d564980J15307J18052j4116j18866o2975j2800O4010J23787L3411p2039n2872j2756
12873d456837r3100J10279l9634K7119J22448j53788J37522j06333L898K0163J49461r0279
12861d369081N0486j97547J97309j46923J49155L2397l9985K25013r4780M4055o4581
12850d214482j41824J38949P16177p78301j43015K0926J97843j46917j15845K29803n764
12839d242450j1137k6262j07301j04530L5081m109J87407L3050j83096j36144J41541o7865
$$ y = [-4330419, -4478936, -4619201, -4752373, -4552616, -4523020, -4488183, -4639070, -4469939, -4559285, -4522221, -4564980, -4449673, -4331621, -4345737, -4464603, -4527578, -4540378, -4476368, -4352581, -4319170, -4391209, -4444081, -4456837, -4549937, -4439658, -4479292, -4452173, -4329725, -4483513, -4345991, -4452324, -4448426, -4428263, -4278802, -4369081, -4318595, -4516142, -4318833, -4465756, -4316601, -4284204, -4324189, -4099176, -4193956, -4149901, -4214482, -4356306, -4217357, -3501180, -4279481, -4422496, -4401570, -4203727, -4350644, -4466489, -4236686, -4242450, -4253587, -4279849, -4387150, -4491680, -4456599, -4460708, -4273301, -4240251, -4423347, -4559491, -4417950, -4485815]
$$ [...]
-2730i089109  $$ checkpoint
##END NTUPLES=
##END=
