##TITLE= S#361566
##JCAMP-DX= 5.00 $$ JEOL NMR v1.10
##DATA TYPE= NMR SPECTRUM
##DATA CLASS= NTUPLES
##NUM DIM= 1
##ORIGIN= DELTA_NMR
##OWNER= organic
##SPECTROMETER/DATA SYSTEM= DELTA_NMR
##.OBSERVE FREQUENCY= 3.00529655924288E+02
##.OBSERVE NUCLEUS= ^1H
##.DELAY= (2.194E+02,2.194E+02)
##.ACQUISITION MODE= SIMULTANEOUS
##.FIELD= 7.0586013
##.FILTER WIDTH= 1.81675738660864
##.ACQUISITION TIME= 3.6339712
##.SPINNING RATE= 17
##.OBSERVE 90= 9.6
##NTUPLES= NMR SPECTRUM
##VAR NAME= FREQUENCY,    SPECTRUM/REAL, SPECTRUM/IMAG, PAGE NUMBER
##SYMBOL=   X,            R,             I,             N
##VAR TYPE= INDEPENDENT,  DEPENDENT,     DEPENDENT,     PAGE
##VAR FORM= AFFN,         ASDF,          ASDF,          AFFN
##VAR DIM=  16384, 16384, 16384, 2
##UNITS= PPM,     ARBITRARY UNITS, ARBITRARY UNITS, 
##FIRST=  1.2501033903057E+01, -1.19955180077536E+01, -8.53119292894774, 1
##LAST=  -2.50011824950436, -1.04604079018148E+01, -1.05209263290222E+01, 2
##FACTOR=  9.1565355261926E-04, 9.6948604695885E-04, 9.6948604695885E-04, 1
##PAGE= N=1
##DATA TABLE=(X++(R..R)), XYDATA
$$ [...]
8228 -9639323 -9628019 -9893411 -8972130 -10454829 -10598954 -10537914 -10635159 -10081016 -10452587 -10025959 -10338417
8217 -10338417 -9797277 -10736623 -10582503 -10310679 -10010785 -10396977 -10194406 -10844752 -10389196 -10802204
8207 -10802204 -10208360 -10133377 -10155056 -10207687 -9750330 -10508078 -10354762 -9910956 -10700570 -10741674 -9459600
8196 -9459600 -9800353 -9749447 -9643175 -9443308 -9799065 -10194592 -9924141 -10486846 -9828898 -9856890 -10205941
8185 -10205941 -10180930 -11297346 -10349218 -10369396 -10593242 -10617926 -10474661 -10494322 -10027162 -9885222 -9554005
8174 -9554005 -10065350 -10709497 -10165619 -10061076 -9655422 -9902299 -9766315 -9729433 -9894059 -10116567 -9941186
8163 -9941186 -10165787 -10657490 -10047483 -10465552 -10653525 -10576950 -10817389 -10372903 -10594018 -10505116 -10132152
8152 -10132152 -9626516 -10385780 -10692201 -10146729 -9871464 -9715229 -10005343 -10617420 -10250478 -10194440 -10430813
8141 -10430813 -9829124 -9612828 -10085512 -9854106 -10328722 -10746178 -10421688 -10251129 -9653781 -9941982 -9945766
8130 -9945766 -10273878 -9839468 -9974462 -9874030 -10321219 -10057507 -10226127 -10401950 -11049583 -10925194 -10256829
8119 -10256829 -10467362 -10492186 -10577699 -9530246 -9781329 -10612798 -10020887 -10564227 -10440032 -9671565 -9136247
8108 -9136247 -10728419 -10824598 -10166450 -10679313 -10519512 -10839350 -10589493 -10641817 -10517266 -10386855 -10204542
8097 -10204542 -10017885 -10577734 -9933507 -10633131 -10029343 -10265621 -10050059 -10094253 -10085743 -9659891 -9838776
8086 -9838776 -10313096 -9820429 -8944929 -10088956 -10085984 -10246189 -10660323 -9453268 -9898707 -10060870 -9602262
8075 -9602262 -9416380 -9749822 -9864307 -10579271 -10535570 -10870999 -10370233 -9910990 -9839537 -9997781 -10154395
8064 -10154395 -10321239 -10143700 -10390561 -11243766 -10141335 -10160365 -10642562 -10347374 -10327406 -9950191 -10485344
8053 -10485344 -10365515 -10427334 -10328456 -10264421 -10154689 -10492198 -10402496 -9955231 -9660434 -10677814 -10554077
8042 -10554077 -10669772 -9749815 -10133617 -9552289 -10252927 -10341085 -10112364 -10253373 -10126330 -9496043 -9464067
8031 -9464067 -9745541 -9526827 -9248853 -9912895 -9780770 -9515825 -9102167 -9424454 -9287403 -9440940 -9335128
8020 -9335128 -9096971 -9102111 -9102534 -9067928 -9391555 -9188691 -9200553 -9285822 -9830063 -10037858 -9305598 -9621031
8008 -9621031 -8544272 -8936288 -8852678 -8968101 -9032534 -9113891 -8884621 -9660704 -9127403 -9533941 -8899674
7997 -8899674 -8921367 -9279815 -9499114 -8855443 -8624502 -8782288 -9092406 -9464968 -9254948 -9692823 -9040848
7986 -9040848 -8303022 -8225514 -8306196 -8538218 -8735939 -8722859 -8770982 -8821256 -8497840 -8681241 -8777927 -7943927
7974 -7943927 -8201348 -7482131 -7404923 -7129762 -7263403 -7166695 -7171039 -7044132 -6695125 -6174839 -5748649
7963 -5748649 -5582932 -5581666 -5568517 -5663738 -5742489 -5680629 -5643095 -5008898 -5145756 -5256250 -5576452 -5191853
7951 -5191853 -4909813 -5463581 -5400137 -5103114 -4696984 -4025790 -4241564 -4253737 -4229494 -4142584 -3068248
7940 -3068248 -2573286 -2277445 -2008209 -1390949 -1699262 -2325463 -1148961 139286 427281 1382057
7930 1382057 1029400 817051 1377960 1417527 732461 216819 239889 1188751 3838976 4571457 2415669
7919 2415669 303100 -1667979 -4600528 -5397144 -4957821 -4990836 -6330170 -7086585 -7494104 -7207077
7909 -7207077 -7406998 -8710528 -8390747 -8342348 -9053867 -9340934 -8634818 -8842139 -9558588 -8757321
7899 -8757321 -10048764 -10356575 -10715527 -11006030 -10472784 -10946536 -10332468 -10154938 -9958832 -9739049 -9712117
7888 -9712117 -9907172 -10520943 -10803747 -11011893 -10392408 -10302852 -10111685 -10075315 -9980894 -9940441 -10347235
7877 -10347235 -9895574 -10065500 -10111637 -9980348 -10045960 -10614101 -9766856 -10032085 -9885103 -10266496 -9948013
7866 -9948013 -9770422 -9950753 -10551851 -10575733 -10273377 -10118854 -9802993 -9923551 -9688329 -10002645 -10158164
7855 -10158164 -10269243 -10724394 -11185517 -10144038 -10067563 -9927847 -10279382 -10477356 -9952545 -9838107
7845 -9838107 -9563493 -10149193 -9696985 -9460315 -9610943 -9887518 -9988788 -9924525 -9975158 -10008727 -10007898
7834 -10007898 -11684676 -10849590 -10315949 -10238343 -10484798 -10222119 -9607913 -11062738 -10908789 -10428545 -10432072
7823 -10432072 -10344440 -10617669 -10487943 -9744589 -10419815 -10906828 -10618795 -10751102 -10658450 -10517626 -11042427
7812 -11042427 -11092199 -11105178 -11062575 -10727346 -9997264 -9934378 -10200871 -10243597 -9947967 -9893802 -9825934 -10236576
7800 -10236576 -10384660 -10064967 -9761432 -9988203 -10192983 -9719763 -10493344 -10644001 -10157780 -10370512
7790 -10370512 -9541574 -10694812 -10622763 -10102448 -10667614 -10875082 -10487764 -10077235 -10436953 -10548107 -10507596
7779 -10507596 -10335865 -10763991 -10492592 -10814548 -10353927 -10401955 -10788616 -10896371 -10803593 -10293525 -10687466
7768 -10687466 -10825102 -11055915 -10429384 -9623645 -10448855 -10016731 -10362339 -10812414 -9949733 -10486351
7758 -10486351 -9697887 -10396293 -10388905 -10513839 -10349429 -10375196 -10300185 -10545060 -9980835 -10033702 -9953398
7747 -9953398 -10354105 -10162886 -10649605 -10387302 -10297480 -10719600 -10658588 -10741949 -9241722 -9309939 -10228480
7736 -10228480 -10748032 -10343978 -9826122 -9750563 -10113168 -9870356 -10404828 -11005221 -10682934 -10166166 -10116962
7725 -10116962 -9935008 -9869961 -10319887 -9766060 -9790350 -10049692 -10151862 -9911523 -11117178 -11005794 -10514561
7714 -10514561 -10140252 -10864667 -9923643 -11028522 -11006501 -10196332 -11081248 -10310682 -11014776 -10889686
7704 -10889686 -9920698 -10596889 -10949656 -10616253 -10723281 -10699901 -9886399 -8578103 -9880412 -10730534
7694 -10730534 -11306233 -10849723 -10774082 -10753681 -11523148 -9153044 -9559422 -10413960 -10252290 -10459004 -9997788
7683 -9997788 -10418819 -10402807 -9610325 -10101168 -10209276 -10365340 -10490416 -10626423 -10038746 -10322515 -9982982
7672 -9982982 -9768602 -10372782 -10558824 -10803299 -10846642 -10709897 -10771727 -10331407 -10315657 -10080658 -10373128
7661 -10373128 -9961109 -9963862 -10297041 -11168474 -10382251 -10453962 -10167598 -10799191 -10300558 -10443138 -10625009
7650 -10625009 -10795336 -10482932 -10386363 -10150410 -10020121 -10075808 -10487560 -10061431 -10727270 -11038200 -10571420
7639 -10571420 -9996051 -10110936 -10092525 -10515065 -10287727 -10206414 -9980212 -10038787 -9946952 -10328108 -9723940
7628 -9723940 -10203075 -10008951 -10718100 -9897856 -10020647 -10151536 -10016296 -10224202 -10256591 -10595687 -10811412
7617 -10811412 -10725216 -10214785 -10360956 -10145101 -9761852 -9902125 -10232699 -10014020 -10637254 -10365247 -10913792
7606 -10913792 -11152846 -10589778 -10727703 -10687122 -10910989 -10704850 -10246384 -10561060 -10005363 -10774188 -10586628
7595 -10586628 -10350666 -10052485 -10157830 -10213738 -10685964 -10548132 -10218050 -9640419 -9613193 -9230201 -11397690
7584 -11397690 -10449038 -11748401 -10336843 -9330794 -9588718 -10661230 -10384142 -10403075 -9906087 -10073805
7574 -10073805 -9596511 -10287143 -10751300 -9867988 -10062407 -10288573 -10502417 -9758135 -10472595 -10371876
7564 -10371876 -10578682 -10605249 -10212022 -10544404 -10555066 -9775325 -10403695 -10120027 -10494889 -10804988 -10619781
7553 -10619781 -10032205 -9917187 -10059682 -10222286 -10206503 -10152031 -10417924 -9829380 -9921973 -10331918 -10287131
7542 -10287131 -10117274 -9808933 -10613624 -10627184 -10476412 -10734685 -10513713 -11106907 -10543475 -10867032 -10408732
7531 -10408732 -10272488 -9562244 -10160828 -10104698 -9930732 -10446081 -10286084 -10544191 -10249394 -10794838 -10055563
7520 -10055563 -10024144 -10120403 -10360136 -10329690 -9878475 -10541262 -10240152 -10344367 -10505821 -10045606 -10183197
7509 -10183197 -10239455 -9971240 -9994514 -10675167 -10079779 -10152049 -9891950 -10085998 -9802556 -9776417 -10339143
7498 -10339143 -9749433 -10348012 -10410581 -10370576 -9914063 -10179548 -10543209 -10666141 -9978682 -10646445 -10545392
7487 -10545392 -10284472 -10757736 -10753429 -10304371 -9856431 -10107590 -10633778 -10897633 -10759660 -10604226 -9604555
7476 -9604555 -10219440 -10388414 -10231097 -10693865 -10834851 -10498988 -10344371 -10413577 -9753035 -10191807 -10187066
7465 -10187066 -10422647 -10128941 -10542708 -11491383 -9547057 -9832955 -10457137 -10723973 -10165030 -8749849
7455 -8749849 -9961083 -10248954 -9789144 -10177271 -9899810 -10083881 -10441600 -10800106 -10609270 -10872699
7445 -10872699 -11069493 -10500671 -10196139 -10564011 -10389844 -11342725 -10217951 -10421377 -10335125 -10667066
7435 -10667066 -9866876 -10420950 -10792445 -10369271 -10482345 -9713139 -9761464 -10758432 -10799665 -10454468 -10008282
7424 -10008282 -9292428 -9347915 -10236623 -10053299 -10326462 -10065621 -9901883 -10258600 -10627614 -10486618 -10473529
7413 -10473529 -10706305 -11306716 -10726398 -10648772 -10439514 -9913009 -10693918 -10600907 -10413603 -10816792 -10596807
7402 -10596807 -10490628 -10685992 -10508910 -10351105 -9882549 -10164301 -10508555 -10566860 -10499614 -10570579 -10571809
7391 -10571809 -10739406 -10057327 -10058850 -10230334 -10786489 -10499467 -10741847 -10318782 -10498396 -10600164 -10247678
7380 -10247678 -10628978 -11003104 -10354314 -9631296 -9823889 -10638204 -10230892 -10325316 -10240078 -10645980 -10623355
7369 -10623355 -10519134 -10470261 -10253011 -10454522 -10585175 -10563560 -11203288 -10564718 -10912321 -10321999 -10582798
7358 -10582798 -10349989 -10713165 -10400177 -10487857 -11096378 -10304891 -10501349 -10481504 -10809070 -10318666 -10849919
7347 -10849919 -10422586 -10120111 -10630843 -10393857 -10503655 -9527012 -9858030 -9889361 -10581521 -10293865 -10582311
7336 -10582311 -10747579 -10448240 -9879186 -10345941 -10315672 -10297292 -10621443 -10683455 -10881345 -10492345 -10369691
7325 -10369691 -10430290 -10370226 -10990095 -11343445 -12430313 -10420491 -9825267 -10432165 -10031183 -9463010
7315 -9463010 -9953939 -10681180 -10973011 -10648290 -10259786 -10180878 -10167683 -10511224 -10841598 -10933067 -10816242
7304 -10816242 -10494481 -9999691 -10165013 -10183080 -10833201 -10083958 -10354527 -10794481 -11303975 -9373499
7294 -9373499 -10104620 -10374382 -10115313 -10181340 -10250979 -10203487 -10383183 -10436723 -9796036 -9397439 -10093419
7283 -10093419 -10640932 -10650988 -10526139 -10271543 -10500322 -10099944 -10198711 -10055637 -9989766 -10037037 -9214483
7272 -9214483 -9468447 -10679301 -10981320 -10797601 -10664384 -10377685 -10596967 -10508669 -10548102 -10332918 -10474963
7261 -10474963 -11089667 -10504530 -9854636 -10321014 -10511499 -9962468 -10130867 -10279622 -10677975 -10336365 -10276802
7250 -10276802 -10752243 -10618151 -10446916 -10862487 -11582627 -10871923 -10521052 -10316587 -10608625 -11572482
7240 -11572482 -10535291 -10507873 -10081096 -9878370 -10447255 -10403348 -10888267 -10954979 -10479918 -10790692 -10743378
7229 -10743378 -10763826 -10697134 -10613347 -10670052 -10587263 -10290052 -10154221 -10123915 -9775300 -10127282 -10132680 -10491895
7217 -10491895 -10818384 -10446855 -10683699 -10569300 -10506083 -10312977 -11223976 -10511057 -10151959 -10767816 -10542208
7206 -10542208 -9902390 -10267955 -10053095 -10255250 -10174713 -10117878 -10031202 -10665625 -10127288 -10403252 -10487425
7195 -10487425 -11565857 -10584022 -10429008 -10553569 -10705440 -10232414 -10189618 -10407691 -10769050 -10087714 -10175667
7184 -10175667 -9795815 -10215896 -11026379 -10810018 -10782282 -10323879 -9841972 -9844971 -10300492 -10331788 -10321698
7173 -10321698 -11016470 -10510311 -10899204 -10698347 -10646246 -10525854 -10391878 -10477413 -10879740 -10903470 -10570745
7162 -10570745 -10035881 -10371368 -9863343 -10927489 -10383649 -10409626 -10603390 -11210543 -10679372 -10677714 -10771300
7151 -10771300 -10587505 -10347642 -10387251 -10568927 -10332088 -10350922 -10183944 -10572472 -10250206 -10174354 -10312942
7140 -10312942 -10696410 -10341373 -10599884 -11007384 -10292509 -9935298 -10491220 -9970990 -10201813 -10503943
7130 -10503943 -10112070 -9960208 -10232814 -10076818 -10765896 -10591796 -10607291 -10980160 -10496145 -10098152 -10365773
7119 -10365773 -10456637 -10783071 -10283371 -10138453 -10248124 -10382925 -10188867 -10421864 -10528742 -10441892 -10093692
7108 -10093692 -10768486 -10526074 -10539421 -10504769 -10373169 -10329049 -10268961 -10709051 -10113816 -10344232 -10049456
7097 -10049456 -10669166 -10535953 -10293413 -10806154 -10770969 -9847146 -10109415 -10499618 -9963471 -9640993 -9168417
7086 -9168417 -9853474 -10242253 -10622645 -9827584 -9552153 -10647085 -10601280 -10383689 -10879850 -11045688 -10790963
7075 -10790963 -10790680 -10823360 -10377978 -10852601 -10469420 -10462287 -10606592 -10879949 -10822090 -10519275 -10801656 -10851124
7063 -10851124 -10839205 -10495380 -10848232 -10606146 -10572676 -11069457 -10181810 -10395297 -10188966 -10763821 -11068673
7052 -11068673 -11207155 -11467141 -10908346 -11020554 -10610437 -10478708 -10708694 -11023925 -10616125 -10396842
7042 -10396842 -10570135 -10323641 -8604233 -11015881 -11175582 -11210992 -10742644 -11167883 -10522702 -10420261
7032 -10420261 -10857437 -11278128 -11049052 -10829429 -10984649 -11157588 -11083704 -11013169 -11013007 -10395995 -10292983
7021 -10292983 -10884439 -11101848 -11211765 -10235475 -10112498 -9025453 -10112286 -10117515 -10605406 -10907079
7011 -10907079 -10249631 -10064298 -10561017 -10527934 -10648079 -10314471 -10531262 -10619061 -11137111 -11276251 -10383781
7000 -10383781 -10840689 -10723586 -10378808 -10798608 -10690014 -10930713 -11207890 -10740603 -11151206 -11249570 -11139344
6989 -11139344 -14550460 -9909767 -9309998 -9380070 -9638008 -9673939 -9584040 -10360555 -11225078 -11320919 -10928918
6978 -10928918 -10924962 -10672998 -10892674 -10820528 -10671592 -10724416 -10458374 -10699833 -10835048 -9826529 -9713475
6967 -9713475 -10384876 -10171962 -10296525 -10152687 -10191179 -10218914 -10163545 -9800967 -9874592 -10339930 -11033036
6956 -11033036 -10734311 -10833811 -10638784 -11126107 -11141339 -10678698 -10413830 -10853481 -9554262 -10392717
6946 -10392717 -12490625 -11842392 -10736138 -10383245 -10404817 -10637244 -10379286 -10380709 -10990406 -10449268 -10112005
6935 -10112005 -9570763 -10237317 -10524228 -10345384 -10101017 -10544381 -10305188 -10866720 -10758188 -9677750
6925 -9677750 -10102513 -9393051 -10649810 -9902100 -10326400 -10316190 -10273349 -10194043 -11257475 -10097176 -10976464
6914 -10976464 -10627999 -10160745 -10251531 -10195514 -10223284 -10014620 -9939305 -11034643 -10563795 -10505596 -10272326
6903 -10272326 -10396933 -10638789 -10687444 -10332579 -10143238 -10265449 -10110569 -9911934 -10016332 -11190587
6893 -11190587 -10465320 -10378686 -10477373 -10702783 -10649033 -10375150 -9919191 -9523346 -9865591 -9606055 -10242840
6882 -10242840 -10664605 -10353931 -10163547 -10821589 -10566777 -10497033 -10271896 -10464774 -10388476 -10282552 -10458109
6871 -10458109 -10276672 -10923536 -10784689 -10214405 -10246795 -10641141 -10283379 -11109101 -10934477 -10799949 -10211176
6860 -10211176 -10490643 -9444815 -10431912 -10679542 -11333114 -10743585 -9563061 -10166326 -10097514 -10193780
6850 -10193780 -10294144 -10459961 -10767468 -10192882 -10243819 -10926530 -10352450 -10104009 -10526121 -11786770
6840 -11786770 -10501855 -10586188 -10214003 -9703396 -10533485 -10711021 -10182960 -10896106 -11013603 -10608557
6830 -10608557 -10152901 -10712293 -10944409 -10523890 -10753802 -11357763 -10760028 -10386812 -10138582 -10244280
6820 -10244280 -9881325 -10480095 -10759890 -10661870 -11048469 -10783920 -11272666 -10443321 -10808178 -10288934 -10254091
6809 -10254091 -10483046 -10629355 -11027667 -11188780 -10504442 -10589388 -10408350 -9748265 -10086617 -11567659
6799 -11567659 -11224381 -11206605 -10506382 -10915954 -10178930 -10615782 -10928987 -10308100 -10473800 -10283735 -10932846
6788 -10932846 -10448117 -11039538 -10110680 -10639096 -10603972 -9895537 -10002760 -10252047 -10472590 -10227682 -10092038
6777 -10092038 -10013500 -10136028 -10192247 -9936222 -9912100 -9829952 -9720078 -11032215 -10769476 -10702407 -10694066
6766 -10694066 -11113042 -10582912 -10772261 -10122496 -9692651 -10117370 -10510460 -10432319 -10783159 -10643832 -10800392
6755 -10800392 -11369227 -10517525 -10075365 -10947604 -10566506 -10866113 -10117347 -10745794 -10457136 -10648676
6745 -10648676 -10889970 -10172690 -10451363 -10236802 -10650516 -10673150 -11237531 -10966798 -10836783 -10303063 -9860748
6734 -9860748 -10581058 -11135587 -10880144 -10881541 -10763072 -11034613 -10491709 -10606672 -10584605 -10458689 -10380932
6723 -10380932 -10292250 -10915802 -11130529 -10759778 -10283774 -10092225 -10564210 -10597339 -10179763 -10739284 -10113707
6712 -10113707 -10734043 -10557714 -10034238 -10560368 -10295119 -10409150 -10217934 -10880824 -10486746 -10576616 -10625864
6701 -10625864 -9647992 -10626599 -10360525 -10090223 -9868515 -9594095 -10802542 -10550627 -10760403 -10785366
6691 -10785366 -11051485 -10787083 -10628508 -10743441 -10566750 -11188455 -10497976 -10589110 -10829994 -10671374 -10665999
6680 -10665999 -10609684 -10519053 -11089264 -10688545 -10666930 -10435452 -10462445 -10571783 -10265757 -10588287 -10467928
6669 -10467928 -10556721 -10860789 -10343192 -10593991 -10788904 -10750242 -9778704 -10044913 -9759189 -10071504 -9938228
6658 -9938228 -10482750 -10345259 -10157173 -10130452 -10744062 -10697859 -11187475 -10431018 -10674138 -10676403 -10225762
6647 -10225762 -9882010 -9588004 -11960006 -10489383 -10679474 -10256697 -10976332 -10682784 -10523911 -10665154
6637 -10665154 -10655579 -10240104 -10729035 -10810287 -10773213 -9909315 -10059762 -10379399 -10356943 -11097841 -10216333
6626 -10216333 -10856217 -9897369 -10128906 -10752280 -10439627 -10313689 -10161054 -10362574 -9423784 -10420513
6616 -10420513 -11030443 -10957636 -12037909 -10771817 -10613193 -10832734 -10895295 -10290011 -10724793 -10522602
6606 -10522602 -10350215 -10977146 -11271496 -11215392 -10734133 -10258312 -10143540 -10525171 -10487757 -9866239 -9452027
6595 -9452027 -10149835 -10831068 -10687570 -9205614 -10322438 -10014158 -10171044 -9582836 -10323012 -10643574
6585 -10643574 -10363049 -10123720 -10140045 -9920453 -9721354 -9623680 -10585307 -10800709 -10302725 -9850508 -10986072
6574 -10986072 -10084470 -9380840 -10157528 -10467753 -10158995 -9650407 -9854427 -9532064 -9890994 -10202207
6564 -10202207 -9775804 -10322534 -9750905 -9728598 -9341098 -9624258 -9384987 -9196910 -9060429 -8355777
6554 -8355777 -6213235 -3767609 -28905971 -16671577 -14268629 -13195158 -12567992 -12375898 -11951988
6545 -11951988 -9389193 -11470283 -11584280 -11568714 -11069485 -11280120 -11370657 -10712856 -10623312 -10941266 -10794658
6534 -10794658 -10284273 -10552657 -10654014 -10930150 -10788656 -10808252 -10789739 -11118463 -10797998 -10745716 -10366521
6523 -10366521 -10695575 -11010457 -11259759 -11766987 -11567431 -12071878 -10801426 -10955061 -10778094 -10854358
6513 -10854358 -10713755 -11034634 -11212170 -11234294 -10969055 -10717958 -10591277 -10754769 -11253674 -10636145 -10828778
6502 -10828778 -10945771 -10796289 -11468962 -10953420 -11011255 -11352257 -10780680 -10796747 -10654830 -11029264 -10324250
6491 -10324250 -10557603 -10570862 -10917975 -10857085 -10826764 -11454993 -10908931 -11002750 -10567721 -10065772 -10390632
6480 -10390632 -10534090 -10701565 -10891187 -10292297 -10724948 -11019292 -10834550 -10380253 -10141733 -10891003 -10908976
6469 -10908976 -10569971 -10707299 -10518912 -10570276 -10509656 -11232458 -10711818 -10853637 -11178756 -10724339 -11017614
6458 -11017614 -11362618 -11388487 -10781511 -10664206 -10982367 -11009347 -10874393 -10400487 -10531475 -10734520 -10376933
6447 -10376933 -10501177 -10639617 -10741226 -10628137 -11333695 -10843737 -10061431 -10814864 -10554165 -10660351
6437 -10660351 -10558290 -10529962 -10787689 -10618991 -10561901 -10260063 -10336400 -10577140 -11085188 -10306506 -10329182
6426 -10329182 -10478219 -10350743 -10147908 -10644014 -10275336 -10476551 -9885227 -11284380 -10664283 -11087121
6416 -11087121 -10704195 -11039888 -10656657 -10333045 -10503231 -11146639 -10342469 -10803494 -10864569 -10436917 -10341599
6405 -10341599 -10144826 -10056036 -10804625 -10972026 -11106603 -13344430 -11373794 -11168923 -10349238 -11084263
6395 -11084263 -10657253 -10592305 -10540758 -10854372 -9941795 -10791450 -10278389 -10145686 -10865855 -10376152 -10631887
6384 -10631887 -10830747 -11023519 -11256993 -10834615 -10149018 -10656796 -11224442 -10428350 -10747932 -11269842
6374 -11269842 -10717453 -10629313 -11245293 -10244850 -10150726 -10683479 -10744511 -10251870 -10348584 -10223405 -10177392
6363 -10177392 -11494255 -10644255 -10780107 -11139705 -11053302 -10629756 -10179159 -11166439 -11115860 -11113739 -10818319
6352 -10818319 -10727255 -11129893 -10408936 -10437893 -10547433 -11044128 -10831768 -10760149 -10721754 -10722891 -10976095
6341 -10976095 -11333132 -10720613 -11157655 -10232646 -10673956 -11218575 -10327074 -11413048 -11290922 -11642760
6331 -11642760 -11188845 -10508102 -10963141 -10805866 -11751804 -11278893 -11081950 -10750449 -10617112 -10135256
6321 -10135256 -10889340 -10081406 -10202896 -11004510 -10405109 -10983534 -10459945 -9955703 -10587933 -10566826 -10884626
6310 -10884626 -11071368 -11095628 -10815534 -10592909 -10363297 -10669079 -10865073 -10369700 -10399583 -10909172 -11337729
6299 -11337729 -11461752 -11258844 -10964270 -10981776 -10514136 -10215385 -10100813 -9594491 -10731838 -10386224
6289 -10386224 -10702326 -10825036 -11068182 -10180309 -10747683 -10847416 -10793454 -10864201 -10472215 -10275693 -9988939
6278 -9988939 -10451566 -10245364 -10723761 -9799052 -11215172 -10766397 -10822294 -10677907 -10948957 -10236687 -10542082
6267 -10542082 -10603556 -11076272 -10819078 -11374401 -11218054 -11026430 -10798065 -11131533 -11111008 -10777328 -10585312
6256 -10585312 -10411900 -10429122 -10964452 -11041798 -10702699 -10396241 -10766166 -11104696 -10767740 -10995907 -10650352
6245 -10650352 -10416968 -10483960 -10349371 -10869575 -10826863 -10348654 -9909731 -10361416 -10191455 -10519190 -10544239
6234 -10544239 -10197767 -10804026 -10811582 -10034716 -10599829 -10482976 -10334878 -10966508 -10658114 -10141263 -10505729
6223 -10505729 -10607414 -10794372 -10466052 -11376883 -9852553 -10392863 -10817762 -10454743 -10454734 -10731375 -10632489
6212 -10632489 -10727432 -10754691 -10503627 -10275732 -10367039 -10646493 -10197603 -9933744 -10631281 -10575338 -10928654
6201 -10928654 -10683751 -10572329 -10759269 -10340997 -9699314 -10390046 -10235762 -10616319 -10041872 -10417734
6191 -10417734 -10008372 -11099209 -10686024 -10741648 -10770272 -10492113 -10404476 -10539489 -10529278 -10419048 -10217230
6180 -10217230 -10516640 -10402961 -10501123 -10921497 -10864377 -11037435 -10712762 -10759631 -10582453 -11124345 -10827642
6169 -10827642 -11290746 -10296419 -11000754 -11048316 -10124914 -10747999 -11091125 -10788965 -10255022 -10426605 -10726825
6158 -10726825 -11012332 -10929509 -10833889 -10168788 -9915196 -10144423 -10065919 -9166644 -11197159 -10839873 -10496480
6147 -10496480 -10206683 -10171759 -10219433 -10400097 -10048841 -10174909 -10225205 -9992989 -10748100 -10681066 -10266063
6136 -10266063 -10596050 -10272449 -10468826 -10018073 -10362418 -10523317 -9929366 -9766312 -9782157 -10327124 -9622118
6125 -9622118 -10048926 -9706980 -8965925 -9864977 -8999048 -8169933 -6905366 -5777029 -2744799 -29045879
6115 -29045879 -18942019 -15443947 -14123077 -13175088 -12577394 -12152605 -11358269 -11831014 -11142280 -12041431
6105 -12041431 -11786138 -11363159 -11425221 -11385653 -11727801 -12027791 -11117586 -10480498 -11416522 -11316845 -11290655
6094 -11290655 -10840136 -10648996 -10982040 -11358419 -10993114 -11158314 -10817123 -10867927 -10515146 -10720005 -11424969
6083 -11424969 -10960154 -10911028 -10848643 -10921018 -11066130 -10904851 -10821418 -11187549 -11187609 -11370033 -11253011 -11237105
6071 -11237105 -10908762 -11445175 -11658028 -11125858 -10892079 -11317212 -11252438 -11345066 -11136907 -11535946 -11073190
6060 -11073190 -11342443 -10940065 -11491120 -11677048 -11508028 -11021948 -11054710 -10683269 -10853194 -11369310 -11140067
6049 -11140067 -10246611 -10630113 -10683549 -11095998 -11280339 -10649040 -10857174 -11079073 -10956836 -10534048 -10749711
6038 -10749711 -10756941 -10812487 -10810171 -10989209 -10309169 -11058707 -11292099 -10185346 -10800780 -10825794 -10915174
6027 -10915174 -11335119 -10965413 -10915582 -11096015 -11136665 -11141797 -11561501 -10781542 -11107495 -11662561 -11263393
6016 -11263393 -11156557 -11012372 -11445670 -11982600 -10541549 -11137113 -10512822 -10115342 -10740302 -10529135
6006 -10529135 -9418523 -11043330 -10406998 -10626349 -10351273 -10471409 -11074793 -10190326 -10926533 -10896681
5996 -10896681 -10509038 -11406854 -10716178 -10336355 -11161544 -11000799 -11290539 -10842831 -10518664 -10661375
5986 -10661375 -11189366 -11168970 -10967221 -10595030 -10623316 -10832698 -11323401 -10160867 -10175775 -10980044 -11090502
5975 -11090502 -10633091 -10562374 -10831745 -10570486 -11196910 -11085374 -11164367 -11213163 -11039070 -11086031 -11296086
5964 -11296086 -10966552 -10913775 -10722720 -11342444 -12248480 -11193148 -11432941 -11296203 -11480070 -10801468
5954 -10801468 -10926360 -11069928 -11028600 -10997852 -10535485 -11171668 -11190357 -11354248 -10872856 -11548494 -11085462
5943 -11085462 -11541672 -11785672 -11652987 -9919857 -10436917 -10493354 -10402208 -10393444 -10379516 -10682488 -11432782
5932 -11432782 -10611793 -10674685 -10854200 -10853837 -10548666 -10440406 -11003899 -11573350 -10668169 -10760893 -10429306
5921 -10429306 -10861363 -11674853 -10847561 -11088726 -10833863 -10890661 -10931409 -10475656 -10909892 -11163032 -10475610
5910 -10475610 -10776791 -10567185 -10904557 -10358171 -10984127 -11422697 -10636870 -10491798 -10414220 -10628492 -11203488
5899 -11203488 -11143131 -11493266 -10968971 -10960321 -10871203 -11155745 -10819070 -11102695 -11068695 -11481855 -11270867
5888 -11270867 -11586629 -11208166 -10582133 -11086891 -10983278 -11079782 -10150380 -10682683 -10556427 -10876537 -11158727
5877 -11158727 -11268615 -10988490 -10766399 -10294859 -11309091 -11112976 -10346053 -10132499 -10266502 -10633419
5867 -10633419 -9751366 -9979700 -9961513 -11503299 -11048781 -10777851 -10743768 -10494158 -11024235 -11316711 -11204960
5856 -11204960 -11090666 -11017575 -10699722 -11138569 -10823708 -10924276 -10804215 -11025259 -11062606 -10994960 -10887128
5845 -10887128 -10700894 -10635467 -10638482 -11189379 -10562145 -10916817 -11398665 -10997821 -11081373 -11070180 -11073798 -11366022
5833 -11366022 -10821383 -9426974 -10542025 -10410392 -10281667 -10316797 -11338282 -10635130 -11286123 -11051343
5823 -11051343 -10917447 -10657717 -10301608 -11494779 -11212107 -10609770 -10761202 -11235173 -9342375 -10253810
5813 -10253810 -10422180 -10763978 -10791156 -10721851 -10656347 -10897981 -11177601 -10748005 -10788467 -11025852 -10908156
5802 -10908156 -10522060 -10688439 -10789591 -10745132 -10203921 -10540347 -11017047 -10721240 -10437471 -10906737 -10979673
5791 -10979673 -11483248 -11153478 -11010757 -10610136 -10409986 -10679075 -11127988 -11322604 -11266854 -11081461 -11023016
5780 -11023016 -10772347 -10952728 -11118553 -10536041 -10919566 -11023626 -11139756 -11621058 -10951410 -10772685
5770 -10772685 -10460323 -10408605 -10926356 -11059954 -11448550 -10878067 -10657344 -10371041 -10366644 -10620852 -10701906
5759 -10701906 -10786256 -10955831 -10967693 -10614720 -10713664 -10851855 -10724470 -11118058 -11065552 -10392729 -10594840
5748 -10594840 -10128656 -10421988 -10519546 -10374708 -10335296 -10061752 -10271177 -11024597 -10660553 -10774979 -11701306
5737 -11701306 -11212806 -11180497 -11037553 -10904274 -11116726 -12130756 -10019964 -10455931 -10596636 -10964999 -10968331
5726 -10968331 -11158205 -10974759 -10775156 -10753974 -11079405 -11040312 -11062888 -10637917 -10665751 -10342113 -10473746
5715 -10473746 -10349163 -10410411 -10297233 -10679891 -10363815 -10490601 -9917049 -10150731 -10728625 -10409451 -10053515
5704 -10053515 -10905561 -10397339 -9854709 -9869993 -10461570 -10304239 -9910376 -10400845 -10149194 -9827902 -9506822
5693 -9506822 -9604952 -9984281 -8936264 -9728746 -9610745 -9638987 -8318931 -8656638 -8271336 -7431544
5683 -7431544 -6303617 -4202473 1199772 8103271 -19247825 -17172322 -15535240 -14284628 -13233309
5674 -13233309 -12915139 -12814263 -12627670 -12200517 -12523694 -12205617 -11969656 -12303014 -11747193 -12292339
5664 -12292339 -12145449 -11503898 -11628136 -11591610 -11539446 -11034148 -10761012 -10827602 -13074825 -12212450 -11594120
5653 -11594120 -11281406 -11389575 -11645337 -11697229 -11646782 -11837245 -11481536 -11454925 -11784517 -11751630 -11508205
5642 -11508205 -11961227 -11970007 -11507814 -11678621 -12127365 -10541324 -11198337 -11201741 -11489219 -11063224 -11282044
5631 -11282044 -11274540 -11340464 -11134908 -11335765 -11368028 -11507054 -11574164 -11623702 -11367486 -11837979 -10650019
5620 -10650019 -11271571 -11411057 -13179045 -11443405 -10656294 -10783184 -11116455 -10882534 -10529089 -10891973
5610 -10891973 -10364549 -11147879 -11654921 -11512551 -11160333 -11913346 -11141292 -11753480 -11998610 -11773472
5600 -11773472 -11630010 -11301408 -11234614 -10646281 -10934464 -10974963 -11502013 -11149472 -10975660 -11391950 -11624691
5589 -11624691 -11176493 -11174275 -11633662 -11800728 -11252315 -10778474 -10952237 -10840578 -11303497 -11665771 -11510243
5578 -11510243 -11464163 -10825916 -11236935 -11061653 -10951565 -11404003 -11137967 -10892525 -10380561 -11549355
5568 -11549355 -11093577 -11189381 -10875858 -11098751 -11745422 -10801400 -10936369 -11872120 -10982731 -10980620 -11623345
5557 -11623345 -11549904 -11082382 -11004059 -10921148 -11368267 -11595664 -11520877 -10770288 -10787646 -11162196 -11575614
5546 -11575614 -11240149 -11448402 -11242723 -11338014 -11523660 -11456684 -11494467 -11574491 -12189551 -12329953 -10953757
5535 -10953757 -10395869 -10931270 -11041100 -10865939 -11583150 -10869406 -10680595 -10806946 -11347846 -11240345 -11290633
5524 -11290633 -11318764 -11369821 -11089568 -11152237 -11753874 -11375434 -10417801 -11316992 -10817875 -11033617 -11261736
5513 -11261736 -11626545 -11607070 -10980456 -11132595 -11029820 -11475306 -10950724 -10945846 -10579310 -11404235 -11891676
5502 -11891676 -11364555 -11373757 -11247680 -11080267 -11098340 -10884039 -10509326 -10484366 -10656554 -11035315 -10933864
5491 -10933864 -11303050 -11186955 -11357216 -11017520 -11703234 -12271255 -11820312 -11361490 -11616708 -11260550
5481 -11260550 -11628226 -11269817 -11964531 -11303835 -11488747 -11180750 -10869795 -11974017 -11236295 -11047203
5471 -11047203 -11284228 -11231054 -11819259 -10933752 -10892092 -11474657 -11169237 -11026460 -11693806 -9755904 -10722008
5460 -10722008 -10809943 -12462499 -11660251 -11689518 -11162757 -10841264 -10670266 -10970343 -10083969 -10871015 -11023298
5449 -11023298 -10685605 -10003237 -11153309 -11670935 -11049353 -11036281 -10867698 -10743484 -11127825 -10921422
5439 -10921422 -11101941 -10955240 -10950764 -10817690 -10770244 -10577877 -10735726 -10777851 -11285267 -11332851 -11245758 -11235156
5427 -11235156 -11283506 -10673890 -10524910 -11230313 -10461477 -10608367 -10833807 -11264422 -11440043 -11502418 -11075229
5416 -11075229 -11684806 -11208791 -10956816 -10365297 -10918867 -11398267 -10993044 -11110389 -10461867 -10780989
5406 -10780989 -10330946 -10462408 -10812496 -10602545 -10927994 -10244149 -10975365 -11079736 -10864730 -10663246
5396 -10663246 -11435139 -10632479 -10745186 -10838104 -11509472 -10465580 -11338668 -11208128 -11240589 -11584381 -11873216
5385 -11873216 -11407449 -11220048 -11335875 -11401062 -11320112 -10910516 -10507055 -10804164 -10691832 -11102211 -10466414
5374 -10466414 -10995546 -10642302 -11471401 -11199452 -11514768 -10921715 -10167383 -10548479 -10992335 -10906509 -10702459
5363 -10702459 -10842833 -11079266 -10824419 -12139233 -11940457 -10708741 -10952330 -10935892 -11254599 -11754003
5353 -11754003 -10774741 -11417641 -11303419 -10835771 -11060369 -11377408 -11360554 -11606096 -10923936 -11313822 -11542400
5342 -11542400 -11266803 -11820857 -11078005 -10809129 -11233187 -10449488 -10731597 -10900604 -10750168 -11156973
5332 -11156973 -10936417 -10950619 -10678159 -10832019 -10449201 -10514576 -10873052 -11047797 -10850324 -10810767 -10666394
5321 -10666394 -10184601 -10214857 -10624241 -11039231 -11158258 -11352419 -10714895 -10750596 -10774684 -10425873 -11030546
5310 -11030546 -10027491 -10337617 -10274330 -10064626 -11460625 -11582668 -11326441 -11624342 -10985545 -10786352
5300 -10786352 -11136228 -11332252 -10693828 -10691916 -10434829 -10578966 -10807074 -10745215 -10653766 -10282769 -11308442
5289 -11308442 -11457537 -11015371 -10787900 -11413069 -11246210 -10826888 -10703140 -11458200 -11613993 -10713478
5279 -10713478 -10905015 -10482692 -11364196 -10686328 -11265175 -11321957 -11602892 -10734456 -11130761 -11018053 -10495480
5268 -10495480 -8380179 -11064880 -11214573 -11006223 -10713018 -10550904 -10604606 -10811538 -10176386 -10859647
5258 -10859647 -10624891 -9839879 -10049397 -10138649 -10722708 -10627105 -10349675 -9971954 -9585684 -9720432 -8850283
5247 -8850283 -8869681 -7200773 -7554270 -31531893 -22106022 -16805357 -15670276 -14190041 -12982267 -13051602
5237 -13051602 -13029202 -12383692 -12430420 -11903780 -12878983 -12714260 -12662935 -13022176 -12063678 -11992404 -11811778
5226 -11811778 -12215281 -11688021 -11355694 -11301446 -12050927 -12000581 -12647475 -11890375 -11135750 -11911811 -11159938
5215 -11159938 -11727944 -11646146 -11848167 -11795334 -11912850 -11108807 -11887363 -11564073 -11190501 -11846302 -11039945
5204 -11039945 -11418125 -11578776 -11524295 -11278881 -10995426 -11619571 -11854667 -11607267 -11718093 -10890571 -11384042
5193 -11384042 -12242032 -12664053 -11978495 -11415406 -11722116 -10991499 -10803237 -11285860 -11943420 -11580379
5183 -11580379 -11325572 -11793023 -11627506 -11872544 -11385702 -11137104 -10850576 -11198379 -11489034 -11669147 -11661608
5172 -11661608 -11387306 -10926706 -10866826 -11585506 -11536932 -11505120 -11429025 -11120259 -11301972 -11485488 -11450507
5161 -11450507 -11108349 -10636581 -10939874 -11462612 -10853209 -11228594 -11044496 -11377298 -11290826 -10722572 -11327185
5150 -11327185 -11466243 -11420622 -11603836 -11186521 -11275104 -11210752 -10857735 -10810350 -11661988 -11103562 -11638637
5139 -11638637 -11479184 -11063824 -11297118 -11477386 -12096896 -11355422 -11543712 -11850608 -11125098 -11319661
5129 -11319661 -11579851 -11462068 -11909641 -11403875 -11809761 -11233573 -11808036 -11499337 -11216796 -10858534
5119 -10858534 -11079074 -10734626 -11317026 -10816655 -10944978 -10964125 -11100610 -10804743 -11516669 -11988309 -12320394
5108 -12320394 -12742293 -11309913 -11333976 -11429335 -11247352 -10914090 -11033832 -10556387 -10787694 -10942735 -10798279
5097 -10798279 -11617176 -11468304 -11455832 -11521863 -11792640 -10075283 -11063774 -11289031 -11438300 -11910630 -11719776
5086 -11719776 -10915384 -11179649 -11421225 -10932942 -11238918 -11378791 -11145840 -11075852 -10703658 -11297220 -10447977
5075 -10447977 -10396410 -10948640 -11460824 -11831770 -11875683 -11566280 -11535266 -11230280 -11313525 -10751189 -10652073
5064 -10652073 -11032924 -11404332 -11509486 -10964887 -10970639 -11809777 -11522449 -11367459 -11673244 -11030825 -11012440
5053 -11012440 -10980684 -11180589 -11453111 -11361640 -11431230 -11234559 -11589170 -10557124 -10603076 -10568370 -10833321
5042 -10833321 -10798254 -10115803 -10656502 -10510921 -10838186 -10675850 -10557135 -10559475 -11062032 -11407109 -11396541
5031 -11396541 -11085370 -11037035 -11076085 -11162779 -11135713 -9758011 -11235490 -11299947 -11847475 -12136368 -12136954
5020 -12136954 -11549152 -11206568 -10974487 -10976281 -10559197 -11181986 -10844252 -11400351 -11342577 -11407157 -11495709
5009 -11495709 -10890178 -11146927 -11240720 -11396028 -11237526 -11400977 -11364071 -11015829 -11088637 -11478150 -11543384
4998 -11543384 -11581509 -10916226 -10704333 -11586714 -10957580 -11054456 -11381776 -11499823 -11416112 -11108584 -10837854
4987 -10837854 -11176403 -11104894 -10726166 -10791645 -12322864 -11972050 -11616650 -12009739 -11059245 -11391992 -11798045
4976 -11798045 -11094309 -10907732 -11323257 -11078958 -11273620 -11436702 -11496229 -11534456 -12058416 -11752292 -12295093
4965 -12295093 -11967373 -11997967 -12198059 -11601620 -11053142 -11448873 -11707237 -11458500 -11110597 -10960682 -11249099
4954 -11249099 -11372406 -11485862 -11527288 -11654431 -11784280 -11832792 -11482213 -11467610 -11246674 -10958333 -10711086
4943 -10711086 -10864090 -10987735 -11727721 -10952546 -11247840 -11291525 -11630730 -11174632 -11143541 -11345325 -11187055
4932 -11187055 -11352945 -11620771 -10663967 -11405064 -11021330 -11381109 -11528741 -11264339 -11201776 -11280163 -11561890
4921 -11561890 -11627133 -11672620 -11670208 -10742830 -10620083 -11140826 -10431942 -10433902 -10749535 -10448543 -12010719
4910 -12010719 -11575226 -11353942 -11316799 -11022941 -10768506 -11195202 -10902037 -11535297 -11000932 -11557153 -10906673
4899 -10906673 -11485801 -11190276 -11378960 -11579394 -12079632 -11364444 -11714740 -11702728 -11649402 -11149099 -11120199
4888 -11120199 -11403702 -11280133 -11048095 -11182825 -11239202 -11636931 -11165263 -11332464 -11140288 -11015861 -11678246
4877 -11678246 -10921627 -11190668 -11112653 -11092607 -10932682 -11144163 -11380351 -10941039 -11185609 -11325672 -11606904
4866 -11606904 -12023230 -11597618 -11332262 -11563963 -11367231 -11078037 -11318083 -11116630 -11137191 -11611064 -11335310
4855 -11335310 -12075236 -11392059 -11024670 -11052282 -10938566 -11506335 -11523048 -11251603 -10967990 -11516737 -11351666
4844 -11351666 -11219255 -11777934 -11004083 -11370473 -11188933 -11353047 -10554992 -11687166 -11592434 -11315651
4834 -11315651 -11167897 -11662309 -11483527 -11619899 -11247948 -11714631 -11745845 -11119815 -11306759 -11672520 -11573008
4823 -11573008 -11448922 -11414716 -11689540 -11130670 -12021810 -11681008 -11057855 -11543796 -11889411 -11470330 -11296053
4812 -11296053 -12122082 -12020234 -12200600 -10730778 7803571 -5250957 -9349664 -10226097 -9805236
4803 -9805236 -10142756 -9911543 -11091821 -11268228 -11249710 -10768814 -10571294 -11457553 -10807704 -11013389 -11073324
4792 -11073324 -10615276 -11303164 -11091928 -10999238 -11037720 -11132105 -11409657 -11072265 -10269396 -11231157 -11384898
4781 -11384898 -11134434 -11160666 -11125444 -10858246 -10801538 -11288733 -10969468 -10362796 -12214717 -11494087 -11478709
4770 -11478709 -12187761 -11450103 -11392523 -11907034 -11385799 -11024372 -11137154 -11348024 -10888398 -11426150 -11478985
4759 -11478985 -11068928 -11229840 -10998520 -11144730 -10901375 -11190831 -10983872 -10924840 -11587260 -11178633 -11227547
4748 -11227547 -10753702 -11328155 -11640208 -11330837 -10900657 -10963444 -10221689 -10670441 -10765118 -10859986 -11107248
4737 -11107248 -11352937 -11000460 -10944230 -11570991 -11452373 -10273301 -10454756 -10332771 -11017506 -11070667 -10816551
4726 -10816551 -10587464 -11324439 -10953644 -10356114 -11209607 -11010520 -11097918 -10971150 -11093851 -11073775 -10692558
4715 -10692558 -10921622 -10604624 -11162472 -10582454 -10637953 -10625463 -10941906 -11063567 -10812295 -11561617 -10506850
4704 -10506850 -10582255 -11605654 -11068295 -11001774 -11191778 -11190880 -10909127 -10420508 -10970264 -11257242 -11323656
4693 -11323656 -11559625 -10864556 -10963271 -10986899 -10832875 -10980279 -10767374 -10833770 -11007383 -11175976 -11375032
4682 -11375032 -11393908 -11127699 -11457427 -10840187 -10759397 -10915904 -11548053 -11353066 -11103595 -10769746 -11035945
4671 -11035945 -11693818 -11231555 -11288226 -11340684 -11399399 -11906729 -12539501 -11634646 -10630201 -10815166 -10487054
4660 -10487054 -11434586 -11340016 -11440357 -11351310 -11898634 -12141864 -11912680 -11702134 -11330696 -10614702 -10013144
4649 -10013144 -10929821 -10800603 -10987352 -11368167 -11251530 -11361936 -11164081 -11173310 -11374651 -10813351 -11503213
4638 -11503213 -11599572 -10280323 -10865252 -10894998 -11064077 -11381384 -11301199 -11096181 -11234473 -11508565 -11116339
4627 -11116339 -11099386 -11270103 -10965694 -11871665 -11984857 -11767812 -11012287 -11893695 -11330048 -10768715 -10907677
4616 -10907677 -11088753 -10853143 -11337828 -10568911 -11185271 -11146115 -11556147 -11988663 -11531538 -11166389 -10871873
4605 -10871873 -10865732 -10740825 -11140567 -10783443 -10916478 -11005130 -11137487 -10890845 -11575053 -11145404 -11104920
4594 -11104920 -11421044 -11219028 -11844318 -11945647 -12312620 -11609103 -10792158 -10887860 -11282290 -11064087 -10572049
4583 -10572049 -11374929 -11455927 -11475600 -11366418 -10824222 -10672963 -11068518 -11204735 -11202763 -11493859 -11221097
4572 -11221097 -10946801 -10975470 -11192258 -11084318 -10835026 -10596020 -10874286 -10570407 -9938208 -10313460 -10550879
4561 -10550879 -11048182 -10860244 -10591198 -10456054 -10111574 -10370691 -10841448 -10547444 -10896916 -10322699
4551 -10322699 -11588712 -11240067 -10634357 -10800211 -10966545 -10075913 -10924346 -10657147 -9917129 -11309827
4541 -11309827 -10890717 -11262478 -11309501 -11205177 -10721713 -10915266 -10874437 -10668256 -10661952 -10641331 -11204335
4530 -11204335 -11104625 -11219345 -11075854 -10908419 -11428589 -10279708 -11278855 -11839703 -11672891 -11063676
4520 -11063676 -10509198 -11257693 -11426199 -11873749 -11622147 -11740791 -11651333 -10857843 -11052967 -11570010 -11502071
4509 -11502071 -11317389 -11730550 -11959515 -11609227 -12227167 -10498979 -10985092 -11300169 -11132526 -10942506
4499 -10942506 -11044516 -11036574 -10821803 -11387380 -10974028 -10830940 -10818989 -10832719 -10514531 -10661265 -10775119
4488 -10775119 -11355015 -11356277 -10896446 -10855571 -11382114 -11538573 -10993843 -10897264 -10788808 -10629995 -11226854
4477 -11226854 -10858195 -10991577 -11197813 -11376194 -10371248 -10728693 -10895148 -11237056 -10478361 -10759433
4467 -10759433 -10913947 -10795390 -10917845 -10914618 -10581231 -10986870 -10844492 -10367744 -10783261 -10892641 -11414745
4456 -11414745 -10421875 -11308305 -10796932 -10329282 -11317567 -11328774 -11086950 -10072461 -10085608 -10453275 -10728482
4445 -10728482 -10796961 -10569047 -10333091 -10072648 -10324222 -10230700 -10530994 -10788590 -11179816 -11162066 -10138356
4434 -10138356 -10684796 -10299735 -10733398 -11481492 -11204640 -11190264 -11048245 -11296151 -11486404 -11233789
4424 -11233789 -10096430 -10657809 -11047341 -11397364 -11619966 -11049341 -10842475 -10953023 -11257684 -11223257
4414 -11223257 -11091018 -11494986 -11478953 -11699238 -11571720 -11597633 -11538191 -11437572 -12382793 -11863829 -10703675
4403 -10703675 -11227666 -12022755 -11595840 -11806664 -11929733 -11246725 -11059824 -10952688 -11640886 -11853852
4393 -11853852 -11602486 -11458680 -11559294 -11571244 -11101791 -10893516 -11516134 -11513743 -10998274 -11418700 -12065670
4382 -12065670 -12167838 -11292162 -11878334 -12582874 -13277985 -11962476 -12551957 -12844104 -12739405 -14303357
4372 -14303357 -26822340 -13890658 -12556042 -11781439 -12028913 -11455627 -12304297 -11408326 -11581836 -11384665
4362 -11384665 -11291711 -11012930 -11285996 -11952626 -11862589 -12059105 -12077798 -12587397 -12116569 -12443112 -12404309
4351 -12404309 -12591570 -11823448 -11456956 -10897676 -10934894 -11496995 -12358423 -11879724 -11722471 -11569271 -11967892
4340 -11967892 -11791024 -11989805 -11878939 -11659301 -11081172 -11235347 -11736913 -10828295 -12413172 -11600159
4330 -11600159 -11377512 -12528623 -11759299 -11756226 -11874544 -12246364 -11893788 -11564976 -11881399 -11764915 -11843103
4319 -11843103 -12273264 -11890172 -11354302 -11656726 -11642393 -11829596 -11509086 -11856506 -12429334 -10719905
4309 -10719905 -11030747 -11775860 -11369645 -11233677 -10471813 -10885503 -10518539 -10842384 -11391234 -10659756
4299 -10659756 -10519554 -10399766 -10672019 -10673570 -10539668 -10986858 -10796188 -11166282 -10358083 -10764580 -10696056
4288 -10696056 -10582946 -10817136 -10412145 -10808752 -10876854 -10870981 -11178379 -11102559 -10992758 -11972232 -10770162
4277 -10770162 -10016813 -9507450 -10607870 -10420593 -10224723 -10145384 -10198432 -10032108 -10055956 -9655812 -9555735
4266 -9555735 -9579271 -9063710 -8357989 -8465463 -9310763 -8931942 -9585063 -9407631 -9864292 -9921918 -9738430
4255 -9738430 -9725635 -9386323 -10218348 -9542130 -9400071 -8947128 -9115012 -8666504 -8644105 -8883107 -8376051
4244 -8376051 -8658994 -8418296 -8615291 -8646341 -8184002 -8202077 -7394951 -7485290 -7588558 -7538450 -7357110
4233 -7357110 -7706062 -7911461 -7577059 -7844051 -7490525 -6858824 -8003762 -7611142 -8060532 -8340830
4223 -8340830 -8721108 -7992301 -6908902 -7050971 -7353091 -7223972 -7259427 -7712528 -7084850 -7116000 -7622570
4212 -7622570 -7967903 -8196555 -8363182 -8166141 -8488356 -8020765 -7834514 -8308563 -7748879 -7490992 -7911702
4201 -7911702 -8374188 -8380341 -7833751 -8006282 -7224737 -7665359 -7862383 -8370910 -8235784 -8926090 -9353071
4190 -9353071 -9073212 -9858441 -9990129 -9981131 -10287560 -10587354 -10448664 -10672048 -10731983 -10843506 -10383337
4179 -10383337 -10979894 -10608861 -10771953 -10994246 -11406118 -11331512 -10359389 -9952041 -10279981 -10062672 -9968774
4168 -9968774 -10290205 -10551525 -10748834 -10854475 -10716036 -10495481 -10677514 -10620235 -10928476 -11218274 -11088126
4157 -11088126 -11102452 -11386109 -11159622 -11401091 -10959996 -10838833 -11288176 -10291416 -10767732 -9596937
4147 -9596937 -9885219 -9241385 -9761052 -9720283 -9706074 -9922813 -10060200 -9754317 -9510003 -9596207 -9247551
4136 -9247551 -8111874 -8033945 -8310171 -8090487 -7225622 -7722612 -6937920 -6521248 -6034002 -4787126 -4871843
4125 -4871843 -4985399 -4125850 -4742133 -5235693 -5262101 -5681187 -5889365 -5749145 -5810219 -5921012 -6442759
4114 -6442759 -6088069 -5661330 -6082999 -5725518 -4850603 -4986359 -4451824 -4206598 -3325385 -1356483
4104 -1356483 -469927 -65948 770256 621850 651049 507353 99671 -227848 335372 219191 459672
4093 459672 490528 875309 1278939 967634 369371 1891086 2489670 2706211 3949724 4021639 3665369
4082 3665369 4580341 6053765 8125785 10496536 12355686 14113647 14255595 13866241 13567753 12753352
4072 12753352 11914611 11715948 11956272 13464538 14104040 13999224 14822535 14792672 16191770 17607299
4062 17607299 17610323 18865573 21328323 22659388 23896307 25053566 26593446 28363936 30784187
4053 30784187 34375331 36794992 37848313 37344939 35456637 33492573 32112804 33104028 34582101
4044 34582101 36269763 37144087 38551117 40937322 43123987 44328234 43986063 42986384 45478450
4035 45478450 50094078 55677561 59181336 61078984 61692085 63526515 64022898 68261194 71524243
4026 71524243 74195140 74296309 74516071 75248445 77409549 82080581 86911390 91068267 94698702
4017 94698702 99806996 104424494 108879951 112566773 113952223 115294836 120597236 129058758 136741997
4008 136741997 140662990 141729479 143317515 144829627 148697996 154298108 159739038 163225995 165541931
3999 165541931 168512662 172853505 180066147 189944378 198999746 208569983 217910650 226759987 233948196
3990 233948196 241683886 252924975 267709395 282091923 294678442 306383807 312322434 312589027
3982 312589027 315149570 326065568 345077223 366860890 387331913 393733417 392540236 390344199
3974 390344199 392234490 395572000 400667199 412820499 442607183 476271350 482349171 460371915
3966 460371915 427883833 397075266 381862750 390128903 407659545 418640995 420409902 414193182
3958 414193182 410042847 412369606 423433677 445757880 476384020 500060851 508192780 500599217
3950 500599217 491463935 491360542 487997646 480666335 483431897 520782442 570647844 569728819 515145037
3941 515145037 440429604 365590887 309878114 290244359 292837161 287980307 272856332 257561381
3933 257561381 250472732 248476717 242774918 238944538 244331997 251381740 250465340 242735534 234904151
3924 234904151 233311525 228986690 217114277 206708627 216295997 240165590 239872053 208287866
3916 208287866 169734695 129757103 96451493 82600949 81709505 77438623 64634755 52255970
3908 52255970 51002696 49487647 43838780 33949414 27752171 23879493 18398056 13036019 10413671
3899 10413671 9578258 7358482 1821500 -3985783 -6884557 -7758552 -5501693 -4235527 -2216532
3890 -2216532 -496845 -22434 511745 2384896 531964 -3874586 -3799551 -4216700 -4196773 -2546286
3880 -2546286 -1358483 -1327323 -2260812 -4546278 -5997536 -5017346 -3809866 -6000475 -7286948 -8233579
3870 -8233579 -8006751 -5734102 -2711004 785557 1928952 95042 -909584 -3051655 -5230511
3861 -5230511 -9833760 -15043296 -16896026 -17226014 -17137301 -16026974 -13950981 -11914557 -11430760 -10916516
3851 -10916516 -10735626 -7908688 -5719020 -6176503 -7014982 -7240125 -7863633 -8297886 -7417170 -4960719
3841 -4960719 -4757641 -5279731 -7436294 -9267445 -10171586 -15343010 -19607021 -22707826 -21249113 -20484474
3831 -20484474 -18230897 -16172534 -13497714 -11881750 -10632251 -9426764 -9213007 -7903754 -8143136
3822 -8143136 -8341133 -8220036 -7648578 -7871586 -7522217 -7523463 -7168003 -7087368 -6846118 -7904342 -8780496
3811 -8780496 -10754674 -12860882 -13578063 -12782586 -11268156 -9742854 -8892782 -7943984 -7086818 -6340335
3801 -6340335 -6861764 -6423158 -6645897 -6575618 -6455019 -7670100 -7623036 -7728577 -7474449 -7565293 -8120929
3790 -8120929 -7474804 -7679262 -7272311 -7865125 -7531113 -7404322 -8049710 -7945994 -7270081 -6491026 -6486932
3779 -6486932 -6382760 -6574293 -7538248 -7864199 -8095254 -8786953 -8420607 -8111312 -8342040 -9136180 -8988605
3768 -8988605 -9038641 -8404941 -8078794 -8425355 -7790157 -7972195 -7602067 -7556128 -7331763 -7635405 -7247511
3757 -7247511 -6850626 -6456542 -6882489 -6339428 -6959870 -7019654 -7724302 -6743891 -6678434 -7103725 -7036214
3746 -7036214 -7928326 -8120785 -8501886 -8914942 -8293430 -7982656 -8364532 -8503269 -8101209 -7580704 -7433244
3735 -7433244 -7462932 -7044667 -7169271 -7124719 -7137085 -7984951 -7732688 -6819139 -7074850 -6735319 -7306394
3724 -7306394 -7324566 -7663834 -7922095 -7964705 -7321909 -7991220 -8513650 -9242803 -9312926 -8236808 -9293710
3713 -9293710 -8606905 -8778622 -7748089 -7709988 -8622666 -8605059 -8901685 -9132296 -9190471 -8974560 -8399208
3702 -8399208 -8949842 -9133373 -9193731 -9021736 -9477100 -9365356 -9098741 -8834909 -8750007 -8679967 -9124165
3691 -9124165 -9372279 -9817170 -10016142 -10016000 -8976754 -9511117 -8813567 -9267812 -9986063 -10007768 -10617946
3680 -10617946 -10719802 -10874388 -10011725 -10305392 -10427138 -10173660 -10270223 -10425696 -11114304 -10790116 -10426849
3669 -10426849 -10590718 -10431418 -10116147 -9901669 -11026913 -11167357 -10417357 -10990264 -10166281 -9961494
3659 -9961494 -10491740 -10687526 -11055242 -11300828 -12002459 -11781623 -11674784 -12113696 -10154392 -10541310 -10531198
3648 -10531198 -10219778 -10665703 -11703291 -11450507 -10950517 -10901569 -11308394 -10907500 -10824516 -11353106
3638 -11353106 -10254882 -10729057 -11110373 -10872928 -10917553 -10891198 -11261951 -10908977 -10959969 -9509665
3628 -9509665 -10962847 -11648464 -10897667 -9807528 -10587114 -10402754 -10789205 -10510569 -11110459 -10514350
3618 -10514350 -9993340 -11117276 -10605941 -10623668 -10725538 -11181042 -10453241 -10268698 -10301795 -10002395 -10862285
3607 -10862285 -10391628 -10028915 -10116427 -10989018 -9086783 -9862196 -10231091 -9950386 -9872372 -10257419 -10150476
3596 -10150476 -10296773 -10568729 -10905906 -10908679 -10218543 -10311133 -10607839 -10423428 -10554842 -10036897 -10126356
3585 -10126356 -10797254 -10674697 -10371256 -10415307 -10518961 -10344817 -10431347 -10583695 -10254229 -10172781 -10351328
3574 -10351328 -10383287 -9885994 -10192659 -10611291 -10074752 -10559458 -10260051 -10198084 -11003734 -10647856 -11093959
3563 -11093959 -10557051 -9983040 -10524107 -10449614 -10442614 -10983768 -11400463 -10756771 -10867946 -10257730 -10409336
3552 -10409336 -10295103 -10323379 -10570157 -11639899 -11262678 -10861598 -10648860 -10585667 -10773079 -10421922 -10696380
3541 -10696380 -10965786 -11083875 -11536694 -11556302 -11096367 -10981086 -10924361 -11180861 -10752368 -10733094 -10918886
3530 -10918886 -11494401 -11929900 -11587718 -11886883 -11755974 -11478636 -11234299 -11413621 -11595582 -11875526
3520 -11875526 -12175535 -12089695 -11194536 -11135008 -11949053 -11930222 -10886348 -11368006 -11327898 -11853021 -11594900
3509 -11594900 -11234028 -11196018 -11342692 -11003395 -11224552 -11247261 -11668850 -11348105 -12489969 -13851672
3499 -13851672 -13036228 -11435317 -11747398 -11711426 -11650804 -11290837 -11457848 -11924825 -11758284 -12139664 -12376007
3488 -12376007 -11459000 -10968778 -10946054 -11399793 -10239464 -11984746 -11627288 -11127771 -11484811 -11448725
3478 -11448725 -12030377 -11752304 -12011376 -11711393 -11488199 -11850759 -11656969 -11842571 -11547859 -11352040
3468 -11352040 -11007680 -11447792 -11751161 -11043472 -11727264 -11756843 -11853182 -12532255 -12196495 -11503144 -11949926
3457 -11949926 -11959624 -12027401 -11709330 -11675380 -11508084 -11353087 -11658309 -11578857 -11412420 -11610542 -12125667
3446 -12125667 -11738526 -11867015 -12459207 -11809590 -11607399 -11804997 -11438948 -11697489 -11801557 -11112661
3436 -11112661 -11474829 -11794959 -12088884 -10959150 -10899862 -11439322 -11840292 -11858315 -12027984 -12016713 -11307919
3425 -11307919 -11920019 -11991917 -11936016 -12205431 -12006706 -11969180 -11265595 -11064767 -11822798 -11549511 -11580721
3414 -11580721 -11540225 -11634790 -11611398 -10377184 -12439212 -12016286 -11685726 -12201576 -11345398 -12046637 -11560110
3403 -11560110 -11540615 -11448844 -11633629 -11412621 -11197788 -11551041 -11845486 -11002818 -11541412 -11985492 -12327357
3392 -12327357 -12352357 -11702692 -12087148 -12055470 -11802086 -12020322 -11317367 -11857689 -12403737 -11765858 -11627145
3381 -11627145 -11547684 -11998044 -11651268 -11559912 -12117147 -12032992 -11678855 -11375547 -11307941 -11764539 -11996296
3370 -11996296 -11146925 -11659797 -11507805 -11876231 -11331604 -11963014 -11872856 -11585002 -11493080 -11735910 -11889095
3359 -11889095 -11307626 -11138794 -12259800 -12255083 -12211294 -12207813 -11998645 -12370606 -12296427 -12006976 -11602245
3348 -11602245 -11531102 -12423396 -12026702 -12237878 -12186965 -12643049 -11723392 -12066948 -11787476 -11114401 -12400408
3337 -12400408 -12137478 -12094936 -12039451 -11958229 -11982506 -11589246 -11545482 -11729264 -11541796 -11256352 -11194401
3326 -11194401 -11348816 -11522118 -12143615 -11868414 -12526148 -12352232 -12017693 -11371895 -11810448 -12144258
3316 -12144258 -11808433 -12012121 -11357024 -11379067 -11611163 -11698881 -11645882 -10903322 -11427201 -11329729 -11953667
3305 -11953667 -11536077 -12291534 -12247605 -12052888 -11503889 -11297295 -11701690 -12258725 -12168346 -12233469 -11592247
3294 -11592247 -11847283 -11600622 -11928207 -12046410 -12106749 -11465422 -11298265 -11833913 -11517197 -11803554 -11594882
3283 -11594882 -12003114 -11852797 -12258733 -12095554 -12048391 -11871081 -11773539 -11821608 -11660644 -10890616 -11206919
3272 -11206919 -11088753 -11028193 -11768453 -11692834 -11746430 -11705912 -11821064 -11741192 -11863996 -11758086 -11805948
3261 -11805948 -11622149 -11533961 -11579902 -11754506 -11400518 -10754430 -11920816 -12603276 -12045507 -11766882 -11299592
3250 -11299592 -11691880 -11654246 -10849736 -11045519 -11142065 -11541748 -11555209 -11855668 -11030516 -11763994 -11261690
3239 -11261690 -11410833 -10906236 -11485269 -10836619 -9400711 -11739239 -11820609 -11269981 -11310879 -11941039 -11921157
3228 -11921157 -11477773 -12158546 -12362258 -12216926 -11785113 -11342043 -11738076 -11439456 -11522768 -11479823 -12181862
3217 -12181862 -11853902 -11386397 -11783813 -11687155 -11960638 -11807339 -11312825 -11576021 -11560857 -11669541 -11722697
3206 -11722697 -11352031 -11605086 -11058394 -11047506 -10825010 -11391748 -11551973 -11449744 -11693662 -11725937 -11888541
3195 -11888541 -11498034 -11025584 -10973324 -10852907 -11144879 -11620211 -11241844 -11778182 -11330399 -11708319 -11503185
3184 -11503185 -11366855 -11698674 -11231887 -11197130 -11180317 -11215964 -11780144 -11582762 -11069041 -11274926 -11714671
3173 -11714671 -11530755 -11333505 -11568945 -11273369 -11753974 -11971358 -11361778 -11358245 -11587367 -11448637 -11755833
3162 -11755833 -11374581 -11696739 -11103720 -11121033 -12220963 -12118622 -11186623 -11972227 -11405644 -11255854
3152 -11255854 -11738681 -11909720 -11781098 -11800519 -11258657 -11988735 -11734871 -11927493 -12647821 -12005082 -11627681
3141 -11627681 -11774643 -11718482 -11716152 -12164204 -11732155 -11854584 -11767803 -12249059 -12264402 -11552296 -11574568
3130 -11574568 -11280255 -11575404 -11307441 -11692706 -11237294 -12728655 -11918059 -11468649 -11817709 -11741402 -11794736
3119 -11794736 -11291346 -11980265 -12088210 -11943379 -11676909 -11859098 -11975748 -11974996 -10946582 -11654051 -11789963
3108 -11789963 -11318711 -11257424 -11384476 -11237662 -11478557 -12048419 -11621992 -11788542 -11647005 -11427488 -11715733
3097 -11715733 -10366981 -11234090 -10992670 -11402751 -11666889 -11778483 -10834263 -9685442 -11285902 -11449480
3087 -11449480 -11350234 -11473166 -11788606 -11762478 -11328752 -11791857 -11556475 -11424486 -11445968 -11109853 -11315752
3076 -11315752 -11173432 -11452771 -11600562 -11591819 -11930387 -11995781 -11637681 -11493123 -11046115 -11235132 -11077576
3065 -11077576 -11133897 -10835446 -10955563 -11424511 -11432120 -11296459 -11598015 -11227320 -11510179 -11051461 -11762564
3054 -11762564 -11813630 -10934728 -11397244 -11487448 -10941804 -11890588 -11455592 -11681422 -11372404 -11038946 -11188349
3043 -11188349 -11540881 -10905291 -11235457 -11799051 -11485901 -11386146 -11133293 -11626701 -11231909 -10942845 -11636852
3032 -11636852 -12286017 -12093188 -11801874 -11475216 -11672329 -11784170 -11688106 -11717072 -10382545 -11445081 -11387642
3021 -11387642 -11161489 -11754218 -11503668 -11325719 -11078872 -11646337 -11615502 -11155150 -11558796 -11961260 -12388442
3010 -12388442 -11741496 -11109209 -11127385 -11645168 -11340792 -11466817 -11448138 -11386515 -11131273 -11298517 -11192230
2999 -11192230 -11725562 -11932028 -11777637 -11901863 -12076867 -11697794 -11806157 -11296283 -11010309 -11222701
2989 -11222701 -11609087 -11497393 -11967275 -11712489 -11489584 -11103231 -11610682 -11480164 -11882244 -11985122
2979 -11985122 -11532208 -11264444 -11448665 -11959810 -11217871 -11695980 -11427285 -10997678 -11140057 -12763331
2969 -12763331 -12076376 -12249381 -12327831 -11231107 -11543615 -11139653 -11313608 -11925984 -12135673 -11774419
2959 -11774419 -11622997 -10945172 -11080375 -11850434 -11657814 -11370036 -11717105 -11139285 -11705760 -11770765 -12067858
2948 -12067858 -11070006 -11308224 -10964809 -11218551 -11313691 -11455587 -11759301 -11487747 -11702215 -12203036 -12150456
2937 -12150456 -11665666 -11287805 -10909842 -11105595 -11656902 -11735267 -12019062 -11350533 -11320907 -11713148 -12231450
2926 -12231450 -12169271 -11667663 -11701525 -11229016 -11307424 -12035972 -11220389 -11412565 -11483688 -11573317 -13155156
2915 -13155156 -12351650 -12091346 -12155871 -11958396 -11206264 -11319273 -11305126 -11564070 -11617972 -11355397 -11117083
2904 -11117083 -11915209 -12010740 -12366122 -11885881 -12108931 -12079341 -11417111 -11726246 -11808530 -11950932 -11411474
2893 -11411474 -11194746 -11619096 -11570707 -11741898 -11618730 -11374245 -11507646 -11586045 -11428502 -11990814 -11850675
2882 -11850675 -11895608 -11617087 -11298238 -11654858 -10994832 -11234790 -11152372 -11282887 -11833210 -12077976 -11796745
2871 -11796745 -11976703 -11930242 -12192489 -11570382 -11750663 -11711732 -11848614 -11623319 -11302516 -11492293 -11411102
2860 -11411102 -11443894 -11731498 -12228288 -11064073 -11222210 -11798044 -12262537 -11569996 -12205021 -11925848 -11917470
2849 -11917470 -11768705 -11644058 -11692595 -11685233 -12087617 -11861990 -12444795 -12663560 -12150664 -12769734 -11951432
2838 -11951432 -12324203 -12424932 -11268633 -11583268 -11874635 -11633026 -11774145 -12084021 -12117915 -12015008
2828 -12015008 -11743996 -11488774 -12205476 -11567398 -11564251 -11855879 -11852204 -12106408 -12072785 -12406416 -12318059
2817 -12318059 -11638554 -13175126 -11046697 -11728124 -11906103 -11822675 -11385157 -11310924 -12394509 -11624917
2807 -11624917 -11914561 -11302472 -11608581 -11946894 -12064156 -11570602 -11741360 -11842742 -12217325 -12337807
2797 -12337807 -11984877 -12079971 -11828934 -11666463 -11838895 -11961783 -12096789 -12309093 -12354395 -12347736 -12176288
2786 -12176288 -12546534 -12194455 -12388726 -12375371 -12403142 -12195147 -12421013 -12333510 -11938347 -11974345 -12423617
2775 -12423617 -12035372 -11155902 -11433797 -12053931 -12396933 -12360124 -12108367 -12093237 -11180979 -11319832 -11985085
2764 -11985085 -11732280 -12133950 -12448593 -12768131 -12062897 -11591233 -11857640 -11863258 -11985561 -12082916 -12118978
2753 -12118978 -11569598 -11481777 -12257251 -11718447 -11875801 -11938375 -12031364 -12204627 -12230145 -11807775 -12047543
2742 -12047543 -11899751 -11856975 -10552825 -12275601 -11996062 -11867365 -11694331 -11756970 -11917729 -11517100
2732 -11517100 -11828558 -11527070 -11597752 -11931955 -11959030 -12905215 -11356919 -11481757 -12317518 -12062184 -11801304
2721 -11801304 -11719081 -11693084 -11840233 -11877638 -12000131 -11901819 -11878042 -12267030 -12328727 -12122110 -12383423
2710 -12383423 -12242490 -11366092 -11795448 -12438537 -12360906 -11747628 -11111534 -11375137 -11959128 -11921479 -12152802
2699 -12152802 -12113249 -12700420 -11777472 -11921895 -11826702 -12400796 -12358890 -11985971 -11362956 -11453262 -10572715
2688 -10572715 -11131955 -11765697 -12123194 -12123837 -12438394 -12273291 -11912461 -11673761 -11393573 -11038024 -11350270
2677 -11350270 -11537552 -11339790 -11596173 -11796472 -11591952 -11363588 -11102642 -11107439 -11418262 -12193531 -11156123
2666 -11156123 -11529098 -11092426 -11233174 -11352052 -11249462 -11391832 -11895844 -12028437 -11784650 -12030925
2656 -12030925 -11474287 -11567385 -11448065 -12044065 -12251063 -12675925 -12910723 -12822436 -12591594 -13192548 -13453230
2645 -13453230 -13161864 -13210810 -13695850 -13485758 -13353386 -13282651 -13043692 -13151367 -13363942 -13640930 -13729522
2634 -13729522 -13123253 -13510545 -13455600 -13261000 -13470735 -13000837 -13148299 -9563008 -11172949 -11784526
2624 -11784526 -11998978 -12376326 -12850772 -11782614 -12519576 -12770922 -13017167 -13045938 -13748235 -12743646
2614 -12743646 -12508953 -12265211 -11590229 -11331382 -11737638 -12411308 -10090798 -10587469 -10460077 -10482217 -10468325
2603 -10468325 -10669277 -10403640 -10345712 -10302041 -10391620 -9777961 -9889493 -10154384 -10043960 -9705910 -9610935
2592 -9610935 -9586241 -9258493 -9440608 -9876758 -9769734 -9932827 -9367318 -9178738 -9282640 -8837053 -9237885
2581 -9237885 -9101063 -9391976 -9953955 -9971291 -9700835 -9275150 -9153524 -9696154 -8923252 -8299491 -7900094
2570 -7900094 -7871765 -7217828 -6235445 -6118018 -6708324 -6659433 -6218346 -7059616 -7843104 -6815524 -6576745
2559 -6576745 -5939141 -5850173 -5158404 -5353551 -5035020 -4609433 -5755973 -5911225 -6614017 -6455026 -6179521
2548 -6179521 -5813135 -6045213 -6278637 -5676029 -4966560 -4528247 -4314726 -3972639 -3500356 -3413410 -2892080
2537 -2892080 -2448536 -1918732 -1137135 80936 1440190 1822859 2545073 4212888 4756858 4306556
2527 4306556 5158527 5596458 5455859 5127429 6511859 6701188 8304823 10472550 12440253 15111982
2517 15111982 17278663 19984244 21682680 22790419 23733872 23732946 24839956 26549495 28604056 30478415
2507 30478415 31493128 32765376 35437032 36099268 37030116 38329596 39925241 41362399 44074428
2498 44074428 46238584 48793273 51322567 51850976 51970022 53989526 56224200 58984176 60900519
2489 60900519 62944047 64272534 65385718 65977183 66690773 68416807 70421107 72008061 74542100
2480 74542100 77285967 78635385 78552134 79195492 79879001 80954724 84527531 88421132 90838201
2471 90838201 93271048 94771973 95717614 96609931 97673787 98789158 99913215 100790365 102319626
2462 102319626 104469743 107191769 110342872 113000290 116290211 117549418 118217227 118764621 122096376
2453 122096376 126599167 131909271 136419646 137925586 137722177 137192755 135990678 135218113 135851464
2444 135851464 136660309 137687541 139537168 142978635 146214832 146771357 146723267 147310845 147789563 153569914
2434 153569914 159733623 165397314 169261705 171425997 172468133 177955514 186231377 195577499 203745883
2425 203745883 207495503 209458998 216180056 225609965 233121181 242022548 253120286 267127172
2417 267127172 282497963 293125292 303580770 299428640 293386156 304710741 340995651 399318852
2409 399318852 441452574 443475914 418993904 382252484 349817653 330677148 317761633 301605376
2401 301605376 283407261 267689853 262181037 261088965 249487453 226986488 200596179 177346452
2393 177346452 156792727 138459593 128279096 121970125 115942521 106344321 96149459 87184698
2385 87184698 78323749 70084178 62552089 56388292 51159450 45873728 44933162 45634614 44317400
2376 44317400 42321916 40776533 39864460 38448901 37461436 37622375 35990589 35384140 34292340
2367 34292340 32329796 33414322 32853307 33475427 32185120 31747046 31464363 30036279 33323546
2358 33323546 37069837 41097010 45191015 48640917 49176425 48288742 49853316 54116661 62259200
2349 62259200 68289610 73314069 76719011 77009445 76512335 82865956 94294157 104572487 113723153
2340 113723153 118419267 117843983 115820167 112626611 116316955 114251526 110091460 111388358 130123831
2331 130123831 158071802 143292549 115386833 92003035 64924301 45365310 40660689 41685668
2323 41685668 36859992 27363848 20267894 23039055 20777583 13479324 5487287 2076898 1417950
2314 1417950 13606 -4101594 -3438652 -1519322 -2900334 -6654821 -10940739 -12517812 -13268354
2305 -13268354 -13654124 -14224756 -14027440 -16152599 -18291961 -18003927 -16166141 -15756041 -15603514 -15363543
2295 -15363543 -14779727 -13320835 -12391323 -11759472 -11673954 -11960549 -12180012 -12894944 -13416614 -13028768
2285 -13028768 -12021161 -11985553 -12039409 -10531150 -8553956 -6387335 -6377823 -5232197 -4457519 -4941430
2275 -4941430 -4644974 -4928127 -5379816 -6352050 -6264128 -6015669 -5100308 -4526262 -5396606 -5416474 -5591916
2264 -5591916 -7017524 -6847962 -5596622 -6182877 -7438516 -7882102 -7850210 -8628945 -8938684 -8376934
2254 -8376934 -7729259 -9167218 -8969277 -9175975 -9697148 -10181947 -11072332 -12215007 -11784755 -11966372
2244 -11966372 -12404232 -12639197 -12398271 -12015196 -12049563 -12302678 -12479193 -11500510 -11004257 -11835057 -11433438
2233 -11433438 -11613271 -11205446 -11278945 -10593661 -10182953 -9256531 -9999800 -9354043 -9943896 -10239605 -11094656
2222 -11094656 -13409878 -13768805 -12201465 -11575469 -11212284 -10793058 -10393045 -9679403 -9192173 -8958961
2212 -8958961 -9179026 -8267198 -9213237 -9522253 -9326300 -9268613 -9054708 -9610848 -9073200 -8814284 -9143843
2201 -9143843 -9256634 -9250757 -9224948 -9794342 -9539284 -9776132 -10447927 -9748473 -9555855 -8922879 -9917495
2190 -9917495 -9468734 -9025529 -10012827 -10023493 -10151332 -10236826 -10187894 -9688374 -10328095 -10655867 -11481744
2179 -11481744 -10241799 -10526556 -10561654 -10740511 -10704491 -11329008 -11098039 -11544417 -10965073 -11015220 -10901026
2168 -10901026 -11550936 -12095189 -11495315 -11421845 -11975558 -11666114 -11372447 -11811929 -11868631 -12074113 -11756477
2157 -11756477 -11907813 -11954084 -12067109 -12385956 -11364540 -11435252 -11484039 -11808054 -11874648 -11807161 -11201920
2146 -11201920 -11485992 -11122551 -10835411 -11534073 -11100620 -11104005 -11447038 -10773632 -11779454 -11396586 -11039168
2135 -11039168 -10383663 -10497386 -10967129 -11141643 -10648080 -10453114 -10976294 -10847709 -10835724 -11089009 -10681965
2124 -10681965 -10673755 -10671144 -10163475 -10229122 -10308654 -10116898 -9993217 -10117175 -9825604 -10324435 -9525577
2113 -9525577 -9700329 -9897241 -9823551 -10039854 -9709029 -9388817 -9745983 -9638585 -9422866 -9776978 -10336077
2102 -10336077 -9655318 -9895949 -9998892 -9955421 -9625301 -9688948 -10156941 -9862058 -9841585 -10184015 -10213665
2091 -10213665 -10419103 -10677263 -10286220 -10350261 -11018588 -11246401 -10722512 -10342241 -11086378 -10779181 -11461905
2080 -11461905 -10733940 -10507215 -10350034 -9864778 -9701486 -9965912 -10147209 -10327126 -10531415 -10101038
2070 -10101038 -9813035 -9722291 -9897550 -9667533 -9749164 -10035747 -9904948 -9786387 -10413642 -9977451 -10231220
2059 -10231220 -9646479 -9193280 -8996051 -9345037 -9465032 -10070963 -9811892 -10197598 -9587414 -9572372 -9508640
2048 -9508640 -9457694 -9200598 -9294231 -9966791 -9653785 -9478505 -10032170 -9355288 -10120564 -9792576 -10073252
2037 -10073252 -9855702 -9556382 -9309760 -9343114 -9318089 -9139788 -9491804 -9069422 -9300264 -8985973 -9580701
2026 -9580701 -10433539 -10280823 -9927043 -10111549 -9551473 -10190369 -10152147 -10501665 -9956777 -10263420 -9870961
2015 -9870961 -9822643 -9401087 -9284065 -9405222 -9250211 -9702462 -9406502 -9066146 -8918985 -8795525 -8566813
2004 -8566813 -8458212 -8599969 -8418251 -8761043 -8749589 -8505954 -8644161 -8595768 -8746387 -9413310 -8211430
1993 -8211430 -8020939 -7944472 -7817231 -7562505 -7192437 -7146286 -7243366 -6936697 -7222988 -7031208 -6659820
1982 -6659820 -6225504 -6190635 -5552186 -5407753 -4936258 -5479590 -5739841 -5590822 -5827635 -6163053 -5366919
1971 -5366919 -5108778 -5321541 -4631331 -3980176 -4246618 -4751136 -3975430 -4238159 -4001906 -3329864 -2411032
1960 -2411032 -1647561 -914292 -485415 -56130 339019 1007137 925226 746533 1339761 1436251 1279394
1949 1279394 1398032 1809493 2759093 2867375 3369860 2919756 3181721 4136621 4598047 5297221 6048436
1938 6048436 7546741 8107295 8645064 10240118 10724292 11901789 12207097 13196153 14219509 14530817
1928 14530817 15438771 14833978 14868579 15685914 16380175 17171545 18512495 19979317 21016474 21816133
1918 21816133 22941121 24247827 24711354 25853688 28031545 29599111 30914181 32454862 33726998
1909 33726998 35351507 36156110 38060576 40004119 41931395 43037230 43421163 43646480 44261825
1900 44261825 45803358 47772314 49286729 52413132 55276667 56999567 57717594 59216234 59807543
1891 59807543 61442202 64017918 66250232 68926497 71073704 73264916 73922853 76808473 79676975
1882 79676975 82522237 85911939 88238673 89735849 90454505 91794940 93577865 95263166 97457928
1873 97457928 101891354 106454729 110321609 111252579 110596840 108632524 108113760 108434467 110307882
1864 110307882 113126425 116012421 117180309 118310438 120237626 123461924 127531956 133833318 135641536
1855 135641536 138311753 140551644 141007539 141518328 143138178 146150799 150025937 154892588 159195289
1846 159195289 161121312 158589787 152648928 145959988 140631032 138554313 139338828 139573830 140322520
1837 140322520 140192764 141179778 142429553 145639388 149283576 152059386 155218004 156238376 156678218
1828 156678218 156662766 157244736 158383310 160373553 164206959 167656962 167949844 164824726 156988009
1819 156988009 145803909 134468367 128257264 124509341 122428796 121007448 119535611 118219846 117528447
1810 117528447 118310338 119663736 122284594 121713016 122305370 121870403 121290521 120083771 119258702 119206339
1800 119206339 120816683 122057821 121788912 119697030 113114572 102671229 91238110 82391055 77191046
1791 77191046 74359204 72270436 70042297 66347832 66198773 64450371 63463406 63350263 64501421
1782 64501421 63511777 63280789 62229179 60892314 59230867 57809033 57652241 57321965 56998180 56247211
1772 56247211 53060821 47003723 40271723 34401828 29781826 27415545 26291934 24977937 22974580
1763 22974580 20398911 20072691 18737017 18191776 17434216 17323866 16474633 16116271 14813087 13476619
1753 13476619 13436939 12592185 12841694 12250655 12145951 10822543 9264248 7474441 6897247 6063530
1743 6063530 4916677 4044450 3034965 2027296 753162 -897653 -2124481 -2137372 -3239821 -2569822
1733 -2569822 -2513217 -2465728 -3290333 -3262722 -2646385 -2349662 -2906478 -1601212 -2259625 -1893832 -1746007
1722 -1746007 -549098 419479 699767 1161939 1102380 700053 -1033470 -3381444 -3612430 -4668386
1712 -4668386 -4545468 -4149885 -3364308 -2462896 -2140649 -2276320 -1338160 -795424 -531114 416029 92744
1701 92744 -6752 367899 1189577 2498334 4257672 6586507 8417959 9088138 8667118 8147362
1691 8147362 6959177 5362822 4762623 4547390 4790501 5664283 7126732 8548097 9024488 9983607
1681 9983607 10527053 11250380 12262822 13502777 14396494 14930747 15079596 16252340 17182847 19927521
1671 19927521 22923532 25172357 27188689 27359032 26317307 25392164 24332517 23047189 23210311
1662 23210311 23756255 25886252 27233915 28116986 29857891 31818937 33490942 33606477 34026880 34827385
1652 34827385 37649260 40718925 43079966 44508032 46779671 47770685 50533839 53142176 56772205
1643 56772205 58900579 58675378 57579437 57017474 58192672 61219791 64716537 66868831 70462838
1634 70462838 72954671 75690205 79282665 82197214 83964576 85198609 88215307 95274738 101337514
1625 101337514 105141085 106529436 108148348 109679064 112537455 116898742 120490898 124177814 126523980
1616 126523980 128538448 131405939 136538098 143542118 150655553 158323797 164509190 169931398 175690647
1607 175690647 183612638 191431179 201639701 211947823 221216939 230147224 236299601 238397805
1599 238397805 241309518 248786052 259707885 272334169 283665945 290478303 291748811 293353391
1591 293353391 295827469 298079296 303221153 315738664 337330949 359354315 368901952 360208994
1583 360208994 343928737 329587211 327324614 339740611 356440520 367962015 373320772 371935882
1575 371935882 368882063 371587639 386165590 405641447 429509103 447233370 452839815 449474320
1567 449474320 442527810 443948810 445359604 439450300 446470139 479609423 531972022 534468723
1559 534468723 489176817 435923366 380248541 342155544 334160991 345559972 351253068 342046813
1551 342046813 329744892 325030385 325365798 326596485 332027275 343962770 356503495 359163816
1543 359163816 351248973 344104138 343428917 339550117 330694755 326253427 345388883 373899112 377897357
1534 377897357 341677942 289590614 238098130 196163059 178205664 177447565 175554824 163363288
1526 163363288 149838847 142509173 139366639 134656916 128827175 125580126 124727894 121942835 115404697
1517 115404697 111118788 108209795 105019995 97794366 90493055 91655207 99823907 102155003 92957312
1508 92957312 77523437 62437410 46942490 39874677 38288823 36290195 30570966 25041759
1500 25041759 22277306 20944217 19559062 16441355 12952937 10717942 7524292 4694705 3994535
1491 3994535 4372498 1303196 -570058 -4228206 -5772244 -4369277 -2039168 250953 1415945
1482 1415945 2122499 3010618 1736098 120279 -3325003 -7586559 -8777329 -8618364 -8927414 -7949294
1472 -7949294 -6561733 -4945501 -4724096 -5480096 -5759426 -4240156 -2284186 -2941261 -3854534 -4190905
1462 -4190905 -6106430 -4721520 -2594595 76706 711901 379231 -1495601 -3068730 -5855705
1453 -5855705 -9630787 -15103162 -17763117 -16834088 -14911235 -13749298 -12819218 -10933537 -8915446
1444 -8915446 -8510178 -7258275 -6419035 -4824463 -3610321 -4288898 -4475866 -4586906 -4502740 -4598102
1434 -4598102 -4181768 -3949427 -3807659 -4004633 -6005911 -8068178 -10668170 -13637906 -15155986 -15335251
1424 -15335251 -13260618 -11847819 -10996509 -9647538 -8107540 -7088155 -6867816 -6065292 -5766246 -6701086
1414 -6701086 -6978499 -7355823 -6925124 -7210831 -7307420 -6504401 -6769622 -6446252 -6576884 -6696513 -7054747
1403 -7054747 -7818638 -9209371 -10189278 -10146440 -9165153 -8453429 -7553695 -7648667 -7620411 -7461415 -7479893
1392 -7479893 -7667637 -7289541 -7511576 -7202906 -7250582 -7407170 -7750112 -7817249 -8042179 -7972658 -7157963
1381 -7157963 -7374167 -7893017 -8606556 -7895187 -7849767 -7969731 -7936473 -8043618 -7471547 -7430349 -7168824
1370 -7168824 -7247541 -7333043 -6660224 -7239797 -7809905 -7752547 -8207408 -7871096 -7710840 -9054935 -9247521
1359 -9247521 -9563957 -8905250 -8323367 -8507974 -8277433 -8264820 -7659394 -7833978 -8097116 -7985206 -7976895
1348 -7976895 -8531778 -8587433 -8107624 -9616699 -6871250 -6859987 -7146332 -7507642 -7684996 -8919703
1338 -8919703 -8679299 -8836874 -9323329 -8932743 -9055739 -8250529 -9261979 -9034647 -8883251 -9004011
1328 -9004011 -8361924 -8491465 -8867973 -9316600 -8920681 -9349450 -9266543 -9067220 -9155801 -9571556 -9606540
1317 -9606540 -8927291 -9484145 -10264898 -10676748 -10208236 -9862881 -10905751 -10040210 -9471420 -9424418 -9710985
1306 -9710985 -10687871 -11254598 -11098668 -11875713 -11420665 -11611757 -11766851 -11074931 -11562847 -11022137 -10717674
1295 -10717674 -10879365 -10204803 -10036181 -10133182 -10180096 -9599673 -10191408 -9882554 -9791263 -10023319 -9291281
1284 -9291281 -8796904 -8767873 -8380686 -9076790 -9651596 -10773741 -10670560 -10562254 -10894407 -10664863 -10345566
1273 -10345566 -9023387 -10390944 -9923262 -9821994 -9310615 -9135131 -8780705 -8880166 -8966744 -8552765 -8644511
1262 -8644511 -8319090 -8013429 -7455076 -7264256 -6772951 -6809510 -6830170 -7754674 -7151585 -7475187 -8080170
1251 -8080170 -8442634 -8707528 -8325675 -8036448 -7583060 -7518083 -7391639 -7064843 -6345612 -5741666 -6068985
1240 -6068985 -6371600 -5839627 -5210678 -5236086 -4624647 -4260306 -4019535 -4023509 -3759402 -3575037 -3278683
1229 -3278683 -2911428 -2942479 -2259669 -2804536 -2941306 -3186579 -3569673 -3075046 -3566046 -3462898 -3292071
1218 -3292071 -2560515 -2729675 -2802217 -2379583 -2974283 -2947647 -3203836 -2760205 -2529770 -3452237 -3330380
1207 -3330380 -4385055 -3882359 -4046966 -4817810 -4589146 -3946133 -3455562 -4614470 -4701832 -3930746
1197 -3930746 -3248556 -4131710 -5583328 -5647149 -6396460 -3896066 -3384181 -3130318 -3149164 -2652660
1187 -2652660 -1384911 -727720 -2397637 -4081506 -5289206 -7164202 -6776849 -7420055 -7585673 -8197116
1177 -8197116 -9042665 -8885676 -8946255 -8969955 -8573621 -8994892 -9618443 -9529736 -8628828 -7308975 -5921763
1166 -5921763 -3856022 -4333390 -3660517 -3256447 -2013763 -2662046 -4274441 -6082294 -6502062 -6675043
1156 -6675043 -6663922 -6680717 -6795956 -7316610 -6602133 -6768221 -6468114 -5556482 -3990893 -3654399 -3563205
1145 -3563205 -3492458 -3156444 -1938446 -1055913 -263519 -1549806 -2497730 -3020137 -2844065 -3152510
1135 -3152510 -3915749 -3818006 -4652739 -4312346 -4062158 -2803409 -817738 815318 341176 1174296
1125 1174296 3948763 5759762 7941545 10924213 12914771 13589257 11418620 10388751 11526344
1116 11526344 10861190 9822702 8500336 8576350 9114280 9632825 10028356 9042607 7981975 8686028
1106 8686028 10524776 12563679 13915637 12278335 10848736 11461840 14489105 19950855 25462060
1097 25462060 29097157 30688798 30255061 30197063 29804648 29020524 27802887 28237538 31885427 33953882
1087 33953882 34869220 36234529 36914094 37430610 39573708 40805609 42978846 46515944 48542079
1078 48542079 49575050 49874879 54366689 59529949 65687154 74881265 81442430 89069581 91077341
1069 91077341 90959900 86472023 81528778 79795145 78157314 78899856 82626029 90141527 91734176
1060 91734176 92622755 98220366 102283127 103666630 106258309 108474958 112232040 116746150 124327682
1051 124327682 131242772 136188364 146012907 153992206 163473202 168885814 171620498 169570371 160555427
1042 160555427 154123309 151563283 158391713 168024183 174259406 178950042 183304516 189152566 197621527
1033 197621527 203232511 201300748 195258341 199452037 220818224 251151390 267539180 270774182
1025 270774182 274624599 274730993 276299441 285579419 298233882 307861216 309790115 316600023 331304557
1016 331304557 353827001 378372426 397339120 417037063 435519802 449932003 466717215 485086572
1008 485086572 500395072 516509188 544478621 581028401 615253506 632483233 634767197 634006450
1000 634006450 635590453 643485557 660725277 687254152 710198273 719942150 731617936 750166261
992 750166261 763064226 781047829 816988467 856589654 895388640 933400686 967561454 989938974
984 989938974 1009153972 1056765305 1141867663 1226314216 1275819861 1313090256 1325830426 1313066712
976 1313066712 1320787404 1385273183 1491288724 1603802485 1694393954 1714818736 1705053454 1680813596
968 1680813596 1668234489 1691137729 1682171321 1700172026 1799710548 2040158471 2147483647
961 2147483647 1965983205 1743014250 1521304691 1357256042 1290717225 1312767793 1335684204
954 1335684204 1290382162 1212597114 1181801063 1232252834 1278421366 1306042899 1333774835 1342512437
946 1342512437 1328872440 1283568897 1256141028 1283986856 1256357185 1221634923 1246525135
939 1246525135 1406785557 1493188261 1316622550 1091498473 857632142 644540895 508140491
932 508140491 488862240 496937591 452612574 383561845 341098235 336682617 303142760 247833589
924 247833589 199415044 182031079 175475000 150147962 121335154 121132198 115000604 87872157
916 87872157 50984448 16257401 -438850 -5541068 -1596057 5527334 14063269 16709841 25432513
907 25432513 40696571 49754407 43294286 31570674 25430201 30068509 35528083 38253977 41178194
898 41178194 39726757 30188613 19914278 10336313 12686074 15450427 11683755 2616006 4091288
889 4091288 8611337 19199117 31125811 43408917 49842414 50266496 46073141 41332338 34027177
880 34027177 19285759 8054699 7443011 5854159 3937833 5389396 5019348 9106526 12817885
871 12817885 7688035 8752459 17659093 19076576 11382032 11408705 8040792 4544598 6359923
862 6359923 14301131 19970809 18330889 13982824 8581164 1218226 -11297913 -23987102 -41666621
853 -41666621 -53055850 -54043496 -49025173 -42674988 -32783256 -26559821 -22105705 -19382527 -14900252
844 -14900252 -6476342 -1881370 -273987 -910395 -3464584 -3286812 209539 3870806 6074068
835 6074068 6541032 7308711 4893122 146681 -4934832 -17625388 -28100459 -28487068 -20313976
826 -20313976 -13529410 -8254694 -3457191 2817685 8671749 11078080 12175057 13165101 12482067
817 12482067 8145442 6532799 7777380 7413847 5905090 4720925 5772356 6881047 7179899
808 7179899 6591604 4990171 3547111 3929914 3192580 2234997 3042920 3371175 5290452 6470227
798 6470227 7113052 6595146 4031772 2500057 45933 -1697110 -1078968 -314167 138600 -302105
788 -302105 -595994 586485 722076 1148470 2768931 2684279 3308069 4832362 5413624 5108679 4817122
777 4817122 5717462 8062340 8288885 7933926 7472093 5872311 5096294 4810020 4155351 4728386
767 4728386 4379406 4305338 3611502 3338017 2025099 3078132 3770341 4754508 5386461 5685620 6360708
756 6360708 7524135 8378865 9164614 8971351 9736180 10476062 10649737 10442465 10320783 10843899 11122855
745 11122855 11908598 12350310 10476484 9507767 8910173 7183640 6550593 6437507 5405381 5562640
735 5562640 6069184 6908670 6190126 4999954 4342911 3964570 3940069 3281269 2751122 2541923 1340444
724 1340444 1287488 2535708 2825171 2865942 2081123 579205 -59496 -1042164 -1646372 -1782397 -2323913
713 -2323913 -3393899 -3723657 -3556690 -3651850 -4950763 -4910925 -7645917 -8374954 -8456632 -8727647 -10126787
702 -10126787 -10869759 -12178348 -11610256 -10638706 -10692441 -11160574 -11997498 -12444190 -12601589 -13420370 -13417850
691 -13417850 -13529984 -14147685 -12162980 -12904981 -12186534 -11484965 -12059654 -12366879 -12344964 -11960709 -12317431
680 -12317431 -12045049 -11802507 -11621722 -11778135 -11863011 -11380827 -11144719 -9974819 -10408800 -9285575
670 -9285575 -8582855 -9282640 -8996795 -10064299 -9343172 -9172203 -9621663 -9174233 -9399256 -9448592 -8991692
659 -8991692 -9028549 -8388246 -8799607 -8801835 -9206839 -8924106 -9113619 -9675072 -9401715 -9081076 -9725012
648 -9725012 -9640793 -8827509 -8655338 -8867253 -9013755 -8254324 -8241214 -8209437 -8392828 -8191818 -7571821
637 -7571821 -7676963 -7704686 -7752919 -7755060 -7836499 -7190328 -7016842 -6632498 -7016792 -6873879 -6035765 -6639606
625 -6639606 -7595711 -8024389 -7713765 -7207243 -7810369 -7732123 -7825721 -6969430 -6287238 -5807751 -6514816
614 -6514816 -6069016 -6075696 -5766985 -5527859 -6212127 -6689418 -7076180 -6056222 -5922951 -5608622 -5109256
603 -5109256 -5315760 -5697815 -6060120 -5066142 -4959131 -5825382 -5932080 -6274557 -6272076 -6487543 -6655909
592 -6655909 -6638299 -6376030 -5729095 -7202709 -6835394 -6539698 -6244596 -6312096 -6026795 -6049841 -6281120
581 -6281120 -6356578 -6680854 -6814746 -7097427 -6861980 -6425761 -7130396 -7086082 -7469208 -7423539 -7590058
570 -7590058 -7608576 -7218026 -7896661 -6779255 -7184017 -7402750 -7361626 -6911283 -7378531 -7352791 -7222494
559 -7222494 -6609323 -6684276 -6613674 -9117092 -9141043 -8513965 -8350712 -8975862 -9078728 -8604240 -8682433
548 -8682433 -8513633 -8298602 -8311527 -7867250 -7867914 -7664983 -7747243 -8050941 -8793265 -8628907 -8689155 -8444763
536 -8444763 -8196278 -8687046 -8565921 -8598170 -8728909 -8523146 -8914610 -7904345 -8563094 -8662905 -9006136
525 -9006136 -9276242 -9482154 -9714137 -9639794 -9914056 -10831247 -10549806 -10886849 -10375585 -9607415 -10031517
514 -10031517 -10046771 -9364570 -10032191 -9846678 -10140950 -9694649 -9761473 -10144280 -9473262 -9744540 -9630317
503 -9630317 -9579588 -9183160 -10267301 -10456533 -10870346 -11470832 -10868108 -10990566 -10917515 -11501593 -11295230
492 -11295230 -10767469 -10542975 -10770497 -11138134 -10971139 -10742834 -10938284 -11014237 -11208519 -11695914 -11659241
481 -11659241 -11469242 -11555241 -11649184 -11380147 -11979018 -11527854 -11543448 -11767005 -11660726 -10047306 -10863671
470 -10863671 -10320795 -10414705 -10994853 -10392282 -10228906 -10312165 -10281982 -10171460 -10226956 -10371038 -10325642 -10300729
458 -10300729 -11107492 -10989489 -10279745 -10772327 -10904173 -11050244 -10737498 -10259222 -10433250 -10794788 -10861676
447 -10861676 -10558972 -10494799 -10407633 -10482661 -10317161 -10230042 -9954256 -9492387 -10143290 -9670299 -10088808
436 -10088808 -10025141 -10598063 -10941351 -10394031 -10202424 -10689405 -10556087 -10803458 -10275062 -11744044 -11499547
425 -11499547 -10163189 -10269360 -10651833 -10010191 -10058960 -9690328 -9400903 -9915729 -9611162 -10307690 -10048654
414 -10048654 -10204530 -10462924 -10709973 -9261263 -10901837 -10585050 -11286421 -10893044 -10676891 -10271865
404 -10271865 -10221069 -10609808 -10980727 -10530790 -9770940 -10193908 -10351307 -9465587 -9712159 -10355600 -10524951
393 -10524951 -10033301 -10307562 -10891006 -9970709 -10143620 -10430536 -10473533 -10142739 -10517231 -10451267 -10398143
382 -10398143 -10551260 -11322939 -10941897 -10593037 -10789089 -10742197 -11130404 -11461009 -11807270 -11463814 -10856100
371 -10856100 -11179008 -10867749 -10712493 -10754270 -10198270 -9879184 -10894901 -11208619 -11255333 -11062503 -11061208
360 -11061208 -11484849 -10930379 -10665066 -10408220 -10317132 -10477341 -10721184 -10901315 -10948419 -11089070 -10742470
349 -10742470 -11090775 -10521076 -11040766 -11165726 -11372285 -11155989 -10962055 -10732472 -10309288 -10622705 -11190563
338 -11190563 -10794208 -10484176 -10366209 -10492679 -10851715 -10451827 -10035524 -9927503 -9856805 -10262420 -10247212
327 -10247212 -10338805 -9404804 -9557627 -10052875 -10633235 -11142902 -10299965 -10596196 -10625165 -11191793 -9935465
316 -9935465 -10468947 -10265269 -10671530 -10053177 -9727973 -9839299 -9463494 -10026603 -9556953 -9143970 -9117638
305 -9117638 -9187014 -9711159 -10726524 -9607308 -9208266 -9781990 -10108006 -10413955 -10237172 -11219109 -10580472
294 -10580472 -10054336 -10173160 -10596527 -10288127 -10437612 -10190343 -11162027 -10393482 -10354852 -10362621 -9946568
283 -9946568 -9223059 -9593008 -10085301 -10410034 -9958623 -9988715 -10013108 -9909657 -9880407 -9687321 -9691830 -10099680
271 -10099680 -10086542 -9849558 -10471302 -10396465 -9897649 -9770735 -9843893 -10784525 -11117266 -10695846 -10020786
260 -10020786 -10532775 -10474012 -9899929 -10278482 -10230464 -9999129 -9217949 -9876066 -10150822 -10419166 -9944883
249 -9944883 -10679703 -10484464 -9844864 -9396197 -10753471 -10124643 -9431806 -9270638 -9881268 -10130863 -9997063
238 -9997063 -9575360 -9787175 -9931511 -9501631 -9569761 -10114529 -9741368 -9676742 -9393147 -9730244 -9744616
227 -9744616 -10396332 -9088478 -9599024 -9571381 -9677735 -9513408 -9393871 -9784558 -9131343 -10058733 -10234828
216 -10234828 -10538451 -10198202 -9683089 -9674056 -9497883 -9638224 -10320070 -10782104 -9863745 -10107234 -9857254
205 -9857254 -9860389 -9970457 -10084655 -9778238 -10180207 -10085348 -11941615 -10218393 -10474650 -10777739 -9793713
194 -9793713 -9303327 -9952310 -9801425 -9276817 -9252120 -9183473 -9596453 -10029678 -10229772 -9583946 -10173928
183 -10173928 -10105522 -9658929 -10159695 -12167191 -11614391 -10568580 -10436382 -10208982 -10486953 -9622497
173 -9622497 -10338760 -9654062 -10275518 -9749102 -10330431 -9909907 -9775668 -9718976 -10196863 -9717274 -10520973
162 -10520973 -10757506 -9635968 -10013042 -10341961 -10378434 -10012248 -10035185 -10395335 -9520498 -9815982 -9667446
151 -9667446 -9734867 -10349053 -10385094 -9963304 -10405806 -10211758 -10123733 -10307843 -9927175 -9984256 -9975918 -10221087
139 -10221087 -10210667 -10458313 -10342360 -10317100 -10333135 -10372730 -10125707 -10314753 -11151514 -10958662 -9126871
128 -9126871 -10525906 -10588641 -10076917 -10595794 -10597156 -9882495 -10084577 -9618263 -9955318 -9937757 -9905294
117 -9905294 -9245714 -9782393 -10019006 -9309491 -9311027 -9858209 -9404542 -9603939 -9814076 -9644779 -10486680
106 -10486680 -9869177 -9517321 -10469289 -10625331 -9985811 -10231012 -9594414 -10527493 -9971647 -10068688 -10417120
95 -10417120 -10406347 -9948407 -10224975 -10217631 -9656992 -9728879 -10148677 -9451074 -9882692 -9854358 -9759870 -10021080
83 -10021080 -10321763 -10117946 -10237591 -10220426 -10320219 -10694362 -10729856 -10267906 -10534445 -10529429 -10320450 -10158657
71 -10158657 -10360746 -9740227 -9991312 -10287890 -10037967 -9826192 -9778059 -10311606 -10469741 -10039535 -10050486
60 -10050486 -9766737 -10113315 -10478706 -10448717 -10555595 -11209988 -10198723 -10331312 -10991655 -10321921 -9950312
49 -9950312 -10537939 -10422008 -9909961 -9469365 -9863023 -9984235 -9781896 -10120479 -9905125 -9463507 -10010044
38 -10010044 -9731338 -9960490 -10752164 -10451158 -9956393 -10487230 -9904352 -9596165 -10072080 -9664488 -10339268
27 -10339268 -9567793 -10145849 -10018466 -9886045 -10435985 -10566029 -11912483 -10919708 -10471756 -10268313 -9735453
16 -9735453 -10029189 -10154016 -10260063 -10624538 -10867163 -10734634 -10436642 -9915376 -10658009 -10090870 -10487170
5 -10487170 -10183663 -10483552 -10601591 -10337424 -10649939 -10545436 -10914463 -10356670 -10426814 -11111824 -11594615
-6 -11594615 -11204190 -10470172 -10812445 -10541781 -10188079 -10424174 -10331919 -10612287 -11004909 -10506317 -10671861
-17 -10671861 -10363160 -9522087 -9946113 -9770234 -10447942 -10192876 -10126373 -10536792 -10466792 -10415692 -10631106
-28 -10631106 -10300624 -10371829 -11219084 -10169452 -10659238 -10697202 -10776861 -9733402 -10952688 -10097021 -10638247
-39 -10638247 -11347508 -10620561 -10669934 -10135086 -9770512 -10201119 -10356195 -10728114 -10568480 -10864023 -10451418
-50 -10451418 -10163181 -10512778 -10982851 -10406935 -10073253 -10357600 -10561606 -10067618 -10464301 -10562851 -9964990
-61 -9964990 -10374534 -10800353 -10817662 -10661463 -10685779 -10560588 -10406602 -11092414 -11187457 -10963662 -10354037
-72 -10354037 -10757963 -10441570 -10964745 -10964100 -10243828 -10600694 -10868388 -11275401 -10980821 -10773948 -11054999
-83 -11054999 -10817816 -10791457 -10618539 -10613787 -10542960 -10885593 -11142475 -11140509 -11556267 -11116411 -10161620 -10445915
-95 -10445915 -10916686 -10578197 -11021741 -11176678 -11052925 -10848466 -10659711 -10777486 -10206690 -10528226 -10596841
-106 -10596841 -10648117 -10389706 -10951417 -10309197 -10083491 -10712300 -10494685 -10858408 -11338423 -11038991 -10723625
-117 -10723625 -10834301 -10867647 -11217747 -10474775 -10612316 -10811215 -10229635 -10911066 -11152544 -10833871 -10155158
-128 -10155158 -9876238 -10204023 -10077114 -9835116 -10182566 -10442476 -10260124 -9895851 -10283746 -10879714 -10955281
-139 -10955281 -11131122 -11148788 -10459784 -10058333 -10363618 -11235872 -10776672 -10248308 -10612538 -10557561 -10664368
-150 -10664368 -10037924 -9286645 -10170731 -9847988 -10328568 -10006991 -10140223 -10605678 -10013701 -10602647 -10525091
-161 -10525091 -10271710 -10403307 -9724096 -10136434 -10380052 -10187248 -10597066 -10006189 -10199804 -10494796
-171 -10494796 -10325763 -9919471 -9440124 -10200111 -9796968 -9619790 -10699541 -11198817 -10833575 -10030294
-181 -10030294 -10547458 -10691206 -11375049 -11705431 -11191165 -10732785 -10331747 -10777604 -10367670 -9906609
-191 -9906609 -10162476 -10560830 -10505499 -10069335 -10233620 -9949424 -9879125 -9550035 -10217400 -10681302 -9748514
-202 -9748514 -9874150 -10034517 -10262171 -10383090 -10947823 -10872396 -10738877 -10661736 -10885831 -10429814 -9567252
-213 -9567252 -10013452 -10362938 -10499993 -10649907 -10824949 -12271751 -10707789 -10833763 -10714291 -10944270
-223 -10944270 -10012143 -10553245 -10539528 -10128172 -8994765 -10131046 -10718659 -10179583 -10606109 -10659625 -10665694
-234 -10665694 -11169351 -11237996 -10628770 -10248272 -10380628 -10518491 -10443865 -10640784 -10712551 -10976550 -10694917
-245 -10694917 -10041767 -11074397 -11030348 -10679070 -10743819 -10918063 -11568327 -11023321 -11119278 -11229298 -11559916
-256 -11559916 -11344894 -10765003 -10423429 -10451137 -10307301 -10452481 -10495625 -10017476 -10634292 -10666766 -10511379
-267 -10511379 -10011080 -9923686 -10534570 -10868101 -10381031 -10520588 -10608801 -10667020 -10610652 -10789858 -10190848
-278 -10190848 -10994837 -11259271 -10497591 -10600435 -10200742 -9994497 -10392444 -9629945 -10337669 -10536212
-288 -10536212 -10179733 -10881299 -10652907 -10363537 -10678537 -10674779 -10936808 -10973169 -10269168 -9673012 -10496435
-299 -10496435 -10811657 -10130670 -10325274 -10465442 -10164135 -9712046 -10506936 -10684751 -10265431 -10777593
-309 -10777593 -10090374 -9995464 -10478366 -11021339 -10880968 -10870565 -10252816 -9658187 -9580798 -10307322 -10599445
-320 -10599445 -10734644 -11078850 -10486313 -10934581 -10825723 -10643408 -10520822 -10276373 -11280039 -10313571
-330 -10313571 -9772676 -11294763 -11537499 -12086970 -11138329 -10817418 -11079637 -10854825 -10547496 -10452010
-340 -10452010 -11400939 -11060640 -10625780 -10999214 -11230556 -10858117 -11268118 -11285183 -11576093 -11203038 -11077854
-351 -11077854 -10707821 -10734856 -10438303 -11288476 -10722789 -11068254 -10973974 -11139223 -10350810 -10324606 -10911008
-362 -10911008 -10768811 -10491555 -10266067 -10437901 -10698562 -10311299 -10561177 -9828805 -9876215 -9702184 -9415301
-373 -9415301 -10560349 -10134119 -9641225 -10003995 -10040608 -10671517 -10084160 -10133828 -9859752 -11119083 -10591200
-384 -10591200 -10038095 -10105657 -10506778 -11164428 -10354374 -10267415 -9918116 -10213172 -10923907 -10500303 -9670116
-395 -9670116 -10574955 -10557897 -10692759 -10479426 -10843517 -10986560 -11407730 -10846940 -10302182 -10653225 -11150863
-406 -11150863 -10329960 -10453890 -10100728 -10046585 -9761390 -10200989 -10088812 -11269208 -10822086 -10948419
-416 -10948419 -10533793 -10488320 -10617787 -11066132 -10679879 -10736114 -11408463 -11261824 -11038666 -11710081 -10812919
-427 -10812919 -11284480 -10445149 -10741329 -10396832 -10118948 -10974854 -10395469 -10456065 -10932965 -9979484 -10123982
-438 -10123982 -10644298 -10180872 -10935170 -13011159 -11996472 -11576549 -11687184 -11233832 -11550141 -11291067
-448 -11291067 -11013430 -10856843 -11112886 -11148759 -10880974 -10885892 -11330401 -11241918 -11329087 -11295812 -11139909
-459 -11139909 -10429865 -10609931 -10710669 -11360011 -11020914 -11558759 -11415344 -10971055 -10982785 -10952944 -10978646
-470 -10978646 -10916839 -10583208 -10635399 -10884653 -10772162 -11507644 -11261139 -10937283 -11402816 -11551760 -11674052
-481 -11674052 -11179250 -10641719 -11064620 -10758818 -10914522 -11135885 -11266748 -11085715 -10629260 -11182806
-491 -11182806 -11052216 -10845905 -10724507 -10531474 -10915472 -11461647 -11381772 -11466187 -11412005 -11473149 -10971007
-502 -10971007 -11177604 -11332952 -10881849 -11049115 -11687181 -10834318 -10909803 -11232564 -11526321 -11358417 -11880993
-513 -11880993 -10540882 -10689886 -11496927 -11276924 -11271133 -10704835 -11157417 -10783894 -10588846 -11338172 -11403840
-524 -11403840 -10822725 -11047058 -11026257 -10526487 -10996944 -10486717 -11161024 -11418603 -10204851 -10408856
-534 -10408856 -11036332 -10975236 -11206390 -10820527 -10901095 -10910518 -10989288 -11068618 -10687813 -10930712 -10366717
-545 -10366717 -10860412 -11533977 -11054076 -11126699 -11166538 -11648271 -11475456 -11087109 -10072736 -10890990 -11286549
-556 -11286549 -10506557 -10805385 -11367853 -10978821 -10568713 -11038966 -11038552 -10420038 -10862153 -11017966 -10991425
-567 -10991425 -11034560 -11180279 -11479708 -12189128 -11515870 -11313230 -11659316 -10869699 -11104672 -11138667 -11289431
-578 -11289431 -10980064 -11043608 -11116112 -11132949 -10411423 -10660414 -10664704 -10750904 -11529633 -11253014 -11155502 -10629551
-590 -10629551 -10498513 -11448821 -11267662 -10772829 -11161402 -11576669 -10918606 -10756523 -11117064 -11548617
-600 -11548617 -10579235 -10485548 -10837896 -10770306 -10607184 -10256324 -10602543 -10672183 -10753480 -9823059 -10167225
-611 -10167225 -10021229 -10168227 -10332870 -9887710 -12002660 -10892929 -10736182 -10330232 -11300357 -10859705
-621 -10859705 -10294837 -11055484 -10748440 -10960352 -11033091 -11312708 -11663477 -11149510 -11212448 -11274576 -11223207
-632 -11223207 -10372905 -10683842 -10939409 -10463067 -11616439 -11065263 -10782531 -10372832 -10843211 -11550279
-642 -11550279 -10910154 -10993973 -10606103 -10463466 -10900746 -10929300 -11014145 -10632684 -10809173 -10521773 -10852191
-653 -10852191 -10586773 -10547765 -10605738 -10426866 -10395186 -10430700 -10645529 -10267922 -10749896 -10705860 -10291673
-664 -10291673 -11219284 -11008613 -10578727 -10986895 -10542842 -11063502 -11093467 -10859753 -10794464 -12242000 -11620171
-675 -11620171 -11583572 -11179060 -11344776 -11070954 -11016885 -10721322 -10761468 -11066641 -10706439 -10319694 -10356279
-686 -10356279 -10782832 -10933691 -11251533 -11272941 -10861895 -11219552 -10838466 -10646780 -10380571 -10765241 -11352475
-697 -11352475 -10952275 -11899446 -11326488 -10986728 -10873507 -11917970 -10608125 -10306987 -10865942 -11346503
-707 -11346503 -10981626 -10395643 -9905406 -10359082 -10750071 -10438418 -10482807 -10909311 -12852338 -13461178
-717 -13461178 -11675117 -11918276 -11819957 -11620972 -11342212 -11494420 -11462260 -10916913 -10824938 -10844088 -10888530
-728 -10888530 -11234256 -11131975 -11175689 -11302821 -11513949 -10908836 -10483381 -11370147 -10765872 -10563830 -10963235
-739 -10963235 -10352435 -11043334 -11048685 -10903438 -10678222 -10168634 -10717110 -10756313 -10621675 -10679298 -11026080
-750 -11026080 -11159990 -11357238 -11045766 -10788968 -11114553 -11221198 -11632465 -11146400 -11117984 -11111768 -10528441
-761 -10528441 -10548222 -10551782 -10436795 -10695736 -10892986 -10525590 -11313612 -11167658 -10968516 -11068869 -10938015
-772 -10938015 -10162975 -10880523 -10294891 -10684917 -10778827 -10160919 -11271556 -10781044 -10098546 -10160489 -10638917
-783 -10638917 -10862809 -10472973 -10671126 -10389107 -10785862 -11166057 -11326096 -10857743 -11427644 -11786011
-793 -11786011 -11117991 -11293468 -11314934 -10902385 -11238415 -11166599 -10449633 -10747911 -11054215 -11073171 -10616598
-804 -10616598 -11010594 -10440344 -10880548 -11019352 -11337551 -10983281 -10937768 -10961574 -11321557 -10989774 -10752841
-815 -10752841 -11002292 -10704061 -10796795 -10759708 -10680080 -10941851 -10937503 -11101114 -11085167 -10709412 -11128785
-826 -11128785 -11409673 -11412530 -11235735 -11103226 -11145985 -11007088 -11193083 -11033206 -11255464 -10730660 -10612096
-837 -10612096 -10188696 -10731441 -11171032 -10973980 -10948407 -11179647 -10480847 -10461014 -10574050 -9884639 -10423130
-848 -10423130 -10825475 -11143989 -10898983 -10654545 -10864184 -10807752 -11741366 -11402577 -11098676 -11131787 -11333087
-859 -11333087 -11035696 -11139748 -11619954 -10983167 -10674092 -11238280 -10820987 -10901316 -11578674 -11339208 -11242768
-870 -11242768 -10800710 -10636560 -10902201 -10878028 -10758680 -10615223 -10678314 -11990680 -11115433 -10851045 -10916099
-881 -10916099 -10890887 -11053488 -10964537 -10489648 -10368284 -10328205 -10920021 -11117843 -10979404 -10926621 -10817219
-892 -10817219 -11134147 -10639812 -10651270 -10462702 -11814991 -11060228 -11253970 -11547353 -11040160 -10255729
-902 -10255729 -10691297 -10590516 -10596362 -10059478 -10400196 -10248566 -10329150 -10792337 -10972833 -10739651 -10792347
-913 -10792347 -11367221 -10661734 -10592902 -10593106 -10761827 -11085558 -11048066 -11488778 -11321680 -10847910 -10723878
-924 -10723878 -11002180 -11130522 -10849114 -10794452 -10620877 -10544706 -10284440 -10830859 -10576112 -10546741 -10643426
-935 -10643426 -9751465 -11146860 -11265528 -11387544 -10669706 -10441946 -11012542 -11182253 -11177389 -11189468 -11024900
-946 -11024900 -11088456 -10812566 -11022291 -11605235 -12231411 -11586657 -11346593 -10880367 -10999430 -10777522 -10820634
-957 -10820634 -11221490 -10757133 -10812036 -10473424 -11247961 -10974773 -10465224 -10979817 -10965401 -11053403 -10918779
-968 -10918779 -11356018 -10972341 -10901058 -11263439 -11375286 -10863780 -10833838 -10691026 -11168835 -11451026 -11245772
-979 -11245772 -11664007 -11303284 -10714691 -11016992 -11318247 -10757026 -10559665 -11303168 -11292592 -11513705 -11296663
-990 -11296663 -10942034 -11498330 -11468891 -10466386 -10589781 -10961358 -10836692 -10356706 -10792769 -10843517 -11003103
-1001 -11003103 -11304609 -10792474 -10820325 -10973379 -11213469 -11180792 -10545934 -11230218 -12549286 -11241687
-1011 -11241687 -10787640 -11109674 -11908464 -11878411 -11523566 -10980662 -10892246 -10746073 -11172210 -11032719 -11006481
-1022 -11006481 -10679145 -11135404 -11556700 -10800762 -11279109 -11438094 -11714302 -11429219 -11192943 -12095124
-1032 -12095124 -12107288 -11684524 -11459380 -11587189 -11926196 -11820289 -11425799 -11827776 -11559158 -10236954
-1042 -10236954 -11134096 -11240737 -11376891 -11702757 -10899313 -10730818 -10729477 -11024025 -11097695 -11621430 -11506408
-1053 -11506408 -11572381 -11047926 -10777204 -11106046 -11729161 -11361503 -11806507 -10769805 -10987268 -10893659
-1063 -10893659 -11019884 -10589802 -10853393 -10856706 -10642919 -10529791 -10674594 -11206108 -10751563 -11395429 -11760904
-1074 -11760904 -11342610 -11044186 -11067630 -11382005 -11243258 -10916759 -11333089 -10869531 -10846814 -11299396 -11212326
-1085 -11212326 -11435427 -11059851 -11094241 -11110338 -11697468 -11534942 -10081524 -10417615 -11075218 -11260650
-1095 -11260650 -11019080 -10873597 -11259695 -10886781 -10911957 -11346497 -11000949 -11029644 -11047625 -11169418 -10550305
-1106 -10550305 -10752496 -11324447 -10641133 -9407252 -10687218 -10668235 -10840108 -11276440 -10685668 -11041845
-1116 -11041845 -11065121 -11295207 -11187744 -10922333 -11449925 -11379937 -10890760 -10521602 -11327849 -11091887 -10826905
-1127 -10826905 -11102790 -11768248 -11519266 -11863088 -10864064 -11147356 -11737395 -11661584 -11047378 -11196715
-1137 -11196715 -11059275 -11224758 -11199713 -10854517 -11174220 -11220227 -10947485 -11624686 -11895621 -11390426 -10622826
-1148 -10622826 -11170745 -11421608 -10724841 -10532806 -10778957 -10149835 -12051984 -10831839 -11220250 -11457199
-1158 -11457199 -10918722 -11068622 -11138301 -10846645 -11265748 -11395038 -10827554 -11035892 -11499036 -11246053
-1168 -11246053 -11469070 -11903064 -11777834 -10777649 -10285757 -11308731 -10966823 -11808017 -11225127 -10816934
-1178 -10816934 -11694247 -10620050 -10737147 -10272047 -11887960 -10908165 -10712344 -11589716 -11024267 -11362711
-1188 -11362711 -10597996 -10368214 -10700858 -11150246 -11081664 -10712703 -11058777 -11073769 -11262447 -11443776 -10698412
-1199 -10698412 -11558317 -11685516 -10228598 -10609462 -11248406 -11518724 -11141106 -11382481 -11383317 -10864347 -11612615
-1210 -11612615 -11136750 -11116702 -10840373 -10674755 -11078696 -11156555 -11163456 -10948178 -11382618 -10976595 -11339994
-1221 -11339994 -11198929 -11073533 -10835610 -10527369 -10746977 -10773042 -11347738 -11360461 -11215365 -11729875 -10810537
-1232 -10810537 -11620006 -11338234 -11181550 -11305376 -11584724 -11602767 -10813427 -10834283 -10755786 -11049263 -11084066
-1243 -11084066 -10947994 -11866857 -11102953 -11136061 -10863970 -10945115 -11044796 -10950551 -11013439 -11426840 -11423079
-1254 -11423079 -11856796 -10840571 -11690932 -10562211 -11291795 -10950378 -11402814 -11753730 -11468118 -11479221
-1264 -11479221 -11357228 -11268294 -11242195 -11265311 -12245850 -10721198 -11245129 -10767904 -11423047 -11658283 -10715029
-1275 -10715029 -10820461 -10720500 -11084462 -10819443 -10601901 -10905579 -10736240 -10996082 -11555311 -11591000 -11030790
-1286 -11030790 -11473014 -10544653 -11211323 -10682785 -11368621 -10997622 -11221003 -10970413 -10825338 -11631429
-1296 -11631429 -11185369 -10650612 -10802421 -10801681 -11243472 -10868026 -10958970 -11070426 -11000762 -10952182 -11537462
-1307 -11537462 -10677149 -10881186 -11034720 -10984789 -10839909 -10738002 -11086568 -10809283 -10634250 -10698568 -10837231
-1318 -10837231 -11393793 -10907436 -10800205 -11297186 -10783653 -10827135 -11405518 -10965420 -11044408 -11536937 -11079588
-1329 -11079588 -10625804 -11330997 -11073855 -11180005 -10916163 -11471008 -11056719 -10527706 -10624449 -10841153
-1339 -10841153 -11264220 -11108733 -11005867 -11003027 -10541230 -10476768 -11100888 -11521755 -11136411 -11168737 -11254660
-1350 -11254660 -10985835 -11191645 -10988270 -11088288 -10568861 -10606050 -10240070 -11065968 -11248836 -10639196
-1360 -10639196 -11004146 -11502928 -11862214 -10819908 -11179164 -11343299 -10874318 -11167765 -11419204 -11286553
-1370 -11286553 -10987463 -11517724 -11253576 -11054172 -10950947 -11587677 -11780889 -11055801 -11204431 -11707433
-1380 -11707433 -11100030 -10695950 -10616150 -10993402 -10807956 -11397813 -11317348 -11287791 -11258595 -11363247 -11218532
-1391 -11218532 -11221096 -11140092 -10942297 -11218423 -11492772 -11349242 -11442722 -10786582 -10901970 -11088891 -11131468
-1402 -11131468 -11226331 -11093995 -11524337 -10763435 -10896143 -11051589 -11783714 -12265191 -10600418 -10421776
-1412 -10421776 -10265635 -10346846 -10894676 -10557603 -11229181 -11679673 -11079090 -11289441 -11779452 -11364173 -11419037
-1423 -11419037 -11055692 -11462765 -11186567 -10803921 -11416295 -11543548 -10846953 -10814737 -11351197 -11184974
-1433 -11184974 -11623964 -11818151 -8495521 -10537083 -11131533 -11265507 -11681267 -11516608 -11548357 -11366697
-1443 -11366697 -11173868 -10975323 -10024287 -11650097 -11230504 -11250741 -11397011 -11129448 -11284286 -10706570
-1453 -10706570 -10012031 -10656141 -11238481 -11391048 -11161668 -11248669 -11549062 -11299365 -11875951 -11310722
-1463 -11310722 -10863400 -11440622 -11127884 -11804146 -11238191 -10884305 -11065867 -10573926 -8697786 -11059180
-1473 -11059180 -10748389 -10722339 -11121564 -11191017 -11114880 -10917273 -11398958 -11157418 -11616925 -11579148 -11338973
-1484 -11338973 -10163679 -12576592 -11333146 -11148604 -11034297 -10629653 -10544774 -10480200 -11364440 -11220892
-1494 -11220892 -11436822 -11171183 -11300951 -11313345 -11002007 -10663898 -10784443 -10809354 -11446564 -10416902
-1504 -10416902 -11523306 -11322547 -11396888 -11478498 -10699572 -10915411 -10351901 -11116890 -11596404 -11379447
-1514 -11379447 -10894598 -10887695 -10912371 -11261125 -11095572 -10742086 -10909538 -11175937 -11566335 -11224347 -10995149
-1525 -10995149 -10712037 -11578816 -11198416 -10516183 -10738180 -10863094 -10505732 -11348005 -11682945 -11615387
-1535 -11615387 -13337307 -12151063 -11572467 -11332966 -11427501 -11083291 -11053304 -11334681 -10866822 -10748117
-1545 -10748117 -10611133 -11230075 -11108487 -10833446 -11604250 -11437747 -11483417 -11660751 -11826282 -10671072
-1555 -10671072 -9815424 -10376934 -10803740 -10775859 -10909364 -10632149 -10903816 -11513118 -11713685 -11279715
-1565 -11279715 -10932219 -10985559 -10980089 -10288654 -11025754 -11153994 -10723552 -10975179 -10761287 -11526772 -11349680
-1576 -11349680 -11548182 -11222556 -11052283 -10914999 -11066641 -11032112 -10818850 -10891318 -11306365 -11093950 -10908253
-1587 -10908253 -11115216 -10560613 -10582368 -10607776 -10899660 -11158701 -10883433 -11357561 -11217773 -10777414 -11045185
-1598 -11045185 -11169937 -10884071 -11186225 -11665732 -10920009 -11466580 -11326562 -11552552 -12244780 -13651554
-1608 -13651554 -11195566 -9623771 -10735259 -11106848 -10769693 -10895755 -10784789 -10364276 -10800097 -11539863
-1618 -11539863 -11177105 -11329597 -10766265 -10724172 -11033320 -10602884 -11106361 -11066682 -11224719 -11124485 -10778088
-1629 -10778088 -10198506 -10620600 -10858383 -11259680 -11200428 -10905349 -11311414 -11101417 -11057917 -10963683 -10880323
-1640 -10880323 -11256609 -10719590 -10497046 -10333457 -10581343 -10681378 -10424995 -10466741 -10005702 -11385366
-1650 -11385366 -11106333 -11057123 -10912828 -11060045 -11497932 -11571892 -11576439 -11352256 -11194556 -11575137 -11584364
-1661 -11584364 -11666001 -11272047 -10269443 -10878684 -11053628 -11280718 -11829869 -11652444 -10945225 -11286195
-1671 -11286195 -11135837 -11357369 -10868636 -11009775 -11046944 -11547032 -10958991 -10854006 -10746743 -11491787
-1681 -11491787 -10962005 -11055756 -10633384 -10888017 -10848467 -10873744 -10914127 -10512985 -10836873 -10897899 -11243868
-1692 -11243868 -10685214 -11362884 -11561239 -11129646 -11637752 -11350839 -10944160 -10996688 -11399342 -10451991
-1702 -10451991 -11318791 -11022782 -10968929 -10860344 -11050724 -10733189 -11183842 -11493993 -10847511 -10529878 -10500619
-1713 -10500619 -11132934 -11543506 -11099138 -11693759 -10869067 -10586614 -10689207 -11571510 -11258998 -11230463 -11130734
-1724 -11130734 -10718899 -10972493 -11047763 -10752407 -10784475 -11525347 -11503650 -11063476 -11302775 -11010416 -11016122
-1735 -11016122 -10674758 -11200273 -11337969 -11346703 -11163944 -11112046 -10755474 -10810061 -10824166 -11237969 -11048753
-1746 -11048753 -11009505 -11330950 -10789079 -10702268 -11210298 -10782771 -10588647 -11235430 -10887378 -10617746 -11385938
-1757 -11385938 -11220143 -11303337 -11085526 -11365677 -11745779 -11036854 -10512856 -10607794 -10825823 -11264882 -10875988
-1768 -10875988 -10816939 -10968074 -10955782 -11223955 -11442728 -10715105 -11052769 -11049617 -11192808 -11053804 -10622679
-1779 -10622679 -10966165 -10746987 -10585375 -11455292 -11037688 -11282493 -11602808 -11563284 -10582737 -10708583
-1789 -10708583 -11012141 -10810911 -11101784 -11019691 -11201383 -11200353 -11580747 -10861978 -11677672 -11057877 -11463189
-1800 -11463189 -11706044 -10238877 -10800750 -10991929 -11266585 -11120672 -11075832 -11262139 -10968906 -10877977 -10789996
-1811 -10789996 -10050588 -11014782 -11435179 -10750413 -11100465 -10936962 -10755224 -10991719 -10850038 -11345869
-1821 -11345869 -10788579 -10782079 -10740151 -11169157 -10855575 -11923449 -10995446 -10927290 -11512858 -11303437 -11462495
-1832 -11462495 -11587410 -11226319 -11652024 -11432594 -10621921 -10568992 -11085937 -10391955 -10728875 -11122008
-1842 -11122008 -10777474 -9867254 -9989357 -10533952 -11573229 -11360084 -12127182 -11286775 -9586059 -10569150
-1852 -10569150 -10859565 -10955087 -10940507 -10949696 -11074214 -11092050 -11345466 -11384760 -11142113 -11145468 -11127598 -11324927
-1864 -11324927 -11211363 -11336518 -10892634 -11258261 -10901669 -11139480 -11014057 -10986971 -10675036 -10412735
-1874 -10412735 -10808547 -10874886 -10670481 -11101582 -11086997 -9974561 -10653764 -10875447 -10350768 -10879109
-1884 -10879109 -10469415 -10577550 -10564759 -10987571 -10648970 -11110386 -11414337 -10783178 -10829957 -11433736 -11425554
-1895 -11425554 -11094468 -10925869 -10698273 -11020687 -11295893 -11248695 -11007776 -10894340 -10930667 -10667092 -10781364
-1906 -10781364 -10656487 -11198401 -11898888 -10569389 -10440994 -10887450 -10698491 -10907303 -11440328 -11052717
-1916 -11052717 -11076980 -10854298 -10650223 -10657363 -10795272 -10917088 -11091733 -10726916 -11750429 -11548525 -10997606
-1927 -10997606 -11063422 -11426043 -11075112 -11119771 -11025773 -11227597 -10822331 -10802472 -10776810 -10649342 -10706726
-1938 -10706726 -11113911 -11168353 -10587751 -11003317 -10651084 -11103918 -10562088 -11140539 -11497917 -11070029
-1948 -11070029 -10304875 -10465378 -10677353 -10716598 -10176988 -10411677 -10723097 -10946261 -10914133 -11026659 -11343340
-1959 -11343340 -10950167 -10965268 -10610880 -10610931 -10478738 -10497022 -11267302 -10692391 -10746147 -11107286 -11331234
-1970 -11331234 -10713643 -10320053 -10364483 -10866169 -10751327 -11563211 -11048099 -10224814 -10905598 -11175200
-1980 -11175200 -11817504 -11253868 -9942578 -10540401 -10388577 -10455724 -10915160 -11000999 -11057713 -11272978 -11384424
-1991 -11384424 -11326502 -10812318 -11176122 -11536897 -11187767 -11348346 -10840577 -11211986 -11839533 -11543206 -11512039
-2002 -11512039 -11615347 -11173686 -11162208 -11338001 -11489671 -11696141 -11229551 -10864589 -11505290 -10845480
-2012 -10845480 -11008075 -11510796 -11695245 -11106722 -11372985 -11483097 -11679098 -10892838 -11295576 -11656389
-2022 -11656389 -11913050 -11536412 -11643194 -11296286 -11036524 -11289516 -11329627 -11273265 -10835335 -10028192 -10570195
-2033 -10570195 -10530277 -10902113 -11245539 -10507544 -11517738 -11640165 -10950577 -11330416 -11792021 -11259927
-2043 -11259927 -11123563 -11347406 -10891644 -11297534 -11340189 -11435623 -11598552 -11429751 -10911057 -11318020 -11143959
-2054 -11143959 -11772721 -11982713 -11497727 -10966563 -11342789 -11677087 -11161753 -11428625 -11585143 -11380867
-2064 -11380867 -11148913 -11310707 -11522218 -11263502 -11429872 -11866807 -11945681 -10893054 -11272586 -10832189
-2074 -10832189 -11156063 -11322811 -11430319 -11239117 -11092367 -11147992 -10826956 -11714206 -11452500 -10986034
-2084 -10986034 -11096180 -11371265 -10940368 -10777061 -10880643 -10971720 -11610316 -11332481 -10614907 -10594928 -11322601
-2095 -11322601 -11110154 -11246224 -10989247 -10401973 -11081109 -11413546 -11228693 -11179026 -11941249 -10727336
-2105 -10727336 -10851314 -11270064 -12116258 -11147765 -10664433 -11380459 -10793079 -11421176 -10872695 -11087955
-2115 -11087955 -10704045 -11267866 -11518661 -11023194 -11108219 -10859412 -11011850 -10252724 -10512728 -10538614 -11468069
-2126 -11468069 -11678464 -11496690 -11293632 -11235680 -11522373 -11222606 -11267984 -10989464 -10574645 -10097654 -10485683
-2137 -10485683 -10118937 -10431926 -11058380 -10906500 -10449313 -10702917 -10589619 -10837453 -10425286 -10520556
-2147 -10520556 -10888729 -11362505 -10799225 -11175440 -10636450 -10423491 -10507947 -11318316 -11249264 -10825962 -10888833
-2158 -10888833 -10388695 -10447482 -9968792 -10588576 -11218435 -11218774 -11178681 -11487236 -11060991 -11742336 -11383676
-2169 -11383676 -10938448 -10973901 -11254087 -11739249 -11026102 -11586937 -10768047 -10711616 -10994759 -11067367 -11179681
-2180 -11179681 -10630237 -10574440 -10673806 -10247725 -11225719 -11288860 -11127131 -10992516 -11679786 -11551984 -10803478
-2191 -10803478 -11108521 -11461721 -11245363 -10955930 -10957904 -11434420 -11092405 -11158963 -10446876 -10817893 -11071497
-2202 -11071497 -11377929 -11061770 -11456561 -10984781 -11167134 -10635104 -11311199 -11325579 -11433322 -11184204
-2212 -11184204 -10991618 -10843326 -10744977 -11374602 -11442547 -11188170 -11391007 -10891911 -11150385 -11184707 -11372090
-2223 -11372090 -11390416 -10807725 -10901217 -10875065 -10447119 -9767398 -10515549 -11847766 -10957331 -11029713 -11166737
-2234 -11166737 -10813582 -11323351 -11139350 -9999366 -10103569 -10588583 -11039967 -11401169 -11199729 -11000357
-2244 -11000357 -11446665 -11298221 -10781531 -11057677 -10429543 -11070158 -11483648 -10807250 -10906700 -10603671
-2254 -10603671 -10977907 -10836423 -10746997 -10704891 -11224375 -10561378 -11072274 -10977085 -10780871 -10974486 -10799329
-2265 -10799329 -11180656 -11209083 -10870088 -11033897 -10854546 -11358777 -11947834 -11717106 -10935919 -11332984
-2275 -11332984 -11154726 -10527786 -11174468 -11269708 -10797031 -10702723 -11650608 -11403150 -10640515 -11509042 -11377329
-2286 -11377329 -11037530 -11223886 -11268733 -11132373 -10879725 -10886519 -10594703 -10570149 -11400067 -10990336 -11112449
-2297 -11112449 -11544563 -12027234 -11383089 -10988738 -11239784 -11366208 -11022213 -10874900 -11252759 -10856730
-2307 -10856730 -11174834 -11269422 -11087076 -10700519 -10857093 -10307890 -10876717 -11133546 -11150527 -10871913 -11117965
-2318 -11117965 -10870052 -10704643 -10644022 -11266475 -10745927 -11469421 -11601665 -11083680 -10099089 -11087433
-2328 -11087433 -11580796 -11009397 -10520838 -11593782 -11022019 -11005058 -11234419 -11152522 -11668120 -11162282
-2338 -11162282 -10878850 -11620381 -10770559 -10845994 -10838358 -10406793 -10344113 -10633411 -11818751 -11150814 -10689341
-2349 -10689341 -12026578 -10634692 -10714734 -11465901 -11333966 -11004539 -11674769 -11455031 -10899463 -10963626
-2359 -10963626 -10853437 -10824995 -10921345 -10949064 -11633585 -11279080 -11491614 -11377837 -10824288 -10755490 -11598767
-2370 -11598767 -10828305 -9880036 -10808072 -10875278 -10673134 -11394634 -11854783 -11100961 -10954533 -11474500 -11487144
-2381 -11487144 -11184507 -10943755 -11281797 -11254938 -10816798 -10855560 -10879692 -10675765 -11265034 -11074248 -11024976
-2392 -11024976 -11050521 -10922331 -11175731 -11199677 -10971260 -11271638 -11104874 -11044439 -10672530 -10057033 -10118662
-2403 -10118662 -10864337 -11101927 -11137488 -10386940 -11132437 -11452183 -10658580 -11879655 -11543564 -11215980
-2413 -11215980 -11193940 -11091724 -11109281 -10581652 -10878005 -11021214 -11268214 -10719650 -10728609 -10781533 -10939317
-2424 -10939317 -10444214 -11049571 -11037575 -10944091 -10728101 -10792065 -10619313 -10527151 -10604820 -10313928 -10807562
-2435 -10807562 -10031241 -10328216 -11041306 -11350959 -11089255 -10875403 -10568804 -10539370 -11186396 -10293211
-2445 -10293211 -10085256 -10614428 -10684501 -11230919 -10240930 -10802068 -11169242 -10928071 -10509618 -10060641
-2455 -10060641 -10369939 -10504192 -11116234 -10721487 -10937333 -11042480 -11376873 -11492200 -10723640 -10957296
-2465 -10957296 -10795052 -10762723 -10972454 -11480865 -10980189 -11360697 -11437792 -11109133 -10939362 -10948340 -10065251
-2476 -10065251 -10846151 -11133760 -10998430 -10529849 -10472711 -10909710 -11383951 -11598431 -11375051 -10512542
-2486 -10512542 -11370102 -10834596 -11191466 -11233371 -11357458 -11107719 -11941864 -11147834 -10092080 -10858114
-2496 -10858114 -11245159 -11273982 -10790259 -10745551 -11270564 -11371788 -11578306 -11563307 -11043112 -11017286 -10585019
-2507 -10585019 -11437674 -10618259 -10486188 -11158962 -10268124 -10379018 -10529338 -10305827 -10596195 -10289098
-2517 -10289098 -10424124 -10658180 -10969559 -10425454 -11099012 -11195159 -10920994 -10683890 -11022270 -11235879
-2527 -11235879 -11107433 -11021764 -10712110 -10626848 -11071299 -10787750 -10436953 -9798748 -10315636 -10382225 -10828571
-2538 -10828571 -10933715 -10872254 -10953981 -10864541 -10696650 -11285114 -9908036 -11407072 -10914309 -10504487
-2548 -10504487 -10689434 -10674996 -11314730 -10568209 -10575494 -10699034 -11015073 -10526923 -11101382 -11283815 -11510104
-2559 -11510104 -11358424 -11537845 -10565580 -10254215 -10408764 -10254745 -10872943 -11589188 -11339076 -11369011
-2569 -11369011 -10989934 -10734299 -11527058 -11558770 -10691879 -11491987 -10788486 -10619499 -10990110 -10887114
-2579 -10887114 -10744046 -11397420 -11318802 -10805081 -10883413 -10862194 -10644908 -10955091 -11296592 -10902523 -11423743
-2590 -11423743 -11277474 -10910164 -10561568 -10826429 -10555906 -10461439 -11488867 -11189242 -10286562 -11582696
-2600 -11582696 -11415759 -11047335 -10933544 -11031258 -10915225 -10837366 -10966852 -10441327 -10438410 -10897785 -10613925
-2611 -10613925 -10748261 -11221676 -11242487 -11203706 -11414084 -10883085 -11857164 -11495238 -11400145 -11152176 -10941506
-2622 -10941506 -11154099 -10952101 -10807079 -10943384 -11072726 -11309073 -11126483 -11229825 -11478722 -11294165
-2632 -11294165 -11441165 -11606926 -11349004 -10800594 -10721124 -10917286 -10935837 -10231710 -11143042 -10904625 -11231112
-2643 -11231112 -11430499 -11377790 -11324212 -10796601 -11038690 -10410374 -10741530 -11298285 -12019705 -10668323
-2653 -10668323 -10308432 -10305817 -10830259 -10512165 -10736587 -10958080 -10597220 -10730422 -10521379 -10682170 -10591791
-2664 -10591791 -11131318 -11603961 -11410950 -10968085 -10171566 -10448263 -10201937 -10933062 -10996153 -11134685
-2674 -11134685 -10712841 -11285680 -11240322 -10676654 -10967000 -11251718 -10975989 -10615752 -10867936 -11121435
-2684 -11121435 -10976770 -11300369 -10692912 -11429199 -11311487 -10962855 -11005642 -11308668 -11698520 -11161785 -11175201
-2695 -11175201 -11165579 -10650988 -11196249 -11176388 -10509760 -10689373 -10532899 -11042803 -10650230 -10894637 -10533553
-2706 -10533553 -11163078 -11674586 -10940894 -11267226 -10860070 -11262168 -11152693 -10914625 -10571165 -10421283
-2716 -10421283 -10779754 -11682239 -10288379 -10575982 -10443745 -10555592 -10726243 -10462512 -10046472 -10474157
-2726 -10474157 -10391557 -10812335 -11160945 -11129240
-2730a1129240  $$ checkpoint
##PAGE= N=2
##DATA TABLE=(X++(I..I)), XYDATA
13653 -9076672 -9092348 -9038374 -9076870 -9178601 -9588024 -8644585 -9048000 -9456335 -9137447 -9627206 -9677909
13642 -9677909 -9854920 -10464782 -8848686 -8593346 -8988233 -8898468 -8645376 -8686204 -8805412 -9051289 -9245892
13631 -9245892 -8865172 -8913167 -8970309 -9085119 -9266527 -9320924 -9065142 -9022772 -9693019 -8478049 -8732546
13620 -8732546 -8662052 -9133731 -9123719 -9041737 -9054506 -8716416 -8442566 -8931341 -9466803 -8659522 -9106777
13609 -9106777 -8564372 -8630931 -7916680 -8463518 -8443361 -8156544 -8076351 -8695970 -8783498 -8862705 -8241803
13598 -8241803 -7999169 -8353633 -8310333 -8427662 -8314166 -8953272 -9010435 -8000647 -8324175 -8214335 -8450922
13587 -8450922 -9431087 -9226829 -8696861 -8930803 -9052125 -8481361 -8554655 -8542759 -8418999 -8130260 -7390533
13576 -7390533 -7983421 -7941327 -8742757 -8365660 -8780184 -8614180 -8848790 -8829999 -8562444 -8386532 -9002328
13565 -9002328 -8373664 -7471605 -8578228 -8296525 -8200934 -8622484 -8202214 -8795194 -7946353 -8032495 -8543862
13554 -8543862 -8409429 -7739886 -8908165 -8767699 -8973680 -8532135 -8185583 -8078461 -8546331 -8702764
13544 -8702764 -9103835 -8606187 -8627003 -8353421 -8322240 -8727224 -8433926 -8666394 -8868474 -9097809 -8264711
13533 -8264711 -8500255 -8196590 -8356326 -8149917 -8242612 -8429681 -8149767 -8225926 -8151955 -8294813 -8463956
13522 -8463956 -7871682 -7400303 -7856047 -8998294 -8366693 -8236963 -8298907 -8160342 -8468747 -8185428 -8125170
13511 -8125170 -8296297 -7891875 -8551844 -8199253 -8019057 -8401192 -8083957 -8094618 -7559919 -7713659 -7728291
13500 -7728291 -7917424 -7614183 -7361881 -8145078 -7977599 -8164545 -7968939 -8241987 -8519892 -8166529
13490 -8166529 -8400696 -9025702 -8222496 -7991504 -7903047 -8357945 -8266142 -8311991 -8107956 -8531473 -8012454
13479 -8012454 -8168821 -7070767 -7630416 -7828234 -7868946 -8343626 -8094523 -8049533 -7797506 -7392782 -7750763
13468 -7750763 -7837760 -8883996 -8113032 -8430712 -8517733 -8315242 -7758515 -7918336 -8261824 -8142268 -7537839
13457 -7537839 -7913541 -8142988 -7888408 -7950821 -7455974 -7581846 -7850768 -8058028 -7822224 -7523939 -7957211
13446 -7957211 -7807754 -8275369 -8325366 -8044198 -7931536 -7359816 -7724378 -7320325 -7714385 -7635560 -7500039
13435 -7500039 -7932812 -7655413 -7794508 -8408217 -7835644 -7583209 -7429239 -7613117 -7813483 -7684872
13425 -7684872 -7998304 -7893190 -7670056 -8145943 -8038395 -7877840 -8202063 -8515801 -7192834 -7829414
13415 -7829414 -7919049 -8052564 -8638373 -7628882 -7912438 -8333778 -7676197 -7432876 -8281855 -7786255
13405 -7786255 -6941860 -6768661 -7359976 -7465556 -7368020 -7878900 -7449073 -7679395 -7889719 -8502944 -8015843
13394 -8015843 -8186145 -8156895 -7608977 -7064179 -7706096 -7836762 -7410880 -7840628 -6642956 -6512119
13384 -6512119 -7412730 -7429022 -7581639 -7443108 -7397883 -7255294 -7531769 -6522736 -6908087 -6792861 -7115630
13373 -7115630 -6917833 -7375875 -7316562 -6995605 -6653624 -6943418 -7602926 -7677770 -7630508 -7448645 -6920737
13362 -6920737 -7525575 -8030238 -7668403 -7589553 -6973211 -7212341 -6989940 -6999556 -7373257 -7481169 -7278138
13351 -7278138 -7391844 -7178286 -7223684 -6981645 -6604091 -6789372 -7532962 -7059847 -7195673 -7251201 -6887792
13340 -6887792 -7276309 -7586307 -7059355 -7449149 -7431647 -7425608 -7559272 -7629959 -7782647 -7324505 -7073583
13329 -7073583 -6927045 -6796346 -6836711 -7509506 -7117917 -7082497 -7459772 -7069066 -7488766 -7851832 -7199411
13318 -7199411 -7185754 -7093605 -7158898 -7092194 -7077236 -7408166 -8076944 -7433635 -7512025 -6855763 -7035765
13307 -7035765 -7327323 -6304119 -6242627 -7187346 -7363062 -7939823 -7394279 -6549393 -7171070 -6969637
13297 -6969637 -6810895 -7003883 -7482376 -6898996 -6830859 -6926435 -6720843 -6814664 -7061535 -7231704 -7470136
13286 -7470136 -7255446 -7885147 -7686566 -7297024 -7565096 -6437972 -6972316 -7281955 -6929913 -7065122
13276 -7065122 -6418712 -6839267 -6758599 -7081223 -6976606 -6788688 -6895639 -7061147 -7026387 -6951280 -7119540
13265 -7119540 -7062038 -6875783 -7699877 -6627486 -7095413 -6609179 -6702148 -6679698 -6733904 -6732080 -6688604 -6709189
13253 -6709189 -7162890 -7173741 -7279658 -6426057 -6357666 -7388999 -6358522 -6506891 -7001949 -6910594 -7069257
13242 -7069257 -7137342 -6431969 -7342535 -7008414 -7591429 -6783591 -6917566 -7097409 -6969864 -7035606 -6328800
13231 -6328800 -6659833 -6660304 -6925038 -6503415 -6494573 -7009624 -7009072 -6658493 -7352266 -8367797 -6792655
13220 -6792655 -6491382 -7104087 -6411347 -5888693 -6584614 -6281315 -6527531 -6033144 -6136060 -6057779 -6482842
13209 -6482842 -7135460 -6167176 -6485990 -6131921 -6238756 -6681904 -6360315 -6370433 -6069107 -5997832 -6877496
13198 -6877496 -6755173 -6617229 -6881026 -6348739 -6664068 -6702657 -6984480 -6726362 -6504729 -5958213 -5916527
13187 -5916527 -6314863 -6170582 -6519337 -6278025 -6983039 -6350270 -6776227 -6329581 -6741788 -6482943
13177 -6482943 -6381839 -6097019 -6453523 -6024114 -6278479 -6605290 -7060869 -6948733 -6747925 -6797989
13167 -6797989 -5765945 -5662722 -6161192 -6957228 -7220300 -7353995 -7450551 -5980303 -6413230 -6774053
13157 -6774053 -6867799 -6866601 -6603990 -6424643 -6868688 -6652324 -6507019 -6151841 -6545982 -5431884 -6177402
13146 -6177402 -5373131 -5897076 -6230734 -6259893 -6490448 -6577302 -6793664 -6683527 -6076294 -5981875 -6739164
13135 -6739164 -6582465 -5766244 -5897739 -6677263 -6832230 -6461980 -6034468 -5715801 -5736572 -6315145 -5986330
13124 -5986330 -5905205 -6582926 -6310207 -6087199 -6474430 -6695432 -6028396 -5988911 -5758950 -5820010 -6061856
13113 -6061856 -6088402 -6229733 -6629507 -6572116 -6537120 -6202284 -6380848 -6177825 -6041135 -6147279 -5863206
13102 -5863206 -5205735 -5275646 -6284735 -6423433 -6011288 -6039337 -5338512 -5614461 -5467731 -5796689 -5785820
13091 -5785820 -5322465 -5962703 -5784401 -6043850 -5345751 -6109813 -6198117 -5981793 -6394365 -6433516 -5491948
13080 -5491948 -6320535 -5918825 -6030591 -5967361 -6031940 -6302129 -6060413 -6540581 -6212922 -6023158 -5826990
13069 -5826990 -6203513 -5894099 -6844270 -6310685 -6369238 -5580072 -5801649 -6256272 -5879181 -5669663 -6138683
13058 -6138683 -5974026 -5748450 -5147975 -5779243 -5798060 -5959842 -5434725 -6117848 -6055314 -5671077 -5568875
13047 -5568875 -5655632 -6610032 -6337561 -6042665 -6209907 -5443197 -5596085 -5943513 -5631302 -5537440 -5709703
13036 -5709703 -5759021 -6293691 -5832354 -5709024 -6418858 -6095120 -5746094 -5762616 -5282849 -4561178 -5651609
13025 -5651609 -6263735 -6119332 -5842675 -5972189 -6320902 -6452204 -6102850 -6578899 -5963039 -5981955 -5689917
13014 -5689917 -5546631 -5550093 -5320403 -5662690 -6216421 -6340540 -6469461 -5715465 -5893980 -6188477 -5802274
13003 -5802274 -5525243 -5023135 -5409343 -5656049 -5428654 -5454353 -5190480 -5348990 -5024818 -6281041
12993 -6281041 -5650572 -5608313 -5519464 -5908911 -5114507 -4947726 -5906226 -5547819 -5283733 -5234912 -5740935
12982 -5740935 -5691177 -5824624 -5813220 -5894145 -5798412 -5567856 -5437883 -5891556 -5919349 -5591520 -5201655
12971 -5201655 -5606297 -4951813 -5122341 -5668622 -5491601 -5796913 -6230315 -5941697 -5206648 -5683495
12961 -5683495 -5426953 -5261728 -5872127 -6108627 -5233268 -5882579 -5714220 -5141884 -5603798 -5124840 -5116575
12950 -5116575 -5176771 -5012385 -5376368 -5737556 -4974287 -5568193 -5773203 -5974801 -5894700 -5498788 -4664589
12939 -4664589 -5316802 -5364253 -5505936 -5830886 -5318329 -5025303 -5082781 -5365171 -5636939 -5821405 -5527202
12928 -5527202 -5602512 -5155530 -5373959 -5076045 -5172937 -5512079 -6489538 -6074300 -5059904 -5429267 -5813616
12917 -5813616 -5071911 -5088683 -5272769 -5545025 -5660201 -5518444 -5060225 -5946830 -5519843 -5292268 -5572516
12906 -5572516 -5144878 -5156756 -4739815 -5341926 -4932175 -4802380 -5270177 -5590574 -4494920 -4690471
12896 -4690471 -4916477 -6809207 -5473232 -5865231 -5542335 -5503096 -5543180 -4971227 -5464629 -5271429
12886 -5271429 -4904661 -4981718 -5180501 -5133321 -5853137 -5282520 -5644415 -5476308 -4997493 -5267744 -5739845
12875 -5739845 -5404537 -4642467 -5135655 -4986115 -4932287 -5332192 -5246429 -4474614 -5121437 -5205867 -4693239
12864 -4693239 -4891636 -4896602 -5242750 -5641009 -4934367 -4940163 -4734715 -4891358 -4859934 -5105393 -5405640
12853 -5405640 -5636659 -5566231 -5394866 -5592657 -6297930 -6214662 -3950430 -4341719 -5111621 -5533460 -5533486
12842 -5533486 -5455931 -4939335 -5439723 -5069653 -5353974 -4988096 -5405347 -5149285 -5062176 -5293907 -6084374
12831 -6084374 -4092451 -4689975 -4630230 -4806313 -5413685 -5143955 -5111396 -4382085 -4785421 -5336028 -5071640
12820 -5071640 -5714828 -5530733 -5010874 -4604112 -4902541 -5160777 -4743221 -4730135 -5312646 -5203669 -5126078
12809 -5126078 -5029631 -4894347 -4749038 -5031087 -4739923 -4944784 -4542064 -4467057 -3989408 -4849699 -5598225
12798 -5598225 -4953183 -4884682 -4546963 -4520418 -5402846 -5307423 -4820242 -4877303 -4676848 -5228922 -4885941
12787 -4885941 -4899108 -5067017 -4942347 -4230055 -4085885 -4186843 -4288775 -4336589 -4611970 -5342672 -5404736
12776 -5404736 -5392759 -5125307 -4960488 -4197625 -4372842 -4194949 -4592802 -3848678 -4214481 -4264208 -4355593
12765 -4355593 -4959086 -4449034 -4749358 -5019845 -4807922 -4504423 -4187738 -5086193 -4672931 -5686684
12755 -5686684 -5248317 -5298141 -4892299 -5106080 -5186811 -5179436 -4594086 -4786167 -4692719 -4049328 -4785242
12744 -4785242 -5290552 -5008268 -4703113 -4052576 -4495086 -4650655 -4572641 -4172622 -4962773 -5250881 -5408459
12733 -5408459 -4834041 -4743501 -5087383 -4962014 -4601636 -4590128 -4217444 -5177888 -5394091 -4257870 -4057778
12722 -4057778 -4593739 -4212076 -4364229 -4508623 -4811019 -4723622 -4252415 -4222044 -3465007 -4283045 -4702159
12711 -4702159 -4935971 -4858828 -4530062 -4792678 -4392609 -4554930 -4570828 -4323965 -4568611 -4127968 -4099073
12700 -4099073 -4717852 -4789416 -5146163 -5030032 -4502205 -4178647 -4271073 -4325045 -4767934 -4366568 -4540326
12689 -4540326 -4029467 -4427232 -4894896 -4625103 -4428395 -4060936 -4557092 -4283896 -4350143 -4724656 -4784019
12678 -4784019 -5110270 -4065137 -4003567 -4423726 -4482588 -4370057 -4042090 -3977852 -4148575 -4187143 -4323169
12667 -4323169 -4815102 -4586607 -4504606 -4819757 -4354110 -4111842 -4132220 -4355202 -5158097 -4834101 -4692394
12656 -4692394 -4463123 -4693948 -4116216 -5116703 -4290672 -4386666 -4371949 -4485161 -4132596 -4534187 -4934268
12645 -4934268 -4135676 -4484297 -4788886 -4825766 -4372978 -4141096 -4288033 -4032986 -3932645 -4875754 -4884603
12634 -4884603 -4816522 -4321373 -4435867 -4708456 -4608245 -3694696 -4213174 -4757762 -4374162 -4696596 -4612422
12623 -4612422 -4348550 -4400005 -4109568 -4149894 -4014154 -4940343 -4533946 -3772394 -4018665 -3967277 -4202057
12612 -4202057 -3726923 -3728869 -3425124 -4022065 -4126136 -4537683 -4572033 -3615079 -4077215 -4441835 -4703226
12601 -4703226 -4475652 -4045646 -3803144 -3452590 -3841930 -3637498 -3792329 -4253619 -4302335 -4311650 -4433497
12590 -4433497 -4077164 -3991168 -3936719 -3454421 -5210973 -4267863 -4037660 -4006870 -3719995 -3955240 -3952468
12579 -3952468 -4006879 -4033543 -4093023 -4363076 -4664921 -4084419 -3881298 -3046860 -3611786 -4015747 -3761823
12568 -3761823 -3764704 -3752489 -4778216 -3890235 -4144664 -4305295 -4190470 -4026664 -4091995 -4287588 -4357941
12557 -4357941 -4409907 -4367571 -3867392 -3924413 -4452996 -4155708 -3730847 -3927943 -3573416 -4590030 -4440790
12546 -4440790 -3915789 -4090095 -3693141 -4261181 -3980503 -4045494 -3533643 -3965776 -3368404 -3728980 -3899855
12535 -3899855 -3884564 -4049690 -3633494 -5684046 -3660931 -3503713 -3743300 -3624640 -4069472 -3791417
12525 -3791417 -4216731 -3989347 -3995116 -4270142 -3997243 -3809194 -3590177 -4451380 -4545385 -4140802 -4107671
12514 -4107671 -3971411 -4222151 -3801894 -3488722 -3985541 -3929535 -4550076 -3749979 -4079665 -3980528 -4023834
12503 -4023834 -3269250 -3309910 -2906921 -3264046 -3738960 -3549040 -4001655 -4414416 -4363266 -3761916 -3590285
12492 -3590285 -3493945 -4302850 -4285710 -4137424 -3710828 -3883377 -3732209 -3785529 -3828796 -4032574 -4485727
12481 -4485727 -4192115 -3774362 -3388708 -2030282 -3783006 -4082581 -4294472 -3653359 -3665888 -3059226
12471 -3059226 -3554100 -3213827 -3351906 -4107953 -4035717 -3914249 -3203313 -3474392 -3751835 -3809431 -3310755
12460 -3310755 -3326828 -2811919 -3200667 -3534447 -3505007 -4491716 -4140071 -3606619 -3932128 -3255510 -2642830
12449 -2642830 -3068452 -3477239 -2825062 -3603116 -4054338 -3463556 -4417134 -3638131 -3083352 -3897468
12439 -3897468 -3634910 -3943862 -3197600 -3414077 -3319843 -3345052 -3235043 -3914782 -3460359 -3897373 -3796547
12428 -3796547 -4127790 -5375190 -4274774 -4352775 -4188822 -3801581 -3820005 -4255872 -4177940 -3323806 -3531335
12417 -3531335 -3347981 -2857719 -3219083 -2776776 -2802114 -2889832 -2595834 -3121554 -2614929 -4443374 -3752634
12406 -3752634 -3362746 -3704903 -3737783 -4015603 -4038252 -3814545 -4331524 -4035688 -3345095 -3228165 -3943889
12395 -3943889 -5861357 -3917900 -3515626 -3593284 -3067996 -4134746 -3088378 -3250478 -3326135 -3471629
12385 -3471629 -3452273 -3275868 -3333916 -3621274 -3650767 -3729117 -3054091 -2307359 -3297530 -3869370 -3177521
12374 -3177521 -3050862 -3052210 -2944703 -3218316 -3075338 -3321664 -3330627 -3929726 -3183863 -3100981 -3093933 -3341026
12362 -3341026 -2959602 -2533858 -1969596 -1133357 -4792498 -3688106 -3900451 -3417868 -3356084 -3209507
12352 -3209507 -3868187 -3341471 -4061089 -3950319 -3800061 -3836307 -4344016 -3554948 -3912112 -3349819 -3619153
12341 -3619153 -2855998 -2766967 -3667000 -3584569 -4035423 -3323615 -3396307 -3306851 -1431836 -3059061 -3501064
12330 -3501064 -3839753 -3248768 -3016048 -3184986 -3313193 -3629828 -3171844 -3466652 -2913068 -2834170 -2553892
12319 -2553892 -2925950 -3246139 -3639078 -3189278 -3608147 -3533347 -3543122 -3242007 -3035604 -3224858 -3246287
12308 -3246287 -2819474 -3415389 -3061520 -3104481 -3326543 -3243991 -3630676 -3070617 -3097722 -3236046 -3402754
12297 -3402754 -2884573 -2999310 -2764992 -3030898 -2870953 -3207498 -3368661 -2385032 -2384195 -2478333 -2417631
12286 -2417631 -3258759 -3353905 -2640037 -3159100 -2947309 -3027622 -2931555 -3363642 -3516751 -3450138 -3024282
12275 -3024282 -3142723 -2682834 -2355320 -2415933 -3136666 -2840411 -2851939 -3263236 -3838962 -2996806 -2967709
12264 -2967709 -3053931 -3159544 -3343008 -2684932 -3089223 -3323148 -3200958 -3067909 -3099985 -3236540 -2875711
12253 -2875711 -3685945 -3433788 -3477859 -2796783 -3864005 -3058108 -3333233 -2968286 -3088364 -3177835 -3306576
12242 -3306576 -2569642 -2885017 -2516562 -3269182 -2762254 -3009417 -3032755 -2507159 -2873347 -2840271 -2755384
12231 -2755384 -3002982 -2694734 -2920569 -3520239 -3511677 -2925519 -2468005 -2772572 -3126046 -2536821 -3060913
12220 -3060913 -3283406 -2937678 -3001304 -3243473 -3361134 -2693697 -2906655 -2528464 -2859253 -3765050
12210 -3765050 -2654080 -2835785 -2984317 -3150451 -2790553 -3043046 -2799077 -2941896 -2419468 -2583864
12200 -2583864 -3012579 -2892131 -2593481 -2741830 -3149705 -2644938 -2653356 -2842684 -3693936 -2711624 -2546402
12189 -2546402 -1917431 -2371633 -2864894 -2561682 -2682927 -2920912 -3175902 -2903480 -2710992 -3031299 -3067833
12178 -3067833 -3287802 -2784999 -2522472 -2826151 -2047982 -2902748 -2938813 -2867290 -3092422 -3451904 -3017062
12167 -3017062 -2444785 -2524861 -2143204 -2245671 -2846141 -2607768 -2960981 -2696652 -2391618 -2077532 -2624008
12156 -2624008 -2469157 -2907778 -3364679 -2750374 -3063406 -3362656 -2191799 -2256066 -2098747 -2229067
12146 -2229067 -2773856 -2744728 -2824562 -2796023 -2774622 -2146700 -2977755 -2791242 -3073126 -2906932 -2935203
12135 -2935203 -3368989 -3204977 -3071424 -2663582 -3751612 -2803096 -3135683 -3465693 -2657612 -3405037
12125 -3405037 -3390540 -2066126 -2680606 -2728293 -2659877 -3219893 -2536745 -2624050 -2300865 -2829463 -2768437
12114 -2768437 -2602872 -2606128 -2555913 -2966440 -2958357 -3348507 -3061285 -3764083 -3413718 -2701128 -2570912
12103 -2570912 -2295824 -2322659 -2862141 -2595499 -3161021 -3330122 -2431074 -3242662 -2781958 -2835111 -3714019
12092 -3714019 -2186256 -2781504 -3400781 -2689611 -2658720 -2862014 -2648657 -3269550 -2578455 -2383183
12082 -2383183 -2637812 -2140077 -2884020 -2329472 -2424830 -4347346 -2985555 -2361831 -2856684 -2614031
12072 -2614031 -2928216 -2842813 -2572096 -1721264 -3088157 -3089439 -2777466 -2907959 -2892499 -2551369 -2123753
12061 -2123753 -2357301 -2493677 -1265763 -2283896 -2809867 -3512694 -1877653 -2669751 -3264301 -3648754
12051 -3648754 -2543162 -2306833 -2707382 -2783036 -2999771 -3038170 -3383948 -2858664 -2440156 -2897966 -2368860
12040 -2368860 -2610988 -2333921 -2738277 -3750786 -3383828 -3385390 -3341626 -3992336 -2406112 -2339696 -2429441
12029 -2429441 -2886305 -2169890 -2416383 -2538752 -2316373 -2258048 -2868519 -2319330 -1947741 -2387180 -2454681
12018 -2454681 -2132430 -2115394 -2292895 -2244858 -2981758 -2391269 -2278752 -2550398 -2588601 -1931779 -2333813
12007 -2333813 -2583500 -2650775 -2819728 -2460706 -2439862 -2406625 -2454510 -2046036 -2262301 -2586340 -2413136
11996 -2413136 -2758532 -2373056 -2115190 -2428211 -2602417 -1993266 -2180312 -2051487 -1983384 -1881292 -1737020
11985 -1737020 -2457409 -1497241 -3965844 -2797281 -2192591 -2789593 -2320742 -1956122 -2484355 -2943441
11975 -2943441 -2641418 -2505762 -2544456 -2680505 -2599660 -2478138 -2254871 -2370130 -2769852 -2498697 -2173557
11964 -2173557 -2811664 -2864271 -2406563 -2406709 -2308800 -2425563 -2049686 -2565338 -2257662 -1650768 -1709832
11953 -1709832 -1607313 -1621097 -1921901 -1740618 -2060780 -1829748 -1796986 -2271776 -1976903 -2000870 -1465069
11942 -1465069 -1345656 -1906547 -2020476 -2695624 -2258547 -2997915 -2495155 -2592787 -2581251 -3427873 -1356640
11931 -1356640 -1189040 -1332002 -1422434 -1622874 -2441592 -1977351 -2088922 -2095749 -2693800 -2451961 -1765295
11920 -1765295 -1839226 -1752238 -2057669 -1928294 -2632919 -1830235 -1762455 -1988993 -1921272 -1577120 -1993570
11909 -1993570 -1594869 -2247998 -2458831 -2745176 -2200056 -1886370 -1823679 -1899860 -1239660 -2148814 -2212948
11898 -2212948 -2822504 -2101578 -2537616 -2743368 -2030173 -2142741 -1647269 -1507655 -1552699 -1554927 -2132955
11887 -2132955 -1723107 -2296486 -2069761 -1864775 -1357887 -1940602 -1747136 -2540999 -1691096 -1965279 -1900788
11876 -1900788 -2487043 -2588510 -2036938 -2134460 -2352859 -2264601 -1723386 -1864948 -1959595 -2623376 -2485506
11865 -2485506 -2389442 -3083566 -2189942 -2203920 -1745584 -1877276 -2237368 -2176293 -2742867 -2466682 -2105126
11854 -2105126 -1660276 -1975515 -2244524 -2120051 -2507124 -1853421 -1827752 -1768372 -1515889 -1697428 -1979211
11843 -1979211 -1967017 -1906831 -2147294 -1607908 -1453921 -1762318 -1360355 -2125822 -1793617 -1483169 -1515066
11832 -1515066 -1416583 -1856807 -1880099 -1902337 -1852108 -2256467 -2172833 -1625233 -1729672 -1681152 -2326018
11821 -2326018 -2037268 -1338683 -2190575 -1941646 -1341940 -1936894 -2549259 -2487269 -1346754 -2294282
11811 -2294282 -1999939 -2128762 -2292923 -1646006 -1902264 -1639777 -2517848 -1848522 -1924227 -2006072 -2029843
11800 -2029843 -1152089 -2158221 -2369700 -2100027 -2238224 -2143469 -1559351 -1918538 -2234552 -2279168 -1718737
11789 -1718737 -1484548 -2018611 -2292228 -2420436 -1708593 -1846581 -1677914 -1357454 -1913578 -1592098
11779 -1592098 -1788053 -1919953 -2654638 -1744799 -1645164 -1806051 -1649843 -1412094 -1819343 -1591361 -2080873
11768 -2080873 -1281696 -2043356 -1489734 -856835 -1281438 -1761011 -1623238 -1503592 -1486671 -1477395 -1225895
11757 -1225895 -1810913 -1535527 -1545227 -1430537 -1754668 -2583811 -1588690 -1845017 -1570040 -983427 -1478764
11746 -1478764 -1678398 -1656110 -1522793 -1145959 -1715980 -1391472 -1353394 -1185776 -1972767 -2236168 -2490569
11735 -2490569 -1537400 -1869838 -1049318 -1630633 -1596199 -1240208 -1235850 -1718356 -1407009 -1465487 -2043270
11724 -2043270 -1706714 -1451898 -912981 -1738378 -1672262 -2443816 -1274354 -1773693 -1495212 -1149804
11714 -1149804 -1419634 -2016226 -2172371 -1742316 -1694882 -1377857 -1108355 -1399242 -1149095 -546586
11704 -546586 -1632247 -1924851 -1411022 -1768217 -1979682 -1464941 -1461802 -1299784 -1269064 -1662551 -876978
11693 -876978 -1526734 -2041344 -1171487 -1651784 -1801667 -1398512 -1357870 -2515933 -1785123 -1834975 -1399005
11682 -1399005 -1872827 -1267605 -1227854 -982564 -1365515 -962953 -1508539 -1946684 -1804823 -1419632 -1647942
11671 -1647942 -1631100 -1005144 -1472465 -1751572 -1527955 -1663418 -1674240 -510091 -1699885 -1666899 -1439422
11660 -1439422 -1662571 -1719983 -1707400 -1326191 -2355765 -1422888 -1334881 -1093571 -1349526 -1500818 -1665201
11649 -1665201 -1457670 -1694282 -1927596 -2547612 -1429293 -1399467 -1333702 -1793792 -1876920 -2322375 1934076
11638 1934076 -50071 -706761 -1355379 -1397049 -1051179 -1656121 -1413768 -489797 -852228 -1143254
11628 -1143254 -593727 -804071 -890913 -1508911 -1823078 -1582267 -1500482 -1744343 -1385802 -1526383 -1639190
11617 -1639190 -1391783 -1268454 -943596 -1626647 -1659657 -1066159 -1585789 -1316842 -1493357 -1560662 -1608026
11606 -1608026 -1288387 -1596007 -1154491 -1058865 -1685495 -1231467 -1393134 -1968392 -1029942 -1103695 -1265210
11595 -1265210 -1272171 -1807322 -1779652 -1868950 -1333068 -1631169 -1563466 -1151237 -1895395 -1783334 -1198782
11584 -1198782 -2012102 -1058248 -1158057 -1041610 -879229 -1193433 -1039989 -628363 -1031678 -743717 -1167815
11573 -1167815 -1249380 -1235432 -1307532 -577773 -1122394 -1725930 -1453396 -877471 -1596747 -1815996 -867434
11562 -867434 -773852 -365798 -581404 -762136 -950160 -762487 -865127 -1253985 -1106352 -1206269 -723004
11551 -723004 -260335 -1129357 -955283 -936080 -1127004 -1002251 93146 -1024319 -1385004 -1496503
11541 -1496503 -1119617 -1402943 -1665651 889487 -129473 -209290 -1143074 -812739 -1180738 -601754
11531 -601754 -1061074 -1037421 -1111815 -626338 -875901 -1452988 -1244287 -1583645 -526792 -368848 -1498999
11520 -1498999 -1591005 -1322979 -1300391 -1124284 -1308921 -667231 -1152378 -1412727 -1048532 -901710 -1027589
11509 -1027589 -727366 -961269 -881443 -1115840 -133782 -619544 -895929 -849172 -1115255 -535290 -831816
11498 -831816 -591327 -1552812 -572979 -1222561 -1219288 -891514 -1031392 -505682 -114666 366279 -908560
11487 -908560 -923711 -309086 -653236 -957007 -1102625 -848578 -1285428 -1053231 -817446 -1039483 -426315
11476 -426315 -991528 -976408 -1336995 -1096365 -505111 -1088529 -656101 -1321844 -1187938 -585817 -635050
11465 -635050 -1231676 -1479073 -982768 -1110781 -728926 -1237372 -952463 -1156623 -1166234 -678072 -961206
11454 -961206 -1054594 -1150973 -1084520 -1059679 -1332686 -1221571 -1163052 -850372 -1095936 -1237635 -1073664
11443 -1073664 -644807 -1225292 -1068223 -1139757 -901296 -1665843 -291333 -330056 -384941 -417335 -432591
11432 -432591 -1100909 -508020 -1274244 -1275516 -1098334 -1577229 -886889 -665042 -897737 -427460 -424109
11421 -424109 -172474 -186264 -863987 -1328258 -1390208 -1304028 -1212968 -494652 -1000869 -1151429 -957509
11410 -957509 -1006906 -1030053 -1086154 -1013838 -1110662 -1127500 -1030649 -1144861 -1270679 -1711698 -1243270 -1209625
11398 -1209625 -1757409 -1314380 -1624376 -863112 -1034211 -763007 -611659 -470645 -1045843 -559406
11388 -559406 -681752 -669682 -750426 -127023 -327918 -356718 -850167 -990936 -510399 -445337 -195673
11377 -195673 -284244 -271274 -470409 -237188 -499426 -463236 -717896 -767423 -1171083 -981871 -361414
11366 -361414 -238432 -1533138 -314895 -387548 225068 -282117 -259295 -300751 -298926 -474076 -905508
11355 -905508 -1105552 -667298 -1043825 -953234 -1144781 -1606973 -1721049 -1300186 -758627 -730218 -308047
11344 -308047 -811599 -768811 -982979 -1001862 -1103498 -622819 -561272 -362676 115786 -729958 -1013277
11333 -1013277 -1403324 -868078 -287491 -591438 -1093467 -365209 -589065 -734234 -532072 -348726
11323 -348726 -588395 -492391 -329798 -389213 -694812 -304894 -920057 -1065271 -606086 -971923 -712264
11312 -712264 -886677 -1027998 -781947 -912615 -478861 -696946 -241467 -97048 93182 402515 304739
11301 304739 -252390 -479161 -136216 -682568 -621933 -237711 -722583 12667 -1076518 -728714 -45819
11290 -45819 336813 -833466 -1182798 -859042 -503323 -590389 -672787 -387920 -1882290 -1536469 -396593
11279 -396593 -180159 -669751 -23501 -618258 -238161 -511138 -348560 -479803 -685380 -354583 -670494
11268 -670494 -523996 -461362 -585572 -465403 782754 -147300 -382342 -784100 -423412 -386919 -369033
11257 -369033 -340054 -834423 -639211 1522396 132508 -563686 -194903 466152 -299911 -583863
11247 -583863 -133459 -214230 -357049 603406 -66567 -568093 -626440 -940154 -16437 57049 239323
11236 239323 -308683 -177123 -131384 -635511 87991 -419661 -540679 -838325 -299977 -360197 -512406
11225 -512406 -1018055 -1026827 -106014 -186147 -576706 -179587 9417 -17952 104074 -175586 -139730
11214 -139730 -552393 -192021 64911 -320663 -930264 -1195892 192019 354884 156750 -183500
11204 -183500 -844167 -314988 -443810 168094 -15592 -348374 -267045 60632 186545 -496775 -613467
11193 -613467 -668602 -702368 -243183 -604948 -249737 -54318 -382945 -144155 -317373 -693431 -530028
11182 -530028 240396 -120306 -8949 -140735 -477150 -208709 -82663 -303640 -73712 274924 -96499
11171 -96499 -145923 859928 -1078918 -343847 -645346 -75902 -281937 -280833 105149 -79630 -289525
11160 -289525 272391 736833 -788108 -437456 -471017 56706 296829 241693 2712 129796 -446462
11149 -446462 -428875 -229092 -154237 -650074 -439274 145093 289987 885560 -148791 -655479 -334790
11138 -334790 -807377 -256583 -677588 -349633 37936 -489565 -353435 61209 -298859 -165221 -631516
11127 -631516 -17974 222286 156633 532115 -83452 -596168 -277726 -412374 102892 -560893 -932586
11116 -932586 -328373 -207775 247032 359209 -379608 -328531 503493 1792668 746095 -61979
11106 -61979 62438 105130 -48506 -707219 -53722 443072 662971 456668 424439 374796 35967
11095 35967 -169033 66105 134397 -122953 -188767 -235483 90664 779514 97817 -211128 274889
11084 274889 -48822 -341637 -414278 -382809 -288121 -463891 19235 -515324 173542 -192608 -261293
11073 -261293 727774 286248 -566196 565467 -506128 -128827 919122 32431 -376323 -82512
11063 -82512 16942 -134269 -487109 424300 -72022 83113 -74072 254871 258033 -119446 -292830
11052 -292830 -27267 -401227 717618 643415 285209 36192 -812065 -354454 -517965 4410 210773
11041 210773 -356736 -662794 95820 226848 -32386 343746 669290 612122 -488563 528933
11031 528933 188322 -61490 -224114 -695367 -356077 577309 1537966 156659 512538 73232
11021 73232 -124987 175934 54468 -46286 100519 -65172 351499 792384 78165 306671 383783
11010 383783 68541 363967 -14476 363646 546156 629429 86688 150644 258108 -7110 271233
10999 271233 -12300 -539381 -1203421 -169597 -119742 1048 96662 506183 127413 111799 -24717
10988 -24717 236327 -141637 -172830 561068 377922 653583 886478 392547 221914 7647 -342955
10977 -342955 354810 368194 67516 -233416 -272329 83181 114119 -90050 747096 532806 629536
10966 629536 411556 -205334 470901 468539 36768 684690 262838 90320 307116 200967 -209974
10955 -209974 129792 409441 -11777 -229615 -51452 305745 -126881 176731 545903 151551 -128966
10944 -128966 154893 8052 -215932 -62678 871065 767112 164446 704470 117882 361292 307963
10933 307963 1267745 1246997 501751 752173 729330 278638 27057 -181698 -583233 -1274298 -304513
10922 -304513 -176598 57744 350643 997976 666350 181851 392769 424979 -392840 -241331 109493
10911 109493 485057 427584 36407 271102 -78457 53632 146843 -23709 -164203 889192 1157248
10900 1157248 327653 574315 520727 362160 871551 518730 193576 183422 -133980 -345285 345809
10889 345809 706232 700731 768547 -21449 540105 282787 212542 382200 778327 1003199 131300
10878 131300 476835 606233 218445 158934 341430 -608978 -420557 -420094 -628829 292100 -69348
10867 -69348 811903 717752 100250 227114 994867 1024047 827622 620607 355454 1085012 582915
10856 582915 -17106 949907 918498 538166 -73882 -197689 240277 239775 -271518 346445 51907
10845 51907 80437 425447 1086001 572917 444020 752860 631294 548377 268874 569138 245529
10834 245529 61561 365701 204017 571409 780723 591779 445432 486005 734797 216131 238026
10823 238026 365841 444049 182188 469139 -67261 -259533 393128 908379 1066082 585022 580433
10812 580433 1068100 942470 1259598 646632 211805 906117 545487 525924 373286 923332 716934
10801 716934 542609 2112567 1303096 543021 1079125 1181843 1676869 618897 379056 859360
10791 859360 975730 273901 265488 234023 984969 1024644 675009 460849 471526 1017258 1121668
10780 1121668 576724 593343 661823 678251 1054927 1224655 747306 936129 1391986 1489364 948700
10769 948700 249193 283377 757956 827122 1033768 1111456 471649 783555 102692 748322 411911
10758 411911 611418 677824 502394 1217878 695503 836335 789331 1074002 1449295 567054 1204323
10747 1204323 868032 1035787 1408741 1773446 -39834 70085 642129 628036 716891 481133 694607
10736 694607 816748 453856 440680 1489935 904076 959054 1082406 1214361 341386 513618 129222
10725 129222 25277 1488333 824735 1303663 540996 602074 564324 1060512 655231 981624 370513
10714 370513 43792 784568 740504 990648 538609 667544 532080 1001876 1031417 1495932 1517158
10703 1517158 831017 1084242 1172933 1174305 669863 234498 869500 1125440 810464 1332840 1017831
10692 1017831 1062140 758364 1151523 994976 657604 1074057 1016718 229388 1092898 1318026 621222
10681 621222 368105 898346 1001389 556570 699950 559260 1017444 1060101 853612 1164322 443202
10670 443202 897720 624746 926042 1030521 987377 917484 1226670 938006 741619 1527195 553976
10659 553976 1717974 1995419 1000163 1313729 1270454 1172019 1133700 1500739 1484664 447869 1230527
10648 1230527 1410681 1996486 1911375 1383859 1321431 1270233 1220230 1420795 1317411 1199368 1043568
10637 1043568 1319977 2100713 1421187 1149511 883549 812083 709542 982870 903168 1981582 1859860
10626 1859860 2062132 2459365 709907 401795 1002577 1102644 958099 740683 972369 904422 936121
10615 936121 1546847 1361719 1030145 1315999 921688 1100365 851726 978109 868678 1056656 1696858
10604 1696858 1192336 1589855 955650 765382 752343 615560 1124785 1312753 950282 852901 1855303
10593 1855303 1355430 905653 1023063 1425859 722210 1324924 1454919 955373 1248999 1003243
10583 1003243 1221663 1220546 813681 1214402 1319757 1674384 1091450 1548180 1150132 586786 1349288
10572 1349288 1317054 1879579 573498 1469385 1382125 1788286 1548179 941249 1691977 1652362 1119812
10561 1119812 619711 855211 1185926 1480773 1294495 750062 964888 1008975 743882 950845 1653270
10550 1653270 2061634 1885690 1322736 757258 545532 971861 1323358 900661 1644976 1215403 1292789
10539 1292789 1187454 1082364 1113441 1648422 1450268 1020536 1720443 1258922 683034 549907 1273910
10528 1273910 1011592 637985 819716 933243 1751821 1472314 1479629 1276799 1080881 1141565 1336676
10517 1336676 848166 875112 1542344 797087 -348697 1096140 1396492 1127470 1117356 873876
10507 873876 1046980 1607432 1141834 1949825 984503 1121309 1342163 504735 1541659 774883
10497 774883 572175 1138159 1260425 1334208 1754868 1812900 1930333 1855011 1554400 1229521 1207494
10486 1207494 1242145 884983 1214840 1717537 1816245 1213250 1214582 1522941 868492 1584715 1402385
10475 1402385 1588898 1306513 1572450 1373506 1997522 1735352 1659873 2021630 1713278 1570501 1000106
10464 1000106 1036197 1541849 1044065 983027 1082213 1247814 1160303 917341 1739395 1149531 944013
10453 944013 1510585 740461 1511028 1831583 1181737 1867395 1616022 1489867 1609707 252412
10443 252412 831983 1686403 1229901 1578625 1092429 1229982 665666 743390 1659910 1328249 1464756
10432 1464756 1282411 1766501 1218142 1662308 1829335 2079904 2518795 1996930 1455693 1903899 1921373
10421 1921373 1221522 1125827 877431 1941567 939179 1278296 1853687 1355673 1109092 1549169
10411 1549169 2075491 2041872 1409577 1347840 1683273 1055334 1398612 1662319 1562755 786795 1569640
10400 1569640 1463129 1501266 1838202 1655779 1606895 1530081 814474 1345781 1188968 1615635 1540669
10389 1540669 1941376 1599312 992296 919583 1752669 2185259 1424218 1670309 1066541 1268491 2203744
10378 2203744 2225852 2153291 1915843 1882348 2234129 1252292 1477799 2460733 2577459 1945268 1598750
10367 1598750 568152 1215361 1494391 1418620 1561986 1302866 1460692 1017987 1214052 1559105
10357 1559105 2353633 2662633 2313842 1604581 956537 2094642 1224484 1524075 2032969 1447650
10347 1447650 1562679 2006122 1789875 1793332 2090082 2230431 1478428 1689241 2042165 1134598 1250836
10336 1250836 2065793 2086123 1497101 2199324 2004539 1941303 1799638 1554984 1719718 1062999 1265591
10325 1265591 1434285 1899114 2051640 2143683 1849574 1388329 1043579 1230220 1705108 1720544 1924118
10314 1924118 1381897 1869166 2024711 994775 1836990 1652070 1994580 1750081 2276752 1447965
10304 1447965 1222762 1424515 1405711 1335643 1138522 1542446 2169980 1826741 1402029 2051991 2102087
10293 2102087 1751567 1342824 980234 2027270 2208137 1186363 1171069 1526845 1603561 1696416 1447937
10282 1447937 1372718 1613613 2128561 2062120 1293570 1742594 2022096 2093751 1602934 1384697 1311419
10271 1311419 2064390 2001750 1426212 1756521 1905019 1469184 1775131 1661472 1477258 1799187 1596419
10260 1596419 1786726 1768309 1682954 1865505 1485763 1927210 1833852 1902890 3342709 2508340 1888572
10249 1888572 1800864 1810941 1187416 1730476 1596309 2088764 1663432 1688554 2213812 2435015 2249314
10238 2249314 1956018 1617031 2187992 2322535 1948201 1343664 1114122 1334758 2044609 1901231
10228 1901231 1465129 1473796 1596947 1351977 1724387 1914521 1290760 1979723 1619905 2113567 2131170
10217 2131170 2618845 2518196 1978247 2117176 1983677 2323110 1857461 1653558 1778334 1297081
10207 1297081 1580457 1741684 1673072 1626200 1747505 1742600 1882630 2504575 1435077 1582400 2303212
10196 2303212 2152702 1496067 1200953 1755231 1686397 1802150 1820461 1897030 2275105 2350499 2755231
10185 2755231 2236856 1689706 1323118 1197598 1172336 1823416 1765157 1493956 1438919 1672013 1862448
10174 1862448 1070768 1927693 1801405 1838175 1987198 2210570 1769608 1896274 1968089 1093449 2093794
10163 2093794 2819144 3004455 1844932 2611828 2066589 2350557 2019242 1796860 1749881 1749919 1912734
10152 1912734 1989867 1747375 2053201 2309189 2475228 2192011 2290601 1938789 2391956 1951211 2135796
10141 2135796 2504720 1888053 2262046 2145655 1841955 1950782 1956883 2265970 2791377 1863695 2272890
10130 2272890 2554770 2025593 2277289 2151620 2522580 2506482 2725643 2194693 1554034 1699073 1585218
10119 1585218 2552156 2250009 1984900 1802982 2342206 1415235 2365472 2275690 1188245 2143023
10109 2143023 2406541 3549776 1442935 1704403 2377922 2403678 2715585 2247422 2117931 2032515
10099 2032515 2159514 2327421 2291474 2080286 2412308 2138826 1843432 2329701 2289874 1740215 1992378
10088 1992378 2665121 2291234 2384758 2171427 2409469 2256900 2190092 2719573 3273526 -228094
10078 -228094 1290573 1650504 2287332 2362980 2179849 2169221 2244121 2457140 2529638 2218879 2680003
10067 2680003 2796992 2287155 2329848 2287578 2026870 2590767 2608310 2443767 3221735 3304590 2690732
10056 2690732 3181546 2887846 2231663 1380472 1494073 1350732 1665763 1761177 2080114 2580986 2154659
10045 2154659 1773804 2533973 1974489 2311144 2277356 2128695 1917998 3446455 3148472 2310252
10035 2310252 2477650 2428401 2754284 2405594 2444572 2444469 2557243 2326242 2439216 2150307 3503820
10024 3503820 3053025 2736263 3050958 2727333 2844605 2957189 2745126 3171598 3395481 3207280
10014 3207280 2994341 2790990 2927638 2670371 2707220 2732760 2654147 2788533 2558044 1805331 2412189
10003 2412189 2611286 1954144 2944991 2185480 2779065 2868894 2938152 2829352 3001330 3030190 3055688
9992 3055688 2559994 2133145 1505319 1129855 283115 183575 1888235 2049305 2479150 2868710 3051761
9981 3051761 3402938 3297932 3197225 3103576 2499366 2977588 2333228 2901335 2614885 3257716 3557570
9970 3557570 3028797 2892719 2901934 1618794 1432421 1040424 584327 247753 1258607 2726462
9960 2726462 2532891 2119088 3104850 3303613 2081504 3406986 3106129 3089615 2724531 2646796 2896308
9949 2896308 3395459 3381043 2880170 3073982 3692306 4283607 5554210 3296245 2283642 2662429
9939 2662429 2272908 2702033 2399892 2481494 2583342 2140531 2795116 2119154 2141909 2481179 2963760
9928 2963760 2695891 2709352 2454185 2616491 2759641 2006369 2418266 2453587 2826385 2576820 2686221
9917 2686221 2569796 2421760 2410929 2232666 2534455 2627454 3164919 3103823 3489091 3445713 3419114
$$ [...]
-2730a1193628  $$ checkpoint
##END NTUPLES=
##END=
