##TITLE= S#349379
##JCAMP-DX= 5.00 $$ JEOL NMR v1.10
##DATA TYPE= NMR SPECTRUM
##DATA CLASS= NTUPLES
##NUM DIM= 1
##ORIGIN= DELTA_NMR
##OWNER= organic
##SPECTROMETER/DATA SYSTEM= DELTA_NMR
##.OBSERVE FREQUENCY= 3.00529655924288E+02
##.OBSERVE NUCLEUS= ^1H
##.DELAY= (2.194E+02,2.194E+02)
##.ACQUISITION MODE= SIMULTANEOUS
##.FIELD= 7.0586013
##.FILTER WIDTH= 1.81675738660864
##.ACQUISITION TIME= 3.6339712
##.SPINNING RATE= 14
##.OBSERVE 90= 9.6
##NTUPLES= NMR SPECTRUM
##VAR NAME= FREQUENCY,    SPECTRUM/REAL, SPECTRUM/IMAG, PAGE NUMBER
##SYMBOL=   X,            R,             I,             N
##VAR TYPE= INDEPENDENT,  DEPENDENT,     DEPENDENT,     PAGE
##VAR FORM= AFFN,         ASDF,          ASDF,          AFFN
##VAR DIM=  16384, 16384, 16384, 2
##UNITS= PPM,     ARBITRARY UNITS, ARBITRARY UNITS, 
##FIRST=  1.2501033903057E+01, -5.86074627584203, -5.01840298102844, 1
##LAST=  -2.50011824950436, -5.08517144306966, -6.09837740719656, 2
##FACTOR=  9.1565355261926E-04, 4.16460660123181E-04, 4.16460660123181E-04, 1
##PAGE= N=1
##DATA TABLE=(X++(R..R)), XYDATA
$$ [...]
4945c7676058K54107q2542J43526j383883k35406O71002M38284o16371q89847J098426
$$ -37676058 -37421951 -37504493 -37360967 -38744850 -38980256 -38309254 -37870970 -38487341 -39377188 -38278762
4935c8278762J27086M91959R5579j021040Q40964j10427l91344Q61565j395659N76700
$$ -38278762 -38151676 -37659717 -37564138 -38585178 -37744214 -37854641 -38245985 -37384420 -38780079 -38203379
4925c8203379N08566q91754M36057P32562m30733p05891j79690k68187K161576j766874
$$ -38203379 -37694813 -38586567 -38150510 -37417948 -37848681 -38554572 -38734262 -39002449 -36840873 -38607747
4915c8607747J1748N82659R92480j093731j150971J567166K16468l5695j61425m08749
$$ -38607747 -38595999 -38013340 -37020860 -38114591 -39265562 -37698396 -37481928 -37517623 -37679048 -38087797
4905c8087797J22354J576318p70732k51105j4897M58551j955709J133979k21513q58747
$$ -38087797 -37965443 -36389125 -37159857 -37410962 -37425859 -36967308 -38923017 -37789038 -38010551 -38869298
4895c8869298J028044r0899K25678k0412j210640l68985R63174K88818n95833j523713
$$ -38869298 -37841254 -37932153 -37706475 -37726887 -38937527 -39306512 -38343338 -38054520 -38650353 -40174066
4885d0174066J516748R25986m63547j124943J512321J0620k4711K52437j156540j4130
$$ -40174066 -38657318 -37731332 -38194879 -39319822 -37807501 -37796881 -37821592 -37569155 -38725695 -38739825
4875c8739825J077836j367971Q26606N17550j461559J625931n18064p31171K559467
$$ -38739825 -37661989 -39029960 -38203354 -37685804 -39147363 -37521432 -38039496 -38770667 -36211200
4866c6211200j920230R34443k96389m36547j32801R43751r78386p54915J283704J00295
$$ -36211200 -38131430 -37196987 -37493376 -37929923 -38062724 -37118973 -38097359 -38852274 -37568570 -37468275
4856c7468275l6717N55972p40255J50123j253086J346378M0120q57120L3284Q93352
$$ -37468275 -37504992 -36949020 -37689275 -37539152 -38792238 -37445860 -37405740 -38262860 -38229576 -37336224
4846c7336224j719951P99199k21531M08515R1571N58557P41129r46171o04539K85714
$$ -37336224 -39056175 -38256976 -38478507 -38069992 -37978421 -37419864 -36678735 -37624906 -38229445 -37943731
4836c7943731K26438j073258N12065N21287k35545n04604J49544K48246k77313j600810
$$ -37943731 -37717293 -38790551 -38278486 -37757199 -37992744 -38497348 -38347804 -38099558 -38376871 -39977681
4826c9977681K241811M82460P8303J218983j253070J821503o19620j379444m20567K231273
$$ -39977681 -37735870 -37253410 -37175107 -35956124 -37209194 -35387691 -36007311 -37386755 -37807322 -35576049
4816c5576049L07878l166583J436894K279834N37506K056628K29093J561156k6404547
$$ -35576049 -35268171 -38434754 -36997860 -34718026 -34180520 -32123892 -31894799 -30333643 -56738190
4807e6738190j365904J0549922K342151K207916J895550j4013Q69177J158093m8092K71272
$$ -56738190 -58104094 -47554172 -45212021 -43004105 -41108555 -41122568 -40253391 -39095298 -39143390 -38872118
4797c8872118j348765N44049O53659l18751j755769j581J13829N51875J351052j434888
$$ -38872118 -40220883 -39676834 -39023175 -39341926 -41097695 -41099276 -40985447 -40433572 -39082520 -40517408
4787d0517408J02049J398156J31896J33718M51671n14543N43496j290287o31220J672168
$$ -40517408 -40415359 -39017203 -38885307 -38751589 -38299918 -38814461 -38270965 -39561252 -40192472 -38520304
4777c8520304J68964o55312K153479k293172l029343K364133o75718M63498K194521n78095
$$ -38520304 -38351340 -39006652 -36853173 -39146345 -42175688 -39811555 -40487273 -40023775 -37829254 -38407349
4767c8407349j90240p77646P11074o66949K003776o76968n01448o70267l92382N83835
$$ -38407349 -38597589 -39375235 -38664161 -39331110 -37327334 -38004302 -38505750 -39176017 -39568399 -38984564
4757c8984564r29046l37664J406151J17629o13328r53088R31636l6663P01129j457300
$$ -38984564 -39913610 -40251274 -38845123 -38727494 -39340822 -40293910 -39362274 -39398937 -38697808 -40155108
4747d0155108L48503j131427J015363n2058R04745J370310P20098l28352O3610k696775
$$ -40155108 -39806605 -40938032 -39922669 -39974727 -39069982 -37699672 -36979574 -37307926 -37244316 -39941091
4737c9941091r5439m12306J828081J106344j838358O61722J547924j2431j134709k37266
$$ -39941091 -40036530 -40448836 -38620755 -37514411 -39352769 -38691047 -37143123 -37155554 -38290263 -38527529
4727c8527529o42255j31657J830640R17971k411835O95679K50515O77150j838975k01143
$$ -38527529 -39169784 -39301441 -37470801 -36552830 -38964665 -38268986 -38018471 -37341321 -39180296 -39381439
4717c9381439P11217n49513J65661N3645J03553R41027r209p63951o78792p85064j04411
$$ -39381439 -38670222 -39219735 -39054074 -39000429 -38896876 -37955849 -37965058 -38729009 -39407801 -40192865 -40297276
4706d0297276m23838j650101M796688K09949j473025R22445p69964j37475K62149l06315
$$ -40297276 -40721114 -42371215 -37574527 -37364578 -38837603 -37915158 -38685122 -38822597 -38560448 -38866763
4696c8866763k83367N34122J005315n77656J65472r40140r31010L48172M58542K24412
$$ -38866763 -39150130 -38616008 -37610693 -38188349 -38022877 -38963017 -39894027 -39545855 -39087313 -38862901
4686c8862901j69119q60318J087698O41298j739313M20132q72612m93944K983779l82184
$$ -38862901 -39032020 -39892338 -38804640 -38163342 -39902655 -39482523 -40355135 -40849079 -37865300 -38247484
4676c8247484j55056j21719q31939q27152k13605O85103o06971J298074q50369j39872
$$ -38247484 -38402540 -38524259 -39356198 -40183350 -40396955 -39711852 -40318823 -39020749 -39871118 -40010990
4666d0010990O74379J416271j567814J537231j469167j297967J124314L25301Q17310
$$ -40010990 -39336611 -37920340 -39488154 -37950923 -39420090 -40718057 -39593743 -39268442 -38451132
4657c8451132j253560j24533j225952L2530R5713J499151J184344k860691K936441J79199
$$ -38451132 -39704692 -39829225 -41055177 -41022647 -40926934 -39427783 -38243439 -41104130 -38167689 -37988490
4647c7988490j027381K02123j501780Q74531m60508K55584J120885r26280J55857p28804
$$ -37988490 -39015871 -38813748 -40315528 -39440997 -39901505 -39645921 -38525036 -39451316 -39295459 -40024263
4637d0024263p04332L3335J228077o88761j12431L09768J960981m87545J77509N39845
$$ -40024263 -40728595 -40695260 -39467183 -40155944 -40268375 -39958607 -37997626 -38485171 -38307662 -37767817
4627c7767817j289702m46000O39175J231484k957604O15230J112136o74889j47689Q9331
$$ -37767817 -39057519 -39503519 -38864344 -37632860 -40590464 -39975234 -38863098 -39537987 -39685676 -39596345
4617c9596345j9644J206130r14568j5536m24376r90893O05588P98883P74640l71507L50859
$$ -39596345 -39615989 -38409859 -39324427 -39339963 -39764339 -40755232 -40149644 -39350761 -38576121 -38947628 -38596769
4606c8596769j365518J79861J218478m37162r68936Q85627J235132l42034j91285r77948
$$ -38596769 -39962287 -39782426 -38563948 -39001110 -39970046 -39084419 -37849287 -38191321 -38382606 -39360554
4596c9360554N34746m98748Q72511O491r14716k94591K050680j667341N08740j92152
$$ -39360554 -38825808 -39324556 -38452045 -38445554 -39360270 -39654861 -37604181 -39271522 -38762782 -38954934
4586c8954934r69325L45825N76499M41183o98754p36280K125999j298832r64897L44310
$$ -38954934 -39924259 -39578434 -39001935 -38560752 -39259506 -39995786 -37869787 -39168619 -40133516 -39789206
4576c9789206L09439j80222K6964n34808N61478J359255j106956j46041p89416N73974
$$ -39789206 -39479767 -39659989 -39633025 -40167833 -39606355 -38247100 -39354056 -39500097 -40289513 -39715539
4566c9715539l56331J782428r61016J577712k081766n77672j579137J032787J482684
$$ -39715539 -40071870 -38289442 -39250458 -37672746 -39754512 -40332184 -41911321 -40878534 -39395850
4557c9395850L62265n38518p61424k57632J003042O55764n13420j366906L09433J65072
$$ -39395850 -39033585 -39572103 -40333527 -40591159 -39588117 -38932353 -39445773 -40812679 -40503246 -40338174
4547d0338174K453706n90522j764380R01376J38180q16313p64936P08854J299665j66834
$$ -40338174 -37884468 -38474990 -40239370 -39337994 -39199814 -40016127 -40781063 -40072209 -38772544 -38939378
4537c8939378j125006L63662r82034O10526j511228J115940J312243J683662j247170
$$ -38939378 -40064384 -39700722 -40682756 -40072230 -41583458 -40467518 -39155275 -37471613 -38718783
4528c8718783j235565o08168R97129Q66904K527076k534244j401881o84223O40492K64250
$$ -38718783 -39954348 -40562516 -39565387 -38698483 -36171407 -38705651 -40107532 -40791755 -40151263 -39887013
4518c9887013R52797J060347P92427m18382p61278k579667J306956j053194J374372
$$ -39887013 -38934216 -37873869 -37081442 -37499824 -38261102 -40840769 -39533813 -40587007 -39212635
4509c9212635J054767n10711n64807l37466J667076J198220j153184l29113j908125Q57257
$$ -39212635 -38157868 -38668579 -39233386 -39570852 -37903776 -36705556 -37858740 -38187853 -40095978 -39238721
4499c9238721o30807J056385J178927j36597n19675q06255K044890k137517K306977m92105
$$ -39238721 -39869528 -38813143 -37634216 -37770813 -38290488 -39096743 -37051853 -39189370 -36882393 -37374498
4489c7374498J101077k847024n46811P53345J415126j091212j011403J327141n80451
$$ -37374498 -36273421 -39120445 -39667256 -38913911 -37498785 -38589997 -39601400 -38274259 -38854710
4480c8854710K46897Q12051j784596J424145o37286O84810j9935n48162O14039Q5917l6830
$$ -38854710 -38607813 -37795762 -39580358 -38156213 -38793499 -38108689 -38128624 -38676786 -38062747 -37976830 -38013660
4469c8013660n18167l39716l88775J81710J97868j050113O29393j004059K890976l9642
$$ -38013660 -38531827 -38871543 -39260318 -39078608 -38880740 -39930853 -39301460 -40305519 -37414543 -37454185
4459c7454185j226241j85312o6553L10062Q33706n16737o40280n41210J221159M01538
$$ -37454185 -38680426 -38865738 -38932291 -38622229 -37788523 -38305260 -38945540 -39486750 -38265591 -37864053
4449c7864053p18355j374972P50717J036245r47180J265995k403844J446028l01040
$$ -37864053 -38582408 -39957380 -39206663 -38170418 -39117598 -37851603 -40255447 -38809419 -39110459
4440c9110459j522572J814156R54785j433574j08653k22463m20191R40256J88485J162424
$$ -39110459 -40633031 -38818875 -37864090 -39297664 -39406317 -39628780 -40048971 -39108715 -38920230 -37757806
4430c7757806j098115R72943j42202r39244m0441P77380J657637j206334R75879K16302
$$ -37757806 -38855921 -37882978 -38025180 -38964424 -39004865 -38227485 -36569848 -37776182 -36800303 -36584001
4420c6584001j649160L04043l62882J56104N74853r22009l8548L23565J62986o00822
$$ -36584001 -38233161 -37929118 -38292000 -38135896 -37561043 -38483052 -38521600 -38198035 -38035049 -38635871
4410c8635871J244911j627760L87733j206603L242501O09581j476468J139204J359592
$$ -38635871 -37390960 -39018720 -38630987 -39837590 -36595089 -35985508 -37461976 -36322772 -34963180
4401c4963180j372407k12518P29563m20359J62635j67022o74625P31607o73946m88576
$$ -34963180 -36335587 -36548105 -35818542 -36238901 -36076266 -36243288 -36917913 -36186306 -36860252 -37348828
4391c7348828J703684m13320R5339J02739J041858j30184n11746q0156J638975l09331
$$ -37348828 -35645144 -36058464 -35963125 -35860386 -34818528 -34948712 -35460458 -35540614 -33901639 -34210970
4381c4210970K58209l15098R56497K762502r6761J004354J945873K794501N959344
$$ -34210970 -33952761 -34267859 -33311362 -30548860 -30645621 -29641267 -27695394 -24900893 -18941549
4372a8941549J8350048o4527666J5736672M122000K733219J819305J551334J697138
$$ -18941549 -591501 -65119167 -49382495 -45260495 -42527276 -40707971 -39156637 -37459499
4364c7459499k155936J868136O83834J152604j013556m36085Q06817R47385L42469k12598
$$ -37459499 -39615435 -37747299 -37063465 -35910861 -36924417 -37360502 -36553685 -35606300 -35263831 -35476429
4354c5476429O86883J174178j29468O83246l46661r4015j369118J451702K547479q07015
$$ -35476429 -34789546 -33615368 -33744836 -33061590 -33408251 -33502266 -34871384 -33419682 -30872203 -31679218
4344c1679218l10352L38217r62634R40325L07134J656039L62492j098929J040527j2748
$$ -31679218 -31989570 -31651353 -32613987 -31673662 -31366528 -29710489 -29347997 -30446926 -29406399 -29419147
4334b9419147K220924N19223K470146l497949J654099K127437M58016K89578J688743
$$ -29419147 -27198223 -26679000 -24208854 -27706803 -26052704 -23925267 -23467251 -23177673 -21488930
4325b1488930k42260j980991J786959J177121M81044J701491J756883O60489K193889
$$ -21488930 -21731190 -23712181 -21925222 -20748101 -20267057 -18565566 -16808683 -16148194 -13954305
4316a3954305m02665K739654J985952J899844J119804j537209n834K353905J344004
$$ -13954305 -14356970 -11617316 -9631364 -7731520 -6611716 -8148925 -8154759 -5800854 -4456850
4307d456850J708794L89122O82026K423073K687521J773862J378989J103306J218761
$$ -4456850 -2748056 -2358934 -1676908 746165 3433686 5207548 6586537 7689843 8908604
4298H908604L462515J914498J300514K215000k2487J923621J257516J666915M210535
$$ 8908604 12371119 14285617 15586131 17801131 17778644 19702265 20959781 22626696 26837231
4289B6837231K522266L325766K266448K330619K726909J312849N185908J001410L517617
$$ 26837231 29359497 32685263 34951711 37282330 40009239 41322088 46507996 47509406 51027023
4280E1027023K802365N688116p64393L142957L445338Q558426K029390L014556O694097
$$ 51027023 53829388 59517504 58753111 61896068 65341406 73899832 75929222 78943778 85637875
4271H5637875N553664M575046N628370M918212M321841N171346N701306M149147M833473
$$ 85637875 91191539 95766585 101394955 106313167 110635008 115806354 121507660 125656807 130490280
4262A30490280N313484K580273L598661M053722M396075M969078N498414N166376N326031
$$ 130490280 135803764 138384037 141982698 146036420 150432495 155401573 160899987 166066363 171392394
4253A71392394L869637L867690K01792j021198J899544N2024O54329J738069R25133
$$ 171392394 175262031 179129721 179331513 178310315 180209859 180261883 180916212 182654281 183579414
4244A83579414l950052k166830j280595l468066j986820j628885l50521j61862p88997
$$ 183579414 179629362 177462532 176181937 172713871 170727051 169098166 168747645 168585783 167796786
4235A67796786k842040o599401j0708882j2285297j0441402q375885l935141l854921
$$ 167796786 164954746 158355345 147646463 135361166 124919764 116543879 112608738 108753817
4227A08753817n553352n430698o950158n764555o283605j0944596m523346m303796n657822
$$ 108753817 103200465 97769767 90819609 85055054 78771449 67826853 63303507 58999711 53341889
4218E3341889j979693n392405r255792r916521p644592o877700l665541l183884k227960
$$ 53341889 51362196 45969791 36713999 26797478 19152886 12275186 8609645 5425761 3197801
4209C197801N18014j313473j063332k867689l997539n092740m321457k515560k47159
$$ 3197801 3715815 2402342 1339010 -1528679 -5526218 -10618958 -14940415 -17455975 -17703134
4200a7703134n81450j185453p37651j639378o27899k62845k309056q86018J046497K269868
$$ -17703134 -18284584 -19470037 -20207688 -21847066 -22474965 -22737810 -25046866 -25932884 -24886387 -22616519
4190b2616519K00375L30005J03579O21414n21956p91593M0836q7766o00650K0969j14558
$$ -22616519 -22416144 -22086139 -21982560 -21361146 -21883102 -22674695 -22633859 -22721625 -23322275 -23301306 -23415864
4179b3415864m9209n58243L19283k406171L77239q89356N11176J105678P15705j270183
$$ -23415864 -23465073 -24023316 -23704033 -26110204 -25732965 -26622321 -26111145 -25005467 -24289762 -25559945
4169b5559945r31926J99274j137485m03031l55990k597502J624872o39028j79842N70444
$$ -25559945 -26491871 -26292597 -27430082 -27833113 -28189103 -30786605 -29161733 -29800761 -29980603 -29410159
4159b9410159Q82535k311815O08860O59230l54766l148347l11056J225781P99994k495306
$$ -29410159 -28527624 -30839439 -30230579 -29571349 -29926115 -33074462 -33385518 -32159737 -31359743 -33855049
4149c3855049k69762J465985j38622L02053j230543j43319q48400K30876j65871N89851
$$ -33855049 -34124811 -32658826 -32797448 -32495395 -33725938 -33869257 -34717657 -34486781 -34652652 -34062801
4139c4062801J63835j687292n96948j17696O22022L51451M93893O6066l092091R27568
$$ -34062801 -33898966 -35586258 -36183206 -36300902 -35678880 -35327429 -34833536 -34767470 -37859561 -36931993
4129c6931993n63762K29356m43562K114115q38692l393963M72378Q65101J1825j099826
$$ -36931993 -37495755 -37266399 -37709961 -35595846 -36434538 -39828501 -39356123 -38491022 -38479197 -39579023
4119c9579023N85005O29697j064396L14967J0258k13397k52246J213004o71380r47336
$$ -39579023 -38994018 -38364321 -39428717 -39113750 -39103492 -39316889 -39569135 -38356131 -39027511 -39974847
4109c9974847m97182J42238P03056P19037o59513J357632r99950M28470k75375q17592
$$ -39974847 -40472029 -40329791 -39626735 -38907698 -39567211 -38209579 -39209529 -38781059 -39056434 -39874026
4099c9874026L96214Q83301Q86464n2569k009980N61564l14506J684831l33319p15616
$$ -39874026 -39477812 -38594511 -37708047 -37760616 -39770596 -39209032 -39523538 -37838707 -38172026 -38887642
4089c8887642m8006M31617o06210J269475J389989j391541P59625o58352p13747l3302
$$ -38887642 -38935648 -38504031 -39110241 -37840766 -36450777 -37842318 -37082693 -37741045 -38454792 -38488094
4079c8488094Q68882j478195K032329n63196R39262Q75528j266245r9211R1877J580107
$$ -38488094 -37619212 -39097407 -37065078 -37628274 -36689012 -35813484 -37079729 -37178940 -37087063 -35506956
4069c5506956n39196J196996j072678P49105j030588J0967K02363J305596k266747m79126
$$ -35506956 -36046152 -34849156 -35921834 -35172729 -36203317 -36192350 -35989987 -34684391 -36951138 -37430264
4059c7430264J403432L07158K78121l83558L08314J411012l078034q49262N14541J115594
$$ -37430264 -36026832 -35719674 -35441553 -35825111 -35516797 -34105785 -37183819 -38033081 -37518540 -36402946
4049c6402946N40333l70700q33453O73629j432541j079870L93165Q99632o2697J002718
$$ -36402946 -35862613 -36233313 -37066766 -36393137 -37825678 -38905548 -38512383 -37612751 -37675448 -36672730
4039c6672730K2019J32596l72250J329873K12599K46134p19982l132758m47477l15525
$$ -36672730 -36650711 -36518115 -36890365 -35560492 -35347893 -35101759 -35821741 -38954499 -39401976 -39717501
4029c9717501J046652R95082K86041J7700L01825n23742n58739R17131J354394j783736
$$ -39717501 -38670849 -37675767 -37389726 -37372026 -37070201 -37593943 -38152682 -37235551 -35881157 -37664893
4019c7664893J352672j7187j98501j342528o5162R26676K11026m87465Q35451R58256
$$ -37664893 -36312221 -36329408 -36527909 -37870437 -37935599 -37008923 -36797897 -37285362 -36449911 -35491655
4009c5491655j654412p50950J040732j749495J448222n96340R97123N70880O57441k34945
$$ -35491655 -37146067 -37897017 -36856285 -38605780 -37157558 -37753898 -36756775 -36185895 -35528454 -35763399
3999c5763399n91719j662016K171119m13093m97806m91303J063323K71862N56347n78235
$$ -35763399 -36355118 -38017134 -35846015 -36259108 -36756914 -37248217 -36184894 -35913032 -35356685 -35934920
3989c5934920K14880J538758r01906m90634N43723p09105K362962j700984M08925R07057
$$ -35934920 -35720040 -34181282 -35083188 -35573822 -35030099 -35739204 -33376242 -35077226 -34668301 -33761244
3979c3761244J972967l507641M14882j329035L33184N47703P42128l83576J496521j340197
$$ -33761244 -31788277 -35295918 -34881036 -36210071 -35876887 -35329184 -34587056 -34970632 -33474111 -34814308
3969c4814308k58581o50407J216917J13885j471961J954411L32090n85497N06492p62414
$$ -34814308 -35072889 -35723296 -34506379 -34392494 -35864455 -33910044 -33577954 -34163451 -33656959 -34419373
3959c4419373K71853O69913p23286k034195K358138j58372P6785j66327Q02873R59803
$$ -34419373 -34147520 -33477607 -34200893 -36235088 -33876950 -34035322 -33958537 -34124864 -33321991 -32362188
3949c2362188l35581J160100N39283o91571M04049j174410J929707j900806M68485j960905
$$ -32362188 -32697769 -31537669 -30998386 -31689957 -31285908 -32460318 -30530611 -32431417 -31962932 -33923837
3939c3923837J13169J242087j472092j732805K103899M71965L770537K373184n72505
$$ -33923837 -33810668 -32568581 -34040673 -35773478 -33669579 -33197614 -29427077 -27053893 -27626398
3930b7626398N27105J610104j072919J129313k298160l91953J661105M82580l12809Q26298
$$ -27626398 -27099293 -25489189 -26562108 -25432795 -27730955 -28122908 -26461803 -25979223 -26292032 -25465734
3920b5465734K019392J003098N47886j151506J462197J099266K071252R64060J985693
$$ -25465734 -23446342 -22443244 -21895358 -23046864 -21584667 -20485401 -18414149 -17450089 -15464396
3911a5464396J650326K83658J925858J746816l5329M32735L0838o23931o06605J873661
$$ -15464396 -13814070 -13530412 -11604554 -9857738 -9893067 -9460332 -9429494 -10053425 -10660030 -8786369
3901h786369r6036K183372J179721J082052J844681K999302K611599o32258K061461
$$ -8786369 -8882405 -6699033 -5519312 -4437260 -2592579 406723 3018322 2386064 4447525
3892D447525M133806K250229Q81477J651781R13226K028814J870086O56914K513828
$$ 4447525 8581331 10831560 11713037 13364818 14278044 16306858 18176944 18833858 21347686
3883B1347686J882818J739499K776305L463537L423125K126970N297542M848936O158845
$$ 21347686 23230504 24970003 27746308 31209845 34632970 36759940 42057482 46906418 53065263
3874E3065263L488088L895069L459241M95078J894136J809100M111236K544532M071605
$$ 53065263 56553351 60448420 63907661 64402739 66296875 68105975 72217211 74761743 78833348
3865G8833348O522168M566795O477814O537678O830269P733619R465647M112142M044971
$$ 78833348 85355516 89922311 96400125 102937803 109768072 117501691 126967338 131079480 135124451
3856A35124451O434597L027364L971537M809864P964662L631391m52232l946991j439392
$$ 135124451 141559048 144586412 148557949 153367813 161332475 164963866 164511634 160564643 159125251
3847A59125251J05470M029404O713045P235379O733132M799944O048040N941515P013404
$$ 159125251 159230721 163260125 169973170 177208549 183941681 188741625 194789665 200731180 207744584
3838B07744584Q787549P910374J0137894J10014r069238j9829454j4620660o632899
$$ 207744584 216532133 224442507 234580401 234690415 225621177 205791723 191171063 184538164
3830A84538164l808044J45938K937570N400618O914238P814066Q308793J0261339J5687967
$$ 184538164 180730120 180876058 183813628 189214246 196128484 203942550 212251343 222512682 238200649
3821B38200649J4992059J2143175M362414K65173o284031o361070j264370K545152M237696
$$ 238200649 253192708 265335883 269698297 269963470 263679439 257318369 256053999 258599151 262836847
3812B62836847J971915k224582r044934j0331083o267753K794905R531957J0238741
$$ 262836847 264808762 262584180 253539246 243208163 236940410 239735315 249267272 259506013
3804B59506013R098136J1234436N764939M706084O344452K958908R593862P508648M27721
$$ 259506013 268604149 279838585 285603524 290309608 296654060 299612968 309206830 316715478 317143199
3795C17143199k0488285l5515303l9326260k9769054j5166707n519480k494816J732757
$$ 317143199 296654914 261139611 221813351 192044297 176877590 171358110 168863294 170596051
3787A70596051o3692K415812j62375N512869N719092J1882489Q424867J894887j2036437
$$ 170596051 170532359 172948171 172785796 178298665 184017757 195900246 204325113 206220000 194183563
3778A94183563j8566653k2901274j7033993q561606l604194k376057l475332n388123
$$ 194183563 175616910 152715636 135681643 127120037 123515843 121139786 117664454 112276331
3770A12276331r279027m130146n41552M165919O292486P099646N814992L945814J310408
$$ 112276331 102997304 98867158 98325606 102491525 108784011 115883657 121698649 125644463 126954871
3761A26954871O65322j468179J681527M454169R12607q431597j8724002k1089939j5441163
$$ 126954871 127620193 126152014 127833541 132287710 133200317 124768720 106044718 84954779 69513616
3752F9513616j1372438n014770n32935l1421j728206j221117j117420j233879j999389
$$ 69513616 58141178 53126408 52593473 52562052 50833846 49612729 48495309 47261430 45262041
3743D5262041j088451K274189o33412o679548j1143711j3466938j1589133p756148l610494
$$ 45262041 44173590 46447779 45814367 39134819 27991108 14524170 2935037 -4821111 -8431605
3734h431605k349169j204623k452607q60303l24542n550746M825248J147182N3023J151007
$$ -8431605 -10780774 -11985397 -14438004 -15298307 -15622849 -21173595 -16348347 -15201165 -15148142 -13997135
3724a3997135J05703m57752k668669j423269j48208o47824j84431o50898n99752j09909
$$ -13997135 -13891432 -14349184 -17017853 -18441122 -18589330 -19237154 -19421585 -20072483 -20672235 -20782144
3714b0782144P29555L13877N02627J861J505176K40545Q27861j017685j74039j534488
$$ -20782144 -20052589 -19738712 -19236085 -19234224 -17729048 -17488503 -16660642 -17678327 -17852366 -19386854
3704a9386854r35277k612129j444747J25784n45000o30481j641576m17535J233706N07683
$$ -19386854 -20322131 -22934260 -24379007 -24253223 -24798223 -25428704 -27070280 -27487815 -26254109 -25746426
3694b5746426o55882J276958J663778J18945k142190L61810k480900o98155k254764P52361
$$ -25746426 -26402308 -25125350 -23461572 -23342627 -25484817 -25123007 -27603907 -28302062 -30556826 -29804465
3684b9804465q74991q455q82275m415M51289q34044K111322j495547k16210n86578J958517
$$ -29804465 -30679456 -30687911 -31570186 -31574601 -31123312 -31957356 -29846034 -31341581 -31557791 -32144369 -30185852
3673c0185852K68329j243287o03045n0835m74730J77617J018776j030779j495464j009126
$$ -30185852 -29917523 -31160810 -31763855 -31814690 -32289420 -32111803 -31093027 -32123806 -33619270 -34628396
3663c4628396J182365J498755j027968k226620K84274J305688Q32191o31986L04934n3940
$$ -34628396 -33446031 -31947276 -32975244 -35201864 -34917590 -33611902 -32779711 -33411697 -33106763 -33160703
3653c3160703j623414n60912J996691P3020l76961o16965p2070j311266p69539J094201
$$ -33160703 -34784117 -35345029 -33348338 -33275318 -33652279 -34269244 -34341314 -35652580 -36422119 -35327918
3643c5327918j324348Q66415l94112L19028j904752K796016m27920K19706j059850J749926
$$ -35327918 -36652266 -35785851 -36179963 -35860935 -37765687 -34969671 -35397591 -35177885 -36237735 -34487809
3633c4487809j638578N58817j019884q88839M880044j881876j873349j981852L365663
$$ -34487809 -36126387 -35567570 -36587454 -37476293 -32596249 -34478125 -36351474 -38333326 -34967663
3624c4967663r2782r87523Q15145k05928k19109R72544l06660k20704N52956l00073L8056
$$ -34967663 -35060445 -36047968 -35232823 -35438751 -35657860 -34685316 -34991976 -35212680 -34659724 -34959797 -34921741
3613c4921741m00073N78299K43086J322633j558183J81630o92105p68212j83018J390114
$$ -34921741 -35321814 -34743515 -34500429 -33177796 -34735979 -34554349 -35246454 -36014666 -36197684 -34807570
3603c4807570L766092n816302Q93394J172157P21635j990755P55359L3464N12852J53153
$$ -34807570 -31041478 -36857780 -35964386 -34792229 -34070594 -36061349 -35305990 -35272526 -34759674 -34606521
3593c4606521l89560j18836o84194J195061j959148J178721q76573K71356N56665k94331
$$ -34606521 -34996081 -35114917 -35799111 -34604050 -36563198 -35384477 -36261050 -35989694 -35433029 -35727360
3583c5727360j395609M61269J179839j119844Q68060J32903P61895P878j247308Q11703
$$ -35727360 -37122969 -36661700 -35481861 -36601705 -35733645 -35600742 -34838847 -34830969 -36078277 -35266574
3573c5266574p36809J256539N046p09827J500057j175784n41086j63252J051513j782687
$$ -35266574 -36003383 -34746844 -34741798 -35451625 -33951568 -35127352 -35668438 -35831690 -34780177 -36562864
3563c6562864P65998J67807o34982K324133o68331m92288L95908n06787o97379O70483
$$ -36562864 -35796866 -35629059 -36264041 -33939908 -34608239 -35100527 -34704619 -35211406 -35908785 -35238302
3553c5238302L81997P81953k594054R24601L23917k69708Q5194p15553J306308l71086K738
$$ -35238302 -34856305 -34074352 -36668406 -35743805 -35419888 -35689596 -35604402 -36319955 -35013647 -35384733 -35381995
3542c5381995j032288J85456J359589J10026n32415R28658P5559j720840J695874m52692
$$ -35381995 -36414283 -36228827 -34869238 -34759212 -35291627 -34362969 -34287410 -36008250 -34312376 -34765068
3532c4765068j097828l94364l07356J970576m31581o03441P76499k549554P39019P67845
$$ -34765068 -35862896 -36257260 -36564616 -34594040 -35025621 -35629062 -34852563 -37402117 -36663098 -35895253
3522c5895253k8580Q55576j282409Q45968k20100N8709l57440J669068m10441k11866
$$ -35895253 -35923833 -35068257 -36350666 -35504698 -35724798 -35666089 -36023529 -34354461 -34764902 -34976768
3512c4976768j004355j147149N45419J263646j151085j554013J17266J279648M42092
$$ -34976768 -35981123 -37128272 -36582853 -35319207 -36470292 -38024305 -37907039 -36627391 -36185299
3503c6185299m27283N17522j710604Q44593K798091m473677J033345q82024K115402
$$ -36185299 -36612582 -36095060 -37805664 -36961071 -34162980 -38636657 -37603312 -38485336 -36369934
3494c6369934j644132J92152N13991j39835K93539K11109m08243j223899k106836j045609
$$ -36369934 -38014066 -37821914 -37307923 -37447758 -37154219 -36943110 -37351353 -38575252 -40682088 -41727697
3484d1727697N067224O22754o90183O01914j409959P35905M47132j671022O14361j360028
$$ -41727697 -36660473 -36037719 -36727902 -36125988 -37535947 -36800042 -36352910 -38023932 -37409571 -38769599
3474c8769599J95806j60358J881755r27075j21298N44894l46579k056476R19561J572343
$$ -38769599 -38573793 -38734151 -36852396 -37779471 -37900769 -37355875 -37702454 -39758930 -38839369 -37267026
3464c7267026j037919q43881j449336K423377n24310N53665k50638M95847j076211k97705
$$ -37267026 -38304945 -39148826 -40598162 -38174785 -38699095 -38145430 -38396068 -37900221 -38976432 -39274137
3454c9274137N84731M83723r21570j73804j27835N13016O40659l28930l23313J243266
$$ -39274137 -38689406 -38205683 -39127253 -39301057 -39428892 -38915876 -38275217 -38604147 -38927460 -37684194
3444c7684194P85333j331531j5221p40412j466468J588695J009700p80699O73268k080279
$$ -37684194 -36898861 -38230392 -38245613 -38986025 -40452493 -38863798 -37854098 -38634797 -37961529 -40041808
3434d0041808p14937J486952n7269k23686l94734J352829j498324J001123K312735k34592
$$ -40041808 -40756745 -39269793 -39327062 -39550748 -39945482 -38592653 -40090977 -39089854 -36777119 -37011711
3424c7011711o14897j354713j95345j275112J582627K06178j038599N38977K41002m39561
$$ -37011711 -37626608 -38981321 -39176666 -40451778 -38869151 -38662973 -39701572 -39162595 -38921593 -39361154
3414c9361154j51399p64697J319536N81689j265841n15102M20107o33918k41826J749854
$$ -39361154 -39512553 -40277250 -38957714 -38376025 -39641866 -40156968 -39736861 -40370779 -40612605 -38862751
3404c8862751j099033L15171j063753J72271L07376R00878n08037K63947j853962J864829
$$ -38862751 -39961784 -39646613 -40710366 -40538095 -40230719 -39329841 -39837878 -39573931 -41427893 -39563064
3394c9563064L25183p97247K82089j077556O70791J9672L44376j076597P07971M78641
$$ -39563064 -39237881 -40035128 -39753039 -40830595 -40159804 -40140132 -39795756 -40872353 -40164382 -39685741
3384c9685741J8744j320260R75426N90288L36141K97279m14220K76348L3184k83628
$$ -39685741 -39666997 -40987257 -40011831 -39421543 -39085402 -38788123 -39202343 -38925995 -38892811 -39176439
3374c9176439j444617j570710P68924k15533K998851L34108j434786l3947p55557K67667
$$ -39176439 -40621056 -42191766 -41422842 -41638375 -38639524 -38305416 -39740202 -39774149 -40529706 -40262039
3364d0262039k64094L36042L49062k95392P5271q31444J419941j335888R41468p75322
$$ -40262039 -40526133 -40190091 -39841029 -40136421 -40061150 -40892594 -39472653 -40808541 -39867073 -40642395
3354d0642395K76156m86199J128584L79747J14812q7530j59092L21205m69904R56286
$$ -40642395 -40366239 -40852438 -39723854 -39344107 -39229295 -39316825 -39475917 -39154712 -39624616 -38668330
3344c8668330m99464k226458l96267R69354k98783J34540n27658k9524P72122Q10608
$$ -38668330 -39167794 -41394252 -41790519 -40821165 -41119948 -40985408 -41513066 -41542590 -40770468 -39959860
3334c9959860M21603r06243Q10106J24445q38116J85220J52154P96365l48786N96356
$$ -39959860 -39538257 -40444500 -39634394 -39509949 -40348065 -40162845 -40010691 -39214326 -39563112 -38966756
3324c8966756o91759p38473m32340K30687P98206q22210K8953J385611r55166p96403
$$ -38966756 -39658515 -40396988 -40829328 -40598641 -39800435 -40622645 -40593692 -39208081 -40163247 -40959650
3314d0959650K77309J18001L97149J186068n38240o06271J45040R23505M64278k000919
$$ -40959650 -40682341 -40564340 -40167191 -38981123 -39519363 -40125634 -39980594 -39057089 -38592811 -40593730
3304d0593730m16539R72564r93431J659848o85028q46598n16592K20267P42792L20095
$$ -40593730 -41010269 -40037705 -41031136 -39371288 -40056316 -40902914 -41419506 -41199239 -40456447 -40136352
3294d0136352p97063J196293p75539k024049J820012j318384m53598M82921n866K23439
$$ -40136352 -40933415 -39737122 -40512661 -42536710 -40716698 -42035082 -42488680 -42005759 -42011625 -41788186
3284d1788186j017133J657564O03019M22238K14141p81265K07719L12960J018365n46403
$$ -41788186 -42805319 -41147755 -40544736 -40122498 -39908357 -40689622 -40481903 -40168943 -39150578 -39696981
3274c9696981l52237j999939J027423m38115j41195l63451O93524N65043J068635j121442
$$ -39696981 -40049218 -42049157 -41021734 -41459849 -41601044 -41964495 -41270971 -40705928 -39637293 -40758735
3264d0758735k03443O50637k003804o51195J75085J194407m71253k08866J254702q2577
$$ -40758735 -40962178 -40311541 -42315345 -42966540 -42791455 -41597048 -42068301 -42277167 -41022465 -41105042
3254d1105042M37412m30647p04577O34994j28100k0722j141577j51793J310700j66793
$$ -41105042 -40667630 -41098277 -41802854 -41167860 -41295960 -41316682 -42458259 -42610052 -41299352 -41466145
3244d1466145P03581j364047l52611R55318J164560p81679J94922j189547r72921l9898
$$ -41466145 -40762564 -42126611 -42479222 -41523904 -40359344 -41141023 -40946101 -42135648 -43108569 -43148467
3234d3148467l826581L897753P3942L00257J909815j272807j005299L13902M671892
$$ -43148467 -46975048 -43077295 -43003353 -42703096 -40793281 -42066088 -43071387 -42757485 -38085593
3225c8085593k254893k317753Q45232k54327m94356N0493J205575R78296k969943J792683
$$ -38085593 -40340486 -42658239 -41813007 -42067334 -42561690 -42511197 -41305622 -40327326 -43297269 -41504586
3215d1504586j719879M62033Q83312j685968J896587K28520r22052M31076j222846Q74085
$$ -41504586 -43224465 -42762432 -41879120 -43565088 -41668501 -41439981 -42362033 -41930957 -43153803 -42279718
3205d2279718j98975L67316J78083l14196R60608q15896J084716r34985j071194J00268
$$ -42279718 -42478693 -42111377 -41933294 -42247490 -41286882 -42102778 -41018062 -41953047 -43024241 -42923973
3195d2923973N89012P24750j82109o72850P76847J39910j22304p8349r67377n65869
$$ -42923973 -42334961 -41610211 -41792320 -42465170 -41688323 -41548413 -41670717 -41749066 -42716443 -43282312
3185d3282312J137508m82469Q84087j359869k62903K88553L84216o71041P49952l48483
$$ -43282312 -42144804 -42627273 -41743186 -43103055 -43365958 -43077405 -42693189 -43364230 -42614278 -42962761
3175d2962761q90601Q59890P3113J58396O1375p63829K96633n71383N2460K605238k592743
$$ -42962761 -43853362 -42993472 -42920359 -42761963 -42700588 -43464417 -43167784 -43739167 -43686707 -41081469 -43674212
3164d3674212J39578J46267O16830J15916p17363K76868o0014N16648j167618K10796
$$ -43674212 -43534634 -43388367 -42771537 -42655621 -43372984 -43096116 -43156130 -42639482 -43807100 -43596304
3154d3596304l13163l15295J459646k04828o94214L6412O8794k35685R99665K95556l23983
$$ -43596304 -43909467 -44224762 -42765116 -42969944 -43664158 -43627746 -43558952 -43794637 -42794972 -42499416 -42823399
3143d2823399P51975o78843j424969N47925O504l26897o65732K7613P67387L88707R43389
$$ -42823399 -42071424 -42750267 -44175236 -43627311 -43620807 -43947704 -44613436 -44585823 -43818436 -43429729 -42486340
3132d2486340j29410j32602n67624J96111j77104J78510p49938P86387R37265q36922
$$ -42486340 -42615750 -42748352 -43315976 -43119865 -43296969 -43118459 -43868397 -43082010 -42144745 -42981667
3122d2981667J471087r45500n32861q15400j09009M47754J88888J02664n5133R79511
$$ -42981667 -41510580 -42456080 -42988941 -43804341 -43913350 -43465596 -43276708 -43174044 -43229177 -42249666
3112d2249666m19923o26629O7998j55579P69339k266716J002622R7353M01535j173033
$$ -42249666 -42669589 -43296218 -43228220 -43383799 -42614460 -44881176 -43878554 -43781201 -43379666 -44552699
3102d4552699k77866K002280k27753o37309J42652j45468p20208M38285j2899N15861
$$ -44552699 -44830565 -42828285 -43056038 -43693347 -43550695 -43696163 -44416371 -43978086 -43990985 -43475124
3092d3475124M38124j048689K568058n851059J938189j59366o90506Q37119N50432P04573
$$ -43475124 -43037000 -44085689 -41517631 -47368690 -45430501 -45589867 -46280373 -45443254 -44892822 -44188249
3082d4188249j459260J364160j016018J794121j476947M53568J9001L29463p89491J759736
$$ -44188249 -45647509 -44283349 -45299367 -43505246 -44982193 -44528625 -44509624 -44180161 -44969652 -43209916
3072d3209916P3112P91977l844510K72630J095297j043961R80068L20635j512678K186085
$$ -43209916 -43136804 -42344827 -46189337 -45916707 -44821410 -45865371 -44885303 -44564668 -46077346 -43891261
3062d3891261J317828j238318k47696j40336J005304p40443k49497q8586j76630j162136
$$ -43891261 -42573433 -43811751 -44059447 -44199783 -43194479 -43934922 -44184419 -44273005 -44449635 -45611771
3052d5611771N88252j045363K6202N64404J47070J37242n21003O13648N33980P08034
$$ -45611771 -45023519 -46068882 -46042680 -45478276 -45331206 -45193964 -45714967 -45101319 -44567339 -43859305
3042d3859305j892669K4539p87324K708724l23460k26886R92493j853096m40326L94010
$$ -43859305 -45751974 -45727435 -46514759 -43806035 -44129495 -44356381 -43363888 -45216984 -45657310 -45263300
3032d5263300M23568l71779R7918l2561j3452L81311p64968L24369k335139L579668q60258
$$ -45263300 -44839732 -45211511 -45113593 -45146154 -45159606 -44778295 -45543263 -45218894 -47554033 -43974365 -44834623
3021d4834623M10J694010j639531J08449L97293j439780J05079K02153J140853m69782
$$ -44834623 -44834213 -43140203 -44779734 -44671285 -44273992 -45713772 -45608693 -45406540 -44265687 -44735469
3011d4735469J935424j402530j9674j272083O7178p20929J68961O01076k52021m08560
$$ -44735469 -42800045 -44202575 -44222249 -45494332 -45427154 -46148083 -45979122 -45378046 -45630067 -46038627
3001d6038627m40924J9713r5819l08564J133009M14375l12504Q45062j598050P34364
$$ -46038627 -46479551 -46459838 -46555657 -46864221 -45731212 -45316837 -45629341 -44784279 -46382329 -45647965
2991d5647965j503903l88841K67288K622613j44111M50290m10035l7040r32436q71221
$$ -45647965 -47151868 -47540709 -47273421 -44650808 -44794919 -44344629 -44754664 -44791704 -45724140 -46595361
2981d6595361J171083j29698r78757M92452J633234N25768p20779j282134L60255J204883
$$ -46595361 -45424278 -45553976 -46532733 -46040281 -44407047 -43881279 -44602058 -45884192 -45523937 -44319054
2971d4319054N68078k960038q5075o2848R2548n2530O6333J382750q18196j82443L97222
$$ -44319054 -43750976 -46711014 -46796089 -46858937 -46766389 -46818919 -46752586 -45369836 -46188032 -46370475 -45973253
2960d5973253M1725J51395P74679j052792j157524N70017J038690j60224l44033o56696
$$ -45973253 -45931528 -45780133 -45005454 -46058246 -47215770 -46645753 -45607063 -45767287 -46111320 -46768016
2950d6768016J908877k68974M95715k083499M64199j287903J193035o18416P27438p90397
$$ -46768016 -44859139 -45128113 -44632398 -46715897 -46251698 -47539601 -46346566 -46964982 -46237544 -47027941
2940d7027941J440995j239493M41158n26989p5579o75445k36260O03559N46250N31890
$$ -47027941 -45586946 -46826439 -46385281 -46912270 -46987849 -47663294 -47899554 -47295995 -46749745 -46217855
2930d6217855m77205r25988j109868O15042l60035R40902k95580M82617l46861M37218
$$ -46217855 -46695060 -47621048 -48730916 -48115874 -48475909 -47535007 -47830587 -47347970 -47694831 -47257613
2920d7257613j165233J180522k59813q43126n85484J368448Q84311Q75890j257546k45138
$$ -47257613 -48422846 -47242324 -47502137 -48345263 -48930747 -47562299 -46677988 -45802098 -47059644 -47304782
2910d7304782P20337o06655p92261J758376j233751m98893N13027N57958q03584m03403
$$ -47304782 -46584445 -47191100 -47983361 -46224985 -47458736 -47957629 -47444602 -46886644 -47690228 -48093631
2900d8093631P91075L7610K34662m11955O45127j189183n82114M83855l28115n90241
$$ -48093631 -47302556 -47264946 -47030284 -47442239 -46797112 -47986295 -48568409 -48084554 -48412669 -49002910
2890d9002910J384856J252066r74266o24866L92886p3909J34053K38607j053327N07553
$$ -49002910 -47618054 -46365988 -47340254 -47965120 -47572234 -47646143 -47512090 -47273483 -48326810 -47819257
2880d7819257Q9577k15028M13368N93223r37902K357K29360p74251q49374Q81143J033223
$$ -47819257 -47729680 -47944708 -47531340 -46938117 -47876019 -47873662 -47644302 -48418553 -49267927 -48386784 -47353561
2869d7353561j158649j141706J758702P03098j176661O85830J105852J192314k866067
$$ -47353561 -48512210 -49653916 -47895214 -47192116 -48368777 -47682947 -46577095 -45384781 -48250848
2860d8250848O81164j76189j40330m31351m42750N06014k16071O19517p66489M11592q1703
$$ -48250848 -47569684 -47745873 -47886203 -48317554 -48760304 -48254290 -48470361 -47850844 -48617333 -48205741 -48287444
2849d8287444J805986j101159j228658j2580j341980J527903n76209m20941J815029
$$ -48287444 -46481458 -47582617 -48811275 -48823855 -50165835 -48637932 -49214141 -49635082 -47820053
2840d7820053j154679j630919J170735K334405j520608O84157k113616O32211q7208n39098
$$ -47820053 -48974732 -50605651 -49434916 -47100511 -48621119 -47936962 -50050578 -49418367 -49505575 -50044673
2830e0044673j74137J624211p78107R39225r16032J971759n83920l08201j588197N02169
$$ -50044673 -50218810 -48594599 -49372706 -48433481 -49349513 -47377754 -47961674 -48269875 -49858072 -49355903
2820d9355903m57887Q65432O7790P12608M076741m714185R08796n34824J134518j658384
$$ -49355903 -49813790 -48948358 -48880568 -48167960 -44091219 -48805404 -47896608 -48431432 -47296914 -48955298
2810d8955298j218130J007525K436947k024874j049086J763343m60287q89722j039397
$$ -48955298 -50173428 -49165903 -46728956 -48753830 -49802916 -48039573 -48499860 -49389582 -50428979
2801e0428979J04731L59223L161q68692N70784q2642J081244o82682J166295M44583K8081
$$ -50428979 -50324248 -49965025 -49961864 -50830556 -50259772 -50342414 -49261170 -49943852 -48777557 -48332974 -48304893
2790d8304893L224183Q17893m372901K86277j893224j9932L13490j95109R53437o35972
$$ -48304893 -45080710 -44262817 -48635718 -48349441 -50242665 -50262597 -49949107 -50144216 -49190779 -49826751
2780d9826751j423025J245203N81250j433650M2512J62392o76012J156957J351086j375178
$$ -49826751 -51249776 -50004573 -49423323 -50856973 -50814461 -50652069 -51328081 -50171124 -48820038 -50195216
2770e0195216k1507j61682L089320k282852n22843R36102m84852j153362n74766K423208
$$ -50195216 -50216723 -50378405 -47289085 -49571937 -50094780 -49158678 -49643530 -50796892 -51371658 -48948450
2760d8948450q80277n18309J202766R5159m6920r17841J298862j000403p93172j602714
$$ -48948450 -49828727 -50347036 -49144270 -49049111 -49096031 -50013872 -48715010 -49715413 -50508585 -52111299
2750e2111299n26377P68872J853000j296906Q73156m33040Q31151r8573p43426J381419
$$ -52111299 -52637676 -51868804 -50015804 -51312710 -50439554 -50872594 -50041443 -50140016 -50883442 -49502023
2740d9502023J556644l000608Q28178m94885j260926m09358J923157j540378P46989
$$ -49502023 -47945379 -50945987 -50117809 -50612694 -51873620 -52282978 -50359821 -51900199 -51153210
2731e1153210j365550P81761J088269j501059l74235J725214J482087l436217K160994
$$ -51153210 -52518760 -51736999 -50648730 -52149789 -52524024 -50798810 -49316723 -52752940 -50591946
2722e0591946L29188k093453j503790J635678l5600k48125O51870r70456N01782k79731
$$ -50591946 -50262758 -52356211 -53860001 -52224323 -52259923 -52508048 -51856178 -52826634 -52324852 -52604583
2712e2604583Q33081m94422q11667J054716J406531k305245R51894O65020l56397q8371
$$ -52604583 -51771502 -52265924 -53077591 -52022875 -50616344 -52921589 -51969695 -51304675 -51661072 -51749443
2702e1749443L0550m14767L69946K62834J021065j444079l56960j33170n77455J510588
$$ -51749443 -51718893 -52133660 -51763714 -51500880 -50479815 -51923894 -52280854 -52414024 -52991479 -51480891
2692e1480891m85360k70087O63433n4103o53072O50483j847667O19676J98188n01579
$$ -51480891 -51966251 -52236338 -51572905 -51627008 -52280080 -51629597 -53477264 -52857588 -52659400 -53160979
2682e3160979J231778p88020q77460j009719K235263j285664o30198J281628R4341j481270
$$ -53160979 -51929201 -52717221 -53594681 -54604400 -52369137 -53654801 -54284999 -53003371 -52909030 -54390300
2672e4390300N50754J906313M46440j602134J35048K055343q83335l31472r38627l48072
$$ -54390300 -53839546 -51933233 -51486793 -53088927 -52953879 -50898536 -51781871 -52113343 -53051970 -53400042
2662e3400042J238358j163419l24963Q16429k39830M42424k133069J878017R32113j172191
$$ -53400042 -52161684 -53325103 -53650066 -52833637 -53073467 -52631043 -54764112 -52886095 -51953982 -53126173
2652e3126173K091195M68850l89248k084443n93754P84628M67721O942J739693q91130
$$ -53126173 -51034978 -50566128 -50955376 -53039819 -53633573 -52848945 -52381224 -52374282 -50634589 -51525719
2642e1525719M80262N97879r73238k67348R65960l8229n52935j122802J723410K73528
$$ -51525719 -51045457 -50447578 -51420816 -51688164 -50722204 -50760433 -51313368 -52436170 -50712760 -50439232
2632e0439232j680956M19329M52122M10219k463599K273256N45430j69162M57836j074174
$$ -50439232 -52120188 -51700859 -51248737 -50838518 -53302117 -51028861 -50483431 -50652593 -50194757 -51268931
2622e1268931O50579n91752P12050J198998Q93204j943738N37799j026495J098234R53442
$$ -51268931 -50618352 -51210104 -50498054 -49299056 -48405852 -50349590 -49811791 -50838286 -49740052 -48786610
2612d8786610p01298m99549m5279j369942M825080N81501J405937j409916J418997J752026
$$ -48786610 -49487908 -49987457 -50032736 -51402678 -46577598 -45996097 -44590160 -46000076 -44581079 -42829053
2602d2829053K328801K46503J19968P6511O12532P52900K082488P11317J032971J814494
$$ -42829053 -40500252 -40253749 -40133781 -40057270 -39444738 -38691838 -36609350 -35898033 -34865062 -33050568
2592c3050568J049578J704759L640507R40800M78322K303802K330641R56775K39457
$$ -33050568 -32000990 -30296231 -26655724 -25714924 -25236602 -22932800 -20602159 -19645384 -19405927
2583a9405927J670974L063885K9758J789169J493220Q5467J270295J636294K661460N90263
$$ -19405927 -17734953 -14671068 -14641310 -12852141 -11358921 -11273454 -10003159 -8366865 -5705405 -5115142
2573e115142J390544K271584J257704J07385K374099J740750K108732J258233K824399
$$ -5115142 -3724598 -1453014 -195310 -87925 2286174 4026924 6135656 7393889 10218288
2564A0218288R89402J378251J938235P89989J759410l05314K940120M78083K765624
$$ 10218288 11207690 12585941 14524176 15314165 17073575 16768261 19708381 20186464 22952088
2555B2952088K063042J239585J178389K938659J132785J253864J344382L897758J649997
$$ 22952088 25015130 26254715 27433104 30371763 31504548 32758412 34102794 38000552 39650549
2546C9650549J630460J545674Q6153m14899J75531J250354Q86678M48699J565700j2831
$$ 39650549 41281009 42826683 42912836 42497937 42673468 43923822 44810500 45259199 46824899 46812068
2536D6812068q3582J347441j823555J403874J725043J064741K284111J645378L75023
$$ 46812068 46728486 48075927 46252372 47656246 49381289 50446030 52730141 54375519 54750542
2527E4750542K380177J416540R76824m58901j796J90726J06617J41367o3612R89973M41891
$$ 54750542 57130719 58547259 59524083 59065182 59063386 59254112 59360729 59502096 59438484 60428457 60870348
2516F0870348J189727K00474O44375J424888M71522R10890N19271O34959Q87348O67321
$$ 60870348 62060075 62260549 62904924 64329812 64801334 65712224 66231495 66866454 67753802 68421123
2506F8421123n71569p27718l20679L46459K47257o783J037256k55702j05721R37994
$$ 68421123 67849554 67121836 66801157 67147616 67394873 67388090 68425346 68169644 68063923 69001917
2496F9001917J307378J12977M129090R0359J562486J51546K35344Q45644o89394J641153
$$ 69001917 70309295 70422272 74551362 74641721 76204207 76355753 76591097 77436741 76747347 78388500
2486G8388500N03969j91680J512974M99679j566312J970564M04559n07807N03967O10023
$$ 78388500 78892469 78700789 80213763 80713442 79147130 81117694 81522253 81014446 81518413 82128436
2476H2128436K00172K143370J475813N97392J278641R45902j076480J110361J506640
$$ 82128436 82328608 84471978 85947791 86545183 87823824 88769726 87693246 88803607 90310247
2467I0310247J531429J179679K707397J349968K712644k2010J282235P51192J366432
$$ 90310247 91841676 93021355 95728752 97078720 99791364 99769354 101051589 101802781 103169213
2458A03169213J355964L82900M824321N79605J870996K414731J957725J670711O73999
$$ 103169213 104525177 104908077 109732398 110312003 112182999 114597730 116555455 118226166 118900165
2449A18900165J517403K567743J108589J021175p0407L95713n8663j118564j174263r73412
$$ 118900165 120417568 122985311 124093900 125115075 125044668 125440381 125381718 124263154 123088891 122115479
2439A22115479j791933j128240J26749k91153k490458k15826K27222j333742j217625
$$ 122115479 120323546 119195306 119322055 119030902 116540444 116324618 116551840 115218098 114000473
2430A14000473L97777r86155L405397L91148n25858K462744j076130k01137m61349Q09142
$$ 114000473 114398250 113412095 116817492 117208640 116682782 119145526 118069396 117868259 117406910 118216052
2420A18216052K786431j105443R19416J622783q90911L19054j98592L02342j237111
$$ 118216052 121002483 119897040 120816456 122439239 121548328 121867382 121668790 121971132 120734021
2411A20734021j073027k793425l87730M64492j031122p58619j143521q61829k168109
$$ 120734021 119660994 116867569 116479839 116944331 115913209 115154590 114011069 113149240 110981131
2402A10981131j495568N84895n97531j481255J355377m55170J54849j67886n49901j312564
$$ 110981131 109485563 110070458 109472927 107991672 109347049 108891879 109046728 108878842 108328941 107016377
2392A07016377Q39742j520245o97783k547939R58937r88649j109093R43199j000117J01394
$$ 107016377 107856119 106335874 105638091 103090152 104049089 103060440 101951347 102894546 101894429 101995823
2382A01995823M18628j060747m15074K642255n53705J6331J440878J278844N37701Q14553
$$ 101995823 102414451 101353704 100938630 103580885 103027180 103043511 104484389 105763233 106300934 107115487
2372A07115487J431013M549510l094460K662471j55276Q48619o82005J781798J271129
$$ 107115487 108546500 113096010 110001550 112664021 112508745 113357364 112675359 114457157 115728286
2363A15728286J312549K435947j032760K059455N63050K532105K283915R84722L088898
$$ 115728286 117040835 119476782 118444022 120503477 121066527 123598632 125882547 126867269 129956167
2354A29956167K830773J925381N175036j114222K011463J781763R92166L560948K115964
$$ 129956167 132786940 134712321 139887357 138773135 140784598 142566361 143558527 147119475 149235439
2345A49235439K518757M940447J260066j272097J344172K84861r1200J020603R50588
$$ 149235439 151754196 156694643 157954709 156682612 158026784 158311645 158220445 159241048 160191636
2336A60191636J549187o55319K55849j16583o14190L35358J222309J568673K184800
$$ 160191636 161740823 161085504 161341353 161224770 160610580 160945938 162168247 163736920 165921720
2327A65921720J947731L308177O52008L328308K875019J423136j480367N930643K274619
$$ 165921720 167869451 171177628 171829636 175157944 178032963 179456099 177975732 183906375 186180994
2318A86180994K528506K871016M235517L629449N114792M709112L921479N366941N007001
$$ 186180994 188709500 191580516 195816033 199445482 204560274 209269386 213190865 218557806 223564807
2309B23564807P116073O247866O302271N794617Q171215P192126Q035585R74365K590145
$$ 223564807 230680880 236928746 243231017 249025634 257196849 264388975 272424560 273398925 275989070
2300B75989070j079566k907718j1441962j0207931q884338p365179q580559p577434
$$ 275989070 274909504 272001786 260559824 250351893 241467555 234102376 225521817 217944383
2292B17944383n408141p077424o881300p684371q136703o802983p903038r018302j0495514
$$ 217944383 212536242 205458818 198577518 190893147 182756444 175953461 168050423 159032121 148536607
2283A48536607q081503r103299r879899j0853700r589817j4986271j3607867j1613803
$$ 148536607 140455104 131351805 121471906 110618206 101028389 86042118 72434251 60820448
2275F0820448j0695711j1984965j1674280r568039p879475p515996o316358n100103
$$ 60820448 50124737 38139772 26465492 16897453 9017978 1501982 -4814376 -9914479
2267i914479m541744k387537j520643k369308r71459j294987j83569j058504N93503M99268
$$ -9914479 -14456223 -16843760 -18364403 -20733711 -21705170 -23000157 -23183726 -24242230 -23648727 -23149459
2257b3149459k180248J01392J367111O38051O16383j26764k77146P07405j51923J63824
$$ -23149459 -25329707 -25228315 -23861204 -23223153 -22606770 -22733534 -23010680 -22303275 -22455198 -22291374
2247b2291374o73640l8001J64945M8090j364961N39600q84714n09725p91355n67648J29664
$$ -22291374 -22965014 -23003015 -22838070 -22789980 -24154941 -23615341 -24500055 -25009780 -25801135 -26368783 -26239119
2236b6239119J170652j484741r08819m78481Q02725p90522J262950o54859j405896Q62074
$$ -26239119 -25068467 -26553208 -27462027 -27940508 -27137783 -27928305 -26665355 -27320214 -28726110 -27864036
2226b7864036j809300N57487r25364J142056k48057j613067r16027l24087q39555J45104
$$ -27864036 -29673336 -29115849 -30041213 -28899157 -29147214 -30760281 -31676308 -32000395 -32839950 -32694846
2216c2694846J14054k48800Q51590j86033K141899j495449K10040K39541N16518M33384
$$ -32694846 -32580792 -32829592 -31978002 -32164035 -30022136 -31517585 -31307545 -31068004 -30551486 -30118102
2206c0118102j468763q139l8717J557120J02748L29062j035142N40372R08042m94656
$$ -30118102 -31586865 -31595004 -31633721 -30076601 -29973853 -29644791 -30679933 -30139561 -29231519 -29726175
2196b9726175r70247J75947J236977j133282L63682l213699P632414Q07518j374424o39423
$$ -29726175 -30696422 -30520475 -29283498 -30416780 -30053098 -33266797 -25634383 -24826865 -26201289 -26840712
2186b6840712K395889n68983J241527P59285n48442J639161j397380J460807J764855
$$ -26840712 -24444823 -25013806 -23772279 -23012994 -23561436 -21922275 -23319655 -21858848 -20093993
2177b0093993J125330K773773M66821J735438L296000j748782L234599J009978K291927
$$ -20093993 -18968663 -16194890 -15728069 -13992631 -10696631 -12445413 -9210814 -8200836 -5908909
2168e908909K638031J965420J932764J551268J618694K326772L105050K705057L483383
$$ -5908909 -3270878 -1305458 627306 2178574 3797268 6124040 9229090 11934147 15417530
2159A5417530L147546J738525J702216K787824K246386L562237L729135K541202K970521
$$ 15417530 18565076 20303601 22005817 24793641 27040027 30602264 34331399 36872601 39843122
2150C9843122J889224L236538K341727M139470L696280L701604M456182M316320K754072
$$ 39843122 41732346 44968884 47310611 51450081 55146361 58847965 63304147 67620467 70374539
2141G0374539M514862M044628M546263N932163M545111M646215O226493M588701M253151
$$ 70374539 74889401 78934029 83480292 89412455 93957566 98603781 104830274 109418975 113672126
2132A13672126O382208P461148P535580P073275P128523P770946Q009179P709412R953844
$$ 113672126 120054334 127515482 135051062 142124337 149252860 157023806 165032985 172742397 182696241
2123A82696241R431032Q182414J1593400Q046694R589387J0864549J1806899J0893835
$$ 182696241 192127273 200309687 211903087 219949781 229539168 240403717 252210616 263104451
2115B63104451J2498764J2319106J2587784J4228865J4443919J4888813J4285318J3412915
$$ 263104451 275603215 287922321 300510105 314738970 329182889 344071702 358357020 371769935
2107C71769935J6767506J6349557J6432780J3693501J4079658J4097920J2765801J3247424
$$ 371769935 388537441 404886998 421319778 435013279 449092937 463190857 475956658 489204082
2099D89204082J2235081J4671843J8792405J2025883J1752393R299253J3614447R129456
$$ 489204082 501439163 516111006 534903411 546929294 558681687 567980940 581595387 590724843
2091E90724843O531638O699635Q492051K339570l729074o903914j658977O44872m19425
$$ 590724843 597256481 603956116 612448167 614787737 611058663 604154749 602495772 603140644 602721219
2082F02721219j256417j591933l638221q063081o792544m732909m456019p613694p164840
$$ 602721219 601464802 599872869 596234648 588171567 581379023 576646114 572190095 564576401 557411561
2073E57411561m905036m827254j0764673j4544040p912483n022903l756790l528068
$$ 557411561 552506525 547679271 536914598 522370558 514458075 509435172 505678382 502150314
2065E02150314j160631k193652k732712q55896N564333M581543K992923J53708M982323
$$ 502150314 500989683 498796031 496063319 495207423 500771756 505353299 508346222 508499930 513482253
2056E13482253N726404M647066L224688L253824O153469O803894N314120N397431L226181
$$ 513482253 519208657 523855723 527080411 530334235 536487704 543291598 548605718 554003149 557229330
2047E57229330N96598j829091O18380K308825j678103r623843j0501431r693628j2194457
$$ 557229330 557825928 555996837 556615217 558924042 557245939 547622096 537120665 527427037 515232580
2038E15232580j0007977j4362424j1388082j4720991j7002016j4817072j7354013k0473811
$$ 515232580 505224603 490862179 479474097 464753106 447751090 432934018 415580005 395106194
2030C95106194k3155961j9100813j2111069j4581097k4144652k9151278k4821730k3385868
$$ 395106194 371950233 352849420 340738351 326157254 302012602 272861324 248039594 224653726
2022B24653726k2515815j9633327j6024503j5305420j5953772j7221857j2827418j0986641
$$ 224653726 202137911 182504584 166480081 151174661 135220889 117999032 105171614 94184973
2014I4184973r533232r475347n550216q034455q517095r457183q584558n421686k385610
$$ 94184973 84651741 75176394 69626178 61591723 53074628 43617445 35032887 29611201 27225591
2005B7225591k754679k372316q70444j256612k13751q63425O45972M24487p0584K461695
$$ 27225591 24470912 22098596 21228152 19971540 19757789 18894364 19540336 19964823 19894239 22355934
1995B2355934q56327r53147o5390j278560o94248p89391o10917j051060j239555n60911
$$ 22355934 21499607 20546460 20481070 19202510 18508262 17718871 17107954 16056894 14817339 14256428
1985A4256428m71900j485009k3288j865228j441075j788387k783083o92010j665215
$$ 14256428 13784528 12299519 12276231 10411003 8969928 7181541 4398458 3706448 2041233
1976B041233k225580J77237k317697j959973J071450Q0818j698403k251322q77260q89833
$$ 2041233 -184347 -7110 -2324807 -4284780 -3213330 -3132512 -4830915 -7082237 -7959497 -8849330
1966h849330j983333p6520L09417q62412k593597n16917o68975k59159K20564j138473
$$ -8849330 -10832663 -10909183 -10599766 -11462178 -14055775 -14572692 -15241667 -15500826 -15280262 -16418735
1956a6418735j468713J517091k1807m84213k11638o40748L25639P13708J261348l69805
$$ -16418735 -17887448 -16370357 -16392164 -16876377 -17088015 -17728763 -17403124 -16689416 -15428068 -15797873
1946a5797873P29888k28573o01973O35241q3520J93972j312887K405670o2380j196216
$$ -15797873 -15067985 -15296558 -15898531 -15263290 -15346810 -15152838 -16465725 -14060055 -14122435 -15318651
1936a5318651Q96640K94317J046184J79258P01183R82058J522777k143087P93073N22952
$$ -15318651 -14422011 -14127694 -13081510 -12902252 -12201069 -11219011 -9696234 -11839321 -11046248 -10523296
1926a0523296q97962M03064K024313K47691J622692Q51475K406664M39424K216101K447909
$$ -10523296 -11421258 -11018194 -8993881 -8746190 -7123498 -6272023 -3865359 -3425935 -1209834 1238075
1916A238075J082161J868530J644845K611305K205835L490506M008297L062531J563704
$$ 1238075 2320236 4188766 5833611 8444916 10650751 14141257 18149554 21212085 22775789
1907B2775789L551734K578601J093867M331974L288014L550052M472372N045858K408228
$$ 22775789 26327523 28906124 29999991 34331965 37619979 41170031 45642403 50688261 53096489
1898E3096489N959977M002179N535768L749812K715408M762378L403407M756047N283345
$$ 53096489 59056466 63058645 68594413 72344225 75059633 79822011 83225418 87981465 93264810
1889I3264810M006951O116263N384303N604148O503695N415245P807664M523572Q924020
$$ 93264810 97271761 103388024 108772327 114376475 120880170 126295415 134103079 138626651 147550671
1880A47550671N825411N874268P642864P259878N117221J0779902P928414P400626
$$ 147550671 153376082 159250350 166893214 174153092 179270313 190050215 197978629 205379255
1872B05379255J1244363J0813197J0430514J1096484J2531395R807632J3139669J2574191
$$ 205379255 216623618 227436815 237867329 248963813 261495208 271302840 284442509 297016700
1864B97016700J2152802J4897117J4337300J5803496J4484271J7489794J4713323J5331800
$$ 297016700 309169502 324066619 338403919 354207415 368691686 386181480 400894803 416226603
1856D16226603K2069700J6078745J7552788J7459712J6958117K0168046J8016711J9433164
$$ 416226603 438296303 454375048 471927836 489387548 506345665 526513711 544530422 563963586
1848E63963586K0126685K0385129K0092252K1419515J7572625J7291450K1315620J9666111
$$ 563963586 584090271 604475400 624567652 645987167 663559792 680851242 702166862 721832973
1840G21832973K0547344J9832677J9678847J8643458J3174653J3655723R430754O201038
$$ 721832973 742380317 762212994 781891841 800535299 813709952 827365675 836796429 842997467
1832H42997467L860121M57549K739899L070199R26338k863170j268010J241130J670503
$$ 842997467 846857588 847315137 850055036 853125235 854051573 851188403 849920393 851161523 852832026
1823H52832026m18207j403017o167482r221266j0408660j3852359j3005501r693869
$$ 852832026 852413819 851010802 844843320 835622054 825213394 811361035 798355534 788661665
1815G88661665j2066890j2170348j1772764r353257p029617p753773n541809j963737
$$ 788661665 776594775 764424427 752651663 743298406 736268789 728515016 722973207 721009470
1807G21009470l553724J396424J080826K892643L775271N035484M966023O662731J0883988
$$ 721009470 717455746 718852170 719932996 722825639 726600910 731636394 736602417 743265148 754149136
1798G54149136J1972638P233565N954082P059021J0583763J3901505J1229902J4465228
$$ 754149136 766121774 773355339 779309421 786368442 796952205 810853710 822083612 836548840
1790H36548840J2583742J3698564J3477795L553410J937946j568476n879155r886094
$$ 836548840 849132582 862831146 876308941 879862351 881800297 880231821 874352666 864466572
1782H64466572j1412869p137198r579070j1719064j3316506j3914796j3373423j4450766
$$ 864466572 853053703 845916505 836337435 824618371 811301865 797387069 784013646 769562880
1774G69562880j5448034k0214533k1560322k6746356l2369966l4295035l3495544l3655966
$$ 769562880 754114846 733900313 712339991 685593635 653223669 618928634 585433090 551777124
1766E51777124l3154397l6076575l7547573l3449174l3909685k7040105k6466941k2808089
$$ 551777124 518622727 482546152 444998579 411549405 377639720 350599615 324132674 301324585
1758C01324585k3139595k0535118j9661897j7943779j4633438j3920133j4381091j4268926
$$ 301324585 278184990 257649872 237987975 220044196 205410758 191490625 177109534 162840608
1750A62840608j3976078j2470078j1767220j0131380q387565o736799m198029l313723
$$ 162840608 148864530 136394452 124627232 114495852 106108287 99371488 95173459 91859736
1742I1859736j459368j259514r67240o41535L07623J659190J229324K591745o81955
$$ 91859736 90400368 89140854 88173614 87532079 87839702 89498892 90728216 93319961 92638006
1733I2638006K341253q76643J751322Q20965l55205M7799J033124J788405R45284J808674
$$ 92638006 94979259 94102616 95853938 96674903 96319698 96367497 97400621 99189026 100134310 101942984
1723A01942984J508687j046734J055256J253985p11921R68767j33443M196010J8574
$$ 101942984 103451671 102404937 103460193 104714178 104002257 104971024 104837581 109033591 109052165
1714A09052165J261887K705891N09757J772449K186657J563734J771947P87280K321831
$$ 109052165 110314052 113019943 113529700 115302149 117488806 119052540 120824487 121611767 123933598
1705A23933598K110825J205765J791812M108505M577125O736101O851417O135654M363387
$$ 123933598 126044423 127250188 129042000 133150505 137727630 144463731 151315148 157450802 161814189
1696A61814189M348932M570191N981271M705752M682044N003413L979152O200913N675808
$$ 161814189 166163121 170733312 176714583 181420335 186102379 191105792 195084944 201285857 206961665
1687B06961665O082105M279837J334961J269164j894293K655161J863503K466544L617129
$$ 206961665 213043770 217323607 218658568 219927732 218033439 220688600 222552103 225018647 228635776
1678B28635776L243595M004612K283514N41036J15987k064462l881971l452137l754991
$$ 228635776 231879371 235883983 238167497 238708533 238824520 236760058 232878087 229425950 225670959
1669B25670959l003915l745677l238086q93555j051859O52834j778278M972771K606570
$$ 225670959 222667044 218921367 215683281 214789726 213737867 214390701 212612423 217585194 220191764
1660B20191764K852063J170451L484353o10088J688400K051567K625633L832470O457667
$$ 220191764 223043827 224214278 227698631 227088543 228776943 230828510 233454143 237286613 243744280
1651B43744280P740424P169106Q369534Q059014P324135Q819341O118655N957363L526381
$$ 243744280 251484704 258653810 267023344 275082358 282406493 291225834 297344489 303301852 306828233
1642C06828233L185635K794712M238863P823810N031211N311054L949865K599009j506838
$$ 306828233 310013868 312808580 317047443 324871253 329902464 335213518 339163383 341762392 340255554
1633C40255554m078441o284111o816043r427806p967536p140826l525053m935213l945087
$$ 340255554 336177113 329893002 323076959 313649153 305681617 298540791 295015738 290080525 286135438
1624B86135438k453665l622558l978481m765655p238737p112626o365201p939642m307148
$$ 286135438 283681773 280059215 276080734 271315079 264076342 256963716 250598515 242658873 238351725
1615B38351725l829714j102485q3881J631988K369435M755279K919048N409313P660558
$$ 238351725 234522011 233419526 233335645 234967633 237337068 242092347 245011395 250420708 258081266
1606B58081266N299709O700382P958045Q113158P714960Q348825Q867316J0624625
$$ 258081266 263380975 270081357 278039402 286152560 293867520 302216345 311083661 321708286
1598C21708286J1911801R579972J0071501R753490Q681826R697922J1381377J1120732
$$ 321708286 333620087 343200059 353271560 363025050 371706876 381404798 392786175 403906907
1590D03906907J1832155J3453964J0612286J1474549J0461656Q112565L507508L940478
$$ 403906907 415739062 429193026 439805312 451279861 461741517 469854082 473361590 477302068
1582D77302068Q46318l857266o838158m865118j607495n971987n318307l095796n899536
$$ 477302068 478148386 474291120 467452962 462587844 460980349 455008362 449690055 446594259 440694723
1573D40694723n980736o764532q505175p704636p867928n973766j777377j45567R97376
$$ 440694723 434713987 427949455 419444280 411739644 403871716 397897950 396120573 395975006 396972382
1564C96972382J067098J722337K655012L337272L035733O24451j432458k144524j009301
$$ 396972382 398039480 399761817 402416829 405754101 408789834 409414285 407981827 405837303 404828002
1555D04828002M52376L522532N980607M424649O384462P164215P351747R353897Q610322
$$ 404828002 405280378 408802910 414783517 419208166 425592628 432756843 440108590 449462487 458072809
1546D58072809Q981359P613483O761676M536506N670438L465514K488745J18776L27744
$$ 458072809 467054168 474667651 481429327 485965833 491636271 495101785 497590530 497709306 498037050
1537D98037050J719244m64787R55605l44632J768832J754817J642332M823999N203972
$$ 498037050 499756294 499291507 500247112 499902480 501671312 503426129 505068461 509892460 515096432
1528E15096432L587556J190109k467189k904730n666294r068953j2413684j4256547
$$ 515096432 518683988 519874097 517406908 514502178 508835884 499766931 487353247 473096700
1520D73096700j3842353j1002277r672465q884377o662024m585060m545246n491424
$$ 473096700 459254347 448252070 438579605 429695228 423033204 418448144 413902898 408411474
1512D08411474n864410m264573o173426j0083320j0316093j0873275p611099j1020625
$$ 408411474 402547064 398282491 392109065 382025745 371709652 360836377 353225278 342204653
1504C42204653r250171p253152q783215m960141o432193k158755k691553p76925J89327
$$ 342204653 332954482 325701330 316918115 311957974 305525781 303367026 300675473 299898548 300087875
1495C00087875J926984Q63994J416332J602007J648536N78424K206836K553112M623273
$$ 300087875 302014859 302878853 304295185 305897192 307545728 308124152 310330988 312884100 317507373
1486C17507373K071385M637818M447206M043139M685610J956051M634318M311571N914396
$$ 317507373 319578758 324216576 328663782 332706921 337392531 339348582 343982900 348294471 354208867
1477C54208867K157441N528544J859969K830974J990381K887760R78300K290534K076580
$$ 354208867 356366308 361894852 363754821 366585795 368576176 371463936 372442236 374732770 376809350
1468C76809350J990731K643297K258534L850065K909496L087873j84921j794079n158568
$$ 376809350 378800081 381443378 383701912 387551977 390461473 393549346 393364425 391570346 386411778
1459C86411778l120423j342995k09784K336849N112980L072825P232710P101962Q108244
$$ 386411778 383291355 381948360 381738576 384075425 389188405 392261230 399493940 406595902 414704146
1450D14704146J0527169R447906N190032N655448N572857O282007Q478479Q698507O517316
$$ 414704146 425231315 434679221 439869253 445524701 451097558 457379565 465858044 474556551 481073867
1441D81073867O774980Q074384P083382N336299N616592N265079N517753L400102M501336
$$ 481073867 487848847 495923231 503006613 508342912 513959504 519224583 524742336 528142438 532643774
1432E32643774K697631L651514R21549J714267o46384R49216k293713j834853m845281
$$ 532643774 535341405 538992919 539914468 541628735 540982351 541931567 539637854 537803001 532957720
1423E32957720n832307l280504l06627j112945l467539l891014o482180j465623K439937
$$ 532957720 527125413 523844909 523538282 522425337 518957798 515066784 508584604 507118981 509558918
1414E09558918L301372M142749M959704R96834L561335N754483O361536M438947K401095
$$ 509558918 512860290 517003039 521962743 522959577 526520912 532275395 538636931 543075878 545476973
1405E45476973l561015J009683M492537O452077P989475N483360R851036R818476J0692668
$$ 545476973 541915958 542925641 547418178 553870255 561859730 567343090 577194126 587012602 597705270
1396E97705270P107731O573752O063061N387389L162109Q214578M953704L132405J425955
$$ 597705270 604813001 611386753 617449814 622837203 625999312 634213890 639167594 642299999 643725954
1387F43725954O26220l717795n361437p987599j1226951j1859170j4605049r239696
$$ 643725954 644352174 640634379 635272942 627285343 616058392 604199222 589594173 580354477
1379E80354477l905180j335091k577693l696635k554183m504100k988807p098355r553609
$$ 580354477 576449297 575114206 572536513 568839878 566285695 561781595 558792788 551694433 542140824
1370E42140824p348982n057487m482137k748042q18179j12100j702420l32470m451560
$$ 542140824 534791842 529734355 525252218 522504176 521685997 521573897 519871477 519539007 515087447
1361E15087447P392900R314398J3162602R565491R673796J2535522J6569798J6963245
$$ 515087447 522480347 531794745 544957347 554522838 564196634 576732156 593301954 610265199
1353F10265199J5865191J4268778J0984282R783384J0720083J4307239J4192511O863271
$$ 610265199 626130390 640399168 651383450 661166834 671886917 686194156 700386667 707249938
1345G07249938R37524K442237L78236j431126l795977j0510176j1385471j2208008
$$ 707249938 708187462 710629699 711007935 709576809 705780832 695270656 683885185 671677177
1337F71677177j7960531j7482181j6948494j1310508j4345176j4760386j4707696j5767353
$$ 671677177 653716646 636234465 619285971 607975463 593630287 578869901 564162205 548394852
1329E48394852j3458225j7268461j7451417j8500758j6996465j7770722j9413016j9971696
$$ 548394852 534936627 517668166 500216749 481715991 464719526 446948804 427535788 407564092
1321D07564092j3720072p010594n048290m090205k197033K268601M395495O838879
$$ 407564092 393844020 386833426 381785136 377694931 375497898 377766499 382161994 389000873
1313C89000873J1335024J4871872J3560104J7359702J8750075J5274081J5357785J7635706
$$ 389000873 400335897 415207769 428767873 446127575 464877650 480151731 495509516 513145222
1305E13145222J2830572J5578254J2082154R474336N519255J376938k47446l154170
$$ 513145222 525975794 541554048 553636202 563110538 568629793 570006731 569759285 566605115
1297E66605115j0221456j2924538j0716028m992327q879671j1672182j4481117j6574568
$$ 566605115 556383659 543459121 532743093 527750766 518871095 507198913 492717796 476143228
1289D76143228j7484690k0750350j8937963j8130639j8420112k5155671k7958391k6500333
$$ 476143228 458658538 437908188 418970225 400839586 382419474 357263803 329305412 302805079
1281C02805079k2333733j8957714k0906182k2622816k1102628j5940698j2500542p538364
$$ 302805079 280471346 261513632 240607450 217984634 196882006 180941308 168440766 160902402
1273A60902402q460083K06825j244359O01187L413574K142796N727652N634786M808191
$$ 160902402 152442319 152649144 151404785 152005972 155419546 157562342 163289994 168924780 173732971
1264A73732971Q981264O231380L974286O891758L905772O777630N113839M81947J560608
$$ 173732971 182714235 188945615 192919901 199811659 203717431 210495061 215608900 216090847 217651455
1255B17651455J932704L82812R99546n425155p357598q252331p353994p873206q220997
$$ 217651455 219584159 219966971 220966517 215541362 208183764 199931433 192577439 184704233 176483236
1246A76483236l571444m565014q040680p508395q585489o944331j1885948j7573091
$$ 176483236 172911792 168346778 160306098 152797703 144212214 137267883 125381935 107808844
1238A07808844j6251907j4878076j1977396r506121r460091q257015o204886m917707
$$ 107808844 91556937 76678861 64701465 55195344 45735253 37478238 31273352 26355645
1230B6355645n635151k906675j579158k375605Q66536j229713L009567L1074J383546
$$ 26355645 20720494 17813819 16234661 13859056 14725592 13495879 16505446 16536520 17920066
1221A7920066r25655j697301r79190n39143j125495O55065J526999K282809n33672j84843
$$ 17920066 16994411 15297110 14317920 13778777 12653282 13308347 14835346 17118155 16584483 16399640
1211A6399640j79024Q02684O75602K18783j633897n62985N84318m39166l06601n70030
$$ 16399640 16220616 17023300 17698902 17917685 16283788 15720803 16305121 15865955 15559354 14989324
1201A4989324J126473N10066r49077n28136J471553j486990l11269M45860l93062Q35641
$$ 14989324 16115797 16625863 15676786 15148650 16620203 15133213 14821944 15267804 14874742 15710383
1191A5710383j011750J526226j711687Q1130p65542J293449j7591q25263j215447m39776
$$ 15710383 14698633 16224859 14513172 14594302 13828760 15122209 15104618 14279355 13063908 12624132
1181A2624132k74394L53283R4709K3299j56675j271601k800395M10165J328202k18795
$$ 12624132 12349738 12703021 12797730 12821029 12664354 11392753 8592358 9002523 10330725 10111930
1171A0111930J325601J493633p043N78712P6171K606227n786515p88676K926057j17767
$$ 10111930 11437531 12931164 12924121 13502833 13579004 16185231 10398716 9610040 12536097 12418330
1161A2418330J310372q63688m32717L161911L31085j51430Q97097K078529j591684J662256
$$ 12418330 13728702 12865014 12432297 15594208 15925293 15773863 16670960 18749489 17157805 18820061
1151A8820061J800971K103615K465903K572183L039808K401815K773240K556595J036623
$$ 18820061 20621032 22724647 25190550 27762733 30802541 33204356 35977596 38534191 39570814
1142C9570814M50923J744996L283501J45714P01942k63925k605320p10690J052491j221506
$$ 39570814 40021737 41766733 45050234 45195948 45897890 45633965 43028645 42317955 43370446 42148940
1132D2148940q29612M433J734462R63075N43640J349459N681187L749883M693635L429431
$$ 42148940 41319328 41323761 43058223 44021298 44564938 45914397 51595584 55345467 60039102 63468533
1122F3468533K994684K470547Q50813J552755J810892O54386M384350k926600J266830
$$ 63468533 66463217 68933764 69784577 71337332 73148224 73802610 78186960 75260360 76527190
1113G6527190m41370K81081L099699K767753O489119L553416N555423N448180M226257
$$ 76527190 76085820 76366901 79466600 82234353 88723472 92276888 97832311 103280491 107506748
1104A07506748Q231873O404057N983930O662901N336517O145166O009880O385651M788459
$$ 107506748 115738621 122142678 128126608 134789509 140126026 146271192 152281072 158666723 163455182
1095A63455182N905202N590740M712832O028383L448344P704310O400412O602170Q731532
$$ 163455182 169360384 174951124 179663956 185692339 189140683 196844993 203245405 209847575 218579107
1086B18579107J1845147J0239900J2974228J4012669J2680928J1445257J6245735J3791913
$$ 218579107 230424254 240664154 253638382 267651051 280331979 291777236 308022971 321814884
1078C21814884J3875627J3180752J0714488P917949R698231P599507P979754l9981m806273
$$ 321814884 335690511 348871263 359585751 367503700 377201931 384801438 392781192 392741211 387934938
1069C87934938o797708o532800o042185n02611n43131n50735k204719k84961j595733
$$ 387934938 381137230 374604430 368562245 368059634 367516503 366965768 364761049 364476088 362880355
1060C62880355j003278m722586o582212o688208m747097j437427K516526M12483j536801
$$ 362880355 361877077 357154491 350572279 343884071 339136974 337699547 340216073 340628556 339091755
1051C39091755O00410M900229P013674M403063N611889R683543J0226931J1990895
$$ 339091755 339692165 344592394 351606068 356009131 361621020 371304563 381531494 393522389
1043C93522389J0475253J2385122J5144023J8281706J9185525K0342567K0534511K6956650
$$ 393522389 403997642 416382764 431526787 449808493 468994018 489336585 509871096 536827746
1035E36827746K7060884K7132333K4542850K5153777K3238874K4822043K0576030J5225213
$$ 536827746 563888630 591020963 615563813 640717590 663956464 688778507 709354537 724579750
1027G24579750P519972J98370q30547N563779K339467j2213651k3054591k8166697
$$ 724579750 732099722 732298092 731467545 737031324 739370791 727157140 704102549 675935852
1019F75935852k0458261j2224571n510999j837613m701560j0850812q115927p051808
$$ 675935852 655477591 643253020 637742021 635904408 631202848 620352036 612236109 605184301
1011F05184301n467134j1802198k1353896k4255222j6914759o963414N32108J361124
$$ 605184301 599717167 587914969 566561073 542305851 525391092 518427678 518959786 520320910
1003E20320910K121250Q80669M462106O235998J1010787J4475967K0608433K6110761
$$ 520320910 522442160 523322829 527784935 534020933 545031720 559507687 580116120 606226881
995F06226881K8911561L0316576K7144894K4582641K8418275L3270977L6141444L1900776
$$ 606226881 635138442 665455018 692599912 717182553 745600828 778871805 815013249 846914025
987H46914025K5720041K2324389K4633296K8028417K8431618L1183070L5960197K3255978
$$ 846914025 872634066 894958455 919591751 947620168 976051786 1007234856 1043195053 1066451031
979A066451031J4605327R413380Q720448J1737158J1541445P595338N040881J3053096
$$ 1066451031 1081056358 1090469738 1099190186 1110927344 1122468789 1130064127 1135105008 1148158104
971A148158104K0490845K6695055L2135701K8595906K4919127J5381083J2266040J2830283
$$ 1148158104 1168648949 1195344004 1227479705 1256075611 1280994738 1296375821 1308641861 1321472144
963A321472144K0370713K6723958L1419479K0704239m660762r867176K0611753M5459216
$$ 1321472144 1341842857 1368566815 1399986294 1420690533 1416029771 1406162595 1426774348 1472233564
955A472233564L7735326k6356525r0761648j00421174o6285822k8361251p970825J0388810
$$ 1472233564 1509968890 1483612365 1392850717 1292429543 1226143721 1197782470 1189811645 1200200455
947A200200455K3787918L2728404L6654363L6816312L0698071L1961136N1048659P5837777
$$ 1200200455 1223988373 1256716777 1293371140 1330187452 1360885523 1392846659 1443895318 1519733095
939A519733095P9775141N6012189N285653k4738778q303486J6163225J7387246j9627853
$$ 1519733095 1599508236 1655520425 1660806078 1636067300 1627763814 1643927039 1661314285 1641686432
931A641686432o9857292p0912064k6359909K4512137M9365909N7587727O5390418N3975199
$$ 1641686432 1571829140 1500917076 1474557167 1499069304 1548435213 1606022940 1671413358 1725388557
923A725388557M6630751N5873652Q6596796Q7964513L0107986l0087894Q02438O9542758
$$ 1725388557 1772019308 1827892960 1914489756 2002454269 2032562255 2002474361 2003276799 2072819557
915B072819557P4664090n8569828k49542295l34107229k69701044j66992018r2729748
$$ 2072819557 2147483647 2088913819 1839371524 1505264295 1235563251 1068571233 975841485
908I75841485n3767543j3205713J4301762K0345989J3460819J2269303K2951399M3654862
$$ 975841485 922073942 908868229 923169991 943515980 956976799 969246102 992197501 1035852363
900A035852363O5291652Q5524382R1192146Q3610324M4091352k2183848n1336051j365974
$$ 1035852363 1101144015 1186668397 1277860543 1361470867 1405562219 1383378371 1332042320 1330676346
892A330676346N1725579K4100923j09373775k45595380k69430201j98586968j18892583
$$ 1330676346 1382401925 1406502848 1297129073 1051533693 782103492 583516524 464623941
885D64623941p1891660m6550606k5997743k7011286m5942810n4695612m6829134k4165492
$$ 464623941 392732281 346181675 320183932 293172646 247229836 192534224 145705090 121539598
877A21539598M691515K3117131K0887055j24919j6203288j5644975l223577M569939
$$ 121539598 126231113 149348244 170235299 170110380 153907092 138262117 135038540 139608479
869A39608479J996478j202474p148552N71652J1067221J4895824R681763J580377L092893
$$ 139608479 141604957 140402483 133253931 133825583 144892804 159788628 169470391 171050768 174143661
860A74143661N769185L527667j742666j2670439j7887282j2280861J647251O041315
$$ 174143661 179912846 183440513 181697847 169027408 151140126 138859265 140506516 146547831
852A46547831N158501k93165p321061p130131j912724M253899K593228m045980K258067
$$ 146547831 151706332 151413167 144092106 136961975 135049251 139303150 141896378 137850398 140108465
843A40108465k322709j331887j491302j127103n510525n394193q293317n361957k519543
$$ 140108465 137785756 136453869 134962567 133835464 128324939 122930746 114637429 109275472 106755929
834A06755929j652235j0189719j0784025p583727L338912P619398P719981N345104j391021
$$ 106755929 105103694 94913975 84129950 76546223 79885135 87504533 95224514 100569618 99178597
825I9178597n061640j0175502q803761q193142n671722L05711J451989k012216k125613
$$ 99178597 94116957 83941455 75137694 66944552 61272830 61578541 63030530 61018314 58892701
816E8892701M45014R30971o24219k74277l21767l704901m022180j649326M098911N56635
$$ 58892701 59337715 60268686 59644467 59370190 59048423 55343522 51321342 49672016 53770927 54327562
806E4327562K39504j712385k127851k470481r82670j704494p78152j272682k119555Q8736
$$ 54327562 54567066 52854681 50726830 48256349 47273679 45569185 44791033 43518351 41398796 41487532
796D1487532J623813l28747p74150m476023l750105l704202o76146R62872J285995m03626
$$ 41487532 43111345 42782598 42008448 37532425 33782320 30078118 29401972 30364844 31650839 31247213
786C1247213j805892k18669j935523k129068l27545k817249l261167p33506j169441
$$ 31247213 29441321 29222652 27287129 25158061 24830516 22013267 18752100 18018594 16849153
777A6849153J161893L150567M259553P17555O55276K78585K098902q96364k432220l355734
$$ 16849153 18011046 21161613 25421166 26138721 26793997 27072582 29171484 28275120 25842900 22487166
767B2487166j607626n60557k733836J309905M38818j263403J81581K218834l387727
$$ 22487166 20879540 20318983 17585147 18895052 19333870 18070467 18252048 20470882 17083155
758A7083155J090476q3931R18302K898871N42986J234610J931658L96231J619116N83083
$$ 17083155 18173631 18089700 19008002 21906873 22449859 23684469 25616127 26012358 27631474 28214557
748B8214557O04711j87718J044823o468376M62189Q38485q30543p70860p23416j133625
$$ 28214557 28819268 28631550 29676373 23207997 23670186 24508671 23678128 22907268 22183852 21050227
738B1050227L70633m44461Q51894J179301j066096o3763m96135K226713q17800J276247
$$ 21050227 21420860 20976399 21828293 23007594 21941498 21877735 21381600 23608313 22790513 24066760
728B4066760L65513j602040N27186q19638j371410o17206M87971P16992L33289O68627
$$ 24066760 24432273 22830233 23357419 22537781 21166371 20549165 21037136 21754128 22087417 22756044
718B2756044O31835p09899M91168k069426n29331J460449p14393l39787J74822j379791
$$ 22756044 23387879 22677980 23169148 21099722 20570391 22030840 21316447 20976660 21151482 19771691
708A9771691p11646k094099K19880o46302n75838k28785p88136R07607j333218o08837
$$ 19771691 19060045 16965946 17185826 16539524 15963686 15734901 14946765 15854372 14521154 13912317
698A3912317K141425K187634L43095o90942J559232o27014K575j001046o55217Q35383
$$ 13912317 16053742 18241376 18584471 17893529 19452761 18825747 18828322 17827276 17172059 18007442
688A8007442Q05128m80891K18063j324530n35255k449179j109584l16752R9157P94796
$$ 18007442 18812570 18331679 18549742 17225212 16689957 14240778 13131194 12814442 12913599 13708395
678A3708395L251890O70224o5709j356147p45697Q89778R4205j008778R24214M56244
$$ 13708395 16960285 17630509 17564800 16208653 15462956 16352734 16446939 15438161 16362375 16818619
668A6818619j096496p45012Q1941j636797K435421n41892n40539L63886j343541k59913
$$ 16818619 15722123 14977111 15059052 13422255 15857676 15315784 14775245 15139131 13795590 13535677
658A3535677j191899J943345r2046J418737K65795m56496p72553k066700P18752j33787
$$ 13535677 12343778 14287123 14195077 15613814 15879609 15423113 14650560 12583860 13302612 13168825
648A3168825p58562m73757j365211O80340j770505j147592j306872O25175J732546j143381
$$ 13168825 12410263 11936506 10571295 11251635 9481130 8333538 7026666 7651841 9384387 8241006
638H241006N71223j59454o55700j06545N04926K40188j632876J564487o63517L47638
$$ 8241006 8812229 8652775 7997075 7890530 8395456 8635644 7002768 8567255 7903738 8251376
628H251376j820033q89134P15053m68097J151121l39882K3680j540016j658969M6982
$$ 8251376 6431343 5542209 6257262 5789165 6940286 6600404 6624084 5084068 3425099 3472081
618C472081L185170o91307m53895l77047R83955j705262m87020m20490J498984j441534
$$ 3472081 6657251 5965944 5512049 5135002 6118957 4413695 3926675 3506185 5005169 3563635
608C563635M67422l85484o88488O55046k136176J15971j274169n6347M41436N01677j72527
$$ 3563635 4031057 3645573 2957085 3612131 1475955 1591926 317757 261410 702846 1204523 1031996
597A031996k68594l20240J047521n99917R47962j438553o33401J414125n53254L11215
$$ 1031996 763402 443162 1490683 890766 1838728 400175 -233226 1180899 627645 938860
587I38860j44121Q93076j382345K114747k12549j382342r24779m96364q3701k87316
$$ 938860 794739 1687815 305470 2420217 2207668 825326 -99453 -595817 -679518 -966834
577i66834j038701L68014J756305j724675o2230K007140m82099l06034j35323J173374
$$ -966834 -2005535 -1637521 118784 -1605891 -1668121 339019 -143080 -449114 -584437 588937
567E88937j293912q56668P02006K79780p48846J937452r06062K13072M61221j541304
$$ 588937 -704975 -1561643 -859637 -579857 -1328703 608749 -297313 -84241 376980 -1164324
557a164324j834336J153150M91952j236127J062038K11890j716723J351620O16270r61986
$$ -1164324 -2998660 -1845510 -1353558 -2589685 -1527647 -1315757 -3032480 -1680860 -1064590 -2026576
547b026576M35176O14690j307941O98209L32522j246205R01069k35187J135395N73611
$$ -2026576 -1591400 -976710 -2284651 -1586442 -1253920 -2500125 -1599056 -1834243 -698848 -125237
537a25237j629222o86766K114565p42830j849839J436531m33505j332050P16674n29265
$$ -125237 -1754459 -2441225 -326660 -1069490 -2919329 -1482798 -1916303 -3248353 -2531679 -3060944
527c060944K744665j625943p49762j60317k62512j336499K096504J94750j368202J493465
$$ -3060944 -316279 -1942222 -2691984 -2852301 -3114813 -4451312 -2354808 -2160058 -3528260 -2034795
517b034795j517439J043011j031689R2160o79506Q48870q82431M93133l38499M07265
$$ -2034795 -3552234 -2509223 -3540912 -3448752 -4128258 -3279388 -4161819 -3668686 -4007185 -3599920
507c599920O99281r4267j490718m33585l80658P44571p35851o9352j40954J401966j09194
$$ -3599920 -2900639 -2994906 -4485624 -4919209 -5299867 -4555296 -5291147 -5360499 -5501453 -4099487 -4208681
496d208681J70127k10150j77625m24172l85356j943867J701005J523482n94967J501849
$$ -4208681 -4038554 -4248704 -4426329 -4850501 -5235857 -7179724 -5478719 -3955237 -4550204 -3048355
486c048355j548319M52354L49785j703055o27868N604K856906p4247j836018j460800
$$ -3048355 -4596674 -4144320 -3794535 -5497590 -6125458 -6119854 -3262948 -3337195 -5173213 -6634013
476f634013R84879J123613j183026J387016l058677J980579l65050J8316J29262O13582
$$ -6634013 -5649134 -4525521 -5708547 -4321531 -7380208 -5399629 -5764679 -5746363 -5617101 -5003519
466e003519p56213J156642j249659P19249n29244o11739P51359k60385M17836j439862
$$ -5003519 -5759732 -4603090 -5852749 -5133500 -5662744 -6274483 -5523124 -5783509 -5365673 -6805535
456f805535J294963j643398k56336J351550J71532j082762J043633l93410J138021o10039
$$ -6805535 -5510572 -7153970 -7410306 -6058756 -5887224 -6969986 -5926353 -6319763 -5181742 -5791781
446e791781r44214P27915K2155Q27787q4890l41220m70951L49985J17127o33064j60814
$$ -5791781 -6735995 -6008080 -5985925 -5158138 -5243028 -5584248 -6055199 -5705214 -5588087 -6221151 -6381965
435f381965J384455k80584m54536j958826L23838L72313J356392k834110J554946J862077
$$ -6381965 -4997510 -5278094 -5732630 -7691456 -7367618 -6995305 -5638913 -8473023 -6918077 -5056000
425e056000j98901K30725j152318j103966K48597Q56375j179083O5491M67460L23311
$$ -5056000 -5254901 -5024176 -6176494 -7280460 -7031863 -6175488 -7354571 -7289080 -6821620 -6498309
415f498309k76591Q62298p32135k15949L511947k148359j848144l123682K790124P65450
$$ -6498309 -6774900 -5912602 -6644737 -6860686 -3348739 -5497098 -7345242 -10468924 -7678800 -6913350
405f913350O74797K0632r48609j740088P32302j241432J056970Q3601M93829m3987l1404
$$ -6913350 -6238553 -6217921 -7166530 -8906618 -8174316 -9415748 -8358778 -8275177 -7781348 -7825335 -7856739
394g856739k47369J125527M681L13004l33442K69938M68513J92273p69740Q1157j464882
$$ -7856739 -8104108 -6978581 -6973900 -6660896 -6994338 -6724400 -6255887 -6063614 -6833354 -6752197 -8217079
383h217079n55074L46776L14977j47718l1554P36997n60936n9489O48309n46511L50726
$$ -8217079 -8772153 -8425377 -8110400 -8258118 -8289672 -7552675 -8113611 -8173100 -7524791 -8071302 -7720576
372g720576k78036k33708j134088M70799j089260J514999Q89405K7816M02781j498531
$$ -7720576 -7998612 -8232320 -9366408 -8895609 -9984869 -8469870 -7580465 -7552649 -7149868 -8648399
362h648399p53165O31482R95506q7933j410112r56301J533108o82257k80701k68477Q32284
$$ -8648399 -9401564 -8770082 -7774576 -7862509 -9272621 -10228922 -8695814 -9378071 -9658772 -9927249 -9094965
351i094965j198987J364674k56603k388177J456778j298372J046580N09918p98290Q98864
$$ -9094965 -10293952 -8929278 -9185881 -11574058 -10117280 -11415652 -10369072 -9859154 -10657444 -9758580
341i758580q30621J383590m09362k197646L28018J606943j786422K628386p51039L31866
$$ -9758580 -10589201 -9205611 -9614973 -11812619 -11484601 -9877658 -11664080 -9035694 -9786733 -9454867
331i454867n25630m41657K58135j72028q17237P83316j102706J311596R30485L48226
$$ -9454867 -9980497 -10422154 -10164019 -10336047 -11153284 -10369968 -11472674 -10161078 -9230593 -8882367
321h882367k603178K023011N63977m453305J324294J30535r0254R92754p84609j94007
$$ -8882367 -11485545 -9462534 -8898557 -13351862 -12027568 -11897033 -11987287 -10994533 -11779142 -11973149
311a1973149R76170P00817j903586j20389J380059M11252M5528j219677K37005J058613
$$ -11973149 -10996979 -10296162 -12199748 -12320137 -10940078 -10528826 -10483298 -11702975 -11465970 -10407357
301a0407357q82911R0030j015039L92395O66063j101158J016142L13469m72527J53185
$$ -10407357 -11290268 -11200238 -12215277 -11822882 -11156819 -12257977 -11241835 -10928366 -11400893 -11247708
291a1247708J331111n97822o07800O94181m98196q15830M9325p28464J6847K05878P56424
$$ -11247708 -9916597 -10514419 -11122219 -10428038 -10926234 -11742064 -11692739 -12421203 -12404356 -12198478 -11442054
280a1442054l6003k54214N10253j137028p01130J51323J579372n4036M30825r64485M16061
$$ -11442054 -11478057 -11732271 -11222018 -12359046 -13060176 -12908853 -11329481 -11383517 -10952692 -11917177 -11501116
269a1501116j484438J089525k8019P0580O02286j860274J183182m73573N27402J140857
$$ -11501116 -12985554 -11896029 -11924048 -11853468 -11251182 -13111456 -11928274 -12401847 -11874445 -10733588
259a0733588m88089k142618J123669R39260j206633q03791L57819L97096j144862J442934
$$ -10733588 -11221677 -13364295 -12240626 -11301366 -12507999 -13311790 -12953971 -12556875 -13701737 -12258803
249a2258803k206842J688620K28502m68680J95009k08661O89588m69388l92132n78095
$$ -12258803 -14465645 -12777025 -12548523 -13017203 -12822194 -13030855 -12341267 -12810655 -13202787 -13780882
239a3780882N14420k0130P61956k92561l23541M35059p5161J01181P37135j004355R69550
$$ -13780882 -13266462 -13286592 -12524636 -12817197 -13140738 -12705679 -12780840 -12679659 -11942524 -12946879 -11977329
228a1977329p54047j096786K40510J418777r55954J85715j3834n95319J171352j128875
$$ -11977329 -12731376 -13828162 -13587652 -12168875 -13124829 -12939114 -12952948 -13548267 -12376915 -13505790
218a3505790o45020L42631J096106j391819M48585j35885K56948r69090N13014k42974
$$ -13505790 -14150810 -13808179 -12712073 -14103892 -13655307 -13791192 -13534244 -14503334 -13990320 -14233294
208a4233294L78683K00135m98990l14957O06869q86351j70884Q82993L12148J045154
$$ -14233294 -13854611 -13654476 -14153466 -14468423 -13861554 -14747905 -14918789 -14035796 -13723648 -12678494
198a2678494j626295O73033L71153J48017j121091K52206P69142k10311j130303N69472
$$ -12678494 -14304789 -13631756 -13260603 -13112586 -14233677 -13981471 -13212329 -13422640 -14552943 -13983471
188a3983471p05330j34305j54989O56801o44913r47299J561717K568140p41147j672148
$$ -13983471 -14688801 -14823106 -14978095 -14321294 -14966207 -15913506 -14351789 -11783649 -12524796 -14196944
178a4196944N4829j221545K06294K39508M63323L535835l251642j39185P67280l099225
$$ -14196944 -14142115 -15363660 -15157366 -14917858 -14454535 -10918700 -14170342 -14309527 -13542247 -16641472
168a6641472K685303j081300L25322l22942q90842n46784K248884n73613n23676j4576
$$ -16641472 -13956169 -15037469 -14712147 -15035089 -15925931 -16472715 -14223831 -14797444 -15321120 -15335696
158a5335696j69741J380557j354546r951J670804j356940J66416j497774J326428R22069
$$ -15335696 -15505437 -14124880 -15479426 -15489377 -13818573 -15175513 -15009097 -16506871 -15180443 -14258374
148a4258374m69377L82648k56509j436252M49493J05593J931300N89348l286837Q52255
$$ -14258374 -14727751 -14345103 -14601612 -16037864 -15588371 -15482778 -13551478 -12962130 -16248967 -15396712
138a5396712k39231n82385k08211K27411q05104J124884j8904M12773j394932j486477
$$ -15396712 -15635943 -16218328 -16426539 -16199128 -17004232 -15879348 -15898252 -15485479 -16880411 -18366888
128a8366888L305655K75164k259059L78240k079417L016608J158668r78623m4534M78765
$$ -18366888 -15061233 -14786069 -17045128 -16666888 -18746305 -15729697 -14571029 -15549652 -15594186 -15115421
118a5115421K1453j120571P78733Q83457p76047O23243J876739j794460l29403j69163
$$ -15115421 -15093968 -16214539 -15435806 -14552349 -15328396 -14705153 -12828414 -14622874 -14952277 -15121440
108a5121440Q74997m54039p07750q01976N07259P88333K73991J64584j342482R7734j81574
$$ -15121440 -14246443 -14700482 -15408232 -16210208 -15702949 -14914616 -14640625 -14476041 -15818523 -15720789 -15902363
97a5902363R0081J228020j802508J379394j04564K3883J47746j413934j98685M04332
$$ -15902363 -15812282 -14584262 -16386770 -15007376 -15111940 -15088057 -14940311 -16354245 -16552930 -16148598
87a6148598p39891j959723J222774n96534J011336J067075Q67672j406137K51940M32856
$$ -16148598 -16888489 -18848212 -17625438 -18221972 -17210636 -16143561 -15275889 -16682026 -16430086 -15997230
77a5997230j224081M34366l28129j501448k36257J314862J240849J150952j762980o27880
$$ -15997230 -17221311 -16786945 -17115074 -18616522 -18852779 -17537917 -16297068 -15146116 -16909096 -17536976
67a7536976J172316o12565M66451J372497k098056k73611N54750J38904O12526k52466
$$ -17536976 -16364660 -16977225 -16510774 -15138277 -17236333 -17509944 -16955194 -16816290 -16203764 -16456230
57a6456230j281793J7786l98075L302868j829542q9289J746810j835576Q96750J32758
$$ -16456230 -17738023 -17720237 -18118312 -14815444 -16644986 -16734275 -14987465 -16823041 -15926291 -15793533
47a5793533j529012J721797p92449j005788N40709R3980j0933p40340n84958j95221R12928
$$ -15793533 -17322545 -15600748 -16393197 -17398985 -16858276 -16764296 -16775229 -17515569 -18100527 -18295748 -17382820
36a7382820P69842L4074k270120L934721l555918L90329Q03474j6036j687835L142226
$$ -17382820 -16612978 -16578904 -18849024 -14914303 -18470221 -18079892 -17276418 -17292454 -18980289 -15838063
26a5838063l8623j064087p64442r14218J00337K26367p3545j546304M47741J014983N86277
$$ -15838063 -15876686 -16940773 -17705215 -18619433 -18519096 -18292729 -18366274 -19912578 -19464837 -18449854 -17863577
15a7863577k21100P3122Q29752p32030k35591k37456O89563J30925L90812K11175m66160
$$ -17863577 -18084677 -18011555 -17181803 -17913833 -18149424 -18386880 -17697317 -17566392 -17175580 -16964405 -17430565
4a7430565k5121j25460P20924M06627j561929J298204p04978Q24082j093414J26562l27479
$$ -17430565 -17455686 -17581146 -16860222 -16453595 -18015524 -16717320 -17422298 -16598216 -17691630 -17565068 -17892547
-7a7892547M79985m41462q55513N1896j44666K166707j475330n24634J973844p67336
$$ -17892547 -17412562 -17854024 -18709537 -18657641 -18802307 -16635600 -18110930 -18635564 -16661720 -17429056
-17a7429056j041276o99279Q20444k29228j8680j991006J722612N07125r41151j11642
$$ -17429056 -18470332 -19169611 -18349167 -18578395 -18597075 -20588081 -18865469 -18358344 -19299495 -19411137
-27a9411137N9503R3508l0229J94009J504962l29578N56616m66536r04996M35800k19288
$$ -19411137 -19351634 -19258126 -19288355 -19094346 -17589384 -17918962 -17362346 -17828882 -18733878 -18298078 -18517366
-38a8517366J026874l2215O38448k175734J260655L37603J72270l48070j74371m71971
$$ -18517366 -17490492 -17522707 -16884259 -19059993 -17799338 -17461735 -17289465 -17637535 -17811906 -18283877
-48a8283877P85240q87113j40589J139024j616745J059105m1754j033116j314487Q08007
$$ -18283877 -17498637 -18385750 -18526339 -17387315 -19004060 -17944955 -17986709 -19019825 -20334312 -19526305
-58a9526305O85959P33468J89451K5855j576822J994451j715919J142850L37070J98563
$$ -19526305 -18840346 -18106878 -17917427 -17891572 -19468394 -17473943 -19189862 -18047012 -17709942 -17511379
-68a7511379j482390Q27773N17825k98302m89098p03369n27918j37256J589976m88205
$$ -17511379 -18993769 -18165996 -17648171 -17946473 -18435571 -19138940 -19666858 -19804114 -18214138 -18702343
-78a8702343j12757K15110N09661o01208j446214J92859R57558j018383o0067L68051
$$ -18702343 -18815100 -18599990 -18090329 -18691537 -20137751 -19944892 -18987334 -20005717 -20065784 -19697733
-88a9697733j49913N57607N16795J054324r81000Q9656M9269m482Q4759m76692M33866
$$ -19697733 -19847646 -19290039 -18773244 -17718920 -18699920 -18610264 -18560995 -18565477 -18480718 -18957410 -18523544
-99a8523544N7156k711974J617585J164657p78204j92098L30427J001188j411213m99948
$$ -18523544 -18466388 -21178362 -19560777 -18396120 -19174324 -19366422 -19035995 -18034807 -19446020 -19945968
-109a9945968r82444J733376J7611J72459R87281M99401j176438j466492K290120q33623
$$ -19945968 -20928412 -19195036 -19177425 -19004966 -18017685 -17518284 -18694722 -20161214 -17871094 -18704717
-119a8704717L4398N7140J65224j653341P57667j85107O86716q65355J457667q94732
$$ -18704717 -18670319 -18613179 -18447955 -20101296 -19343629 -19528736 -18842020 -19707375 -18249708 -19144440
-129a9144440M50686r04809P58208j52077j112542Q67317q9523N38249K210156r69051
$$ -19144440 -18693754 -19598563 -18840355 -18992432 -20104974 -19237657 -19327180 -18788931 -16578775 -17547826
-139a7547826l70348j780442R26854j377003l8194m66119J128112j541689j02253K134348
$$ -17547826 -17918174 -19698616 -18771762 -20148765 -20186959 -20653078 -19524966 -21066655 -21168908 -19034560
-149a9034560m60124m44474J32395j964518Q98103K070867p96066j093858l79333K56105
$$ -19034560 -19494684 -19939158 -19806763 -21771281 -20873178 -18802311 -19598377 -20692235 -21071568 -20815463
-159b0815463N89243J95370O67710j18414l41396O95886L49944J45301k70887j479221
$$ -20815463 -20226220 -20030850 -19363140 -19481554 -19822950 -19127064 -18777120 -18631819 -18902706 -20381927
-169b0381927N06346p55351K489305n03132q98815n57113p85796q7937k666612L090874
$$ -20381927 -19875581 -20630932 -18141627 -18644759 -19543574 -20100687 -20886483 -20974420 -23641032 -20550158
-179b0550158O22906J56721j112949J518091j55258l480278J487337J679809J630994
$$ -20550158 -19927252 -19770531 -20883480 -19365389 -19520647 -23000925 -21513588 -19833779 -18202785
-188a8202785p92966N16383p39888n48988J714624p84687j392765j01570l35622J67556
$$ -18202785 -18995751 -18479368 -19219256 -19768244 -18053620 -18838307 -20231072 -20332642 -20668264 -20500708
-198b0500708J62084l10555P55100j033543P43763l23369J60447J706550p50640K13680
$$ -20500708 -20338624 -20649179 -19894079 -20927622 -20183859 -20507228 -20346781 -18640231 -19390871 -19177191
-208a9177191r03336J77820J080928q45665k23738P54041o65239n16604p70613L30839
$$ -19177191 -20080527 -19902707 -18821779 -19667444 -19891182 -19137141 -19802380 -20318984 -21089597 -20758758
-218b0758758J306767k44274L07124k010426O60294J287903j195071J291344O24819
$$ -20758758 -19451991 -19696265 -19389141 -21399567 -20739273 -19451370 -20646441 -19355097 -18730278
-227a8730278l331470P858K482724j294160k57122K238900p11044m63427j024024l27781
$$ -18730278 -22061748 -22053890 -19571166 -20865326 -21122448 -18883548 -19594592 -20058019 -21082043 -21409824
-237b1409824J584919n9410K64494j481004J083841q47106n25128j99027K069218J555694
$$ -21409824 -19824905 -19884315 -19619821 -21100825 -20016984 -20864090 -21389218 -21588245 -19519027 -17963333
-247a7963333j389372m10062j232759Q80151j262526P79730P16002j43535j077522l5687
$$ -17963333 -19352705 -19762767 -20995526 -20115375 -21377901 -20598171 -19882169 -20025704 -21103226 -21138913
-257b1138913p35561N06284R74993m34884O7731j708766L99729J559727r3084N66201
$$ -21138913 -21874474 -21368190 -20393197 -20828081 -20760350 -22469116 -22069387 -20509660 -20602744 -20036543
-267b0036543J06602q80730m00386P35292j074812K189841k69716j374408K135183l7114
$$ -20036543 -19929941 -20810671 -21211057 -20475765 -21550577 -19360736 -19630452 -21004860 -18869677 -18906791
-277a8906791k195219m36373Q02841q87813j39770J801224r09857j272018J094049K88391
$$ -18906791 -21102010 -21538383 -20735542 -21623355 -21763125 -19961901 -20871758 -22143776 -21049727 -20761336
-287b0761336Q27726j271967L85828r4686J33081K22214k032009l07806K34561R9885
$$ -20761336 -19933610 -21205577 -20819749 -20914435 -20781354 -20559140 -22591149 -22898955 -22664394 -22564509
-297b2564509K710612j931342J604752k97136j711651Q23014M26908m31873R28399n69641
$$ -22564509 -19853897 -21785239 -20180487 -20477623 -22189274 -21366260 -20939352 -21371225 -20442826 -21012467
-307b1012467r61414j98734J023334N64271m02106j52884N19373n52231j727318J938987
$$ -21012467 -21973881 -22172615 -21149281 -20585010 -20987116 -21140000 -20620627 -21172858 -22900176 -20961189
-317b0961189n64164K54653N42191p91976O12095m29597l06945M5448L46794n94139
$$ -20961189 -21525353 -21270700 -20728509 -21520485 -20908390 -21337987 -21644932 -21599484 -21252690 -21846829
-327b1846829J017260l89318k466328J744191P23428J584814k54695p42070k53475r19037
$$ -21846829 -20829569 -21218887 -23685215 -21941024 -21217596 -19632782 -19887477 -20629547 -20883022 -21802059
-337b1802059p47848J62370N89796K151090j387292j25688l77618L29697q28399P52532
$$ -21802059 -22549907 -22387537 -21797741 -19646651 -21033943 -21159631 -21537249 -21207552 -22035951 -21283419
-347b1283419m0449j135930N49748j477208n226k25346K853659n36352J372010j520873
$$ -21283419 -21323868 -22459798 -21910050 -23387258 -23392484 -23617830 -20764171 -21300523 -19928513 -21449386
-357b1449386R02599P63768j417248Q10334j293237p0362P111p78518J705947m89998
$$ -21449386 -20546787 -19783019 -21200267 -20389933 -21683170 -21753532 -21746421 -22524939 -20818992 -21308990
-367b1308990J402503M11099L20328k611145K78855N11856R58824j464360N7854M01799
$$ -21308990 -19906487 -19495388 -19175060 -21786205 -21507350 -20995494 -20036670 -21501030 -21443176 -21041377
-377b1041377J188865M29774p00601j401144K165520k420252j097878Q40769r8219J0892
$$ -21041377 -19852512 -19422738 -20123339 -21524483 -19358963 -21779215 -22877093 -22036324 -22134543 -22123651
-387b2123651J740012k296255j65510p01656J166148M63149N81790L90685m74727J21723
$$ -22123651 -20383639 -22679894 -22845404 -23547060 -22380912 -21917763 -21335973 -20945288 -21420015 -21298292
-397b1298292p85213J523103o11285O83246j286596o9469K8937j54944m33701J330864
$$ -21298292 -22083505 -20560402 -21171687 -20488441 -21775037 -21844506 -21815569 -21970513 -22404214 -21073350
-407b1073350o13048r82318L05103P9112N59783J117944k364307K146208n66460L56758
$$ -21073350 -21686398 -22668716 -22363613 -22284501 -21724718 -20606774 -22971081 -20824873 -21391333 -21034575
-417b1034575k39410o04890j155013Q99423r1688Q08032K15812O11282p18635m60425
$$ -21034575 -21273985 -21878875 -23033888 -22134465 -22226153 -21418121 -21202309 -20591027 -21309662 -21770087
-427b1770087M53414l677255J164964J641368j088176N64029P96428K86791q2896M3496
$$ -21770087 -21316673 -24993928 -23828964 -22187596 -23275772 -22711743 -21915315 -21628524 -21711420 -21667924
-437b1667924j52283q32910K60718L348293j629537k065470J52264j378176J941772l48791
$$ -21667924 -21820207 -22653117 -22392399 -19044106 -20673643 -22739113 -22586849 -23965025 -22023253 -22372044
-447b2372044J021299j361174m63685n2602j66529M88147J32260N94797p77430P53876
$$ -22372044 -21350745 -22711919 -23175604 -23228206 -23394735 -22906588 -22774328 -22179531 -22956961 -22203085
-457b2203085j94018K87038p13637k53120k32425M6959J137717P91103k376872J31529
$$ -22203085 -22397103 -22110065 -22823702 -23076822 -23309247 -23262288 -22124571 -21333468 -23710340 -23578811
-467b3578811k5952J194452k156737P73457p53589J224310N51406j140133J584949m3221
$$ -23578811 -23604763 -22410311 -24567048 -23793591 -24547180 -23322870 -22771464 -23911597 -22326648 -22369869
-477b2369869O70898m77844j80957j185814o35944K398518m80225j272755m27929O66643
$$ -22369869 -21698971 -22176815 -22357772 -23543586 -24179530 -21781012 -22261237 -23533992 -23961921 -23295278
-487b3295278J170850m92986j996311K145882N44722q29009N40895q25808n82919j57084
$$ -23295278 -22124428 -22617414 -24613725 -22467843 -21923121 -22752130 -22211235 -23037043 -23619962 -23777046
-497b3777046M18634J31753k10844j14272k61648j75352P53531J163523L26904j304855
$$ -23777046 -23358412 -23226659 -23437503 -23551775 -23813423 -23988775 -23235244 -22071721 -21744817 -23049672
-507b3049672j302330p1336R38216O49991j51670o74440M76907p23912J694979o24798
$$ -23049672 -24352002 -24423338 -23485122 -22835131 -22986801 -23661241 -23184334 -23908246 -22213267 -22838065
-517b2838065J58681r52204N58448K310975p76612p24976J182835j227390J054379q01179
$$ -22838065 -22679384 -23631588 -23073140 -20762165 -21538777 -22263753 -21080918 -22308308 -21253929 -22055108
-527b2055108m68058J510895j441487P35173r70746n82024m89949n66330J208721Q42981
$$ -22055108 -22523166 -21012271 -22453758 -21718585 -22689331 -23271355 -23761304 -24327634 -23118913 -22275932
-537b2275932q76739Q20213L9469j01184J53318o07415o75106P28637Q88223j841844
$$ -22275932 -23152671 -22332458 -22292989 -22394173 -22240855 -22848270 -23523376 -22794739 -21906516 -23748360
-547b3748360n20556P79632K001771q32976M22983k44561j070730J078358j789258O71269
$$ -23748360 -24268916 -23489284 -21487513 -22320489 -21897506 -22142067 -23212797 -22134439 -23923697 -23252428
-557b3252428Q12391k64117O71648j485010J734639j357829N81968j64114j119960J391571
$$ -23252428 -22440037 -22704154 -22032506 -23517516 -21782877 -23140706 -22558738 -22722852 -23842812 -22451241
-567b2451241r88443k80514K032000j16306j602732j70434M40691L47059M67928o62028
$$ -22451241 -23439684 -23720198 -21688198 -21804504 -23407236 -23577670 -23136979 -22789920 -22321992 -22984020
-577b2984020J455474O32994j864316o90976J92485p26190k34656J511369Q36612k229854
$$ -22984020 -21528546 -20895552 -22759868 -23450844 -23258359 -23984549 -24219205 -22707836 -21871224 -24101078
-587b4101078R87565j792759q1921J207191n48730n36661J059906j33634L541145k059131
$$ -24101078 -23113513 -24906272 -24988193 -23781002 -24329732 -24866393 -23806487 -23940121 -20398976 -22458107
-597b2458107L06914q22176K252312j316134k50040k84585L9513j70168q34317L76016
$$ -22458107 -22151193 -22973369 -20721057 -22037191 -22287231 -22571816 -22532303 -22702471 -23536788 -23160772
-607b3160772L8221N86543j442668N11056K47430o65347j057715M381527j802488q35756
$$ -23160772 -23122551 -22536008 -23978676 -23467620 -23220190 -23885537 -24943252 -20561725 -22364213 -23199969
-617b3199969n04578R18300K64028j61049M99727N91958k021177J264496r33462L61263
$$ -23199969 -23704547 -22786247 -22522219 -22683268 -22183541 -21591583 -23612760 -22348264 -23281726 -22920463
-627b2920463j065513K154981r52326o04311N77394j826800J005219L97123j03878l17549
$$ -22920463 -23985976 -21830995 -22783321 -23387632 -22810238 -24637038 -23631819 -23234696 -23338574 -23656123
-637b3656123J858884j443754K62964K75229O01487r09775l06732J42417m92916j2150
$$ -23656123 -21797239 -23240993 -22978029 -22702800 -22101313 -23011088 -23317820 -23175403 -23668319 -23680469
-647b3680469r5396J321823j954046P12034L83652l09359J270966p35949j31753M59214
$$ -23680469 -23775865 -22454042 -24408088 -23696054 -23312402 -23621761 -22350795 -23086744 -23218497 -22759283
-657b2759283K18306j333224l44951O14899J61069O50267p48680m7112J477907L41586
$$ -22759283 -22540977 -23874201 -24219152 -23604253 -23443184 -22792917 -23541597 -23588709 -22110802 -21769216
-667b1769216q21117J244241j936205q48729O28884R30208l51128j752741k97263J207368
$$ -21769216 -22590333 -21346092 -23282297 -24131026 -23502142 -22571934 -22923062 -24675803 -24973066 -23765698
-677b3765698R35460j288933n18994O92997k06934p53106P35250j150617m71603o323772
$$ -23765698 -22830238 -24119171 -24638165 -23945168 -24152102 -24905208 -24169958 -25320575 -25792178 -32115950
-687c2115950l031667R392423J536312j32120n5480k30819o7279N83299L00635L73807
$$ -32115950 -35147617 -25755194 -24218882 -24351002 -24406482 -24637301 -24704580 -24121281 -23820646 -23446839
-697b3446839j00714K52218n3276Q69261M65633j905629J22904p08239k04816J511476
$$ -23446839 -23547553 -23295335 -23348611 -22479350 -22013717 -23919346 -23796442 -24504681 -24709497 -23198021
-707b3198021p58768L15649N72879j618928P19515j52583p15643J297204j621385J636374
$$ -23198021 -23956789 -23641140 -23068261 -24687189 -23967674 -24120257 -24835900 -23538696 -25160081 -23523707
-717b3523707j786912Q39151P71547m75852j759313K006363N64512R64227K24758p35554
$$ -23523707 -25310619 -24471468 -23699921 -24175773 -25935086 -23928723 -23364211 -22399984 -22175226 -22910780
-727b2910780j337588P56137j10824P24641J91352K31736j504428P57490m4717R77968
$$ -22910780 -24248368 -23492231 -23603055 -22878414 -22687062 -22455326 -23959754 -23202264 -23246981 -22269013
-737b2269013m09571j204769k196615R54422O34318L26690J696396j693219q25003Q98352
$$ -22269013 -22678584 -23883353 -26079968 -25125546 -24491228 -24164538 -22468142 -24161361 -24986364 -24088012
-747b4088012J300235j067318m78533J68796J61941R35570M69864l26742k995432J978525
$$ -24088012 -22787777 -23855095 -24333628 -24164832 -24002891 -23067321 -22597457 -22924199 -25919631 -23941106
-757b3941106j0622o55592O0p069L46468n61602J959101L67161j806816j96671j642620
$$ -23941106 -23951728 -24607320 -24607260 -24614329 -24267861 -24829463 -22870362 -22503201 -24310017 -24506688 -26149308
-768b6149308P41008J310813K83884L2663q40373M60345k53441j93362j71350j081476
$$ -26149308 -25408300 -24097487 -23813603 -23780940 -24621313 -24160968 -24414409 -24607771 -24779121 -25860597
-778b5860597J362654J134380J64374p28422L85184j819559O49293J62957r6266O24811
$$ -25860597 -24497943 -23363563 -23199189 -23927611 -23542427 -25361986 -24712693 -24549736 -24646002 -24021191
-788b4021191P87897q24812m42931j99019P99354k18088m26026q02284J717848j049519
$$ -24021191 -23233294 -24058106 -24501037 -24700056 -23900702 -24118790 -24544816 -25347100 -23629252 -24678771
-798b4678771o11644P61076M14301k31680k49158P51269j234137o80667J290216o54149
$$ -24678771 -25290415 -24529339 -24115038 -24346718 -24595876 -23844607 -25078744 -25759411 -24469195 -25123344
-808b5123344O37816P8662O98408K7428l52854O58062o27388k3451K91037j349233K6346
$$ -25123344 -24485528 -24406866 -23708458 -23681030 -24033884 -23375822 -24003210 -24026661 -23735624 -25084857 -25058511
-819b5058511j73301J221522j98115J204910j849977q4366j252921N72562P10452J196456
$$ -25058511 -25231812 -24010290 -24208405 -23003495 -24853472 -24937838 -26190759 -25618197 -24907745 -23711289
-829b3711289R83396j665653l51967q3494n59707k77994N58033O75671J68529q19238
$$ -23711289 -22727893 -24393546 -24745513 -24829007 -25388714 -25666708 -25108675 -24433004 -24264475 -25083713
-839b5083713P82343m28457O03267r19016J98975n23316K349142j079613m6040R01129
$$ -25083713 -24301370 -24729827 -24126560 -25045576 -24846601 -25369917 -23020775 -24100388 -24146428 -23245299
-849b3245299K37227j900372M60004R60149m84048m47645J104351r65790K34934J64397
$$ -23245299 -23008072 -24908444 -24448440 -23488291 -23972339 -24419984 -23315633 -24281423 -24046489 -23882092
-859b3882092l31440l34490n68212k472694J791083l04940J009316l96387L38289K53343
$$ -23882092 -24213532 -24548022 -25116234 -27588928 -25797845 -26102785 -25093469 -25489856 -25151567 -24898224
-869b4898224M44132o24308J000983J406476k487379J006559j077477K385904j242139
$$ -24898224 -24454092 -25078400 -24077417 -22670941 -25158320 -24151761 -25229238 -22843334 -24085473
-878b4085473j059620j02242K285091k310734J493357J84181K31507l24498j246204M50352
$$ -24085473 -25145093 -25247335 -22962244 -25272978 -23779621 -23595440 -23363933 -23688431 -24934635 -24484283
-888b4484283o53644n66334M59795L67560J352185k38583K69863J745553j351437j768415
$$ -24484283 -25137927 -25704261 -25244466 -24876906 -23524721 -23763304 -23493441 -21747888 -23099325 -24867740
-898b4867740n04981J001202j521494m23215R32159m61575k60746J331696k8020n83012
$$ -24867740 -25372721 -24371519 -25893013 -26316228 -25384069 -25845644 -26106390 -24774694 -24802714 -25385726
-908b5385726j08742J208045q2749q77358l64467K113800l590046J833357O79542p43446
$$ -25385726 -25494468 -24286423 -24369172 -25246530 -25610997 -23497197 -27087243 -25253886 -24574344 -25317790
-918b5317790Q0645O13985M7698J042429O82662j625413m81409n31293m07823J481582
$$ -25317790 -25237145 -24623160 -24575462 -23533033 -22850371 -24475784 -24957193 -25488486 -25896309 -24414727
-928b4414727j227377P70075K68884M40916j923965J04302J742896k40061j086355j763423
$$ -24414727 -25642104 -24872029 -24603145 -24162229 -26086194 -25981892 -24238996 -24479057 -25565412 -27328835
-938b7328835J331149J317321j994488J800630P90795r71885l79109k17735J557491K53166
$$ -27328835 -25997686 -24680365 -26674853 -24874223 -24083428 -25055313 -25434422 -25652157 -24094666 -23841500
-948b3841500J00212J67655q78250l63430K7046j685123M280K1808R08407K70629j9224
$$ -23841500 -23741288 -23573633 -24451883 -24815313 -24788267 -26473390 -26469110 -26447302 -25538895 -25268266 -25287490
-959b5287490j716232J34154Q89158K205960k50179j428722k39563Q4770l31766K246116
$$ -25287490 -27003722 -26869568 -25980410 -23774450 -24024629 -25453351 -25692914 -25608144 -25939910 -23693794
-969b3693794k093681J187382P55009j41335q0717P1966r12745J139842j343786j97966
$$ -23693794 -25787475 -24600093 -23845084 -23986419 -24067136 -23995170 -24907915 -23768073 -25111859 -25309825
-979b5309825Q20494q19148r6515K153177K9783j63935j127217L49571O12398q02584
$$ -25309825 -24489331 -25308479 -25404994 -23251817 -23222034 -23385969 -24513186 -24163615 -23551217 -24353801
-989b4353801p39740M101131l768480N65777Q67016k441626M69463N41618l48062l83842
$$ -24353801 -25093541 -20992410 -24760890 -24195113 -23328097 -25769723 -25300260 -24758642 -25106704 -25490546
-999b5490546J156825k01755l77145q41960J669495j024296k69916k11582J07685m18966
$$ -25490546 -24333721 -24535476 -24912621 -25754581 -24085086 -25109382 -25379298 -25590880 -25483195 -25902161
-1009b5902161j942413L196489j5085k7027P0311K66111k421517R82878k90725j09981
$$ -25902161 -27844574 -24648085 -24663170 -24690197 -24619886 -24353775 -26775292 -25792414 -26083139 -26193120
-1019b6193120J317247K42530P35476J2143M75777p79843j572001J276402j557671m19775
$$ -26193120 -24875873 -24633343 -23897867 -23885724 -23409947 -24189790 -25761791 -24485389 -26043060 -26462835
-1029b6462835J235831o13945N27117R48566j504607q10715J295644K205562k157988
$$ -26462835 -25227004 -25840949 -25313832 -24365266 -25869873 -26680588 -25384944 -23179382 -25337370
-1038b5337370J344673n80820O73150j528610N97957j18877p86564L41301q03983O76741
$$ -25337370 -23992697 -24573517 -23900367 -25428977 -24831020 -24949897 -25736461 -25395160 -26199143 -25522402
-1048b5522402m04454J21093K006880j605153R22110j071857k58126o1063J92890O72583
$$ -25522402 -25926856 -25805763 -23798883 -25404036 -24481926 -25553783 -25811909 -25872972 -25680082 -25007499
-1058b5007499j78720J875681J09244j721414l73856J632984j134832M20671j60575L1482
$$ -25007499 -25186219 -23310538 -23201294 -24922708 -25296564 -23663580 -24798412 -24377741 -24538316 -24506834
-1068b4506834n1402j213914P04974Q19858j866663K173125l32224n38081j763938J765081
$$ -24506834 -24558236 -25772150 -25067176 -24247318 -26113981 -23940856 -24273080 -24811161 -26575099 -24810018
-1078b4810018L16886Q9276r94200k002723J691015P7293L66909K64498l61356n51615
$$ -24810018 -24493132 -24403856 -25398056 -27400779 -25709764 -25632471 -25265562 -25001064 -25362420 -25914035
-1088b5914035m89803J79050K572696q65445o80600M95766O20932l42112j30223K9513
$$ -25914035 -26403838 -26224788 -23652092 -24517537 -25198137 -24702371 -24081439 -24423551 -24553774 -24524261
-1098b4524261R02991o67641j103320O47174o99773O01835j86449j982574J461043R8822
$$ -24524261 -23621270 -24288911 -25392231 -24745057 -25444830 -24842995 -25029444 -27012018 -25550975 -25452153
-1108b5452153R80263k461491P72463p6481M46735Q94478q57117J45490p63150p97053
$$ -25452153 -24471890 -26933381 -26160918 -26237399 -25790664 -24896186 -25753303 -25607813 -26370963 -27168016
-1118b7168016M59291M76281j35737M8533M77108P91700O7515j232608J96207Q33747
$$ -27168016 -26708725 -26232444 -26368181 -26319648 -25842540 -25050840 -24983325 -26215933 -26019726 -25185979
-1128b5185979P46289j148197q93389J295230L60238j006051R63961j544363N90833k8191
$$ -25185979 -24439690 -25587887 -26481276 -25186046 -24825808 -25831859 -24867898 -26412261 -25821428 -25849619
-1138b5849619L55154M90816p75949n41252J481220m62451j427968M35155R76893n19131
$$ -25849619 -25494465 -25003649 -25779598 -26320850 -24839630 -25302081 -26730049 -26294894 -25318001 -25837132
-1148b5837132Q70754m95148O92448q01733J77159j64109j280061L73181J176485j161885
$$ -25837132 -24966378 -25461526 -24769078 -25570811 -25393652 -25557761 -26837822 -26464641 -25288156 -26450041
-1158b6450041O06496J263219j194678L15716j726738J363999J99578k29748p9556L76091
$$ -26450041 -25843545 -24580326 -25775004 -25459288 -27186026 -25822027 -25622449 -25852197 -25931753 -25555662
-1168b5555662m06270N07141K00574J768994r49141j188503Q00086m58270K30438q24838
$$ -25555662 -25961932 -25454791 -25254217 -23485223 -24434364 -25622867 -24822781 -25281051 -25050613 -25875451
-1178b5875451P29381j740344J384840J981034L31308K05996k184671O17581j643642
$$ -25875451 -25146070 -26886414 -25501574 -23520540 -23189232 -22983236 -25167907 -24550326 -26193968
-1187b6193968m04079Q1380p6364J204679P26603m83476l55215J428519j372235j773262
$$ -26193968 -26598047 -26516667 -26593031 -25388352 -24661749 -25145225 -25500440 -24071921 -25444156 -27217418
-1197b7217418n33803J115774M44830O76013K8236K85566j192771O0438m85935M60393
$$ -27217418 -27751221 -26635447 -26190617 -25514604 -25486368 -25200802 -26393573 -26333135 -26819070 -26358677
-1207b6358677N16217P75091m76306m57135P27739J95979j68739N21421n85545o08952
$$ -26358677 -25842460 -25067369 -25543675 -26000810 -25273071 -25077092 -25245831 -24724410 -25309955 -25918907
-1217b5918907N7520r52472P19648M77066L75273j003957k64017J119687j161258R82502
$$ -25918907 -25861387 -26813859 -26094211 -25617145 -25241872 -26245829 -26509846 -25390159 -26551417 -25568915
-1227b5568915m59838O18716J182833k328123K85866p8589p49679J813248o89771n82658
$$ -25568915 -26028753 -25410037 -24227204 -26555327 -26269461 -26348050 -27097729 -25284481 -25974252 -26556910
-1237b6556910M21212P4354q43712J197029K71263L32086j91585k41910Q48612L41653
$$ -26556910 -26135698 -26061344 -26905056 -25708027 -25436764 -25104678 -25296263 -25538173 -24689561 -24347908
-1247b4347908k374659J062556L72250q23940l53736J319664J113504n58700L26997P39573
$$ -24347908 -26722567 -25660011 -25287761 -26111701 -26465437 -25145773 -24032269 -24590969 -24263972 -23524399
-1257b3524399j418366r06342K71448j033032J589813l66021L23163q98902o67390O75998
$$ -23524399 -24942765 -25849107 -25577659 -26610691 -25020878 -25386899 -25063736 -25962638 -26630028 -25954030
-1267b5954030P54236j023030m00884n759k88387J729504j394142K28725l97292R89537
$$ -25954030 -25199794 -26222824 -26623708 -26629467 -26917854 -25188350 -26582492 -26353767 -26751059 -25761522
-1277b5761522j275329l8270J740984K5479j167036R21846j526373L42332O67538Q08127
$$ -25761522 -27036851 -27075121 -25334137 -25308658 -26475694 -25553848 -27080221 -26737889 -26070351 -25262224
-1287b5262224r09420p01967L98595n45513O77860J166659j588065j02922L72395O97070
$$ -25262224 -26171644 -26873611 -26475016 -27020529 -26342669 -25176010 -26764075 -26866997 -26494602 -25797532
-1297b5797532O57796j009833Q66658J046547j697197J352564n71078K6560j622934n70958
$$ -25797532 -25139736 -26149569 -25282911 -24236364 -25933561 -24580997 -25152075 -25125515 -26748449 -27319407
-1307b7319407Q30012J575574k451426K38864P77653P55595J95153j63397m55283J421952
$$ -27319407 -26489395 -24913821 -27365247 -27126383 -26348730 -25593135 -25397982 -25561379 -26016662 -24594710
-1317b4594710k282789J243571m34203m07828J47346R11155k43259p68785K744549p16473
$$ -24594710 -26877499 -25633928 -26068131 -26475959 -26328613 -25417458 -25660717 -26429502 -23684953 -24401426
-1327b4401426j136746n33417K01322j40670q28699P82093j01544J897468j429747j028094
$$ -24401426 -25538172 -26071589 -25870267 -26010937 -26839636 -26057543 -26159087 -24261619 -25691366 -26719460
-1337b6719460L95420J126362L2612Q49033r27374J638454j425744K38391m38991J629655
$$ -26719460 -26324040 -25197678 -25165066 -24316033 -25243407 -23604953 -25030697 -24792306 -25231297 -23601642
-1347b3601642k039908n15760k83005N05019j701146J016460J103281j749627M10075
$$ -23601642 -25641550 -26157310 -26440315 -25935296 -27636442 -26619982 -25516701 -27266328 -26856253
-1356b6856253M72356O09476J265123J054745k192765Q9070O14082k446719J498107m63665
$$ -26856253 -26383897 -25774421 -24509298 -23454553 -25647318 -25558248 -24944166 -27390885 -25892778 -26356443
-1366b6356443j35518N20446N42344j671510l21048Q03153n10521R72822Q8415o14644
$$ -26356443 -26491961 -25971515 -25429171 -27100681 -27421729 -26618576 -27129097 -26156275 -26067860 -26682504
-1376b6682504k29109O34049M06265K32402L55347J26307j471248R2498J40895O75454R817
$$ -26682504 -26911613 -26277564 -25871299 -25638897 -25283550 -25157243 -26628491 -26535993 -26395098 -25719644 -25709827
-1387b5709827J500373j198215j055182J491232P1816K96004j048729o97599N66132p47195
$$ -25709827 -24209454 -25407669 -26462851 -24971619 -24899803 -24603799 -25652528 -26350127 -25783995 -26531190
-1397b6531190m78244Q56817R01163R64264q27718j584775m62604L66131P08290n08627
$$ -26531190 -27009434 -26152617 -25251454 -24287190 -25114908 -26699683 -27162287 -26796156 -26087866 -26596493
-1407b6596493j71952J06885l013628J765587J581239j825853J235973J254515M62737
$$ -26596493 -26768445 -26661560 -29675188 -27909601 -26328362 -28154215 -26918242 -25663727 -25200990
-1416b5200990K135589l960475M21637P15336j088746L44576j09135J457788j174022
$$ -25200990 -23065401 -27025876 -26604239 -25888903 -26977649 -26633073 -26742208 -25284420 -26458442
-1425b6458442R23956j520432Q53222p6477N30733j064318P34100j122763R60983l05927
$$ -26458442 -25534486 -27054918 -26201696 -26278173 -25747440 -26811758 -26077658 -27200421 -26239438 -26545365
-1435b6545365N503492n263874o68407R40751r11461J425849n56277j049464O75922
$$ -26545365 -21041873 -26305747 -26974154 -26033403 -26944864 -25519015 -26075292 -27124756 -26448834
-1444b6448834j161522j788276M58001J505579J803324K72610r83862J283205q27210
$$ -26448834 -27610356 -29398632 -28940631 -27435052 -25631728 -25359118 -26342980 -25059775 -25886985
-1453b5886985j280787k573948L521885j264783J44147J108146j420493M96138o76987
$$ -25886985 -27167772 -29741720 -26219835 -27484618 -27340471 -26232325 -27652818 -27156680 -27833667
-1462b7833667n19734J152319L4323q47990Q2271K90172Q59221j721546j163707N539893
$$ -27833667 -28353401 -27201082 -27166759 -28014749 -27932478 -27642306 -26783085 -28504631 -29668338 -24128445
-1472b4128445k65205j919763o24413J361249J219815j694906j685968Q62249J336843
$$ -24128445 -24393650 -26313413 -26937826 -25576577 -24356762 -26051668 -27737636 -26875387 -25538544
-1481b5538544k10761j334753j07473J884284l993540K344093n92742L64951m03953L37316
$$ -25538544 -25749305 -27084058 -27191531 -25307247 -29300787 -26956694 -27549436 -27184485 -27588438 -27251122
-1491b7251122R60879J586338j364969j59413J564880p19113k82693q65531J16644Q66162
$$ -27251122 -26290243 -24703905 -26068874 -26228287 -24663407 -25382520 -25665213 -26530744 -26414100 -25547938
-1501b5547938j412268M27309P67470J072033l082097K447725r83906j217604J273828
$$ -25547938 -26960206 -26532897 -25765427 -24693394 -27775491 -25327766 -26311672 -27529276 -26255448
-1510b6255448n0759l15701K04671m43021n5984r01789N45283J653377k10118k538575
$$ -26255448 -26306207 -26621908 -26417237 -26860258 -26916242 -27818031 -27272748 -25619371 -25829489 -28368064
-1520b8368064O24601O51853J260624n11672L82368j647175j09317R59503l65568j7014
$$ -28368064 -27743463 -27091610 -25830986 -26342658 -25960290 -27607465 -27716782 -26757279 -27122847 -27139861
-1530b7139861J19466r34593J274747l2198j903373K635084j91624p86567p19778J396236
$$ -27139861 -27020395 -27954988 -26680241 -26712439 -28615812 -25980728 -26172352 -26958919 -27678697 -26282461
-1540b6282461j215290J099107K3654l4847m13651l98510O21598J51505m85545N72953
$$ -26282461 -27497751 -26398644 -26374990 -26409837 -26823488 -27221998 -26600400 -26448895 -26934440 -26361487
-1550b6361487k86702R53426j311869k031110l979910N065482P38778Q0181J145608p57860
$$ -26361487 -26648189 -25694763 -27006632 -29037742 -33017652 -27952170 -27213392 -27133211 -25987603 -26745463
-1560b6745463j74116j95526M57715j911320J488202n67736j007675J754059n14758j33525
$$ -26745463 -26919579 -27115105 -26657390 -28568710 -27080508 -27648244 -28655919 -26901860 -27416618 -27550143
-1570b7550143J020233j238325J487337R8005o10854J210320k426382J563021K44829
$$ -27550143 -26529910 -27768235 -26280898 -26182893 -26793747 -25583427 -28009809 -26446788 -26201959
-1579b6201959q61811O47061L16964P66044j618253J825637k739863J698617j114093
$$ -26201959 -27063770 -26416709 -26099745 -25333701 -26951954 -25126317 -27866180 -26167563 -27281656
-1588b7281656N04531m89267N68642J450469l43468M4477j245582j632245J364919Q67405
$$ -27281656 -26777125 -27266392 -26697750 -25247281 -25590749 -25546272 -26791854 -28424099 -27059180 -26191775
-1598b6191775k429413J424501J790670o24649O01186r86486k91602J556051J06613
$$ -26191775 -28621188 -27196687 -25406017 -26030666 -25429480 -26415966 -26707568 -25151517 -25044904
-1607b5044904J012068n837734L168014M0600M55359j359654j255773P03927m83314
$$ -25044904 -24032836 -29870570 -26702556 -26661956 -26206597 -27566251 -28822024 -28118097 -28601411
-1616b8601411K037788r20626N83122l40649L85935j10509J693467j838554q59513l11365
$$ -28601411 -26563623 -27484249 -26901127 -27241776 -26855841 -26966350 -25272883 -27111437 -27970950 -28282315
-1626b8282315J082028R61521O46288l95735n43813J280789j780121M44395k64464J951870
$$ -28282315 -27200287 -26238766 -25592478 -25988213 -26532026 -25251237 -27031358 -26586963 -26851427 -24899557
-1636b4899557k465705J135607o69906J036035q03874q4391J103272L06555p17733j036524
$$ -24899557 -27365262 -26229655 -26899561 -25863526 -26667400 -26751791 -25648519 -25341964 -26059697 -27096221
-1646b7096221j6908J518614k253162R19542j21539L46988J665985r03860p58093m99857
$$ -27096221 -27113129 -25594515 -27847677 -26928135 -27049674 -26702686 -25036701 -25940561 -26698654 -27198511
-1656b7198511m0830p64642M1029J431391P36478j692964J469503l06806p46139j88028
$$ -27198511 -27239341 -28003983 -27962954 -26531563 -25795085 -27488049 -26018546 -26325352 -27071491 -27259519
-1666b7259519j002682J099436r48417O31416R7236O4428J24883m71931J58837M06045
$$ -27259519 -28262201 -27162765 -28111182 -27479766 -27382530 -27318102 -27193219 -27665150 -27506313 -27100268
-1676b7100268M78832M599O27818j349977K215010k14074j792309O17850j076157K34376
$$ -27100268 -26621436 -26616837 -25989019 -27338996 -25123986 -25338060 -27130369 -26512519 -27588676 -27354300
-1686b7354300M20247O55055j74736K050147k255118j651981J304524j418J12757J663961
$$ -27354300 -26934053 -26278998 -26453734 -24403587 -26658705 -28310686 -27006162 -27007580 -26894823 -25230862
-1696b5230862k118980m15255J298523q48723r0396K91862M49272r27697J093469l83658
$$ -25230862 -27349842 -27765097 -26466574 -27315297 -27405693 -27113831 -26664559 -27592256 -26498787 -26882445
-1706b6882445r55696M25227j48902J80298M5063M20397M98342L00060j704641P48281
$$ -26882445 -27838141 -27412914 -27561816 -27381518 -27336455 -26916058 -26417716 -26117656 -27822297 -27074016
-1716b7074016L51389j57634m84177K30793P37855j532280K01655J288944l83816J48517
$$ -27074016 -26722627 -26880261 -27364438 -27133645 -26395790 -27928070 -27726415 -26437471 -26821287 -26672770
-1726b6672770J091179r74659m50680k88921P80915o80798J245864r80141K58970k2357
$$ -26672770 -25581591 -26556250 -27006930 -27295851 -26514936 -27195734 -25949870 -26930011 -26671041 -26693398
-1736b6693398k86102J021314j081708Q56743k242148R41942J879619n30648p08779M60732
$$ -26693398 -26979500 -25958186 -27039894 -26183151 -28425299 -27483357 -25603738 -26134386 -26843165 -26382433
-1746b6382433n74971M12018j799411l58866L96610K8202N3036r39453J301618L78288
$$ -26382433 -26957404 -26545386 -28344797 -28703663 -28307053 -28278851 -28225815 -29165268 -27863650 -27485362
-1756b7485362Q45084p57400J170069q12100j666635J084348o39978J097195m19946P57985
$$ -27485362 -26640278 -27397678 -26227609 -27039709 -28706344 -27621996 -28261974 -27164779 -27584725 -26826740
-1766b6826740J195587j974681j3539J046571l87746m2253Q61539j178007o34325J286627
$$ -26826740 -25631153 -27605834 -27619373 -26572802 -26960548 -27002801 -26141262 -27319269 -27953594 -26666967
-1776b6666967j286041k13327J235044l07380J181054n3171m9381m69156O53876j487284
$$ -26666967 -27953008 -28166335 -26931291 -27238671 -26057617 -26110788 -26160169 -26629325 -25975449 -27462733
-1786b7462733L1453J520563j592071P98606q56275J92874r5434J054832j026081R74245
$$ -27462733 -27431280 -25910717 -27502788 -26704182 -27560457 -27367583 -27463017 -26408185 -27434266 -26460021
-1796b6460021j054464P54069K78242K497829m11272l320087J011544r40393j328048
$$ -26460021 -27514485 -26760416 -26482174 -23984345 -24395617 -27715704 -26704160 -27644553 -28972601
-1805b8972601J087768P69749o34242L82073j054893J36791M63623J260763N18646q16527
$$ -28972601 -27884833 -27115084 -27749326 -27367253 -28422146 -28285355 -27821732 -26560969 -26042323 -26858850
-1815b6858850N5103l26944J462989k022829K18814M20375l67173n90794J302064l57411
$$ -26858850 -26803747 -27130691 -25667702 -27690531 -27471717 -27051342 -27418515 -28009309 -26707245 -27064656
-1825b7064656P30910q06075q36791r1922K18055k60238l45834K96743K00305R29975
$$ -27064656 -26333746 -27139821 -27976612 -28068534 -27850479 -28110717 -28456551 -28159808 -27959503 -27029528
-1835b7029528j394807k44904J756624l00179M41236J21984j933406L86778l82384J26147
$$ -27029528 -28424335 -28669239 -26912615 -27212794 -26771558 -26649574 -28582980 -28196202 -28578586 -28452439
-1845b8452439J388035k46950J043437j53110R54001j497182Q27919j372953J525944
$$ -28452439 -27064404 -27311354 -26267917 -26421027 -25467026 -26964208 -26136289 -27509242 -25983298
-1854b5983298m990928L669652J065246m61079o4160J458496o06459j394565P54269
$$ -25983298 -30974226 -27304574 -26239328 -26700407 -26764567 -25306071 -25912530 -27307095 -26552826
-1863b6552826j317769n9643l34747N73881J57672n74994L33498o91057J035009m80319
$$ -26552826 -27870595 -27930238 -28264985 -27691104 -27533432 -28108426 -27774928 -28465985 -27430976 -27911295
-1873b7911295Q16131r93700P58605m30532J033901q41948J332037n44490j622397R23375
$$ -27911295 -27095164 -28088864 -27330259 -27760791 -26726890 -27568838 -26236801 -26781291 -28403688 -27480313
-1883b7480313j061946p50563K452331k70119o99682O34361j500256J507719Q22506k57987
$$ -27480313 -28542259 -29292822 -26840491 -27110610 -27810292 -27175931 -28676187 -27168468 -26345962 -26603949
-1893b6603949j393288J440256J343055j563283l17609R3884Q05801j716441l88173Q83120
$$ -26603949 -27997237 -26556981 -25213926 -26777209 -27094818 -27000934 -26195133 -27911574 -28299747 -27416627
-1903b7416627l03104k714428K401886p21538j688159K898171K59489j131693J313662
$$ -27416627 -27719731 -30434159 -28032273 -28753811 -30441970 -27543799 -27284310 -28416003 -27102341
-1912b7102341j332858N30221L5708J383973r79766R87314q09625j84667J533638j146954
$$ -27102341 -28435199 -27904978 -27869270 -26485297 -27465063 -26477749 -27287374 -27472041 -25938403 -27085357
-1922b7085357M66018L87204m904572K782690m39382l05826J801208l78891l58783M25064
$$ -27085357 -26619339 -26232135 -31136707 -28354017 -28793399 -29099225 -27298017 -27676908 -28035691 -27610627
-1932b7610627p55535L92496J395415j289390j37303l64175J561747J469020k208599
$$ -27610627 -28366162 -27973666 -26578251 -27867641 -28004944 -28369119 -26807372 -25338352 -27546951
-1941b7546951N34737L99429j094155j106731Q37949m06682J250367p42092m34140J590871
$$ -27546951 -27012214 -26612785 -27706940 -28813671 -27975722 -28382404 -27132037 -27874129 -28308269 -26717398
-1951b6717398m75837j482584R22776o61056J034510o39790J59539J994992k47497j873539
$$ -26717398 -27193235 -28675819 -27753043 -28414099 -27379589 -28019379 -27859840 -25864848 -26112345 -27985884
-1961b7985884N61012j046449N58643J160714L01785q53745K79116k134559N69566J048145
$$ -27985884 -27424872 -28471321 -27912678 -26751964 -26450179 -27303924 -27024808 -29159367 -28589801 -27541656
-1971b7541656k687287J403362r95066J988706j0768k93821J193062j619030J331975
$$ -27541656 -30228943 -28825581 -29820647 -27831941 -27842709 -28136530 -26943468 -28562498 -27230523
-1980b7230523j595403N21685J179641j084092L85367p98513J321498L84643L70811q01706
$$ -27230523 -28825926 -28304241 -27124600 -28208692 -27823325 -28621838 -27300340 -26915697 -26544886 -27346592
-1990b7346592J049411j261598J73477j288606L44168q3152P57715l76014j359110J904237
$$ -27346592 -26297181 -27558779 -27385302 -28673908 -28329740 -28412892 -27655177 -28031191 -29390301 -27486064
-2000b7486064p47232M48745m0448J495026r72968J541270m97656n55570j280171K89088
$$ -27486064 -28233296 -27784551 -27824999 -26329973 -27302941 -25761671 -26259327 -26814897 -28095068 -27805980
-2010b7805980J80662j387550L12865M59929K02109n64294m72993J39801O34983J012093
$$ -27805980 -27625318 -29012868 -28700003 -28240074 -28037965 -28602259 -29075252 -28935451 -28300468 -27288375
-2020b7288375o24104J9276P33881m08303j301736k62097J073776L37546r7585K55742
$$ -27288375 -27912479 -27893203 -27159322 -27567625 -28869361 -29131458 -28057682 -27720136 -27817721 -27561979
-2030b7561979M18120K00499L29492r09430k57554K12805J337059j474494O28477M88950
$$ -27561979 -27143859 -26943360 -26613868 -27523298 -27780852 -27568047 -26230988 -27705482 -27077005 -26588055
-2040b6588055p50014n14383L41508M34149r76070j27713J345253q72045J253157k120305
$$ -26588055 -27338069 -27852452 -27510944 -27076795 -28052865 -28180578 -26835325 -27707370 -26454213 -28574518
-2050b8574518R63888J29396j398661N86619n53765R82071n04348k85230R81339j54350
$$ -28574518 -27610630 -27481234 -28879895 -28293276 -28847041 -27864970 -28369318 -28654548 -27673209 -27827559
-2060b7827559k34305J028378j273760J386760p52942J292034j697183j92830P57090
$$ -27827559 -28061864 -27033486 -28307246 -26920486 -27673428 -26381394 -28078577 -28271407 -27514317
-2069b7514317J227260n45004k940926J034992Q65813j892748K009363J117510n14945
$$ -27514317 -26287057 -26832061 -29772987 -28737995 -27872182 -29764930 -27755567 -26638057 -27153002
-2078b7153002J10369k9574R97609m83138n12844J56410L3081M82899j074182J093647
$$ -27153002 -27042633 -27072207 -26074598 -26557736 -27070580 -26914170 -26881089 -26398190 -27472372 -26378725
-2088b6378725j386245j37609l23427o02109L4913J583626N47740j733842R0839M84441
$$ -26378725 -27764970 -27902579 -28226006 -28828115 -28793202 -27209576 -26661836 -28395678 -28304839 -27820398
-2098b7820398n53007O54947R528n30482P65327K414882l416762R63267n47774O31824
$$ -27820398 -28373405 -27718458 -27708930 -28239412 -27474085 -25059203 -28475965 -27512698 -28060472 -27428648
-2108b7428648J108073k505545J858871j256897r16933J467088j652001J554672n65665
$$ -27428648 -26320575 -28826120 -26967249 -28224146 -29141079 -27673991 -29325992 -27771320 -28336985
-2117b8336985l43745P89774L97767o41791j86303J736837j181499O67095j777858K87541
$$ -28336985 -28680730 -27890956 -27493189 -28134980 -28321283 -26584446 -27765945 -27098850 -28876708 -28589167
-2127b8589167M85885M00769P86147l1115k19586l30882j046161n02692N12060O03970
$$ -28589167 -28103282 -27702513 -26916366 -26947481 -27167067 -27497949 -28544110 -29046802 -28534742 -27930772
-2137b7930772l93562J095977p81853M26099J22138J56127m35724M56809j773145R64846
$$ -27930772 -28324334 -27228357 -28010210 -27584111 -27461973 -27305846 -27741570 -27284761 -29057906 -28093060
-2147b8093060P70656k21270R73696j219576J060477O954r55038P00440j742440Q16147
$$ -28093060 -27322404 -27543674 -26569978 -27789554 -26729077 -26722123 -27677161 -26976721 -28719161 -27903014
-2157b7903014k001694N43947Q80920J522962m91941q07290j04398J2089m42092L59534
$$ -27903014 -29904708 -29360761 -28479841 -26956879 -27448820 -28256110 -28360508 -28348419 -28790511 -28430977
-2167b8430977M21979L78118L31844m0053J6335k143199J453312j18316R77575R94268
$$ -28430977 -28008998 -27630880 -27299036 -27339089 -27322754 -29465953 -28012641 -28130957 -27153382 -26159114
-2177b6159114q03827r08748r46290Q74996k48213K62068j650095k08461J626666n06125
$$ -26159114 -26962941 -27871689 -28817979 -27942983 -28191196 -27929128 -29579223 -29787684 -28161018 -28667143
-2187b8667143k5852J174061l47185k18194o05619j44250K235633q7169j92992l8851
$$ -28667143 -28692995 -27518934 -27866119 -28084313 -28689932 -28834182 -26598549 -26685718 -26878710 -26917561
-2197b6917561N02327J80192j384450J93838k19785n13628J245881j510791l65417K21400
$$ -26917561 -26415234 -26235042 -27619492 -27425654 -27645439 -28159067 -26913186 -28423977 -28789394 -28567994
-2207b8567994R24627L88714j129020R01524k76414j092328O41468N51750J268591q84474
$$ -28567994 -27643367 -27254653 -28383673 -27482149 -27758563 -28850891 -28209423 -27657673 -26389082 -27273556
-2217b7273556p08263P75248j192571K728935j357478J159619l6589J94929K51511k180830
$$ -27273556 -27981819 -27206571 -28399142 -25670207 -27027685 -25868066 -25904655 -25709726 -25458215 -27639045
-2227b7639045P16194L10766r11581r09584M28610m16864l56171J022832l61511J287669
$$ -27639045 -26922851 -26612085 -27523666 -28433250 -28004640 -28421504 -28777675 -27754843 -28116354 -26828685
-2237b6828685l09881j30502n50144N52605Q0237O32829J35676j580772n25645J770729
$$ -26828685 -27138566 -27269068 -27819212 -27266607 -27186370 -26553541 -26417865 -27998637 -28524282 -26753553
-2247b6753553n58770p63194M81419m81397l77922j44790j082958N38488J233148m32853
$$ -26753553 -27312323 -28075517 -27594098 -28075495 -28453417 -28598207 -29681165 -29142677 -27909529 -28342382
-2257b8342382O28387j736491O84184J539102k44839m78372n57912J284496j029037o6681
$$ -28342382 -27713995 -29450486 -28766302 -27227200 -27472039 -27950411 -28508323 -27223827 -28252864 -28319545
-2267b8319545P73888J110004N85181k404026n3779M30649K60198l45500k69937P59990
$$ -28319545 -27545657 -26435653 -25850472 -28254498 -28308277 -27877628 -27617430 -27962930 -28232867 -27472877
-2277b7472877L30703K9249j26830l93797n02367L66829p55116o17317J256785j3572
$$ -27472877 -27142174 -27112925 -27239755 -27633552 -28135919 -27769090 -28524206 -29141523 -27884738 -27898310
-2287b7898310j620317M72277J332455o67168o35711J065098K82032P30486Q53699q16514
$$ -27898310 -29518627 -29046350 -27713895 -28381063 -29016774 -27951676 -27669644 -26939158 -26085459 -26901973
-2297b6901973j372779q89463k866565K403353P18033N50471r52187j64575P01378n98295
$$ -26901973 -28274752 -29164215 -32030780 -29627427 -28909394 -28358923 -29311110 -29475685 -28774307 -29372602
-2307b9372602m67694Q38932j27910j51505L45436J7958Q40968j079295P70268J944132
$$ -29372602 -29840296 -29001364 -29129274 -29280779 -28935343 -28917385 -28076417 -29155712 -28385444 -26441312
-2317b6441312p23041p315j696066N66603K33899J268846L97805O12098j696315j862067
$$ -26441312 -27164353 -27171668 -28867734 -28301131 -28067232 -26798386 -26400581 -25788483 -27484798 -29346865
-2327b9346865n02278m72768J176875P0761l10915L95052j112352J058188K367550j767271
$$ -29346865 -29849143 -30321911 -29145036 -29074275 -29385190 -28990138 -30102490 -29044302 -26676752 -28444023
-2337b8444023Q18951j364858J42908n24134R39911R19896L89698j975185j001574K243609
$$ -28444023 -27625072 -28989930 -28847022 -29371156 -28431245 -27511349 -27121651 -29096836 -30098410 -27854801
-2347b7854801N6574o14162j284263K238955m69157J26167j839439O92362P34744o88405
$$ -27854801 -27798227 -28412389 -29696652 -27457697 -27926854 -27800687 -29640126 -28947764 -28213020 -28901425
-2357b8901425J282614j619374l34065M2743J646900j142261q12641m10811J801534m14156
$$ -28901425 -27618811 -29238185 -29572250 -29529507 -27882607 -29024868 -29837509 -30248320 -28446786 -28860942
-2367b8860942J457260p52556N4150J437304m43186j458309j64049Q55544q64033O24836
$$ -28860942 -27403682 -28156238 -28102088 -26664784 -27107970 -28566279 -28730328 -27874784 -28738817 -28113981
-2377b8113981J92056r8117k207363J135021J823847p25742K73502N63929O56872j557092
$$ -28113981 -27921925 -28020042 -30227405 -29092384 -27268537 -27994279 -27720777 -27156848 -26499976 -28057068
-2387b8057068L28663r28508m1503P30575M28608Q13430k175220Q80920N9277J92501
$$ -28057068 -27728405 -28656913 -28698416 -27967841 -27539233 -26725803 -28901023 -28020103 -27960826 -27768325
-2397b7768325O08060l46149o79230J014671r26474L36738o41614j82742M51807k39542
$$ -27768325 -27160265 -27506414 -28185644 -27170973 -28097447 -27760709 -28402323 -28585065 -28133258 -28372800
-2407b8372800m57275J354820P4535K307031m01058m10533j058283j418534Q53822n34289
$$ -28372800 -28830075 -27475255 -27400720 -25093689 -25494747 -25905280 -26963563 -28382097 -27528275 -28062564
-2417b8062564o09094j50451K52021J177822r69276j27245j621480J157292J608183r04998
$$ -28062564 -28671658 -28822109 -28570088 -27392266 -28361542 -28488787 -30110267 -28952975 -27344792 -28249790
-2427b8249790M56240q51550P12057p11537j31784P80570o35859l35546k93402J880667
$$ -28249790 -27793550 -28645100 -27933043 -28644580 -28776364 -27995794 -28631653 -28967199 -29260601 -27379934
-2437b7379934L41916r09115J0294L74861J36554j164795J049136j236525j84974M80887
$$ -27379934 -27038018 -27947133 -27936839 -27561978 -27425424 -28590219 -27541083 -28777608 -28962582 -28481695
-2447b8481695Q54961r91240L94499j12325J4148M40078p96583Q14043J40380o3734
$$ -28481695 -27626734 -28617974 -28223475 -28335800 -28321652 -27881574 -28678157 -27864114 -27723734 -27787468
-2457b7787468k310978J58504J105509L5337n90869j83319K310773J27643j213625O40535
$$ -27787468 -30098446 -29939942 -28834433 -28799096 -29389965 -29573284 -27262511 -27134868 -28348493 -27707958
-2467b7707958O22186q2227q86186k91459Q41813n90682J71662p98179J718177j503447
$$ -27707958 -27085772 -27167999 -28054185 -28345644 -27503831 -28094513 -27922851 -28721030 -27002853 -28506300
-2477b8506300p21103J166981R11683m37443j588616J605608k239472J377516l56766
$$ -28506300 -29227403 -28060422 -27148739 -27586182 -29174798 -27569190 -29808662 -28431146 -28787912
-2486b8787912R13962n31423Q0974m70808J494559J74396P360k353290L925167k309340
$$ -28787912 -27873950 -28405373 -28324399 -28795207 -27300648 -27126252 -27118892 -29472182 -25547015 -27856355
-2496b7856355J76617L15299l78443K94932q52165L69154j035888m11766Q59042n58945
$$ -27856355 -27679738 -27364439 -27742882 -27447950 -28300115 -27930961 -28966849 -29378615 -28519573 -29078518
-2506b9078518J375829j62778k85094M81018j60753L24223R40927o80698k514659j86799
$$ -29078518 -27702689 -27865467 -28150561 -27669543 -27830296 -27506073 -26565146 -27245844 -29760503 -29947302
-2516b9947302J976751p08889K3916N64141J96921l77288j117469K15065n15626R51708
$$ -29947302 -27970551 -28679440 -28655524 -28091383 -27894462 -28271750 -29389219 -29174154 -29689780 -28738072
-2526b8738072j08910J178266N66939n40543m65630m05480K29375m6683J29603M5088o6138
$$ -28738072 -28846982 -27668716 -27101777 -27642320 -28107950 -28513430 -28284055 -28330738 -28201135 -28156047 -28222185
-2537b8222185N03220l94236n3370L2469N30640L33860o62481l097301J230643K482668
$$ -28222185 -27718965 -28113201 -28166571 -28134102 -27603462 -27269602 -27932083 -31029384 -29798741 -27316073
-2547b7316073m58959j182744j023744K211119j95817n52028K56099J40226p55634m45704
$$ -27316073 -27775032 -28957776 -29981520 -27770401 -27966218 -28518246 -28262147 -28121921 -28877555 -29323259
-2557b9323259K61722R38152p15923n3171J99551O84119p55693N74894J493630k902759
$$ -29323259 -29061537 -28123385 -28839308 -28892479 -28692928 -28008809 -28764502 -28189608 -26695978 -29598737
-2567b9598737R95657M16966N81135o74316L50906O60552j190505J90851P82859J216481
$$ -29598737 -28603080 -28186114 -27604979 -28279295 -27928389 -27267837 -28458342 -28267491 -27484632 -26268151
-2577b6268151k176378q11216J617489q8483j194809O1827K69489M45061k25560o21150
$$ -26268151 -28444529 -29255745 -27638256 -27726739 -28921548 -28859721 -28590232 -28145171 -28370731 -28991881
-2587b8991881P89352N79239p03991J08502j526223J495112k86583R77624n117801M064259
$$ -28991881 -28202529 -27623290 -28327281 -28218779 -29745002 -28249890 -28536473 -27558849 -32676650 -28612391
-2597b8612391J663377j397533O28407m07019k22596j2219J138757n14733j643041n13749
$$ -28612391 -26949014 -28346547 -27718140 -28125159 -28347755 -28359974 -27221217 -27735950 -29378991 -29892740
-2607b9892740J418228p49491P45061M73877j74769m45848M14003L32934J99199O32465
$$ -29892740 -28474512 -29224003 -28478942 -28005065 -28179834 -28625682 -28211679 -27878745 -27679546 -27047081
-2617b7047081K59632r34138m67903m15347p88316M51533J173989j626901l43684P12632
$$ -27047081 -26787449 -27721587 -28189490 -28604837 -29393153 -28941620 -27767631 -29394532 -29738216 -29025584
-2627b9025584K173609j963974m68317L64942P79437q28213o9037n00023J581588p05294
$$ -29025584 -26851975 -28815949 -29284266 -28919324 -28139887 -28968100 -29037137 -29537160 -27955572 -28660866
-2637b8660866k55355Q90406p46778m62278M81964J395263j298154Q75280j313125O66089
$$ -28660866 -28916221 -28025815 -28772593 -29234871 -28752907 -27357644 -28655798 -27780518 -29093643 -28427554
-2647b8427554m02211J271206j028513J284073Q29440r5566j433072r59845q05601J555411
$$ -28427554 -28829765 -27558559 -28587072 -27302999 -26473559 -26569125 -28002197 -28962042 -29767643 -28212232
-2657b8212232O73543k408321K286464r89979r87622j086217J007679O61151M38596n71707
$$ -28212232 -27538689 -29947010 -27660546 -28650525 -29638147 -30724364 -29716685 -29055534 -28616938 -29188645
-2667b9188645k882337K832619J318330J927051j165340r6589L51788j41718p84016N88266
$$ -29188645 -32070982 -29238363 -27920033 -25992982 -27158322 -27254911 -26903123 -27044841 -27828857 -27240591
-2677b7240591j379803L81127l18016r22931P52155L98156J596424k99937j700718l91229
$$ -27240591 -28620394 -28239267 -28557283 -29480214 -28728059 -28329903 -26733479 -27033416 -28734134 -29125363
-2687b9125363K007064j691838O06068Q61872j730430O20867P09251j387844j168066
$$ -29125363 -27118299 -28810137 -28204069 -27342197 -29072627 -28451760 -27742509 -29130353 -30298419
-2696c0298419L31025O33144P51540Q17524o9524n79706j65975m36329J95296o94524
$$ -30298419 -29967394 -29334250 -28582710 -27765186 -27834710 -28414416 -28580391 -29016720 -28821424 -29515948
-2706b9515948J092985M3344L48012J61088N35230j765543N84533M1937K92493p7035
$$ -29515948 -28422963 -28379619 -28031607 -27870519 -27335289 -29100832 -28516299 -28474362 -28181869 -28258904
-2716b8258904J390047n395528L228671L75178Q97600k466789J932840R10279p43336P1317
$$ -28258904 -26868857 -32264385 -29035714 -28660536 -27762936 -30229725 -28296885 -27386606 -28129942 -28058625
-2726b8058625r82875L19740o30238L2426
$$ -28058625 -29041500 -28721760 -29351998 -29319572
-2730b9319572  $$ checkpoint
##PAGE= N=2
##DATA TABLE=(X++(I..I)), XYDATA
13653b8934606j382416N42354m01848j012777J222565Q57300m26917l66442n21763l54787
$$ -28934606 -30317022 -29774668 -30176516 -31189293 -29966728 -29109428 -29536345 -29902787 -30424550 -30779337
13643c0779337k54667M52302r69918L501212M15835r27139R81025l185098R95131J476753
$$ -30779337 -31034004 -30581702 -31551620 -28050408 -27634573 -28561712 -27580687 -30765785 -29770654 -28293901
13633b8293901Q87707r27131j013072p18158L20866q72103J890918k57392k88682J687665
$$ -28293901 -27406194 -28333325 -29346397 -30064555 -29743689 -30615792 -28724874 -28982266 -29270948 -27583283
13623b7583283o21001j186901j452578L91844J743433p76026J345471J93515j028386
$$ -27583283 -28204284 -29391185 -30843763 -30451919 -28708486 -29484512 -28139041 -27945526 -28973912
13614b8973912J525937j064616j53237N42787j39902j121496J328365m35498R91521
$$ -28973912 -27447975 -28512591 -28665828 -28123041 -28262943 -29384439 -28056074 -28491572 -27500051
13605b7500051j720873l25886M25783P98209R92201p18539J309112p73188n91269n76653
$$ -27500051 -29220924 -29546810 -29121027 -28322818 -27330617 -28049156 -26740044 -27513232 -28104501 -28681154
13595b8681154n1962j60607k18457K128632q80562j127192M34180l34096N23538o02910
$$ -28681154 -28733116 -28893723 -29112180 -26983548 -27864110 -28991302 -28557122 -28891218 -28367680 -28970590
13585b8970590J001971K38424m68316j739131N86254r37887J28123M13902q94861j03198
$$ -28970590 -27968619 -27730195 -28198511 -29937642 -29351388 -30289275 -30161152 -29747250 -30642111 -30745309
13575c0745309K618866P37541j477197Q25252n12461J550357o33809r44079n07234J726917
$$ -30745309 -28126443 -27388902 -28866099 -28040847 -28553308 -27002951 -27636760 -28580839 -29088073 -27361156
13565b7361156j593355P81977J138773m35873o65737J026026j365909P62125j077039
$$ -27361156 -28954511 -28172534 -27033761 -27469634 -28135371 -27109345 -28475254 -27713129 -28790168
13556b8790168J105049k88190K03539o74522p2911J135703J153482k047457j352110N38886
$$ -28790168 -27685119 -27973309 -27769770 -28444292 -28517203 -27381500 -26228018 -28275475 -29627585 -29088699
13546b9088699r09048R27397J493060k69869J611752J277684l003887N70399K17426m59631
$$ -29088699 -29997747 -29070350 -27577290 -27847159 -26235407 -24957723 -27961610 -27391211 -27173785 -27633416
13536b7633416J126529o13686q54729P10099j746764L83973O67020K036921j516561M40192
$$ -27633416 -26506887 -27120573 -27975302 -27265203 -29011967 -28627994 -27960974 -25924053 -27440614 -27000422
13526b7000422J293543o82083j587906J816548q43887O88506J39828R29956m906226
$$ -27000422 -25706879 -26388962 -27976868 -26160320 -27004207 -26315701 -26175873 -25245917 -30152143
13517c0152143K073829n46884J012973j192734Q46723k78882R93758L706j20584J282864
$$ -30152143 -28078314 -28625198 -27612225 -28804959 -27958236 -28237118 -27243360 -27239654 -27360238 -26077374
13507b6077374m03477j961448p1171j07774R40304L30766M69255o1625m25760P18258
$$ -26077374 -26480851 -28442299 -28513470 -28621244 -27680940 -27350174 -26880919 -26942544 -27368304 -26650046
13497b6650046K51229r53625Q25702K11345J40364j304875j74833K335930k587544J77869
$$ -26650046 -26398817 -27352442 -26526740 -26315395 -26175031 -27479906 -27654739 -25318809 -27906353 -27728484
13487b7728484J457049p31997k14062J544760M19538l79777M38983k082910j67725J487916
$$ -27728484 -26271435 -27003432 -27217494 -25672734 -25253196 -25632973 -25193990 -27276900 -27444625 -25956709
13477b5956709L88470k44537o12096n38418L34428J504334j536288N57540N26558j657623
$$ -25956709 -25568239 -25812776 -26424872 -26963290 -26628862 -25124528 -26660816 -26103276 -25576718 -27234341
13467b7234341j003793J449554n01335j612956J525296J814497p7238P12312k523253
$$ -27234341 -28238134 -26788580 -27289915 -28902871 -27377575 -25563078 -25640316 -24928004 -27451257
13458b7451257j164382J503225J290997l133650J128907Q06346O52395j20744R28880
$$ -27451257 -28615639 -27112414 -25821417 -28955067 -27826160 -27019814 -26367419 -26488163 -25559283
13449b5559283J51749j061162J91624j71106r68782J895511n15577o91673k00340P1223
$$ -25559283 -25407534 -26468696 -26277072 -26448178 -27416960 -25521449 -26037026 -26728699 -26929039 -26857816
13439b6857816J041934p82546j03392j040778J991217J243111l61322j579555N40630
$$ -26857816 -25815882 -26598428 -26701820 -27742598 -25751381 -24508270 -24869592 -26449147 -25908517
13430b5908517J79966o21362O52306l62875m5020J223819j395949K96368m42876K59415
$$ -25908517 -25728551 -26349913 -25697607 -26060482 -26105502 -24881683 -26277632 -25981264 -26424140 -26164725
13420b6164725j498167N03177j542943K543430J011045k084739l41454J656451J680613
$$ -26164725 -27662892 -27159715 -28702658 -26159228 -25148183 -27232922 -27574376 -25917925 -24237312
13411b4237312L33423j371355j298763L5414n72527J798935R02390r20539J580273o93883
$$ -24237312 -23903889 -25275244 -26574007 -26538593 -27111120 -25312185 -24409795 -25330334 -23750061 -24443944
13401b4443944K47637M78412j122322k24881j062482J249565n65749K092889j103875
$$ -24443944 -24196307 -23717895 -24840217 -25065098 -26127580 -24878015 -25443764 -23350875 -24454750
13392b4454750J58506p13638j458390J270013m17862K90959K963973j651576m74374L88897
$$ -24454750 -24296244 -25009882 -26468272 -25198259 -25616121 -25325162 -22361189 -24012765 -24487139 -24098242
13382b4098242k28753o31512R95486r25847k19137j483309J394383L50376j67645N87584
$$ -24098242 -24326995 -24958507 -23963021 -24888868 -25108005 -26591314 -25196931 -24846555 -25014200 -24426616
13372b4426616j011577M57774J422459l34445l91720N8084n18545J10499j26096l55260
$$ -24426616 -25438193 -24980419 -23557960 -23892405 -24284125 -24226041 -24744586 -24634087 -24760183 -25115443
13362b5115443N9855N74034O44813q98737J81763j039840m86450K1357R80285P42775
$$ -25115443 -25055588 -24481554 -23836741 -24735478 -24553715 -25593555 -26080005 -26058648 -25078363 -24335588
13352b4335588p51911m39941Q18717J8416n51536j30731J12804Q45824J683q1919N54551
$$ -24335588 -25087499 -25527440 -24708723 -24690307 -25241843 -25372574 -25259770 -24413946 -24412263 -24494182 -23939631
13341b3939631j56331K04630p4352j193694N63943J46684q85938k69239K371020N62629
$$ -23939631 -24095962 -23891332 -23965684 -25159378 -24595435 -24448751 -25334689 -25603928 -23232908 -22670279
13331b2670279j277849j070436K10423Q91641m77295j224951K140229j85662o34566J84012
$$ -22670279 -23948128 -25018564 -24808141 -23916500 -24393795 -25618746 -23478517 -23664179 -24298745 -24114733
13321b4114733J010732j015391M64399q56921L17387m13633P40909N59596j220823Q46683
$$ -24114733 -23104001 -24119392 -23654993 -24511914 -24194527 -24608160 -23867251 -23307655 -24528478 -23681795
13311b3681795R34336j252930J2675r32934Q02924K31749p778K97834j189694k22020
$$ -23681795 -22747459 -24000389 -23987714 -24920648 -24117724 -23885975 -23893753 -23595919 -24785613 -25007633
13301b5007633O93719n10552j615549J477824o59119M52034j867608M021059m26929N53944
$$ -25007633 -24313914 -24824466 -26440015 -24962191 -25621310 -25169276 -27036884 -23015825 -23442754 -22888810
13291b2888810j220840O19372r58416K07018O61766Q00380l06316M5877j620502J021262
$$ -22888810 -24109650 -23490278 -24448694 -24241676 -23579910 -22779530 -23085846 -23039969 -24660471 -23639209
13281b3639209j109410J647005j66418p19795M15264n63356N23831J170568o8084o20683
$$ -23639209 -24748619 -23101614 -23268032 -23987827 -23572563 -24135919 -23612088 -22441520 -22509604 -23130287
13271b3130287m3718M4330j257202j07956J500697j237636O19887M95325m35538R87275
$$ -23130287 -23174005 -23129675 -24386877 -24494833 -22994136 -24231772 -23611885 -23116560 -23552098 -22564823
13261b2564823q85303j07836Q6015L59622J03773j361216L72280m24714J471157m46821
$$ -22564823 -23450126 -23557962 -23471947 -23112325 -23008552 -24369768 -23997488 -24422202 -22951045 -23397866
13251b3397866m20650k129573L387465O31520j711066k93881Q67436m38310J843322p02586
$$ -23397866 -23818516 -25948089 -22560624 -21929104 -23640170 -23934051 -23066615 -23504925 -21661603 -22364189
13241b2364189l83365J841795j741853O99382k98430L52828o96880m63406P9000N13562
$$ -22364189 -22747554 -20905759 -22647612 -21948230 -22246660 -21893832 -22590712 -23054118 -22975118 -22461556
13231b2461556j867878J277815J246423j717566l70656o28388J132218j938758j73244
$$ -22461556 -24329434 -23051619 -21805196 -23522762 -23893418 -24521806 -23389588 -25328346 -25501590
13222b5501590M225916J119629r73796q4889p91078j06459j245697J776581j06207j374303
$$ -25501590 -21275674 -20156045 -21129841 -21214730 -22005808 -22112267 -23357964 -21581383 -21687590 -23061893
13212b3061893l63612L97940R03017N53234l38347M89582j50905o88541Q20177m4659
$$ -23061893 -23425505 -23027565 -22124548 -21571314 -21909661 -21420079 -21570984 -22259525 -21439348 -21484007
13202b1484007l18565j872264K297361k53248p09488n5594q68336L42790q17348N49937
$$ -21484007 -21802572 -23674836 -21377475 -21630723 -22340211 -22395805 -23264141 -22921351 -23738699 -23188762
13192b3188762J084160P50710j22645j04264q28977M93321l52021J113247m91876r55989
$$ -23188762 -22104602 -21353892 -21476537 -21580801 -22409778 -21916457 -22268478 -21155231 -21647107 -22603096
13182b2603096k14073j43107k69114J377166j26123j771736J951028J4491l30793M366
$$ -22603096 -22817169 -22960276 -23229390 -21852224 -21978347 -23750083 -21799055 -21784564 -22115357 -22110991
13172b2110991J96317L81358l33268o46619o06534J159645L95120J62963l01982L73914
$$ -22110991 -21914674 -21533316 -21866584 -22513203 -23119737 -21960092 -21564972 -21402009 -21703991 -21330077
13162b1330077j317196O54193j493691K946064k397597J467256M2820p0808j19838m07718
$$ -21330077 -22647273 -21993080 -23486771 -20540707 -22938304 -21471048 -21428228 -21499036 -21618874 -22026592
13152b2026592J38274K16404K00195J817261k262915L09921J52897l1318j71128J15224
$$ -22026592 -21888318 -21671914 -21471719 -19654458 -21917373 -21607452 -21454555 -21485873 -21657001 -21541777
13142b1541777R07631o61876n6185k39432P59879P3149j276918J30450j215647N06694
$$ -21541777 -20634146 -21296022 -21352207 -21591639 -20831760 -20758611 -22035529 -21905079 -23120726 -22614032
13132b2614032P06800J900753p26417j29573o01421Q36806l06237m4110J117776k796352
$$ -22614032 -21907232 -20006479 -20732896 -20862469 -21463890 -20627084 -20933321 -20977431 -19859655 -22656007
13122b2656007R06875k76155J515396p01745J15912K91044J308312j797986r59284J249912
$$ -22656007 -21749132 -22025287 -20509891 -21211636 -21095724 -20804680 -19496368 -21294354 -22253638 -21003726
13112b1003726p85051L29601R24469N74908o56822j245683P284Q2609M17607o71422O96504
$$ -21003726 -21788777 -21459176 -20534707 -19959799 -20616621 -21862304 -21855020 -21772411 -21354804 -22026226 -21329722
13101b1329722J031977l586j435891J200654J15022k35642K20621n15361o61951L05341
$$ -21329722 -20297745 -20301331 -21737222 -20536568 -20421546 -20657188 -20436567 -20951928 -21613879 -21308538
13091b1308538K47883r20455L69685M03083R79330m31760O01270j246318N46764N50437
$$ -21308538 -21060655 -21981110 -21611425 -21208342 -20229012 -20660772 -20059502 -21305820 -20759056 -20208619
13081b0208619j599944r4487m94070K145843j12610Q00566K58862m08012P09520o36726
$$ -20208619 -21808563 -21903050 -22397120 -20251277 -20363887 -19563321 -19304459 -19712471 -19002951 -19639677
13071a9639677k054500j116214K077967j397634R80020L93416n56324J93642N47494O70773
$$ -19639677 -21694177 -22810391 -20732424 -22130058 -21150038 -20756622 -21312946 -21119304 -20571810 -19901037
$$ [...]
-2730c5161414  $$ checkpoint
##END NTUPLES=
##END=
