##TITLE= S#360080
##JCAMP-DX= 5.00 $$ JEOL NMR v1.10
##DATA TYPE= NMR SPECTRUM
##DATA CLASS= NTUPLES
##NUM DIM= 1
##ORIGIN= DELTA_NMR
##OWNER= organic
##SPECTROMETER/DATA SYSTEM= DELTA_NMR
##.OBSERVE FREQUENCY= 3.00529655924288E+02
##.OBSERVE NUCLEUS= ^1H
##.DELAY= (2.194E+02,2.194E+02)
##.ACQUISITION MODE= SIMULTANEOUS
##.FIELD= 7.0586013
##.FILTER WIDTH= 1.81675738660864
##.ACQUISITION TIME= 3.6339712
##.SPINNING RATE= 14
##.OBSERVE 90= 9.6
##NTUPLES= NMR SPECTRUM
##VAR NAME= FREQUENCY,    SPECTRUM/REAL, SPECTRUM/IMAG, PAGE NUMBER
##SYMBOL=   X,            R,             I,             N
##VAR TYPE= INDEPENDENT,  DEPENDENT,     DEPENDENT,     PAGE
##VAR FORM= AFFN,         ASDF,          ASDF,          AFFN
##VAR DIM=  16384, 16384, 16384, 2
##UNITS= PPM,     ARBITRARY UNITS, ARBITRARY UNITS, 
##FIRST=  1.2501033903057E+01, -6.49365721965046, 1.64228219458175, 1
##LAST=  -2.50011824950436, -6.54891814676183, 3.7831905595138E-01, 2
##FACTOR=  9.1565355261926E-04, 8.14142945189845E-04, 8.14142945189845E-04, 1
##PAGE= N=1
##DATA TABLE=(X++(R..R)), XYDATA
$$ [...]
12491i898962L90804j10695l19402K66314p9249k99346L23724m33714M55688k37994L04140
12480i638692K30333n54214J176356k07043J6352J11983p05693K14485m37456n68399O4659
12469a0297329M75154M15719K04654m45963k78486K87738L08522J9698r9228m53598l72672
12458a0235791L30762N50018J51022J68784K80743n27784n05065M71798l97823M41126
12448i272210n28412j19617q15201O91551j35295R15752j208583N44060q69823P24567q474
12437a0081685l05010M91495J041849p89625K07350j38346L7043J4429j15446j028911
12427a0666857Q54837n548O44505q66680L86424J89808O4688m21101L46178m80537K17901
12416i736382k74094K34060j654k0651K32851L92685M19025j94439q59482l30147j56352
$$ plain form
12491 -9898962 -9508158 -9618853 -9938255 -9671941 -9751190 -10050536 -9726812 -10160526 -9704838 -9942832 -9638692
12480 -9638692 -9408359 -9962573 -8786217 -8993260 -8976908 -8864925 -9570618 -9356133 -9793589 -10361988 -10297329
12469 -10297329 -9822175 -9406456 -9201802 -9647765 -9926251 -9638513 -9329991 -9310293 -9409521 -9863119 -10235791
12458 -10235791 -9905029 -9355011 -9203989 -9035205 -8754462 -9282246 -9787311 -9315513 -9713336 -9272210
12448 -9272210 -9800622 -9920239 -10735440 -10043889 -10179184 -9263432 -10472015 -9927955 -10797778 -10073211 -10081685
12437 -10081685 -10386695 -9895200 -8853351 -9642976 -9435626 -9573972 -9536929 -9522500 -9637946 -10666857
12427 -10666857 -9812020 -9817568 -9173063 -10039743 -9653319 -9463511 -9398823 -9819924 -9473746 -9954283 -9736382
12416 -9736382 -10010476 -9776416 -9778070 -9798721 -9565870 -9173185 -8754160 -8948599 -9808081 -10138228 -10294580
12405a0294580P06438o77409L95364j73629k85078j33821N71864K47092m86594K8823
12395a0101530j120054K401176m79826p0259j07547m83912J043239k17296j472174Q36052
12385i772131J95608m94369M61726j55701k79073K3750n12977K62905Q99768o26289K85338
12374i711445l306O34733j83105O4952M96181o333p70793m51861k4626M25819j02869N686
12362i626967n2624M17100N27862o02403j605192q061o4288N85304l70253k8776R09863
12351i918435m23668l24760L96581K68304j65090M36648J3361M1837K27207K05827k63109
12340i505297j096886K24405l10713K2238N45820O2936k7452J014289n88302K52183n01635
12329i908414M40661K51360j528820J226775k82955Q2620j22765l36454N36504j03541
$$ plain form
12405 -10294580 -9588142 -10265551 -9870187 -10043816 -10328894 -10462715 -9890851 -9643759 -10130353 -10101530
12395 -10101530 -11221584 -8820408 -9300234 -9370493 -9478040 -9961952 -8918713 -9136009 -10608183 -9772131
12385 -9772131 -9576523 -10070892 -9609166 -9764867 -10043940 -10020190 -10533167 -10270262 -9370494 -9996783 -9711445
12374 -9711445 -9714751 -9080018 -9263123 -9198171 -8701990 -8708323 -9479116 -9930977 -9955603 -9529784 -9632653 -9626967
12362 -9626967 -9679591 -9262491 -8734629 -9337032 -10942224 -10950285 -11014573 -10429269 -10799522 -10828298 -9918435
12351 -9918435 -10342103 -10666863 -10270282 -10001978 -10167068 -9730420 -9717059 -9675222 -9448015 -9242188 -9505297
12340 -9505297 -10602183 -10377778 -10688491 -10666253 -10120433 -10057497 -10084949 -9070660 -9658962 -9406779 -9908414
12329 -9908414 -9467753 -9216393 -10745213 -9518438 -9801393 -9718773 -9841538 -10177992 -9641488 -9745029
12319i745029n16807r2090O39608K41472L03214L26099j65107K40712o23889O484J88013
12308i197320j217484J043762k00398J55319m15502k46408J91347L80732J59502p06757
12298a0053207M03270k60437M07941n17601L94653j55144O90880p56693m96657K41733
12288a0101262N08115L09756n69574n60914P61973o75537Q2093M448K28104L69200j37746
12277i781344m24990K62912K67900k23264k29600k67247N43093K39524k38660J76345
12267i675331N75488j036258K51034j60449n02402O01247M39378l95062r50944R22399
12257i930900N57554n12039q0080P52326l96562r77093P86216J8988j8383j1461J83800
12246i627634o62372J81424K62164J107571j393993Q4605L00760L91159o92835K14067
$$ plain form
12319 -9745029 -10261836 -10353926 -9714318 -9472846 -9169632 -8843533 -9008640 -8767928 -9391817 -9385333 -9197320
12308 -9197320 -10414804 -9371042 -9571440 -9416121 -9831623 -10078031 -9886684 -9505952 -9346450 -10053207
12298 -10053207 -9649937 -9910374 -9502433 -10020034 -9625381 -9780525 -9089645 -9846338 -10342995 -10101262
12288 -10101262 -9593147 -9283391 -9852965 -10413879 -9651906 -10327443 -10245350 -10240902 -10012798 -9643598 -9781344
12277 -9781344 -10206334 -9943422 -9675522 -9898786 -10128386 -10395633 -9852540 -9613016 -9851676 -9675331
12267 -9675331 -9099843 -10136101 -9885067 -10045516 -10547918 -9946671 -9507293 -9902355 -10853299 -9930900
12257 -9930900 -9373346 -9885385 -9965465 -9213139 -9609701 -10586794 -9800578 -9781590 -9799973 -9811434 -9627634
12246 -9627634 -10290006 -10108582 -9846418 -8738847 -10132840 -10048235 -9747475 -9356316 -10049151 -9835084
12236i835084q7528R02265o4959o128j38534P1834r23817K88355L36891K80214J67820
12225i008671k70543O54062r02723k57511k842M95522l77956p82962O01068K30178N85020
12214i037358j117160K84874L89087K89360m17450k79638l59329L06458J50354N06386
12204i284416J98537l19617k6770L69151j130055P06506j95728K65249k28480k33999K5597
12193i854025l22957n43453J266786J6327N2453j5847n19229l86738O37636m6476j5663
12182i731186l34842M35566m93820N79158k74289Q59016p51016J21450L38427K76557
12172h974979o75293j5917P9624J01867m07652K85307p2502n21802L62052m867j31191
12161i975353J68348j65891P74558R8657k97985q54299N17894J784515j307923o80811
$$ plain form
12236 -9835084 -9922612 -9020347 -9085306 -9091434 -9229968 -9158134 -10081951 -9793596 -9456705 -9176491 -9008671
12225 -9008671 -9279214 -8625152 -9527875 -9785386 -9788228 -9292706 -9670662 -10453624 -9852556 -9622378 -9037358
12214 -9037358 -10154518 -9869644 -9480557 -9191197 -9608647 -9888285 -10247614 -9941156 -9790802 -9284416
12204 -9284416 -9085879 -9405496 -9432266 -9063115 -10193170 -9486664 -9682392 -9417143 -9645623 -9879622 -9854025
12193 -9854025 -10176982 -10720435 -9453649 -9437322 -9384869 -9400716 -9919945 -10306683 -9669047 -9715523 -9731186
12182 -9731186 -10066028 -9630462 -10124282 -9545124 -9819413 -8960397 -9711413 -9589963 -9251536 -8974979
12172 -8974979 -9650272 -9666189 -9586565 -9484698 -9892350 -9607043 -9679545 -10201347 -9839295 -9844162 -9975353
12161 -9975353 -9807005 -9972896 -9198338 -9099681 -9397666 -10251965 -9734071 -7949556 -9257479 -9938290
12151i938290M65044j92904J40387p02314K72859R8534M42956l85014J33027J16463n21498
12140a0070750N45058J88187J55164m07633p48509M1668O12198O7250o31817k01380K22778
12129a0227786L58185P15195n93244k12969k05511Q8850N85341M6812l84885n0657L25617
12118i555052K09736o03999K60626l14024O92273o34108K53812J2729k49291Q4892k43785
12107a0086191q68891J641865L22084n80390N308m8096l54767j29150P30290p29169O40311
12096i456796m96956R1524j01675P93450n58582j50273n8779N58751m7306n93006K85718
12085i733930k5749j33248L70565r35524L29993J35364P38459j054454m90461M89877
12075a0309108o42044L56213K12243J75238L33693M09845K69875k33838m901n14514l06097
$$ plain form
12151 -9938290 -9473246 -9666150 -9525763 -10228077 -9955218 -9856684 -9413728 -9798742 -9665715 -9549252 -10070750
12140 -10070750 -9525692 -9337505 -9182341 -9589974 -10338483 -10296815 -9684617 -9617367 -10249184 -10450564 -10227786
12129 -10227786 -9869601 -9154406 -9747650 -9960619 -10166130 -10077280 -9491939 -9445127 -9830012 -9880669 -9555052
12118 -9555052 -9345316 -9949315 -9688689 -10002713 -9310440 -9944548 -9690736 -9678007 -9927298 -9842406 -10086191
12107 -10086191 -10955082 -9313217 -8991133 -9571523 -9566215 -9614311 -9969078 -10098228 -9367938 -10097107 -9456796
12096 -9456796 -9953752 -9862228 -9963903 -9170453 -9729035 -9879308 -9938087 -9379336 -9426642 -10019648 -9733930
12085 -9733930 -9759679 -9892927 -9522362 -10457886 -10127893 -9992529 -9254070 -10308524 -10798985 -10309108
12075 -10309108 -10951152 -10594939 -10382696 -10207458 -9873765 -9463920 -9194045 -9427883 -9432784 -9947298 -10253395
12064a0253395j31669J06151L33463M86198L70257q65344R7875k53915j72391r0632J65549
12053a0207853J17562L1257n38819O98474k05491j65331J8261L609K09520M48208K70689
12042i319914m52113J23576L48540q35121j08228L74779K43399J99232r9654J537325
12032g988179j847988n3346L15112K81229o19373k64375O29208q77780O50958k85784
12022a0060318N90435n578K87806m50289j20500J49151J70470k9924J55934k32678M4940
12011i500551o64345l10390K25310L49146k79556p80067J088064n8352N09104o61263
12001a0082900K77610k0263p3049j6089O58180q54441M51244O19494j027853J70694J23868
11990i773505j22520O02601m47174m24786j30952N58022J361012j243802m54348N15986
$$ plain form
12064 -10253395 -10385064 -10278913 -9945450 -9459252 -9088995 -9954339 -9856464 -10110379 -10282770 -10373402 -10207853
12053 -10207853 -10090291 -10059034 -10597853 -9899379 -10104870 -10270201 -10251940 -10248331 -10038811 -9590603 -9319914
12042 -9319914 -9772027 -9648451 -9299911 -10135032 -10243260 -9868481 -9625082 -9425850 -9525504 -7988179
12032 -7988179 -9836167 -9889513 -9574401 -9293172 -9912545 -10176920 -9547712 -10425492 -9774534 -10060318
12022 -10060318 -9469883 -9475461 -9187655 -9637944 -9758444 -9609293 -9438823 -9468747 -9312813 -9545491 -9500551
12011 -9500551 -10164896 -10475286 -10249976 -9900830 -10180386 -10960453 -9872389 -9930741 -9421637 -10082900
12001 -10082900 -9805290 -9825553 -9898602 -9914691 -9256511 -10110952 -9659708 -9040214 -10068067 -9897373 -9773505
11990 -9773505 -9896025 -9293424 -9740598 -10165384 -10296336 -9738314 -8377302 -9621104 -10075452 -9559466
11980i559466q3720n43049N51626l58654L61814p0720L0479p08818K12001k32394J38977
11969a0261924M79110l56055L60385m35940L31458R49646l50085p04941o0795k69381N061
11958a0313461J161976q78298j91847M68104l66593L67119l36333J44703m39422O40910
11948i743142n1982m9830j57594N92479m3679J10546N0608J73171j51329m74583n35647
11937a0280982O922R96513j209831l2885K16570J721369q28037K77647o38006N2518o60595
11926a0378797P57886l61801k6346j920j01659P7363J3825r7269O98817l58230p3905
11915i852036K94578j72003K504k47501L26000n33007o6420N85961K29741l55959O9172
11904i718970o73749J82065N45681o01497M15501l4659J067542q90657m14407P10291
$$ plain form
11980 -9559466 -9643186 -10186235 -9634609 -9993263 -9631449 -9702169 -9671690 -10380508 -10168507 -10400901 -10261924
11969 -10261924 -9782814 -10138869 -9778484 -10214424 -9882966 -8933320 -9283405 -9988346 -10049141 -10318522 -10313461
11958 -10313461 -9151485 -10029783 -10221630 -9753526 -10120119 -9753000 -10089333 -9944630 -10384052 -9743142
11948 -9743142 -9795124 -9844954 -10002548 -9410069 -9453748 -9343202 -9292594 -9119423 -9270752 -9745335 -10280982
11937 -10280982 -10274060 -9277547 -10487378 -10520263 -10303693 -8582324 -9410361 -9132714 -9770720 -9718202 -10378797
11926 -10378797 -9620911 -9982712 -10009058 -10010978 -10112637 -10035274 -10021449 -10118718 -9419901 -9778131 -9852036
11915 -9852036 -9557458 -9729461 -9726957 -9974458 -9648458 -10181465 -10247885 -9661924 -9432183 -9788142 -9718970
11904 -9718970 -10392719 -10210654 -9664973 -10266470 -9850969 -9885628 -8818086 -9708743 -10123150 -9412859
11894i412859j87456M2156n49120J86839R76767r23906K25333m74546l64310O33970l70122
11883a0217254J86461N48084j057848L59724n74064N97827N73941Q6541l51581J060735
11873h787434q41333K0975j025734Q21018m36980j17839K91878K1154j79575J50997M6959
11862a0035914k12603N75358R85654r82471M4570k24305j66203J198J57037j48895j44171
11851a0150745l63792L82736o49749N20554L01281n2879Q3891K9239l17592J17391M59416
11840i640249j13770O67292j480888R00973N68375p86685N7588j91986k36779K86504
11830i969625m54668Q36447o48930l52903M55691l15266R20806l7632r67808m5762p98873
11819a1378523J834563k3497K93571j9368j73818k86886O13058n87083J58701M32548
$$ plain form
11894 -9412859 -9600315 -9558159 -10107279 -9920440 -8943673 -9867579 -9642246 -10116792 -10481102 -9847132 -10217254
11883 -10217254 -10030793 -9482709 -10540557 -10180833 -10754897 -10157070 -9583129 -9496588 -9848169 -8787434
11873 -8787434 -9628767 -9607792 -10633526 -9812508 -10249488 -10367327 -10075449 -10054295 -10233870 -10082873 -10035914
11862 -10035914 -10248517 -9673159 -8687505 -9669976 -9625406 -9849711 -10015914 -10014716 -9857679 -10006574 -10150745
11851 -10150745 -10514537 -10131801 -10781550 -10260996 -9959715 -10012594 -9928703 -9899464 -10217056 -10099665 -9640249
11840 -9640249 -9754019 -9086727 -10567615 -9666642 -9098267 -9884952 -9827364 -10019350 -10256129 -9969625
11830 -9969625 -10424293 -9587846 -10236776 -10589679 -10133988 -10449254 -9528448 -9566080 -10533888 -10579650 -11378523
11819 -11378523 -9543960 -9567457 -9273886 -9293254 -9467072 -9753958 -9140900 -9727983 -9569282 -9136734
11809i136734j27776r22036L7416O60816R79528j342329M69490o44037L46455k19471
11799i898678j12473j15474J59818J021932o17777l27055r18044P24881q54517Q42644
11789a0094743K39945P3806J21383L04092K28975n64188J60184k44553j19492j92753
11779a0087344j78545k96545Q05832j97124J38815L44456Q5992o60516R28144p89155
11769i905990O34126m64090m17782L36619O99008n53440M13632n25857L71784k33854
11759i645844J45564k55703N8615p20857O92519J6774P4123l49441N91261p65436J60371
11748i998054O3850M2130N88722l91100k07176L77214m9019q6694K59778k47169K42211
11737i405307M97979j089222J55456K19547m07767M30175r137n90620O21836R5487l88283
$$ plain form
11809 -9136734 -9264510 -10186546 -10149130 -9488314 -8508786 -9851115 -9381625 -10025662 -9679207 -9898678
11799 -9898678 -10011151 -10126625 -9966807 -8944875 -9562652 -9889707 -10807751 -10082870 -10937387 -10094743
11789 -10094743 -9854798 -9780992 -9659609 -9355517 -9126542 -9690730 -9530546 -9775099 -9894591 -10087344
11779 -10087344 -10265889 -10562434 -9756602 -9953726 -9814911 -9470455 -9384463 -10044979 -9116835 -9905990
11769 -9905990 -9271864 -9735954 -10153736 -9817117 -9118109 -9671549 -9257917 -9783774 -9411990 -9645844
11759 -9645844 -9500280 -9755983 -9697368 -10418225 -9725706 -9708932 -9634809 -9984250 -9392989 -10158425 -9998054
11748 -9998054 -9934204 -9892074 -9303352 -9694452 -9901628 -9524414 -9573433 -9660127 -9400349 -9647518 -9405307
11737 -9405307 -8907328 -9996550 -9841094 -9621547 -10029314 -9599139 -9608276 -10198896 -9577060 -9481573 -9869856
11726i869856J20549M39749n32115l4889k46833K76320m4424O3091L63844l02254l90291
11715a0157109M08298N7944J77995j71116j6839k2547J95577n43183Q87768P457j273403
11704a0449158M9450O32852j00591k71206J56012N15028k53236j49169N0699o9329j45540
11693a0034188m5540m65247P12860p10283M39119J18809K58910m18952N46280p224J79391
11682i426065J92471m79012R1016l47271N06609m96259L0561O61605J99898m63989m63994
11671i994430L37494K70373j17117m58307L74719N2768n36011P00454j270028L27961
11661a0312124P63847J5603l25244P8198p29444L78368L34152O0748m61606M19922Q8958
11650i688622o4159j26593k42342J80553r73854J199445k50491j52380P4997J13088j27096
$$ plain form
11726 -9869856 -9749307 -9309558 -9841673 -9876562 -10123395 -9847075 -9891499 -9828408 -9464564 -9766818 -10157109
11715 -10157109 -9748811 -9690867 -9512872 -9683988 -9700827 -9723374 -9527797 -10070980 -9183212 -9175755 -10449158
11704 -10449158 -10399708 -9766856 -9867447 -10138653 -9982641 -9467613 -9720849 -9870018 -9819319 -9888648 -10034188
11693 -10034188 -10079728 -10544975 -9832115 -10542398 -10103279 -9984470 -9725560 -10144512 -9598232 -9605456 -9426065
11682 -9426065 -9233594 -9712606 -9621590 -9968861 -9462252 -9958511 -9927950 -9266345 -9066447 -9530436 -9994430
11671 -9994430 -9656936 -9386563 -9503680 -9961987 -9587268 -9534500 -10070511 -9370057 -10640085 -10312124
11661 -10312124 -9548277 -9532674 -9857918 -9779720 -10509164 -10130796 -9796644 -9735896 -10197502 -9777580 -9688622
11650 -9688622 -9752781 -9879374 -10121716 -9941163 -10915017 -9715572 -9966063 -10118443 -10043446 -9930358 -10057454
11639a0057454n42008m48120O08528l54179k68858r09572K539117N62819m11979j60357
11629i442063J1943j70577n41576N84716l7972L83698m61139k64652j38103R78360K9455
11618i067910l93777M36873O499r84784o4595O06523l15668k66168N50308L35834n75260
11607i732125N3953j10285J38960m5029J49547l04774k06132K80082K86329L7783j65953
11596i617644K68603J16040p21537R8994O98956l40960Q9080l01020K79512q2772O71248
11585h841500m80202J112584j148204p9015j293868Q98987L16108n60760O09388p7314
11575i543796p02752N40084p23725O55477O25979k44386o3560o1910l67134L17550r29949
11564a0498122O89507P01296o88767l27066r98598J855679n91979k57312K96686q3894
$$ plain form
11639 -10057454 -10599462 -11047582 -10439054 -10793233 -11062091 -11971663 -9432546 -8869727 -9281706 -9442063
11629 -9442063 -9430120 -9600697 -10142273 -9557557 -9595529 -9211831 -9672970 -9937622 -10075725 -9097365 -9067910
11618 -9067910 -9461687 -9024814 -9018315 -10003099 -10067694 -9461171 -9776839 -10043007 -9492699 -9156865 -9732125
11607 -9732125 -9678172 -9788457 -9649497 -9694526 -9544979 -9849753 -10055885 -9775803 -9489474 -9451691 -9617644
11596 -9617644 -9349041 -9233001 -9954538 -9855544 -9156588 -9497548 -9408468 -9709488 -9429976 -9512748 -8841500
11585 -8841500 -9321702 -8209118 -9357322 -9436337 -10730205 -9831218 -9515110 -10075870 -9466482 -9543796
11575 -9543796 -10246548 -9706464 -10430189 -9774712 -9148733 -9393119 -9456679 -9518589 -9885723 -9568173 -10498122
11564 -10498122 -9808615 -9107319 -9796086 -10123152 -11121750 -9266071 -9858050 -10115362 -9818676 -9902570
11554i902570K99864k74447M4972k07054M20854m64148O18438p80267m22253Q54783m99224
11543a0311052l3693N46951K19053O8401J436728j098868j284233K80605j43129K28334
11533a0090903N27013o23935J041549o78828J46575M02425n03900K5435k36473N37081
11523i453961m85189K88355o6822Q38885j330915l55043J51697k31973P97993k02484q9402
11512a0138859O1042r6407M63795L50217K60123l92484K72886j311534J180912J91534
11502i158775r05475O7614K78413M2937J04892o71183J44811J06922K05606P6852j36239
11491i843625R7903k74335j58163P44997J23055m37539K68006j93992K20619l77296L9796
11480i790574J85367L89137o53104M90733K49343o00335r666M55331q74274K39270L16366
$$ plain form
11554 -9902570 -9602706 -9877153 -9832181 -10039235 -9618381 -10082529 -9464091 -10244358 -10666611 -9811828 -10311052
11543 -10311052 -10344745 -9797794 -9578741 -9510340 -8073612 -9172480 -10456713 -10176108 -10319237 -10090903
11533 -10090903 -9563890 -10187825 -9146276 -9825104 -9678529 -9276104 -9780004 -9754569 -9991042 -9453961
11523 -9453961 -9939150 -9650795 -9717617 -8878732 -10209647 -10564690 -10412993 -10644966 -9846973 -10049457 -10138859
11512 -10138859 -10077817 -10174224 -9710429 -9360212 -9100089 -9492573 -9219687 -10531221 -9350309 -9158775
11502 -9158775 -10064250 -9996636 -9718223 -9675286 -9570394 -10241577 -10096766 -9989844 -9784238 -9707386 -9843625
11491 -9843625 -9745722 -10020057 -10178220 -9433223 -9310168 -9747707 -9479701 -9673693 -9453074 -9830370 -9790574
11480 -9790574 -9605207 -9216070 -9869174 -9378441 -9129098 -9729433 -9739099 -9283768 -10158042 -9918772 -9602406
11469i602406p50486O08639k6903Q0157m62842l73986L79148K86345l26642J27343N70858
11458i490775L04219n72709O081o11260J22448K20177J260533j179556N29078j035988
11448a0447752K87493O91241m46103J46198j87994J07348J49802P70926k56488n9476
11438i244805j089096J110412q33042L56799j56598m61137N28759K5324o93595O4740
11428a0392239J20970j46781n05950J62990L75692J61834N53374L5055k26790N04190
11418i357655k31311n31712P3603M71742k38145k08850O76377m5427k25654p87299O77679
11407i726652j66796k27160K36944N39693o46505J008135m3326Q33695j018103J58888
11397i051187K2934m42930l84416N58964o02495L06310m69041o15821M14507O24267N11330
$$ plain form
11469 -9602406 -10352892 -9744253 -9771156 -9690999 -10153841 -10527827 -10148679 -9862334 -10188976 -10061633 -9490775
11458 -9490775 -9186556 -9759265 -9753184 -10364444 -10241996 -10021819 -8761286 -9940842 -9411764 -10447752
11448 -10447752 -10160259 -9469018 -9915121 -9768923 -9956917 -9849569 -9699767 -8928841 -9185329 -9244805
11438 -9244805 -10333901 -9223489 -10056531 -9699732 -9856330 -10317467 -9788708 -9763384 -10456979 -10392239
11428 -10392239 -10271269 -10418050 -10924000 -10761010 -10385318 -10223484 -9670110 -9635055 -9861845 -9357655
11418 -9357655 -9588966 -10120678 -10047075 -9575333 -9813478 -10022328 -9345951 -9391378 -9617032 -10404331 -9726652
11407 -9726652 -9893448 -10120608 -9883664 -9343971 -9990476 -8982341 -9025667 -8191972 -9210075 -9051187
11397 -9051187 -9028253 -9471183 -9855599 -9296635 -9899130 -9592820 -10061861 -10677682 -10263175 -9638908 -9127578
11386i127578J98410m79813j87803M71926r49060j37694L8467N17913J1851P921k75277
11375i910737L7562M73591k5130k52478j34697q25385J045842l11193K62215J17524
11365i522886j935335M97621P98691J05489J06439j35715N38857l12788M01505k82941
11355i741063L21087o05789L28236r44606M98133o5632j18183Q48144K64568n25000L65580
11344i374525r64533m8468J318945m56560J52386k42753k25601J55071K49023P3748l98202
11333i761469m11220N14962q63295L69055L58436L72372p97001l95715N32637K5358l29769
11322a0385649L03833K77827k14735l17897k21437P74726m69035M82519r5963N94693
11312i271118k01594j32606j41806J41453l67537m06594j78418J095884M67736j174939
$$ plain form
11386 -9127578 -8929168 -9408981 -9596784 -9124858 -10073918 -10211612 -10173145 -9655232 -9643381 -9635460 -9910737
11375 -9910737 -9873175 -9399584 -9424714 -9677192 -9811889 -10637274 -9591432 -9902625 -9640410 -9522886
11365 -9522886 -11458221 -10960600 -10161909 -10056420 -9949981 -10085696 -9546839 -9859627 -9458122 -9741063
11355 -9741063 -9419976 -10025765 -9697529 -10642135 -10144002 -10209634 -10327817 -9479673 -9215105 -9740105 -9374525
11344 -9374525 -10339058 -10387526 -9068581 -9525141 -9372755 -9615508 -9841109 -9686038 -9437015 -9363267 -9761469
11333 -9761469 -10172689 -9657727 -10521022 -10151967 -9793531 -9421159 -10218160 -10613875 -10081238 -10055880 -10385649
11322 -10385649 -10081816 -9803989 -10018724 -10336621 -10558058 -9783332 -10252367 -9769848 -9865811 -9271118
11312 -9271118 -9472712 -9605318 -9747124 -9605671 -9973208 -10379802 -10558220 -9462336 -8994600 -10169539
11302a0169539M20307j035771k5423Q74851q3756j81593J36342N10368m45212k19356
11292a0218782j78635J521606n79247n93182R06008o97097k90532N66795k33229Q8864
11282i707431L0554r1809J733l71196J194507p62002k64967K14445m82661J26009P75038
11271i337780l93292n52932N98376m10944Q97533j05659L35315j545703O47686L96210
11261i471190j43071k81402Q26909r10584K25158m91683P6282j384277K409176m70905m092
11250i619679l84657N93951n02909m68313j39611N73738R3099J38524o07718j32502L30725
11239a0125352K41224N0148k27661k34710P14562l1895k06828J97586P7371P3440n51207
11228a0023322L63090M78539l02063K93215n74813O30134p48805r85603k36931J696574
$$ plain form
11302 -10169539 -9749232 -10785003 -10810426 -9935575 -10019331 -10200924 -10064582 -9554214 -9999426 -10218782
11292 -10218782 -10397417 -8875811 -9455058 -10048240 -9142232 -9839329 -10129861 -9563066 -9796295 -9707431
11282 -9707431 -9676877 -9768686 -9766953 -10138149 -8943642 -9705644 -9970611 -9756166 -10238827 -10112818 -9337780
11271 -9337780 -9731072 -10284004 -9685628 -10096572 -9199039 -9304698 -8969383 -10515086 -9867400 -9471190
11261 -9471190 -9614261 -9895663 -9068754 -9979338 -9754180 -10245863 -10169581 -11553858 -9144682 -9615587 -9619679
11250 -9619679 -10004336 -9410385 -9913294 -10381607 -10521218 -9947480 -9854381 -9715857 -10323575 -10456077 -10125352
11239 -10125352 -9884128 -9833980 -10061641 -10296351 -9581789 -9613684 -9820512 -9622926 -9545555 -9472115 -10023322
11228 -10023322 -9660232 -9181693 -9483756 -9190541 -9765354 -9135220 -9884025 -10869628 -11106559 -9409985
11218i409985N54052q54476M4156M90580o97235Q51234o09188J70457k24517N98213p38217
11207i824926m444M02130o6650p15895O92193k86477M52685m14165M99871J61779j4544
11196i118443K82722l4863n07348m15878L14556j62898J1581M89063K52598j001032L68392
11185i521550L7534j06342K63258n78262N50856J40971p07935k36393L35512m63783N17133
11174i769001J17131O17920R6450q6007j745630J730815m78070J60299r15182J133362
11164i137913p55458K53680P8705j26327p11633n87963P94930n1567N64884p11606q3231
11153a0473499K89361K08331p0436P68712P5302m87634O39942l12959J291k65889K49666
11142i377812P19406j624501L25655m66643P04447Q13872r38506j98823m30744m1740
$$ plain form
11218 -9409985 -8855933 -9710409 -9666253 -9175673 -9872908 -9021674 -9630862 -9460405 -9684922 -9086709 -9824926
11207 -9824926 -9829370 -9427240 -9493890 -10209785 -9517592 -9804069 -9351384 -9765549 -9265678 -9103899 -9118443
11196 -9118443 -8835721 -8870584 -9377932 -9793810 -9479254 -9642152 -9630571 -9141508 -8888910 -9889942 -9521550
11185 -9521550 -9484016 -9590358 -9327100 -9905362 -9354506 -9213535 -9921470 -10157863 -9822351 -10286134 -9769001
11174 -9769001 -9651870 -9033950 -8937500 -9023507 -10769137 -9038322 -9516392 -9356093 -10271275 -9137913
11164 -9137913 -9893371 -9639691 -9560986 -9687313 -10398946 -10986909 -10191979 -10243546 -9678662 -10390268 -10473499
11153 -10473499 -10184138 -9975807 -10046243 -9277531 -9202229 -9689863 -9049921 -9362880 -9361589 -9627478 -9377812
11142 -9377812 -8658406 -10282907 -9957252 -10423895 -9719448 -8905576 -9844082 -10042905 -10473649 -10515389
11132a0515389K94251k85616M64506K07826r2940N78044J04524p47936K58353m46111
11122a0180488L60139Q7436J48212q69709L91105l38641M85733K76458j098620J205112
11112i533263q79063l37505O56343j400380J304468P6629L02099o1203K23639N41337M9375
11101i057524l78249Q34395q99524M8193m13459k92687P3038N36531N3189o54408K33704
11090i916801L33695L67379m06143M40191m26702r63584q45638K056572o34625J5990
11080i979666K55168L27684r8815N2551n7874l28804O2668l46497K05868Q76427n84831
11069i616121j298095J425940p36280m50716J495553r21501R49983o73956j404428J073062
11059a0156559L42104k51391P358L36961k6265P0117M53266l67809n11226K25109l28440
$$ plain form
11132 -10515389 -10221138 -10506754 -10042248 -9834422 -9927362 -9349318 -9244794 -9992730 -9734377 -10180488
11122 -10180488 -9820349 -9732913 -9584701 -10454410 -10063305 -10401946 -9916213 -9639755 -10738375 -9533263
11112 -9533263 -10412326 -10749831 -10093488 -11493868 -10189400 -10112771 -9810672 -9871875 -9648236 -9106899 -9057524
11101 -9057524 -9435773 -8601378 -9500902 -9452709 -9866168 -10158855 -10085817 -9549286 -9496097 -10150505 -9916801
11090 -9916801 -9583106 -9215727 -9621870 -9181679 -9608381 -10571965 -11417603 -9361031 -9995656 -9979666
11080 -9979666 -9724498 -9396814 -9495629 -9443078 -9500952 -9829756 -9767088 -10113585 -9907717 -9031290 -9616121
11069 -9616121 -10914216 -9488276 -10224556 -10675272 -9179719 -10101220 -9151237 -9825193 -11229621 -10156559
11059 -10156559 -9814455 -10065846 -10058488 -9721527 -9747792 -9677675 -9224409 -9592218 -10103444 -9878335 -10206775
11048a0206775O68919o82994Q24325n41426q2156N34819l61967N4380L69742l54862r0526
11037i868521l20073N68997n06072k99091J30542R01969j68557j6016k86329L29580M39683
11026i093888m50049p78032p71546J375060J34981J09824O1175n67516l40361j53505
11016a0473857L90912L66914k35141k77498J098078k18966k71082Q0820n95739K11919
11006i923640O04818k29265K62918m22676R5856M56590j95699l88836N87901J08580L82958
10995h660495r22168K14758K7189n57074l692K76752N848m01576L06452Q79975J67173
10984h666858o37349L59170j074457k79617R14599M82653p16522N81687j96756m11109
10974i644559q2564M6763K86408J349M69601J20599j094247P46561O71126J35081j133384
$$ plain form
11048 -10206775 -9537856 -10220850 -9396525 -9937951 -10020107 -9485288 -9847255 -9792875 -9423133 -9777995 -9868521
11037 -9868521 -10188594 -9619597 -10125669 -10424760 -10294218 -9392249 -9560806 -9576822 -9863151 -9533571 -9093888
11026 -9093888 -9543937 -10321969 -11093515 -9718455 -9583474 -9473650 -9412475 -9979991 -10320352 -10473857
11016 -10473857 -10082945 -9716031 -9951172 -10228670 -9130592 -9349558 -9620640 -9539820 -10135559 -9923640
11006 -9923640 -9318822 -9548087 -9285169 -9707845 -9611989 -9155399 -9351098 -9739934 -9152033 -9043453 -8660495
10995 -8660495 -9582663 -9367905 -9340716 -9897790 -9901482 -9624730 -9618882 -10020458 -9714006 -8834031 -8666858
10984 -8666858 -9304207 -8945037 -10019494 -10299111 -9384512 -8901859 -9618381 -9036694 -9233450 -9644559
10974 -9644559 -9727123 -9680360 -9393952 -9392603 -8923002 -8802403 -9896650 -9150089 -8478963 -8343882 -9477266
10963i477266J028617o35828J36049l31813N16608j27953L81331L7087l73747m96428
10953i343343J05702L64530J73932L11829J14920J93693L62486r0927p21006J91715M03944
10942g932525k66069L7009M68416k43142Q52829n78533J68149m37393P0865Q77285l35373
10931g318482l8416K08895m72498K84270k11988r82023K1378J56534Q09925J96471o26135
10920g972069N24164k52126L04187K67681O5876p2801o36855l170n95219J033450M50297
10909f886585M37056J91946Q11602R6938M48076r7888j020693K017694m80683M1038l20917
10898d762416N88866k4120Q24796j11441o96265J633706J155360K76620j040218Q34759
10888a320353J14045J849039K978955L024524J178661k094098l575925l924498k566328
$$ plain form
10963 -9477266 -8448649 -9084477 -8948428 -9280241 -8763633 -8891586 -8510255 -8473168 -8846915 -9343343
10953 -9343343 -9237641 -8873111 -8699179 -8387350 -8272430 -8078737 -7716251 -7807178 -8528184 -8336469 -7932525
10942 -7932525 -8198594 -8161585 -7693169 -7936311 -7083482 -7662015 -7493866 -7931259 -7860394 -6983109 -7318482
10931 -7318482 -7356898 -7148003 -7620501 -7336231 -7548219 -8530242 -8508864 -8352330 -7542405 -7345934 -7972069
10920 -7972069 -7447905 -7700031 -7395844 -7128163 -7062287 -7135088 -7771943 -7775113 -8370332 -7336882 -6886585
10909 -6886585 -6449529 -6257583 -5445981 -5349043 -4900967 -4998855 -6019548 -4001854 -4482537 -4441499 -4762416
10898 -4762416 -4173550 -4197670 -3372874 -3484315 -4180580 -2546874 -1391514 -1114894 -2155112 -1320353
10888 -1320353 -1206308 642731 3621686 6646210 7824871 5730773 2154848 -1769650 -4335978
10879d335978j307945p27211j014332J10382j267247m88980j402770K005960k79802
10870h707923j245914o59806J180583Q94407k50199n05399q8143J26200j98485j60649
10860i615328N80611J03905r48960O11661k1506J7300K96512L80734l81806k19348R14673
10849h281552n76259j89292j03317L20287J43159P2926J89709o43895q26919K53173L59508
10838i282472l41381P9972J18995p97990R0211K06286j11590Q20044n71607K40147o00680
10827a0150065M55373P81628J40705l00456o64893k64970L32661j064429J514245m88418
10817i708619K10932O1822K8798J07118j78860N99713o51763J24851m39584o4648J70086
10806i740154L96289j39745m28486r31Q20356O44557o1983m93020n33011L10278K44005
$$ plain form
10879 -4335978 -5643923 -6371134 -7385466 -7275084 -8542331 -9031311 -10434081 -8428121 -8707923
10870 -8707923 -9953837 -10613643 -9433060 -8538653 -8788852 -9294251 -9382394 -9256194 -9454679 -9615328
10860 -9615328 -9034717 -8930812 -9879772 -9268111 -9289617 -9272317 -8975805 -8595071 -8976877 -9196225 -8281552
10849 -8281552 -8857811 -9047103 -9150420 -8830133 -8686974 -8614048 -8424339 -9068234 -9895153 -9641980 -9282472
10838 -9282472 -9623853 -9543881 -9424886 -10222876 -10132665 -9926379 -10037969 -9217925 -9789532 -9549385 -10150065
10827 -10150065 -9694692 -8913064 -8772359 -9072815 -9737708 -10002678 -9670017 -10734446 -9220201 -9708619
10817 -9708619 -9497687 -9435865 -9407067 -9299949 -9478809 -8879096 -9530859 -9406008 -9845592 -9910240 -9740154
10806 -9740154 -9343865 -9483610 -9912096 -9913027 -9092671 -8448114 -8510097 -9003117 -9536128 -9225850 -8981845
10795h981845J603729j165870j033473L44315q8572L81988k88986l08611N19595P3580
10785h944150k98377m2600K04020k35134l94555K22007J85656R20464l06600j293678
10775i982947O58479J26218m83694P2089L5831l1170j468890J273269l26638N20993l69262
10764i975722k29982O540Q65982j1576o75526N1833k1823k5900J81864j55464Q60657
10753i129117K76128m54892p39228n16201J81801K93205m39988j35233K53680k243205
10743a2653050K621175M58043j79503m59956Q33644n12491O7713L32758Q56016j152584
10733i788235K5333J35259R61099n66948j29134l41768L84469j25640k153130J751551
10723i847144K69516q45045O34160m24536j94932m2209J70751N41924K01614j045991
$$ plain form
10795 -8981845 -7378116 -8543986 -9577459 -9233144 -9321716 -8939728 -9228714 -9537325 -9017730 -8944150
10785 -8944150 -9242527 -9285127 -9081107 -9316241 -9710796 -9488789 -9303133 -8382669 -8689269 -9982947
10775 -9982947 -9324468 -9198250 -9681944 -9609855 -9574024 -9605194 -11074084 -9800815 -10127453 -9606460 -9975722
10764 -9975722 -10205704 -10199164 -9333182 -9344758 -10020284 -9968451 -9990274 -10016174 -9834310 -9989774 -9129117
10753 -9129117 -8852989 -9307881 -10047109 -10563310 -10381509 -10088304 -10528292 -10663525 -10409845 -12653050
10743 -12653050 -10031875 -9573832 -9753335 -10213291 -9379647 -9892138 -9824425 -9491667 -8635651 -9788235
10733 -9788235 -9762902 -9627643 -8666544 -9233492 -9362626 -9704394 -9319925 -9445565 -11598695 -9847144
10723 -9847144 -9577628 -10422673 -9788513 -10213049 -10407981 -10450190 -10279439 -9737515 -9535901 -10581892
10713a0581892Q52868j5212L1120j098872N18290O07779m02864L78135N13281J98646Q9699
10702h909022R9116j249337J83709J2498k63940k05952N91213k28437l82413M7891P36177
10691i568497j18231L86095n76827m72388M10128l8214N24148l23562j24690K90458k03592
10680i815172k41289N78791m42064O22975q62912J284515m6825n24984n56762j47728
10670a0151455l50639P75484P29694m22431l05133j32385K61465L16823l24491L90368
10660i212700j95053k08288n97600J04551m2268M25091k34297n88723J327207q24186
10650a0046266L02436r40257K49455J442966L56482p71874k27801k26945Q58955q12503
10640i815352l242N7908j75112K80545L25630k49470q3896m8837k26738J52211Q0295l0473
$$ plain form
10713 -10581892 -9729024 -9744236 -9713116 -10811988 -10293698 -9685919 -10088783 -9710648 -9197367 -8998721 -8909022
10702 -8909022 -8809906 -10059243 -9875534 -9863036 -10126976 -10332928 -9741715 -9970152 -10352565 -10304674 -9568497
10691 -9568497 -9686728 -9300633 -9877460 -10349848 -9939720 -9977934 -9453786 -9777348 -9902038 -9611580 -9815172
10680 -9815172 -10056461 -9477670 -9919734 -9296759 -10159671 -8875156 -8921981 -9446965 -10003727 -10151455
10670 -10151455 -10502094 -9726610 -8996916 -9419347 -9724480 -9856865 -9595400 -9278577 -9603068 -9212700
10660 -9212700 -9407753 -9616041 -10213641 -10109090 -10151358 -9726267 -9960564 -10549287 -9222080 -10046266
10650 -10046266 -9743830 -10684087 -10434632 -8991666 -8635184 -9407058 -9634859 -9861804 -9002849 -9815352
10640 -9815352 -9818594 -9760686 -9935798 -9655253 -9329623 -9579093 -9662989 -9711826 -9938564 -9786353 -9706058 -9736531
10628i736531K61014j568435O05432L9304N06407Q5099N9998R04228o22445k95701J37697
10617i623933l95275l36657J0470O82844k12241j36579m7976j41641R26646m60913o91328
10606a0426583p68168J707154n27985K51034K10190m12094O43628J79625j000968L12551
10596i831616L64990m01630l22235j0579n17139O41934J95935K48622r6909N19512r0554
10585i299669m24263k55072N16278p48915N4698K81158P3368l56934O14416J86714m60206
10574i818427m74328L70212j77819K34633J28618J33437m07083O1670N73628L39022k43081
10563i279518j87251j79021K06767n31287o7796P60198n07443j16252N5121R9750L4667
10552i712065o97543J02706k76135O18348q2439m12204N13105J64192K93405j93942P7218
$$ plain form
10628 -9736531 -9475517 -11043952 -10438520 -10399216 -9892809 -9807710 -9747712 -8843484 -9465929 -9761630 -9623933
10617 -9623933 -10019208 -10355865 -10345395 -9662551 -9874792 -10011371 -10059347 -10200988 -9274342 -9735255 -10426583
10606 -10426583 -11194751 -9487597 -10015582 -9764548 -9554358 -9966452 -9322824 -9143199 -10144167 -9831616
10596 -9831616 -9466626 -9868256 -10190491 -10201070 -10718209 -10076275 -9880340 -9631718 -9728627 -9209115 -9299669
10585 -9299669 -9723932 -9979004 -9462726 -10211641 -10156943 -9875785 -9802417 -10159351 -9544935 -9358221 -9818427
10574 -9818427 -10292755 -9922543 -10100362 -9865729 -9737111 -9603674 -10010757 -9949087 -9375459 -9036437 -9279518
10563 -9279518 -9466769 -9645790 -9439023 -9970310 -10038106 -9277908 -9785351 -9901603 -9846482 -9746732 -9712065
10552 -9712065 -10409608 -10306902 -10583037 -9964689 -10047128 -10459332 -9946227 -9782035 -9488630 -9682572 -9605354
10541i605354J84967K32114R1987r6010l12650R5921N3346q18639j90413P73591Q03348
10530h787792q51149n01896k97605K66219K74104l13667K32876l92550K9353N25720k60997
10519a0077384L98430Q5301L98719m97861n59401Q08146J580144j390579m74062L1216
10509i697331m5958m52803N17011m37236N6428n42102J054789o49796J098001k51960
10499i350957J07162r21491k25793Q86863l25078j87039L52133J20323M55009l77974
10489i466842p12633l45393O24999J17828p20189N08139L14340k67203k08901M82945
10479i672910o56698Q6867k4724Q71139J91463N7974O9557o06656L97484j659404Q43216
10468a0102692R26724j005534L28561P59602q11480L15427m39265L24912p04798N03199
$$ plain form
10541 -9605354 -9420387 -9188273 -9096286 -9192296 -9504946 -9409025 -9355679 -10174318 -10364731 -9591140 -8787792
10530 -8787792 -9638941 -10140837 -10438442 -10172223 -9898119 -10211786 -9978910 -10371460 -10342107 -9816387 -10077384
10519 -10077384 -9678954 -9593653 -9194934 -9692795 -10252196 -9444050 -7863906 -9254485 -9728547 -9697331
10509 -9697331 -9743289 -10196092 -9679081 -10116317 -10059889 -10601991 -9547202 -10196998 -9098997 -9350957
10499 -9350957 -9243795 -10165286 -10391079 -9504216 -9829294 -10016333 -9664200 -9543877 -9088868 -9466842
10489 -9466842 -10179475 -10524868 -9899869 -9782041 -10502230 -9994091 -9679751 -9946954 -10155855 -9672910
10479 -9672910 -10329608 -10242741 -10267465 -9396326 -9204863 -9146889 -9077332 -9683988 -9286504 -10945908 -10102692
10468 -10102692 -9175968 -10181502 -9852941 -9093339 -9904819 -9589392 -10028657 -9703745 -10408543 -9905344
10458i905344k63092K6300J45568k39836N13798p48726J928782k61438q23401o8164K00623
10447i494930N69185n10043K87685j84831q39259L54085j53866L69446J00107J22007
10437i380414p37038k18238Q13473n43160M56360k11357n82139K19534Q1660J19751J76042
10426i805526m9515P73000o1616L1274K73922o01050K95723j695l97301J21402Q4527
10415i336855l57485l36729r7756J59781L19011L49362q87412M36421j83424M57074n40655
10404a0018667J01780Q7948k02239P98249o48186Q30147j12698n10268L43701m88880
10394i819113p79504O98320R23157J78683q35159m90283K15435J6518P734J42422L06972
10383i434818m03704L85506O43432j331476j177615K000134j46788j72004k80792M90509
$$ plain form
10458 -9905344 -10168436 -10142136 -9996568 -10236404 -9722606 -10471332 -8542550 -8803988 -9627389 -9695553 -9494930
10447 -9494930 -8925745 -9435788 -9148103 -9332934 -10172193 -9818108 -9971974 -9602528 -9502421 -9380414
10437 -9380414 -10117452 -10335690 -9522217 -10065377 -9609017 -9820374 -10402513 -10182979 -10101319 -9981568 -9805526
10426 -9805526 -9855041 -9082041 -9143657 -9112383 -8838461 -9439511 -9143788 -9145483 -9542784 -9421382 -9336855
10415 -9336855 -9694340 -10031069 -10128825 -9969044 -9650033 -9300671 -10188083 -9751662 -9935086 -9478012 -10018667
10404 -10018667 -9916887 -9828939 -10031178 -9232929 -9881115 -9050968 -9163666 -9673934 -9330233 -9819113
10394 -9819113 -10598617 -9900297 -8977140 -8798457 -9633616 -10123899 -9908464 -9891946 -9884212 -9741790 -9434818
10383 -9434818 -9838522 -9453016 -8809584 -10141060 -11318675 -9318541 -9465329 -9637333 -9918125 -9427616
10373i427616K97298m58030r87351O95953m71174p69719J307876j53740Q24017n68093
10363i710579O3869l84018Q06792n20594j465212P49983N39680R20103k83931P1373k39459
10352i451993m58587L67480l97524N61802n58694N65584K16953J8172p20833M6709J44658
10341i666273M15811j51405l82282p31752J003716o31149R59o928K20155J51506J284
10330i776358O38213q69237O21470o26939O42015o73445K68601k08885N32055J59158
10320i293352J76705l61662o5259l37018M06327l0873p1285j7555j34340j72626L93224
10309i507714n0264p22717N30653M04089j055689R43254o97827m20995N98701O21205
10299i357304l27961N73158j148503J62249o4931L1420j01740L19861j87404N27982M4314
$$ plain form
10373 -9427616 -9130318 -9588348 -10575699 -9879746 -10350920 -11120639 -9812763 -9966503 -9142486 -9710579
10363 -9710579 -9646710 -10030728 -9223936 -9744530 -11209742 -10459759 -9920079 -8999976 -9283907 -9212534 -9451993
10352 -9451993 -9910580 -9543100 -9940624 -9378822 -9937516 -9371932 -9154979 -9136807 -9857640 -9810931 -9666273
10341 -9666273 -9250462 -9401867 -9784149 -10515901 -9512185 -10143334 -10142375 -10149303 -9929148 -9777642 -9776358
10330 -9776358 -9138145 -10007382 -9385912 -10012851 -9370836 -10044281 -9775680 -9984565 -9452510 -9293352
10320 -9293352 -9116647 -9478309 -9543568 -9880586 -9474259 -9505132 -9576417 -9593972 -9728312 -9900938 -9507714
10309 -9507714 -9557978 -10280695 -9750042 -9345953 -10401642 -9458388 -10156215 -10577210 -9978509 -9357304
10299 -9357304 -9685265 -9112107 -10260610 -10098361 -10163292 -10131872 -10233612 -9913751 -10101155 -9573173 -9528859
10288i528859j43407n82699K32199K3494Q62321q42469m74393N57069j00815Q48683p27656
10277i876532O33770j45906p47416K77751l61526J59272R4618L24205J8611j15855o58959
10266a0397967k9447J060434n79180k83743L38986j4366l08377N27290O61624l99881
10256i424627K45992o14430k01798q8213K38546M94128J53319k66045o51443J64195N53442
10245i396934l3654O6286K297k30375o3090K65125J25253p9899P2867p1998j20436r23814
10233a0388372L0310j97446R62787j385120R27982N14472k87136Q3321o27898j7499J8011
10222a0366588J094020m3745M18876J8375m78153r70595r5525J328665j81919m43171
10212i719760K17661J125255K58675j877998k73839j09330o9174L10263n1493j73577
$$ plain form
10288 -9528859 -9672266 -10254965 -10022766 -9999272 -9136951 -9979420 -10453813 -9896744 -9997559 -9148876 -9876532
10277 -9876532 -9242762 -9388668 -10136084 -9858333 -10219859 -10060587 -9965969 -9641764 -9623153 -9739008 -10397967
10266 -10397967 -10427414 -9366980 -9946160 -10229903 -9890917 -9905283 -10213660 -9686370 -9024746 -9424627
10256 -9424627 -9178635 -9793065 -9994863 -10083076 -9844530 -9350402 -9197083 -9463128 -10114571 -9950376 -9396934
10245 -9396934 -9430588 -9364302 -9362005 -9592380 -9655470 -9390345 -9265092 -9344991 -9272124 -9344122 -9464558 -10388372
10233 -10388372 -10358062 -10555508 -9592721 -10977841 -10049859 -9535387 -9822523 -9739202 -10367100 -10384599 -10366588
10222 -10366588 -9272568 -9316313 -8897437 -8879062 -9357215 -10327810 -10423335 -9094670 -9276589 -9719760
10212 -9719760 -9502099 -8376844 -8118169 -9996167 -10270006 -10379336 -10448510 -10138247 -10189740 -10363317
10202a0363317O13369l49142p90494j39869N93395L85542j84892J72223n94676j04662
10192a0762523N82331L40151O34208o52320M1648l89365L54955m32527K05442j2287j00473
10181a0190760j3038K12965k29664j6616k22623O71178N60250o20996J12645k22494k44732
10170a0203885O40661K14591o62357n76171P66041m23312Q45141p34625M83548J95706
10160i454662J07584M4686l99487l07199N16325M3337q12359k64563N03396O4183l77741
10149a0336500O07426l95908o3236L74872R2121l04039Q4265K24150L8768N58314k90540
10138i410307J76314j440951M31633J184421N46865p30381R6757j21086j099595M06427
10128i959903m3373o18517j96927O15356J55546L89124n55831O49395k99174R59099o83935
$$ plain form
10202 -10363317 -9749948 -10099090 -10889584 -11029453 -10436058 -10050516 -10235408 -10063185 -10657861 -10762523
10192 -10762523 -10180192 -9840041 -9205833 -9858153 -9816505 -10205870 -9850915 -10283442 -10078000 -10090287 -10190760
10181 -10190760 -10203798 -9990833 -10220497 -10237113 -10459736 -9788558 -9228308 -9849304 -9736659 -9959153 -10203885
10170 -10203885 -9563224 -9348633 -10010990 -10587161 -9821120 -10244432 -9399291 -10133916 -9650368 -9454662
10160 -9454662 -9347078 -9302392 -9701879 -10009078 -9492753 -9449416 -10261775 -10526338 -10022942 -9958759 -10336500
10149 -10336500 -9729074 -10124982 -10188218 -9813346 -9721225 -10025264 -9940999 -9716849 -9678081 -9119767 -9410307
10138 -9410307 -9233993 -10674944 -10243311 -9058890 -8512025 -9242406 -9145649 -9266735 -10366330 -9959903
10128 -9959903 -10003276 -10621793 -10818720 -10203364 -10047818 -9658694 -10214525 -9565130 -9864304 -8905205 -9589140
10117i589140k26251n0975l4529L75311l44039L15608L7202j25269J31304J97645o72667
10106i985800n01118M20678l38244M81622K95868L31611n17491j12602N59075n43353
10096i909754k66136k86779j41487P58711l44525J029497o23468m43325J9831L28167
10086i879268k74203m78909M32767j84364j98351l08386q47702J037752J241552P46227
10076h712885p76698K77610j53895q10774M00439p90121J12628Q79946J17151k75135
10066i731734m07454m187L98039n38567j49145l47176j92220R60336l81173M26298L24949
10055i642034r09905J719912n0259m11896K37219l66459K34312o7004r08378L29900q4849
10044i919441m25852J47447M50091p79789L76784K11361n4759j86773j2601K59111M38348
$$ plain form
10117 -9589140 -9815391 -9866366 -9900895 -9525584 -9869623 -9554015 -9516813 -9642082 -9510778 -9313133 -9985800
10106 -9985800 -10486918 -10066240 -10404484 -9922862 -9626994 -9295383 -9812874 -9925476 -9366401 -9909754
10096 -9909754 -10175890 -10462669 -10604156 -9845445 -10189970 -9160473 -9783941 -10227266 -10207435 -9879268
10086 -9879268 -10153471 -10632380 -10199613 -10383977 -10582328 -10890714 -11738416 -10700664 -9459112 -8712885
10076 -8712885 -9489583 -9211973 -9365868 -10176642 -9776203 -10566324 -10453696 -9573750 -9456599 -9731734
10066 -9731734 -10139188 -10143375 -9745336 -10283903 -10433048 -10780224 -10972444 -10012108 -10393281 -9966983 -9642034
10055 -9642034 -10551939 -8832027 -8882286 -9294182 -9056963 -9423422 -9189110 -9256114 -10164492 -9834592 -9919441
10044 -9919441 -10345293 -10197846 -9747755 -10527544 -10150760 -9939399 -9994158 -10180931 -10193532 -9934421 -9496073
10033i496073L79109o97932K24355r5895M79257p13507P0027J65329l8795M40326p30033
10022a0013832j20382m29439Q71804k51058K54174l31498M84030N77810p76100L02518
10012i431973M5067k41854l24161M78899J91895L04383j177221M91816j00260J475552
10002h287857j175928M5774o23323M41578J1239q97380O0678N20187K89967n8365j43892
9991i817322J96116J74092K14153j596703J174696p97318q4726L34414J1093n46796N96421
9980a0141880j52034l73220K57810O6220O39909J15088L73822r15341J29227L36405k73871
9969i937865m50344P08965L65651l26818j61513L14921K87974o78099K29535n42066r186
9958a0198845O67327o05886l32720k79614O43314L47082m5713J89385l62676l63153R09727
$$ plain form
10033 -9496073 -9116964 -9814896 -9590541 -9686436 -9207179 -9920686 -9850659 -9685330 -9724125 -9283799 -10013832
10022 -10013832 -10134214 -10563653 -9691849 -9942907 -9688733 -10020231 -9536201 -8958391 -9734491 -9431973
10012 -9431973 -9386906 -9628760 -9952921 -9474022 -9282127 -8977744 -10154965 -9663149 -9763409 -8287857
10002 -8287857 -9463785 -9418011 -10041334 -9599756 -9588517 -10485897 -10425219 -9905032 -9615065 -9673430 -9817322
9991 -9817322 -9621206 -9447114 -9232961 -10829664 -9654968 -10452286 -10537012 -10202598 -10191505 -10738301 -10141880
9980 -10141880 -10293914 -10667134 -10409324 -10343104 -9703195 -9588107 -9214285 -10129626 -10000399 -9663994 -9937865
9969 -9937865 -10388209 -9679244 -9313593 -9640411 -9801924 -9487003 -9199029 -9877128 -9647593 -10189659 -10198845
9958 -10198845 -9531518 -10137404 -10470124 -10749738 -10106424 -9759342 -9805055 -9615670 -9978346 -10341499 -9431772
9947i431772K49685J92509O4472k84349l84105k890203J745976K51078M56099j25147p8203
9936a0233960M17391K8963j25641O9102k71398L64976l56948N55016k37699m42741P60402
9925i472537j29262l28114j13008P03078n07117M36332l26532J111606p03518N42660
9915h786412p00183m49194j71561Q1478P30840l40504L80024n63152l2543m65689J43670
9904a0173226M78116k37055O12300l37147Q4302L84961k95943K68054j12225K44755q24682
9893i907790p94070Q34054j28461k3582N81516k26998l90443J34041O0084n32274J00084
9882a0293839L3453r01529J194199L84564l50718k1776J56412P3254K8986P2316j32003
9871i756681o31341K94134M94769k14000n84244N59572J20553N21338k04673K023580
$$ plain form
9947 -9431772 -9182087 -8989578 -8925106 -9209455 -9593560 -12483763 -10737787 -10486709 -10030610 -10155757 -10233960
9936 -10233960 -9816569 -9787606 -9913247 -9844145 -10115543 -9750567 -10107515 -9552499 -9790198 -10232939 -9472537
9925 -9472537 -9601799 -9929913 -10042921 -9339843 -9846960 -9410628 -9737160 -8625554 -9329072 -8786412
9915 -8786412 -9486595 -9935789 -10107350 -10025872 -9295032 -9635536 -9255512 -9818664 -9851207 -10316896 -10173226
9904 -10173226 -9695110 -9932165 -9319865 -9657012 -9572710 -9187749 -9483692 -9215638 -9327863 -9083108 -9907790
9893 -9907790 -10701860 -9867806 -9996267 -10019849 -9438333 -9665331 -10055774 -9921733 -9861649 -10393923 -10293839
9882 -10293839 -10260386 -11161915 -9967716 -9583152 -9933870 -9955646 -9799234 -9725980 -9696994 -9624678 -9756681
9871 -9756681 -10388022 -10093888 -9599119 -9813119 -10397363 -9837791 -9717238 -9195900 -9400573 -7376993
9861g376993j818995j180680M87898k01269N14188o45149L73799K27538M06676j220339
9851a0433326O26315k98349R0771k10282L04907J48830l06437l83291K65995k71416M50193
9840a0016090j12551p06047P28486n3082K14330L8566J016237j307824k27772M89897k1535
9829i957385o6405L11800L35868J83358j054610M78837j42080k27909M8484J61063j97759
9818a0126738m67624k62001O43639K05075m75011Q48627k23785J135278n84942M14398
9808h893084m30960j460583J19592P41695j07350j57742J13599l3227L18477K76638K29584
9797i283361j168947m43641n4828M01399m10874O1491K20599P48281L70937j63093k77813
9786i999850m15948P22969l08713J71081m15124J57661o83338L24832N44364o1637n89791
$$ plain form
9861 -7376993 -9195988 -10376668 -9888770 -10090039 -9575851 -10221000 -9847201 -9619663 -9212987 -10433326
9851 -10433326 -9807011 -10105360 -10014589 -10224871 -9919964 -9771134 -10077571 -10460862 -10194867 -10466283 -10016090
9840 -10016090 -10128641 -10834688 -10106202 -10159284 -9944954 -9906388 -8890151 -10197975 -10425747 -9935850 -9957385
9829 -9957385 -10023790 -9711990 -9376122 -9192764 -10247374 -9768537 -9910617 -10138526 -10090042 -9928979 -10126738
9818 -10126738 -10594362 -10856363 -10212724 -10007649 -10482660 -9634033 -9857818 -8722540 -9307482 -8893084
9808 -8893084 -9324044 -10784627 -10665035 -9923340 -10030690 -10188432 -10074833 -10108060 -9789583 -9512945 -9283361
9797 -9283361 -10452308 -10895949 -10950777 -10549378 -10960252 -10898761 -10678162 -9929881 -9558944 -9722037 -9999850
9786 -9999850 -10415798 -9692829 -10001542 -9830461 -10245585 -10087924 -10771262 -10446430 -9902066 -9963703 -10553494
9775a0553494J208431p33152L93804k49600J16627M30133j53462j70101J09073n66299
9765a0168040j57817K68800M3045J17625O52603k18012r5118j07139R6244l26793o5551
9754i960153j10479K52236m97729j09657L72711O3273l87473q152N30896M2066K98409
9743i514052o79353j38071Q09831N51474j074007p3931J28387M95785k85219M62269
9733i316887j286825M12517J70190M22580l42782l20252L50680j40003K59023m82120k6518
9722a0300397J079290L2745p91328Q58610m22758K02242m94161k21968R4025j51457P34658
9711i380499o1770L9066r24731j1669Q79138l03275n63936J65381o63834J47895m08537
9700a1086771J099335o79549n42680J260136m5950l4119J28355p3932k14232l3812N88174
$$ plain form
9775 -10553494 -9345063 -10078215 -9684411 -9934011 -9817384 -9387251 -9540713 -9710814 -9601741 -10168040
9765 -10168040 -10325857 -10057057 -10014012 -9896387 -9243784 -9461796 -9556914 -9664053 -9567809 -9894602 -9960153
9754 -9960153 -10070632 -9818396 -10316125 -10425782 -10053071 -9989798 -10377271 -10385423 -9854527 -9812461 -9514052
9743 -9514052 -10193405 -10331476 -9521645 -8970171 -10044178 -10118109 -9989722 -9493937 -9779156 -9316887
9733 -9316887 -10603712 -10191195 -10021005 -9598425 -9941207 -10261459 -9910779 -10050782 -9791759 -10273879 -10300397
9722 -10300397 -9221107 -9188362 -9979690 -9121080 -9543838 -9341596 -9835757 -10057725 -9963700 -10115157 -9380499
9711 -9380499 -9442269 -9403203 -10327934 -10339603 -9460465 -9763740 -10327676 -10162295 -10826129 -10678234 -11086771
9700 -11086771 -9987436 -10666985 -11209665 -9949529 -9995479 -10029598 -9901243 -9975175 -10189407 -10223219 -9635045
9689i635045o25819K00938o14030M18046l44977O395k2413q7617J67811J39657k0379
9678a0417433M34254n37576Q15693p10444k1513O36111n68097J61638L07799M67476P1380
9667i360712L65437j35297j386158K45208p77206N94318K30953Q7616L98404m46231K25572
9656i958096l72927j576R6787l58749n96009P69903L32459p82657N51210j71642O19346
9645i871951k66661M30555l53209k01028K49166K00906n71242P35554l78417J3365k63383
9634a0276345M20576J83520m66870N8378J246434r85196J317J08835j3240N04575p14723
9623i932739k72328l17744N20051J56427k76128m60099P87420j448235J308980m59662
9613a0394057K65219K72754l95475J94299j0809p700O7722L22290L20002j11381o83149
$$ plain form
9689 -9635045 -10260864 -10059926 -10673956 -10255910 -10600887 -10594492 -10616905 -10704522 -10536711 -10397054 -10417433
9678 -10417433 -9983179 -10520755 -9705062 -10415506 -10437019 -9800908 -10369005 -10207367 -9899568 -9432092 -9360712
9667 -9360712 -8995275 -9130572 -10516730 -10271522 -11048728 -10454410 -10223457 -10135841 -9737437 -10183668 -9958096
9656 -9958096 -10331023 -10332599 -10235812 -10594561 -11190570 -10420667 -10088208 -10870865 -10319655 -10491297 -9871951
9645 -9871951 -10138612 -9708057 -10061266 -10262294 -10013128 -9812222 -10383464 -9647910 -10026327 -10012962 -10276345
9634 -10276345 -9855769 -9672249 -10139119 -10080741 -8834307 -9819503 -9818186 -9709351 -9722591 -9218016 -9932739
9623 -9932739 -10205067 -10522811 -10002760 -9846333 -10122461 -10582560 -9795140 -11243375 -9934395 -10394057
9613 -10394057 -10128838 -9856084 -10251559 -10057260 -10068069 -10075769 -10008047 -9685757 -9365755 -9477136 -10160285
9602a0160285M53389L71488p47646J047770l93487k91646o44191k2659K7888N55904m65985
9591a0269460n14474N88321j3346j8592J92539j27942Q38308o10063r58905K93408o6684
9580a0666890K11906K480214k063526j95842M47372k2764K92621n5179r35611K43942
9570a0263757L91314N9078k95331N68052l75792l28731j52225l85337j051520K358476
9560i475773n62917L42206j51093n75822P29292o74852Q05477O02911p64888k43552j35002
9549a0104013j57467O14731k69263j06179M91417j05669j63194J17061p694j70082J23254
9538i737098j197269J114306l96702J31881O9725k47496J82364M61116K6100n67889R2326
9527a0068636l54338J97285J22261P56897l01101K2674J12625k599o40960l14210M25004
$$ plain form
9602 -10160285 -9706896 -9335408 -10083054 -9035284 -9428771 -9720417 -10364608 -10387267 -10359379 -9803475 -10269460
9591 -10269460 -10783934 -10195613 -10208959 -10227551 -10035012 -10162954 -9324646 -9934709 -10893614 -10600206 -10666890
9580 -10666890 -10454984 -7974770 -10038296 -10234138 -9786766 -9809530 -9516909 -9572088 -10507699 -10263757
9570 -10263757 -9872443 -9813365 -10108696 -9540644 -9916436 -10245167 -10397392 -10782729 -11834249 -9475773
9560 -9475773 -10038690 -9696484 -9847577 -10423399 -9694107 -10368959 -9563482 -8960571 -9725459 -9969011 -10104013
9549 -10104013 -10261480 -9646749 -9916012 -10022191 -9530774 -9636443 -9799637 -9682576 -9690270 -9860352 -9737098
9538 -9737098 -10934367 -9820061 -10216763 -10084882 -10015157 -10262653 -10080289 -9619173 -9593073 -10160962 -10068636
9527 -10068636 -10422974 -10225689 -10103428 -9346531 -9647632 -9624958 -9512333 -9514932 -10155892 -10470102 -10045098
9516a0045098P21780k30998j50862J49803L44913p9150q17232j07928M90452k57832Q7400
9505i894752j53234k08089j82898M16087N54142j21941n71176p7737j14509m9845L22201
9494a0081751j45237l78442J601254j034943n80041r4794J63497N36230l98329j15994
9484a0528550n51599J246105m00590M45933n70063P47487l23078O13455n77393j65252
9474a0063545L88209k77630n25940P01356L33672l26961j101429Q61197J08210K09120
9464i693741k45587L61136J149915j899474l22205K39914M95529k29987j99316J41570
9454a0202246K18976l55976j65986l92978L86634M23750l86945M61310J03811k23015
9444a0132665n45469j33497K087306q68030M37624l94966k97797n82625L16837R43295
$$ plain form
9516 -10045098 -9323318 -9554316 -9705178 -9555375 -9210462 -9289612 -10106844 -10214772 -9724320 -9982152 -9894752
9505 -9894752 -10047986 -10256075 -10438973 -10022886 -9468744 -9590685 -10161861 -10239598 -10354107 -10403952 -10081751
9494 -10081751 -10226988 -10605430 -9004176 -10039119 -10619160 -10713954 -10550457 -10014227 -10412556 -10528550
9484 -10528550 -11080149 -9834044 -10234634 -9788701 -10358764 -9611277 -9934355 -9320900 -9898293 -10063545
9474 -10063545 -9675336 -9952966 -10478906 -9777550 -9443878 -9770839 -10872268 -10011071 -9902861 -9693741
9464 -9693741 -9939328 -9578192 -8428277 -10327751 -10649956 -10410042 -9914513 -10144500 -10343816 -10202246
9454 -10202246 -9983270 -10339246 -10505232 -10898210 -10511576 -10087826 -10474771 -10013461 -9909650 -10132665
9444 -10132665 -10678134 -10811631 -8724325 -9592355 -9154731 -9549697 -9847494 -10430119 -10113282 -9169987
9434i169987p57987K97649l0336k4339j54154n52961J147053r12789l70923L87067r814
9423a0151521l045L37410k54568J53980J42922N38967J779380j785445m00925j26876
9413i769721m53201K76674m95129P93170q05751P85997L7063j42038p0184p70404P8924
9402a0534600J330296p23709L60021n83185r45431Q01878L91651j85578L0032M28915
9392i629710l69384N52713r47067M03802j13676R33298j343856m25779N69125n14205
9382a0884739P50676N4922J59153J67725o62067j68949N42748n66331k9565M99196j34860
9371a0272091l15023L86487M75329p1745L04535l5817m36720L06859l4719J1870k75843
9360i956878L00958j43138L43559n63380J062969j053511l10423N38628n17089Q55423
$$ plain form
9434 -9169987 -9927974 -9630325 -9660661 -9685000 -9839154 -10392115 -9245062 -10157851 -10528774 -10141707 -10151521
9423 -10151521 -10154566 -9817156 -10071724 -9917744 -9774822 -9235855 -7456475 -9241920 -9642845 -9769721
9413 -9769721 -10222922 -9946248 -10441377 -9648207 -10453958 -9667961 -9630898 -9772936 -9843120 -10613524 -10534600
9402 -10534600 -9204304 -9928013 -9567992 -10151177 -11096608 -10294730 -9903079 -10088657 -10058625 -9629710
9392 -9629710 -9999094 -9446381 -10393448 -9989646 -10103322 -9170024 -10513880 -10939659 -10370534 -10884739
9382 -10884739 -10134063 -10079141 -9919988 -9752263 -10414330 -10583279 -10040531 -10606862 -10636427 -10137231 -10272091
9371 -10272091 -10587114 -10200627 -9725298 -9797043 -9492508 -9528325 -9965045 -9658186 -9692905 -9681035 -9956878
9360 -9956878 -9655920 -9799058 -9455499 -10018879 -8955910 -10009421 -10319844 -9781216 -10298305 -9442882
9350i442882m99235K17075j16287N2754O15076r81788j08375q0520M18904P05354q38048
9339a0057972O15023J065349j479623k65396L59239L77738n46455q7576k86805R66332
9329i340146p93104P5891j63041O17911k18023J218016q51955K2933k42363n31233O04638
9318i600476L48434j121370o97010J066160k12650Q34464m26655Q8795o54395J18010
9308a0256693N11701l84966j26466J12829J18006L21374L71137K47546R3365r42375k66294
9297a0200836k14393P40107j34765M7529m10460K93950m79432O19560l81597M60751l68371
9286a0027957k91987L5874p35759R3047N69531p6215n6161O7485L57115M38011M03572
9275i223444q64904n77965M06131N0865L21042p4360L98054m55369k23827L56997L55055
$$ plain form
9350 -9442882 -9942117 -9725042 -9841329 -9788575 -9173499 -10155287 -10263662 -10344182 -9925278 -9219924 -10057972
9339 -10057972 -9442949 -8377600 -9857223 -10122619 -9763380 -9385642 -9932097 -10019673 -10306478 -9340146
9329 -9340146 -10133250 -10057359 -10220400 -9602489 -9820512 -8602496 -9454451 -9431518 -9673881 -10205114 -9600476
9318 -9600476 -9252042 -10373412 -11070422 -10004262 -10216912 -9382448 -9809103 -9720308 -10374703 -10256693
9308 -10256693 -9744992 -10129958 -10256424 -10143595 -10025589 -9704215 -9333078 -9085532 -8992167 -9934542 -10200836
9297 -10200836 -10415229 -9675122 -9809887 -9762358 -10172818 -9878868 -10358300 -9738740 -10120337 -9659586 -10027957
9286 -10027957 -10319944 -10284070 -11019829 -10926782 -10357251 -10433466 -10489627 -10422142 -10065027 -9627016 -9223444
9275 -9223444 -10088348 -10666313 -10260182 -10209317 -9888275 -9962635 -9564581 -10019950 -10243777 -9886780 -9531725
9264i531725M73331l43667j61436J29478k16338m08158l98662J65667J41185M0936L39678
9253i769711l68515M72515p36320j30334o2690L20976M06317k43419j86876K5694l27131
9242a0599494K8149L39932P18779O2559q8925o59842l81917J73107K08925L28727L05128
9231i564872l06287J31281l34909J00460j65556o6514N3304l87581J006159K01258n02430
9220i835687k33396L12928m876O8184j69264L72963m75455l05878M82333m32758m58699
9209a0679605j13651M73463J40495R2996K07032j54086j41189k65696K44393O81670q66513
9198a0380691m98498O70117P12429m12745o11274r30131J093728J01965l71719P56209
9188i870610j04072L04287j8045K50220j95249l54134p73316j13562L72526N49027P6329
$$ plain form
9264 -9531725 -9058394 -9402061 -9563497 -9434019 -9650357 -10058515 -10457177 -10291510 -10150325 -10109389 -9769711
9253 -9769711 -10138226 -9665711 -10402031 -10532365 -10595055 -10274079 -9867762 -10111181 -10298057 -10272363 -10599494
9242 -10599494 -10571345 -10231413 -9512634 -9450075 -9539000 -10198842 -10580759 -10407652 -10198727 -9870000 -9564872
9231 -9564872 -9871159 -9739878 -10074787 -9974327 -10139883 -10206397 -10153093 -10540674 -9534515 -9333257 -9835687
9220 -9835687 -10069083 -9756155 -9761031 -9692847 -9862111 -9489148 -9964603 -10270481 -9788148 -10220906 -10679605
9209 -10679605 -10793256 -10319793 -10179298 -10086302 -9879270 -10033356 -10174545 -10440241 -10195848 -9514178 -10380691
9198 -10380691 -10879189 -10209072 -9496643 -9909388 -10520662 -11450793 -10357065 -10255100 -10626819 -9870610
9188 -9870610 -9974682 -9670395 -9688440 -9438220 -9633469 -9987603 -10760919 -10874481 -10501955 -9952928 -9876599
9177i876599N49358j011230J51072L8118P39295o27648J1468p0039n18303M51440k63430
9166a0426498N84074P8553M57081p35625J443405j983488r9820N04989K52750N21590l7587
9155i440576j6648K021k38136o57815Q8221j09238K7537k01709N73936M5442K81070R0663
9143i555232j340997J344680m16380j010995L00425m07452R59619J547893j120094L92992
9133i305541j032015N56492k19839M7200J71360m63931Q58914l87908m34399J10485L15223
9122i783959j126343J233916j32335k37371k59987j152228K183210j09142n91978N8638
9112i917579k78707N94606n37694P29269J89639J4772j236798l78829l71459Q86490N2740
9101a0253550M57225j4399K325j02094J68586n08812j44622r9725J93357j1280P59863
$$ plain form
9177 -9876599 -9327241 -10338471 -10187399 -10149281 -9409986 -10037634 -10026166 -10096205 -10614508 -10163068 -10426498
9166 -10426498 -9842424 -9763871 -9306790 -10042415 -8599010 -10582498 -10682318 -10177329 -9924579 -9402989 -9440576
9155 -9440576 -9457224 -9455203 -9693339 -10351154 -10262933 -10372171 -10344634 -10546343 -9972407 -9926965 -9645895 -9555232
9143 -9555232 -10896229 -9551549 -9967929 -10978924 -10678499 -11085951 -10126332 -8578439 -9698533 -9305541
9133 -9305541 -10337556 -9781064 -10000903 -9953703 -9782343 -10246274 -9387360 -9775268 -10209667 -10099182 -9783959
9122 -9783959 -10910302 -9676386 -9808721 -10046092 -10306079 -11458307 -9275097 -9384239 -9976217 -9917579
9112 -9917579 -10196286 -9601680 -10139374 -9410105 -9220466 -9205694 -10442492 -10821321 -11192780 -10306290 -10253550
9101 -10253550 -9796325 -9810724 -9808399 -9910493 -9741907 -10250719 -10395341 -10495066 -10301709 -10312989 -9553126
9090i553126o53818M64818j44362L97106P1520p2203l74457M67542m24981K29726j38289
9079i730524M3476m23819p0602M69371m5760J69961k06580M51860k63763R16049j78632
9068h868963j336773k770396L178936p5324l69789N03110L09871m085j86060l6034l48930
9057a0004437N51263O8847q11398n35365O50053k04013P03564o2628n40494M9675J11521
9046a0023412k63473L85617n6626k51364O3883N88927m5593o14426J84010k55604L13110
9035i974951L80582n68357l3119J317013o27124M98754o01796l30814l28009N13960K22036
9024i531825K55964N46565r46157M55377J48011q9968Q566J002334j937192l76419P08318
9013i756426N01725n24002O52272L749r8612n19639K78472k68640M06471j99224n42299
$$ plain form
9090 -9553126 -10206944 -9742126 -9886488 -9489382 -9417862 -9490065 -9864522 -9396980 -9821961 -9592235 -9730524
9079 -9730524 -9687048 -10110867 -10181469 -9712098 -9757858 -9587897 -9794477 -9342617 -9606380 -8690331 -8868963
9068 -8868963 -10205736 -12976132 -9797196 -9872520 -10242309 -9739199 -9429328 -9433413 -9619473 -9655507 -10004437
9057 -10004437 -9453174 -9384327 -10195725 -10731090 -10081037 -10285050 -9581486 -9644114 -10184608 -10134933 -10023412
9046 -10023412 -10286885 -9901268 -9957894 -10209258 -10145375 -9556448 -9602041 -10216467 -10032457 -10288061 -9974951
9035 -9974951 -9594369 -10162726 -10195845 -8878832 -9505956 -9007202 -9608998 -9939812 -10267821 -9753861 -9531825
9024 -9531825 -9275861 -8729296 -9675453 -9220076 -9072065 -9162033 -9153467 -8151133 -10088325 -10464744 -9756426
9013 -9756426 -9254701 -9778703 -9126431 -9122682 -9221294 -9740933 -9462461 -9731101 -9324630 -9523854 -10066153
9002a0066153n0615O02965m5201n97106J135384j212515k41556O32005Q3540n1776Q24443
8991h986585n55601J37354k77767L28608l41547Q65227q98603K79784K20054j026284
8981a0255360M95893n08644Q70040k76767M78964n31315j80655P91589k33977j53633
8971i503865m40637m6438J43900O94795k89290k14319J62009j27875r81478M99002M51872
8960i652324O8097R41749n60830n23350K99825k36339J2010m1226l18218P43229N60697
8949h706680k88275j605752O83158M16488K59322j94909M95389j067215L19330o39310
8939a0328454R70205k55902n51401P73289K41491N24743Q4616p81374O77691k85111
8929h930207J213990j582613L83771M87536l51095j21622J44249K75328K90449o32009
$$ plain form
9002 -10066153 -10116768 -9513803 -9559004 -10156110 -9020726 -10233241 -10474797 -9842792 -9759252 -9811028 -8986585
8991 -8986585 -9542186 -9404832 -9682599 -9353991 -9695538 -8830311 -9728914 -9449130 -9229076 -10255360
8981 -10255360 -9759467 -10268111 -9398071 -9674838 -9195874 -9727189 -9907844 -9116255 -9350232 -9503865
8971 -9503865 -9944502 -9990940 -9847040 -9152245 -9441535 -9655854 -9493845 -9621720 -10603198 -10104196 -9652324
8960 -9652324 -9584227 -8642478 -9203308 -9726658 -9426833 -9663172 -9651162 -9692388 -10010606 -9267377 -8706680
8949 -8706680 -8994955 -10600707 -9917549 -9501061 -9241739 -9436648 -8941259 -10008474 -9689144 -10328454
8939 -10328454 -9358249 -9614151 -10165552 -9392263 -9150772 -8626029 -8541413 -9322787 -8645096 -8930207
8929 -8930207 -7716217 -9298830 -8915059 -8427523 -8778618 -8900240 -8755991 -8480663 -8190214 -8822223
8919h822223k8323m88736N9575J91709J58482m92969O01819P62393j82494N76693k52585
8908g916659q56152Q08658K69292K49190O2253m71266N86754j12646k9063P02996n35572
8897g242215L56722j04970j51464l5678M11185l0518O46683j31815k12166L55238L51307
8886e787691j94544K95947L23767L06998o87750O67110k85771K50418N89061J62531L3930
8875d325994O55087n26558M52229L02123j30355J30367N59118K41816K05244R20570M05280
8864a111073K87124K51257q12011M52388R64791j20365J05239R80764M57623L33220
8854A788957J195830J48767N62126K03874J332911J864897J235355M16298o02290m77085
8844G669640L22208K90615j249093j828431J07976p42262j014791q99955q58388n10250
$$ plain form
8919 -8822223 -8850546 -9339282 -9279707 -9087998 -8929516 -9422485 -8820666 -8058273 -8240767 -7664074 -7916659
8908 -7916659 -8772811 -7964153 -7694861 -7445671 -7383418 -7854684 -7267930 -7380576 -7409639 -6706643 -7242215
8897 -7242215 -6885493 -6990463 -7141927 -7177605 -6766420 -6796938 -6150255 -6282070 -6494236 -6138998 -5787691
8886 -5787691 -5982235 -5686288 -5362521 -5055523 -5743273 -5076163 -5361934 -5111516 -4522455 -4359924 -4325994
8875 -4325994 -3670907 -4197465 -3745236 -3443113 -3573468 -3443101 -2883983 -2642167 -2436923 -1516353 -1111073
8864 -1111073 -823949 -572692 -1384703 -932315 32476 -87889 17350 998114 1455737 1788957
8854 1788957 2984787 3133554 3695680 3899554 5232465 7097362 8332717 8749015 8146725 7669640
8844 7669640 7991848 8282463 7033370 5204939 5312915 4570653 3555862 2655907 1797519 1287269
8834A287269j35531K09662L07231O30542Q58225Q13158p54103N13919J318258O84894
8824E733524J451593P07977J179715P24153J822246M66164J553630k97841j694355j800082
8814I846724O48301J707018J476260k663619j861211j997387q00460n03361j795771q96291
8804C160203j692171J432001k718185p57074j395299l88462l91252l15710N59105J60239
8794b346605K19203J444483n83097k34246J146805R57477l36560J19893P17772J071204
8784B176329P41522J076449l44835j50556j182045k471881L51433P99219n33277k447119
8774a984761j491794j834599p78553p6274q02138q88344k10868M05856p99066p8201L72302
8763h166440J66486Q2167N52876K56715p54325L24080m69494M8751q75723K88420N77757
$$ plain form
8834 1287269 1151738 1361400 1668631 2299173 3157398 3970556 3216453 3730372 5048630 5733524
8824 5733524 7185117 7893094 9072809 9796962 11619208 12085372 13639002 13341161 11646806 9846724
8814 9846724 10495025 12202043 13678303 11014684 9153473 7156086 6355626 5852265 4056494 3160203
8804 3160203 1468032 2900033 181848 -575226 -1970525 -2358987 -2750239 -3065949 -2506844 -2346605
8794 -2346605 -2127402 -682919 -1266016 -1500262 -353457 604020 267460 387353 1105125 2176329
8784 2176329 2917851 3994300 3649465 3498909 2316864 -155017 196416 995635 462358 -1984761
8774 -1984761 -3476555 -5311154 -6089707 -6165981 -6968119 -7856463 -8067331 -7661475 -8460541 -8538742 -8166440
8763 -8166440 -7999954 -7917787 -7364911 -7108196 -7862521 -7538441 -8007935 -7959184 -8834907 -8546487 -7968730
8752g968730l21319J56111k20123q98308Q52823N78128o91133O38704k95962k84266L15047
8741h139028N31247k97435Q819k60138l7609O07895j063605J65509l36641J695325r00786
8730h026447r25892J136453J15148m85548L41360r81951L68740N88314j11636l13755
8720h295214n53651L22707r6409L06113m37151l42822o7585K08359Q62983k02353o02524
8709h897547J74406K61166M56831j16039o92996m8289N08862N97922k56608o88817J8731
8698h682378j1224l88844L38549Q0578m58102J64521O06288n95556J56386n05439N38967
8687h756254P20274p25729M68457M13115L66275m23061L42904k4705n1011K9591K24767
8676g415377j43911K04769K18867l03945J0464Q5638j49741M55841l13011N43053J22727
$$ plain form
8752 -7968730 -8290049 -8133938 -8354061 -9252369 -8399546 -7821418 -8512551 -7873847 -8169809 -8454075 -8139028
8741 -8139028 -7607781 -7905216 -7896397 -8156535 -8194144 -7586249 -8649854 -8484345 -8820986 -7125661 -8026447
8730 -8026447 -8952339 -7815886 -7700738 -8186286 -7844926 -8826877 -8458137 -7869823 -7981459 -8295214
8720 -8295214 -8848865 -8526158 -8622567 -8316454 -8753605 -9096427 -9164012 -8955653 -8092670 -8295023 -8897547
8709 -8897547 -8723141 -8461975 -8005144 -8121183 -8814179 -8862468 -8353606 -7755684 -8012292 -8701109 -8682378
8698 -8682378 -8693602 -9082446 -8743897 -8663319 -9121421 -8956900 -8350612 -8946168 -8789782 -9295221 -8756254
8687 -8756254 -8035980 -8761709 -8293252 -7880137 -7513862 -7936923 -7594019 -7618724 -7669735 -7640144 -7415377
8676 -7415377 -7559288 -7354519 -7135652 -7439597 -7429133 -7343495 -7493236 -7037395 -7350406 -6807353 -6684626
8665f684626n49606P98463j23685p33070K95148j47976N44471R4262N91178n19085J87328
8654f247198l58410J17024R3017N80666m36916M36053J23736m10299J364293M17183j72491
8643d493342p98226M04745R67256o31425L30105O2580K78513m88467K91096L84140L78224
8632c314801K88562n09266P81694J155835P02486k660K26231M05456R88841J925748
8622B648126J174630n43513O38375P31276k03680O74356n62987k357748j426091n63218
8612B09526n19729m50835m04469l52727r64589r69179l02091J066585J93811n90272N99237
8601b484732J11245J152023L15633Q72234l88453k9379J391417J600592J770703J49879
8591D461162q77972k822444j009130P52960M22446j204580k634985k206888m60719j552497
$$ plain form
8665 -6684626 -7234232 -6435769 -6559454 -7292524 -6997376 -7145352 -6600881 -6506619 -5915441 -6434526 -6247198
8654 -6247198 -6605608 -6488584 -6395567 -5814901 -6251817 -5815764 -5692028 -6102327 -4738034 -4320851 -4493342
8643 -4493342 -5291568 -4886823 -3919567 -4550992 -4220887 -4158307 -3879794 -4368261 -4077165 -3693025 -3314801
8632 -3314801 -3026239 -3535505 -2753811 -1597976 -895490 -898150 -671919 -266463 722378 2648126
8622 2648126 3822756 3279243 3917618 4648894 4445214 5119570 4556583 2198835 772744 209526
8612 209526 -310203 -761038 -1165507 -1518234 -2482823 -3452002 -3754093 -2687508 -2493697 -3083969 -2484732
8601 -2484732 -2373487 -1221464 -905831 -33597 -422050 -451429 939988 2540580 4311283 4461162
8591 4461162 3583190 760746 -248384 504576 927022 -277558 -2912543 -5119431 -5580150 -7132647
8581g132647n53387r93168J62309o16093j14992j18645q5079o83469K64715Q23116q32539
8570i879879Q55892k47490K9835J26550j57898n22786l31299O39892L84520J68258m5104
8559h979509K40066o42957m56975o28132J89777L98669J374103p43397j33886j71320
8549i553561p14409O9899O60594K8353L06765l8591J4690o30704o18409j88084Q64760
8538i798697N67453k32149K36765P10416j64132o16626L50748J45231K09689R0016o24520
8527i125806o32819O74635J132844m39456k31412k77749q36851J94860J78914J18190
8517i244650j06056K2123K18544p39313M43260j04809M43858l2438n06724L06374O51228
8506h648603k51695l41065l8541j604862J231360L41448J03779J03817o19722K53726
$$ plain form
8581 -7132647 -7686034 -8679202 -8516893 -9132986 -9247978 -9366623 -9451702 -10135171 -9870456 -9047340 -9879879
8570 -9879879 -9023987 -9271477 -9241642 -9115092 -9272990 -9795776 -10127075 -9487183 -9102663 -8934405 -8979509
8559 -8979509 -8739443 -9382400 -9839375 -10467507 -10277730 -9879061 -8504958 -9248355 -9382241 -9553561
8549 -9553561 -10267970 -10198071 -9537477 -9509124 -9202359 -9240950 -9226260 -9856964 -10475373 -10663457 -9798697
8538 -9798697 -9231244 -9463393 -9226628 -8516212 -8680344 -9296970 -8946222 -8800991 -8591302 -8501286 -9125806
8527 -9125806 -9758625 -9083990 -7951146 -8390602 -8622014 -8899763 -9736614 -9541754 -9362840 -9244650
8517 -9244650 -9350706 -9328583 -9110039 -9849352 -9406092 -9510901 -9067043 -9099481 -9606205 -9299831 -8648603
8506 -8648603 -8900298 -9241363 -9279904 -10884766 -9653406 -9311958 -9208179 -9104362 -9724084 -9470358
8496i470358p58289J65112M15138o76258J83927K26107k95208L48992l28576J73845J47708
8485i867860R99650n71304o910q0365j18611K77656j93919K02392m74249K24288K45854
8474i363378j21811Q4855J89144k21662m52851K56527R53526l00685O29211l03123o1327
8463h711574l25035K87467j6400n7660l74586N67726j54243L98755o64802N93312l26687
8452h783727N57235n28486p0394J53516J617967p60045J20309K5439P51409P3100j210177
8441h053854j59359O82190j042796R99892J84478k916j06656k70800m2487M09783q13245
8430h215770N88922L3808R8342Q46061R4982L06286n50695O44909j110066J169542m76564
8419f570243l34683O06619j18451l3486r40180J057679l67420M48350N80023L77874J67591
$$ plain form
8496 -9470358 -10228647 -10063535 -9648397 -10324655 -10140728 -9914621 -10209829 -9860837 -10189413 -10015568 -9867860
8485 -9867860 -8868210 -9439514 -9446424 -9526789 -9645400 -9367744 -9561663 -9359271 -9833520 -9609232 -9363378
8474 -9363378 -9485189 -9400334 -9211190 -9432852 -9885703 -9629176 -8675650 -8976335 -8347124 -8650247 -8711574
8463 -8711574 -9036609 -8749142 -8765542 -8823202 -9197788 -8630062 -8784305 -8385550 -9050352 -8457040 -8783727
8452 -8783727 -8226492 -8754978 -8825372 -8671856 -7053889 -7813934 -7693625 -7668186 -6916777 -6843677 -8053854
8441 -8053854 -8213213 -7531023 -8573819 -7573927 -7389449 -7392365 -7499021 -7769821 -7812308 -7402525 -8215770
8430 -8215770 -7626848 -7593040 -7494698 -6648637 -6553655 -6247369 -6798064 -6153155 -7263221 -6093679 -6570243
8419 -6570243 -6904926 -6298307 -6416758 -6450244 -7390424 -6332745 -6700165 -6251815 -5671792 -5293918 -5126327
8408e126327M60333j83360m15824Q5607q8735n57172J3194O26850J94014l87941K6645
8397e352716J61487L21691Q465m5757m24065M87824q5297N48745q31191M41587O64851
8386d104376K98293k22035L58911l51854J160245m7308o1185m66953K4205n43712j20933
8375d076702N24881K63736J77469j037999J43686j20402Q06737j076349K87350N65676
8365c541917O27271P09371M48527M51408r1596R8223m7026J09017O86081K3307J413674
8354H86340J632602J340210L83627p30239p15816r50390J40990j368154j44430l33858
8344A40882k09111R30768o7183L05537J76197L99804J68690j75779J00640J70877k27826
8333A713496N11983O21625N68097J267236K6319K83126J30834O96112J524245J43589
$$ plain form
8408 -5126327 -4665994 -4849354 -5265178 -5179571 -5268306 -5825478 -5812284 -5185434 -4991420 -5379361 -5352716
8397 -5352716 -5191229 -4869538 -4861073 -4906830 -5330895 -4843071 -4928368 -4379623 -5210814 -4769227 -4104376
8386 -4104376 -3806083 -4028118 -3669207 -4021061 -2860816 -2908124 -2969309 -3436262 -3412057 -3955769 -4076702
8375 -4076702 -3551821 -3288085 -3110616 -4148615 -4004929 -4125331 -3318594 -4394943 -4107593 -3541917
8365 -3541917 -2914646 -2205275 -1756748 -1305340 -1396936 -1298713 -1345739 -1236722 -550641 -527334 886340
8354 886340 2518942 3859152 4242779 3512540 2796724 1846334 1987324 619170 474740 140882
8344 140882 -68229 862539 795356 1100893 1277090 1676894 1845584 1669805 1770445 1941322 1713496
8333 1713496 2225479 2847104 3415201 4682437 4708756 4991882 5122716 5818828 7343073 7486662
8323G486662q25457j691861R75281l33632l6578N81132l39522J546575j083011o21559
8313E658030K5996J378139J459658p49614N79271L54770m96358J092563l35955P44403
8303I710903L85085P45942j6700q0116J083378M64252m47396j89788n52695k52372K15156
8292A1065649J007034K8077J4853J270797n0102j67584Q36739P58993L91228L42151R16277
8281A6414112L82098l12638L83931K75282L78825K80427R077K288336J802427J176218
8271B3078095P9686r67264j507847j954079j889178l52086m01398k01055J063818k13874
8261A6734818J555287n4487K25299M0504j639552O09375q47585M9579M57097k68275m11904
8250A6450156J26303J217385q17674l20132j17799Q65823K041871N69495m76009m87464
$$ plain form
8323 7486662 6661205 4969344 5944625 5610993 5574415 6155547 5816025 7362600 6279589 5658030
8313 5658030 5684026 7062165 8521823 7772209 8351480 8706250 8209892 9302455 8966500 9710903
8303 9710903 10095988 10841930 10825230 10745114 11828492 12292744 11845348 11655560 11102865 10850493 11065649
8292 11065649 12072683 12100760 12115613 13386410 13336308 13168724 14005463 14764456 15155684 15497835 16414112
8281 16414112 16796210 16483572 16867503 17142785 17521610 17802037 17811114 20099450 21901877 23078095
8271 23078095 23157781 22190517 20682670 18728591 16839413 16487327 16085929 15884874 16948692 16734818
8261 16734818 18290105 18235618 18460917 18501421 16861869 17471244 16623659 16673238 17130335 16862060 16450156
8250 16450156 16576459 17793844 16976170 16656038 16538239 17404062 19445933 20015428 19539419 19051955
8240A9051955N43343J577854M97467j44983Q98597P96927l60189K92787J547621L60440
8230B5061819q49732k273926k395561j592853o40637M95800r08598k26414o98000O49301
8220A6621199R35655M76097O1341N12399J51635m82285J214138Q69567K121701K5863
8210B2507310J496854N36234J824313N81853J093075m84186o42471m51131l79885o16204
8200B5465762j776506r08468j069343J430894n85607o96620L57633N16377L78008J158237
8190B4270367J433748J244641J156194J316173J052240J385981o49925J886559N40883
8181C3636861R70612O29338K12697Q35850M52410J37372P71635P83413J051551J999548
8171D1481287O90372J808028J773800K176781J649391J897766J758854J972695J826388
$$ plain form
8240 19051955 19595298 21173152 21670619 21525636 22424233 23221160 22860971 23153758 24701379 25061819
8230 25061819 24212087 21938161 19542600 17949747 17309110 17804910 16896312 16669898 15971898 16621199
8220 16621199 17556854 18032951 18094292 18606691 18758326 18276041 19490179 20359746 22481447 22507310
8210 22507310 24004164 24540398 26364711 26946564 28039639 27555453 26912982 26461851 26081966 25465762
8200 25465762 23689256 22780788 21711445 23142339 22556732 21860112 22217745 22734122 23112130 24270367
8190 24270367 25704115 26948756 28104950 29421123 30473363 31859344 31209419 33095978 33636861
8181 33636861 34607473 35236811 35449508 36285358 36737768 36875140 37646775 38430188 39481739 41481287
8171 41481287 42171659 43979687 45753487 47930268 49579659 51477425 53236279 55208974 57035362
8162E7035362K002148K665153J478527L378022J691897J135913J507586q45346l11847
8153F9737415O31849R09535K39660p40243r28212j013531J182891M62705n980j174083
8143F9302006n19310Q57451J065568J717481K841441J390509J893034K165455M149787
8134H4863422J652178N451244M757498K921600K870310J216334k257379m797741l728514
8125I2948952j712877J467668K488012l80877k578503l781270k471351l165798n18406
8116H2295550J115796J939059M165682L989433L438142J349013K100682L583268Q632045
8107A12608670O412443P828474P321961Q010213P013983N883208N085466O149881Q818986
8098A75133285J0022450P310260O772990O075139Q415357R047867Q277664O652605N662482
$$ plain form
8162 57035362 59037510 61702663 63181190 66559212 68251109 69387022 70894608 70049262 69737415
8153 69737415 70369264 71278799 71518459 70778216 69850004 68836473 70019364 70482069 70476089 69302006
8143 69302006 68782696 69640147 70705715 72423196 75264637 76655146 78548180 80713635 84863422
8134 84863422 86515600 91966844 96724342 99645942 102516252 103732586 101475207 96677466 92948952
8125 92948952 91236075 92703743 95191755 94810878 92232375 88451105 85979754 82813956 82295550
8116 82295550 83411346 85350405 89516087 93505520 96943662 98292675 100393357 103976625 112608670
8107 112608670 119021113 126849587 134171548 142181761 149195744 155078952 160164418 166314299 175133285
8098 175133285 185155735 192465995 199238985 205314124 213729481 222777348 231055012 237707617 243370099
8089B43370099O95133J151681J864603M486045O555447P451163P530353O151722P080922
8080B86337168O995467Q009622Q419254J0129877J2377724J3329454J2845063J2359255
8072C70802884J1167549J4244605J9575666K1265086K0384371J6937837N002450j953536
8064D77426912j887428K988352R104613J099145m901189k169827O962428J0889508
8056D99512514J0224395M134931R5540J926604Q006361J3491528K0228150K7083746
8048E84703769K8291761K5255753J8737207J7589881J9376736K3363244K2463408J5882722
8040G55664481J4492593K3553666M3402016O5998714O7788793L9626214J4740122q655011
8032A016611588j4208974p201097O070523N811742o831010Q671849M1792925O2902822
$$ plain form
8089 243370099 244065232 245216913 247081516 251567561 258123008 265574171 273104524 279256246 286337168
8080 286337168 293332635 301342257 309761511 319891388 332269112 345598566 358443629 370802884
8072 370802884 381970433 396215038 415790704 437055790 457440161 474377998 479380448 477426912
8064 477426912 475539484 478527836 487632449 488731594 483830405 481660578 488623006 499512514
8056 499512514 509736909 513871840 513967380 515893984 523900345 537391873 557620023 584703769
8048 584703769 612995530 638251283 656988490 674578371 693955107 717318351 739781759 755664481
8040 755664481 770157074 793710740 837112756 903111470 970900263 1010526477 1025266599 1016611588
8032 1016611588 1002402614 995201517 1001272040 1007083782 1000252772 1008924621 1050717546 1113620368
8024A113620368O8627236O8145321N0392456L0342769k407519k2593454r840863M0145957
8016A336432271J15527746J92795420K50570653J96489956N5667601j19390646k12191893
8009A815901108k59887560k90654591k71215906j99800825j28531966q1760917o0149277
8002E23900066n1088803l1375482j6342506o428876L452962J6179967J8447736J9466722
7994D76211786J4860453J0014021J1860630Q053782J0464160P273527m936299k9438326
7986E04363734m1609735l7332881j8299712l642535J2161648j203282l2587620m1496323
7978C40353294k8277905j3542340J121484Q673681j430553p954716j116743K45657N202926
7969C03274785M89090o999526p685139m452107k07495J852127o105136m841048K641430
$$ plain form
8024 1113620368 1182247604 1250392925 1300785381 1331128150 1328720631 1306127177 1296286314 1336432271
8016 1336432271 1451960017 1644755437 1895326090 2091816046 2147483647 2028093001 1815901108
8009 1815901108 1556013548 1265358957 994143051 794342226 665810260 584049343 523900066
8002 523900066 472811263 441435781 425093275 418664399 422117361 438297328 456745064 476211786
7994 476211786 491072239 501086260 512946890 521000672 531464832 538738359 533802060 504363734
7986 504363734 462753999 425421118 407121406 403478871 415640519 414437237 381849617 340353294
7978 340353294 312075389 298533049 299654533 308328214 306897661 298942945 297826202 298071859 303274785
7969 303274785 303763875 296764349 289079210 284627103 284419608 286271735 280166599 275325551 277966981
7960B77966981O244386J1218997J4205449P977961q384121j9137962k8891291l6699398
7952B24501002l4115553k7347345j5414069p044261j652002Q13135L852155Q33215M85613
7943A44911890j738177J25205j917556m054508l012350k9162J356848K423033k121446
7934A35943777p089482r703360j0040869o473012j738473J951059M58620P98630J645852
7925A05752742j529342n461571J287367J817430j4822609j3700277q204239k924770P80168
7916F2994899K02371l8352m90172k705296n941532m769698k678895N38041L832772N280738
7906E6224876P63585m371163j1572053j3583421j5244506j2025100r580302l729137q04222
7897a3921443K033498J117450J666673P19160K202591K222315J780653K243171J643812
$$ plain form
7960 277966981 284211367 295430364 309635813 317613774 309229653 290091691 261200400 224501002
7952 224501002 190385449 163038104 147624035 140579774 138927772 139740907 143593062 144426277 144911890
7943 144911890 143173713 143298918 141381362 137326854 134314504 134285342 135642190 138065223 135943777
7934 135943777 128854295 119150935 109110066 102637054 100898581 102849640 103308260 104106890 105752742
7925 105752742 104223400 98761829 100049196 101866626 87044017 73343740 65139501 62214731 62994899
7916 62994899 63197270 63158918 62668746 59963450 54021918 49252220 46573325 47111366 50944138 56224876
7906 56224876 56988461 52617298 41045245 27461824 12217318 192218 -9388084 -13117221 -13921443
7897 -13921443 -11887945 -10770495 -9103822 -8384662 -6182071 -3959756 -2179103 64068 1707880
7888A707880M52626o82362m62288j970775J302677K12649l77678m81664j02378q89160
7878a290473q83809o01758R34780J568468J651998M62139o57890N00214J498124R30301
7868D112094J106462j07721o37328j041025m87801M6173j632831J362455L50951P7345
7858C148774K46345k064p98848q50269l3553j61339K47335J17790k88908j040385l15525
7847B69353j210436j295281j748344K20697n89424K52180L78474J85005L72894n44219
7837c709101n99727N12856J046676k928066J057135O40021N10095J65258j49956L54816
7827c099993Q70779L19994O05065m58739j135694M1375q36854O12694J18428R80564m96213
7816b478594L8195N48053J20364Q93265j93454m27954J67174n30145p35843L97671K37973
$$ plain form
7888 1707880 2160506 1478144 1015856 -954919 347758 560407 182729 -298935 -401313 -1290473
7878 -1290473 -2174282 -2776040 -1841260 -272792 1379206 1841345 1183455 1683669 3181793 4112094
7868 4112094 5218556 5110835 4473507 3432482 2944681 2990854 1358023 2720478 3071429 3148774
7858 3148774 3395119 3393055 2594207 1743938 1710385 1549046 1796381 1914171 1625263 584878 269353
7847 269353 -941083 -2236364 -3984708 -3764011 -4353435 -4101255 -3722781 -3537776 -3164882 -3709101
7837 -3709101 -4308828 -3795972 -2749296 -5677362 -4620227 -3980206 -3470111 -3304853 -3454809 -3099993
7827 -3099993 -2229214 -1909220 -1304155 -1762894 -2898588 -2857213 -3694067 -3081373 -2962945 -1982381 -2478594
7816 -2478594 -2440399 -1892346 -1771982 -878717 -1072171 -1500125 -1332951 -1863096 -2598939 -2201268 -1963295
7805a963295J58813L48730Q27085K44119L03040P51801m95559j046901j101184m3607
7795b016958M06822O43785m43765K7548n0444q00003J75664Q75516K2942L11711M22787
7784d24395m00082L33576M09632J39169M21654N22520N41752l37303p64107o00483l35497
7773d93564l15009m86753o12352k77279j01056Q50332M21693m40076p66900O47916L35183
7762a237865j99386r7176l51758L91880k18192o06484N28490N85058P6367q91516O50118
7751a370464K82721M18557k37310L93688K61267N80757p25506K15787l82985P09623K76348
7740D22483q55663J818285l63854O40771m88339q12555k17623J86200K30916p46033k14972
7729d00384R130k94841p33459J24209k24771K73596p73774j68098N13768O324j31037
$$ plain form
7805 -1963295 -1804482 -1455752 -628667 -384548 -81508 670293 174734 -872167 -1973351 -2016958
7795 -2016958 -1610136 -966351 -1410116 -1382568 -1433012 -2233015 -2057351 -1181835 -1158893 -847182 -424395
7784 -424395 -824477 -490901 -81269 57900 479554 1002074 1543826 1206523 442416 -158067 -493564
7773 -493564 -808573 -1295326 -1907678 -2184957 -2286013 -1435681 -1013988 -1454064 -2220964 -1573048 -1237865
7762 -1237865 -1437251 -1534427 -1886185 -1494305 -1712497 -2318981 -1790491 -1205433 -1129066 -2020582 -1370464
7751 -1370464 -1087743 -669186 -906496 -512808 -251541 329216 -396290 -180503 -563488 146135 422483
7740 422483 -433180 1385105 1021251 1662022 1173683 361128 143505 329705 560621 -185412 -400384
7729 -400384 -391254 -686095 -1419554 -1295345 -1520116 -1246520 -2020294 -2188392 -1674624 -1668300 -1799337
7718a799337l90347N59241m48570J21661m2487O12875J265393O7636P99916k75746Q66945
7707A337180j184973n32965m16448N72043n43538l17884p10939o37967l83010R73000
7697a845501j918899K41972j26943m03033m47510K28823o5369j997800L369320q60689
7687c825629l79127j95975k64850K63683K73880k23802K8864O40550p1353m88185J37593
7676d104351l10056k95206L24574m35473n90326O28861L63057l14833L16328q44766N8904
7665e203287j29760j43593j65763k0243q26723m09175N36954L40405K45591n99863m86231
7654f861688j235819M68159Q74623o83186Q34870j09879k64756l24752R11577J87068
7644f203783n12153J98974J36885n99751m30624k59813J28255M06309o44005Q4369K30900
$$ plain form
7718 -1799337 -2189684 -1630443 -2079013 -1957352 -1999839 -1386964 -121571 -53935 745981 470235 1337180
7707 1337180 152207 -380758 -797206 -225163 -768701 -1086585 -1797524 -2435491 -2818501 -1845501
7697 -1845501 -3764400 -3522428 -3649371 -4052404 -4499914 -4271091 -4336460 -6334260 -2964940 -3825629
7687 -3825629 -4204756 -4400731 -4665581 -4401898 -4128018 -4351820 -4322956 -3682406 -3753759 -4241944 -4104351
7676 -4104351 -4414407 -4709613 -4385039 -4820512 -5410838 -4781977 -4418920 -4733753 -4417425 -5262191 -5203287
7665 -5203287 -5333047 -5476640 -5642403 -5662646 -6489369 -6898544 -6361590 -6021185 -5775594 -6375457 -6861688
7654 -6861688 -8097507 -7629348 -6754725 -7437911 -6603041 -6712920 -6977676 -7302428 -6390851 -6203783
7644 -6203783 -6715936 -6516962 -6380077 -6979828 -7410452 -7670265 -7542010 -7135701 -7779706 -7695337 -7464437
7633g464437k56496K07450k49096k23474N03465J73157l68903m55597Q200M75451l98014
7622h048294P16375M17136k35828n18781j8902P1465J95263j59201j05738m02862L600
7611h085767J00549m79526j22890K2942P79963n1608l0084k76264n86351K82028j247805
7600i694813m97818J093380J283886o21812J981j52897M39168N49442M4671m27540J56360
7589g825992J12287l11407L57091N51005n30713q19504j19282K45097O63806k65593m69622
7578h412827M02753P8158K77595Q90799K3810N15138j58771K90121o09683o49871m68871
7567g821649K02931p3084j84221L53639O0657r48206O52292K95858o12725N65518l97271
7556g906261j84790N20959K4917r23681J202816l92498R32094o27085l75746J27056Q8318
$$ plain form
7633 -7464437 -7720933 -7513483 -7762579 -7986053 -7482588 -7309431 -7678334 -8133931 -8125731 -7650280 -8048294
7622 -8048294 -7331919 -6914783 -7150611 -7669392 -7688294 -7616829 -7421566 -7580767 -7686505 -8089367 -8085767
7611 -8085767 -7985218 -8464744 -8587634 -8564692 -7784729 -7836337 -7866421 -8142685 -8729036 -8447008 -9694813
7600 -9694813 -10192631 -9099251 -7815365 -8437177 -8435196 -8588093 -8148925 -7599483 -7554812 -7982352 -7825992
7589 -7825992 -7713705 -8025112 -7668021 -7117016 -7647729 -8467233 -8586515 -8341418 -7677612 -7943205 -8412827
7578 -8412827 -8010074 -7931916 -7654321 -6763522 -6739712 -6224574 -6383345 -6093224 -6702907 -7352778 -7821649
7567 -7821649 -7618718 -7691802 -7876023 -7522384 -7461727 -8409933 -7757641 -7461783 -8074508 -7508990 -7906261
7556 -7906261 -8091051 -7570092 -7545175 -8468856 -7266040 -7658538 -6726444 -7353529 -7729275 -7602219 -7513901
7545g513901q7345P82583l89368o32899N49737k16485J71537l42932P53621k52788P87789
7534f390451q44714n92632j3986L23342L3622K20377p09349P18362r6396j49163l79290
7523g880278n2211j8069m90195M32655l85581J15058k04549O5327J67444M27465N70295
7512g252639j06359J66319l10517l27132L24054n68264k28694N47721j58293l62438L73062
7501g903180M4052M81097q32893k95290P19761K74211j92290Q7897n53463K50508o3779
7490g983369p91605Q42070J03847k56767Q4523O40116O9543J04745j167750L44928l61977
7479h371696Q7818J50991r73541J051514j14876M06306l78433o34338N80621O10096Q6645
7468g498893l85802o07331R31635k65136m61264L85642L37497q4365R34362n48200m7015
$$ plain form
7545 -7513901 -7601246 -6818663 -7208031 -7840930 -7291193 -7507678 -7336141 -7679073 -6925452 -7178240 -6390451
7534 -6390451 -7235165 -7827797 -7841783 -7518441 -7484819 -7264442 -7973791 -7255429 -7351825 -7500988 -7880278
7523 -7880278 -7932489 -7950558 -8440753 -8008098 -8393679 -8278621 -8483170 -8417843 -8250399 -7822934 -7252639
7512 -7252639 -7358998 -7192679 -7503196 -7830328 -7506274 -8074538 -8303232 -7755511 -7913804 -8276242 -7903180
7501 -7903180 -7859128 -7378031 -8210924 -8506214 -7786453 -7512242 -7704532 -7616635 -8170098 -7919590 -7983369
7490 -7983369 -8774974 -7932904 -7829057 -8085824 -8001301 -7361185 -7291642 -7186897 -8354647 -8009719 -8371696
7479 -8371696 -8283878 -8132887 -9106428 -8054914 -8169790 -7763484 -8141917 -8776255 -8195634 -7585538 -7498893
7468 -7498893 -7884695 -8492026 -7560391 -7825527 -8286791 -7901149 -7563652 -7648017 -6713655 -7261855 -7308870
7457g308870n51182N6933M40464q36198P12160k7397j59092j139992N77838M72767J08599
7446g653970P42963j24678j046777k20680N66038J89792j459561Q87345M57873k86331
7436g947986k86596j36660J18061O45735M43097j577821j66738J173513l49895M1168
7426h044122l10005k464036J18491K383093L04349m07193L64162K88271L96824j565481
7416h935647Q19734J27120o64161L15098J7171L4051k8732n96680j65972L51864Q47505
7405g878649j07680m74295k49219O0635K15781R9073J12759J10010N11713m7433L63548
7394g283757k8604l14853q06068L03098r3748j36629m39091P6986l44072K70326Q07859
7383g988553k01801k65084p58372J014936J44425n39332O1858j08913p41093m808L28657
$$ plain form
7457 -7308870 -7860052 -7803119 -7362655 -8198853 -7486693 -7514090 -7673182 -8813174 -8235336 -7762569 -7653970
7446 -7653970 -6911007 -7035685 -8082462 -8303142 -7737104 -7547312 -9006873 -8119528 -7661655 -7947986
7436 -7947986 -8234582 -8371242 -8253181 -7607446 -7164349 -8742170 -8908908 -7735395 -8085290 -8044122
7426 -8044122 -8354127 -10818163 -10699672 -8316579 -8012230 -8419423 -8055261 -7766990 -7370166 -8935647
7416 -8935647 -8115913 -7988793 -8652954 -8337856 -8320685 -8286634 -8315366 -8912046 -9078018 -8726154 -7878649
7405 -7878649 -7986329 -8460624 -8709843 -8649208 -8433427 -8334354 -8221595 -8111585 -7599872 -7647305 -7283757
7394 -7283757 -7312361 -7627214 -8433282 -8130184 -8223932 -8360561 -8799652 -8722666 -9066738 -8796412 -7988553
7383 -7988553 -8190354 -8455438 -9213810 -8198874 -8054449 -8593781 -8531923 -8640836 -9381929 -9386737 -9058080
7372i058080P21800K92351K6081K65622o73879N2156R374o29484L77851N56664J35506
7361g924038m96014O1712m6492L23375o10523j35179M52917q35553M27354q89333j18189
7350i789963L68802N15501k6791K84963O67302m01387M36536j138784K21607M60971N70727
7339g830516J81629m82323o87140K95497r4069k28587k14080m22404O22392J75387M2794
7328h641420o3465K28079k69600k76849m36850L64599n5541j427556K448903p82046m5431
7317h957177M01007O85076l25113K333915k859691Q28470l44657n33258j48307J50808
7307h768927N45853j44801l5001O77077m65554L12469n89635m31021K97896O04266N09742
7296g487636j137805K140055j280256m63998L02736j069896j01821P47833j50537L04260
$$ plain form
7372 -9058080 -8336280 -8043929 -8017848 -7752226 -8426105 -8373949 -8364575 -8994059 -8616208 -8059544 -7924038
7361 -7924038 -8420052 -8358340 -8404832 -8081457 -8691980 -8827159 -8374242 -9209795 -8782441 -9671774 -9789963
7350 -9789963 -9421161 -8905660 -8932451 -8647488 -7980186 -8381573 -7945037 -9083821 -8862214 -8401243 -7830516
7339 -7830516 -7648887 -8131210 -8818350 -8522853 -8616922 -8845509 -9059589 -9481993 -8859601 -8684214 -8641420
7328 -8641420 -8704885 -8476806 -8746406 -9023255 -9460105 -9095506 -9151047 -10578603 -8129700 -8911746 -8957177
7317 -8957177 -8556170 -7871094 -8196207 -5862292 -8721983 -7893513 -8238170 -8771428 -8919735 -8768927
7307 -8768927 -8223074 -8367875 -8402876 -7725799 -8191353 -7878884 -8468519 -8899540 -8601644 -7997378 -7487636
7296 -7487636 -8625441 -6485386 -7765642 -8229640 -7926904 -8996800 -9098621 -8350788 -8501325 -8197065
7286h197065P98353l41465J70407P9897o29770M41665m18190N22222j66740O6107o9075
7275g743654l38711J03588K36223k405406R46408R30002k15559K28351m73464L43816
7265h388406L11789q6964n6908j89079M89868m75455L59094n03176K04991O49755K11885
7254g472606k57289K30668k79749k0929k14427K28634k02506k08100L80328j53122n25460
7243h494558k50927O25390l78417M25067k00006n42159N81663N12160j303237R92574
7233h032450K52322o31451Q80224m38541q4214j96015L23024j59303K7699P01940k72193
7222g628958p20158k85414O40605j29195j144514R97760k4417K23639L01327r65773m7334
7211h782432J027155j99012m35709M22507k0177j314307K16422N62467m14119J088513
$$ plain form
7286 -8197065 -7398712 -7740177 -7569770 -7489873 -8119643 -7677978 -8096168 -7573946 -7740686 -7674579 -7743654
7275 -7743654 -8082365 -7978777 -7742554 -10147960 -9201552 -8271550 -8487109 -8258758 -8732222 -8388406
7265 -8388406 -8076617 -8163581 -8220489 -8409568 -7919700 -8395155 -8036061 -8539237 -8334246 -7684491 -7472606
7254 -7472606 -7729895 -7499227 -7778976 -7799905 -8014332 -7785698 -7988204 -8196304 -7815976 -7969098 -8494558
7243 -8494558 -8745485 -8120095 -8498512 -8073445 -8273451 -8815610 -8233947 -7721787 -9025024 -8032450
7233 -8032450 -7780128 -8411579 -7531355 -7969896 -8054110 -8250125 -7927101 -8086404 -8058705 -7356765 -7628958
7222 -7628958 -8349116 -8634530 -7993925 -8123120 -9267634 -8269874 -8294291 -8070652 -7769325 -8735098 -8782432
7211 -8782432 -7755277 -7954289 -8389998 -7967491 -7987668 -9301975 -9085553 -8523086 -8937205 -7848692
7201g848692n7921k58696J38130M65129m34616L81735K00390k019911J130067J12192
7191h192193j44765R559K64497k57364N45251n24607K11996o7199n65673M72210l65958
7180h614246J86246o30931K51412l46545K61556P14703k29702N42741j9155M9351J89857
7169g644713k54379l06721k43564j45937j43721l271O56430j169277P81654m15905L12336
7158h577068k96141M60470l50814L61253l49714k10950R12717m16173l86439L12508k14500
7147h754851L65510J65023n58846m01034J220669n21356Q19276p87235q30999P75713
7137h508130j38576j79180K32700Q9970J15836L97477q19179R22747L61170k25416m94448
7126h245029j093739R53047j56281j71019J71038l43700L7045P5849j19935L02432O340
$$ plain form
7201 -7848692 -7906613 -8165309 -8027179 -7562050 -7996666 -7614931 -7414541 -9434452 -8304385 -8192193
7191 -8192193 -8336958 -8327399 -8062902 -8320266 -7775015 -8299622 -8087626 -8154825 -8720498 -8248288 -8614246
7180 -8614246 -8428000 -9058931 -8807519 -9154064 -8892508 -8177805 -8407507 -7864766 -7883921 -7834570 -7644713
7169 -7644713 -7899092 -8205813 -8449377 -8595314 -8739035 -8742306 -8085876 -9255153 -8473499 -8889404 -8577068
7158 -8577068 -8873209 -8412739 -8763553 -8402300 -8752014 -8962964 -8050247 -8466420 -8852859 -8540351 -8754851
7147 -8754851 -8389341 -8224318 -8783164 -9184198 -7963529 -8484885 -7665609 -8452844 -9283843 -8508130
7137 -8508130 -8646706 -8825886 -8593186 -8503216 -8387380 -7989903 -8809082 -7886335 -7525165 -7750581 -8245029
7126 -8245029 -9338768 -8385721 -8542002 -8713021 -8541983 -8885683 -8848638 -8772789 -8892724 -8590292 -8583952
7115h583952Q66199q94426k72563K39804P3343M3760J19179J51911m89386O7564K8179
7104h650388J28842k00793M51600K17555l76937N21032j181636K90773M05228o19856
7094i014580R04215k00097K00471L21151j50902j45177n24777M18522k1187j05278m63176
7083h780815k74132l6132J61251L38820K69666j03710M26754l2541n53440r0415k19661
7072h894355R27145L78408p40041p35943J64762R4717M02303M09979l23741m5801l28951
7061h691518P3544M38930l3295k95152m46946r5374k93251L98892M51448n3843J70931
7050h375634M27501J36261l00045k05791j1242N57456l72102j19236j61164K1054J702309
7039f700633k776154m79692N46113R03339p4204o11906P5738O14461o77599L7601O05273
$$ plain form
7115 -8583952 -7717753 -8612179 -8884742 -8644938 -8571595 -8527835 -8408656 -8256745 -8746131 -8678567 -8650388
7104 -8650388 -8521546 -8722339 -8270739 -8053184 -8430121 -7909089 -9090725 -8799952 -8394724 -9014580
7094 -9014580 -8110365 -8310462 -8109991 -7788840 -7939742 -8084919 -8609696 -8191174 -8212361 -8317639 -8780815
7083 -8780815 -9054947 -9091079 -8929828 -8591008 -8321342 -8425052 -7998298 -8030839 -8584279 -8674694 -8894355
7072 -8894355 -7967210 -7588802 -8328843 -9064786 -8900024 -8805307 -8403004 -7993025 -8316766 -8362567 -8691518
7061 -8691518 -8617974 -8179044 -8212339 -8507491 -8954437 -9049811 -9343062 -8944170 -8492722 -8546565 -8375634
7050 -8375634 -7948133 -7811872 -8111917 -8317708 -8328950 -7771494 -8143596 -8262832 -8423996 -8402942 -6700633
7039 -6700633 -9476787 -9956479 -9410366 -8507027 -8581231 -9193137 -9117399 -8502938 -9180537 -9142936 -8537663
7028h537663m19666Q08886n16258l03857J008858q57018N99560O91m73764L4386j14032
7017h769877l14838l88590L101702m66755q20984k52828j73821j30414q42125R55275O1549
7006h041706m77070L34027j15918k78814M25031R9835j98791l8906J72108m9349O0862
6995h108691N8533m90609J05741J115915J66738R83018J623400J738173n997548R7774
6985h707556K20683p61537L46609K42186K08280k22954j93976l28538P75958k72820P795
6974h685870o1962j73414k52590m231p2902P94068R3700j67575k67391m440l08792J69062
6962h942337p2368l63796L95051L36012j08956m3843K16180M35344o12578j57673L0969
6951h887995k79044L97000j53711J82186k49896m51304M44500M5327L77168M22864k19003
$$ plain form
7028 -8537663 -8957329 -8148443 -8664701 -8968558 -7959700 -8816718 -8217158 -8216467 -8690231 -8655845 -8769877
7017 -8769877 -9084715 -9473305 -6371603 -6838358 -7659342 -7912170 -8085991 -8216405 -9058530 -8103255 -8041706
7006 -8041706 -8518776 -8184749 -8300667 -8579481 -8154450 -8054615 -8253406 -8292312 -8120204 -8169553 -8108691
6995 -8108691 -8050158 -8540767 -8435026 -7319111 -7152373 -6169355 -4545955 -2807782 -8805330 -8707556
6985 -8707556 -8486873 -9248410 -8901801 -8659615 -8451335 -8674289 -8868265 -9196803 -8420845 -8693665 -8685870
6974 -8685870 -8747832 -8921246 -9173836 -9178067 -9250969 -8456901 -8363201 -8530776 -8798167 -8802607 -9111399 -8942337
6962 -8942337 -9014705 -9378501 -8983450 -8647438 -8756394 -8800237 -8584057 -8148713 -8761291 -8918964 -8887995
6951 -8887995 -9167039 -8770039 -8923750 -8741564 -8991460 -9442764 -8998264 -8952937 -8575769 -8152905 -8371908
6940h371908M8041m10224K52727R858N27262o61043o27680J531783q47396N74170O1180
6929g913230j98093l36661J56810M61400m74420P4299Q72708j809759K47874L98334
6919h520738J017415N88907j126650m71150O54934j26117j56209J33671J4718j182507
6909i173726M62314K32920m03228L51886J10517j76001N28384n06041p1233J152039n15825
6898h007994j20691L805p7392O06166j540586J41366o29441L78231L86065N8207J39538
6887h662726p7576P7127q5070M28579K97517j68049K16283J16148l99390k94308Q8124
6876h463341P4152N21404m63624q52854J259182K9562L78003j023303L31073n95871o03047
6865i408664M64531N5326Q54085m53814j79898q952R75182o00064k58274j52005r405
$$ plain form
6940 -8371908 -8323867 -8734091 -8481364 -8471506 -7944244 -8605287 -9232967 -7701184 -8548580 -7974410 -7913230
6929 -7913230 -8111323 -8447984 -8291174 -7829774 -8304194 -8229895 -7357187 -9166946 -8919072 -8520738
6919 -8520738 -7503323 -6914416 -8041066 -8512216 -7857282 -7983399 -8139608 -8005937 -7991219 -9173726
6909 -9173726 -8711412 -8478492 -8881720 -8529834 -8419317 -8595318 -8066934 -8572975 -8644208 -7492169 -8007994
6898 -8007994 -8128685 -8124880 -8202272 -7596106 -9136692 -8995326 -9624767 -9246536 -8860471 -8802264 -8662726
6887 -8662726 -8740302 -8663175 -8748245 -8319666 -8022149 -8190198 -7973915 -7857767 -8257157 -8551465 -8463341
6876 -8463341 -8389189 -7867785 -8331409 -9184263 -7925081 -7895519 -7517516 -8540819 -8209746 -8805617 -9408664
6865 -9408664 -8944133 -8888807 -8034722 -8488536 -8668434 -8677386 -7702204 -8302268 -8560542 -8712547 -8721952
6854h721952K75916q772L2714o2259o8897Q4002K24282j59391M5056M50329j14994o1854
6842h085820r06412M89591k66451m47194N31965O92346p46738k52576l0709K48423J3419
6831h760156p01577M88624k92408K60479l41310P58258N70084l24896M78830k93352L7130
6820h120294m30343j77864N28032j2246j10545K11796k86442j32646P8047N9487j12683
6809h505701p3749P54329m75392K02818K66341r9611k05801j57400Q18466j626782J13992
6798h988490L22797Q3771l2840J76754k62966k39814j94193K45867r3157M98579P93290
6787g690402l53019j52034P6584r0230m52942P5534l60118K21764L20326k86393L02401
6776h388529L75942l37893l84154J7903o82157L44207J112426M13932m36628j09632o67380
$$ plain form
6854 -8721952 -8446036 -8454808 -8422094 -8484353 -8553250 -8469248 -8244966 -8404357 -8359301 -7908972 -8023966 -8085820
6842 -8085820 -8992232 -8502641 -8769092 -9216286 -8684321 -7991975 -8738713 -8991289 -9021998 -8773575 -8760156
6831 -8760156 -9461733 -8973109 -9265517 -9005038 -9346348 -8588090 -8018006 -8342902 -7864072 -8157424 -8120294
6820 -8120294 -8550637 -8728501 -8200469 -8212715 -8323260 -8111464 -8397906 -8530552 -8452505 -8393018 -8505701
6809 -8505701 -8579450 -7825121 -8300513 -8097695 -7831354 -7930965 -8136766 -8294166 -7475700 -9102482 -8988490
6798 -8988490 -8665693 -8581922 -8614762 -8438008 -8700974 -8940788 -9134981 -8889114 -8982271 -8483692 -7690402
6787 -7690402 -8043421 -8195455 -8118871 -8209101 -8662043 -8586509 -8946627 -8724863 -8404537 -8690930 -8388529
6776 -8388529 -8012587 -8350480 -8734634 -8716731 -9398888 -9054681 -7942255 -7528323 -7964951 -8074583 -8741963
6765h741963J49310L21483m85696j14141J33742K02778M60754q23706L09530L0906m62723
6754i019726M95910k53354J006175p25205q94325Q67041j22628J07633l3604l79130N33020
6743h418193L50871r54494M12702k76600P8296M20768l97500K90559m34475L13438n49152
6732i163780J34029O23823n86475K94154k6459N79283m32831M53102o63129k19781J66084
6721h841980L2937j9697j04003l20207M32772R1397m70472Q03318k7402o41056N54977
6710h509416m8483q7854J91059l82179l96394k2838J73691m67044J391253l5584o391
6699h200180K33863l73406l07257o23935J130292n22549j54559k8232N52111o2827P1106
6688h285573K34340p92481q10302N18146K97116k4461j90685K97764K20915m73055O18680
$$ plain form
6765 -8741963 -8592653 -8271170 -8756866 -8871007 -8737265 -8534487 -8073733 -8897439 -8587909 -8557003 -9019726
6754 -9019726 -8523816 -8777170 -7770995 -8496200 -9390525 -8523484 -8646112 -8538479 -8572083 -8951213 -8418193
6743 -8418193 -8067322 -9021816 -8609114 -8885714 -8807418 -8386650 -8784150 -8493591 -8928066 -8614628 -9163780
6732 -9163780 -9029751 -8405928 -8992403 -8698249 -8724708 -8145425 -8578256 -8125154 -8788283 -9008064 -8841980
6721 -8841980 -8809043 -8828740 -8932743 -9252950 -8820178 -8728781 -9199253 -8395935 -8423337 -9064393 -8509416
6710 -8509416 -8557899 -8645753 -8454694 -8836873 -9233267 -9256105 -9082414 -9549458 -8158205 -8193789 -8200180
6699 -8200180 -7966317 -8339723 -8646980 -9270915 -8140623 -8663172 -8817731 -8845963 -8293852 -8356679 -8285573
6688 -8285573 -8051233 -8843714 -9654016 -9135870 -8838754 -8863215 -9053900 -8756136 -8535221 -9008276 -8389596
6677h389596j81176P06014q08227P27247k79590M9110q57494M55119M48772m42617M19144
6666h153294o5848K8484l33411k34173N54511l8402l69744P96852r93923J9638M2843l0753
6654h777220N55992l70500L26278m40496q5817k21645L51400M27363n43656n86748J73015
6643i192034M16188O2528M12257j57282k64330K40853P5189m8396J04436K68083n90709
6632h673217q60900P19306L17187k1229k10918l9698O01305N4755k58350K95059j094353
6621i171053O98129K98983Q57683N87909j605469k48020L04891j023769r5059R58358
6611h437417j182725O86715j59221j11176L29685l39013J36280K035L20099p84944K93809
6600i245873M41499l69716m95239M17058O29892n66720K49093l72608j7840J461193j6360
$$ plain form
6677 -8389596 -8570772 -7864758 -8672985 -7945738 -8225328 -8176218 -9033712 -8578593 -8129821 -8572438 -8153294
6666 -8153294 -8219142 -8190658 -8524069 -8758242 -8203731 -8242133 -8611877 -7815025 -8808948 -8789310 -8746467 -8777220
6654 -8777220 -8221228 -8591728 -8265450 -8705946 -8791763 -9013408 -8662008 -8234645 -8778301 -9365049 -9192034
6643 -9192034 -8775846 -8713318 -8301061 -8458343 -8722673 -8481820 -8406631 -8455027 -8350591 -8082508 -8673217
6632 -8673217 -9534117 -8814811 -8497624 -8518853 -8729771 -8769469 -8168164 -8113409 -8371759 -8076700 -9171053
6621 -9171053 -8472924 -8173941 -7316258 -6728349 -8333818 -8581838 -8276947 -9300716 -9395775 -8437417
6611 -8437417 -9620142 -8933427 -9092648 -9203824 -8874139 -9213152 -9076872 -9074837 -8754738 -9539682 -9245873
6600 -9245873 -8804374 -9174090 -9669329 -9252271 -8622379 -9189099 -8940006 -9312614 -9330454 -7869261 -7885621
6589g885621o29321k82794K43309k09373M25379O86906m24544o26681K85808k07446N77841
6578h046537p3781J8153m46294L34860J0547l56268J15046j71185O19954n72675P96318
6567g771862m18521l35057k5554L91049l14231N09908L2953j95773K60729n95378o17343
6556i079080P97979m35927j374560m146667k418770R595284M94297n18024n73997j05925
6546g765390l14355K171017j378963m25479N6183J037022j105034m10361J48999K01613
6536g784748p26028J86505o9781J302971K75887j90334k16208P0133J68987j062826k78400
6525h323842R02295m634p14582M88136K7987q48647l08229k22022J885284K06842k88404
6514g199816o22102J43234j0310O18288m48287l31836L10172K5543p56752M01894Q80028
$$ plain form
6589 -7885621 -8514942 -8797736 -8554427 -8763800 -8338421 -7651515 -8076059 -8702740 -8416932 -8624378 -8046537
6578 -8046537 -8120318 -8102165 -8548459 -8213599 -8203052 -8559320 -8444274 -8615459 -7995505 -8568180 -7771862
6567 -7771862 -8190383 -8525440 -8550994 -8159945 -8474176 -7964268 -7931315 -8127088 -7866359 -8461737 -9079080
6556 -9079080 -8281101 -8717028 -10091588 -14238255 -16657025 -7061741 -6567444 -7085468 -7659465 -7765390
6546 -7765390 -8079745 -5908728 -7287691 -7713170 -7656987 -6619965 -7724999 -8135360 -7986361 -7784748
6536 -7784748 -8510776 -8324271 -8394052 -7091081 -6815194 -7005528 -7221736 -7151603 -6982616 -8045442 -8323842
6525 -8323842 -7421547 -7426181 -8140763 -7652627 -7624640 -8473287 -8781516 -9003538 -7118254 -6911412 -7199816
6514 -7199816 -7821918 -7678684 -7688994 -7070706 -7518993 -7850829 -7540657 -7515114 -8271866 -7869972 -6989944
6503f989944m78455O80077q58447J02863l96511J02572K09746J7818N07612L20790L82963
6492f398916p65250N6119M57470l82163k05509j04359O56479Q9292m96850P70549K42052
6481f081086N81803K00780K33977r33607L6740l73660K04810L13204J13022M65500K07829
6470e030688J900809n73475L36969q07004p11166j028044j070578l49332l09533L40915
6460g301127p02146p3536P07604O048J74866p52335k2845m47771o1992j92499J716393
6449f949340o11295q98888M73337R38259j074857j85008M30887o49443N75098l33225
6439h284475L58568m43371J170374N5387k80397J83635m9414j09413J6232j3604o75286
6428h071764K07581K7794k4947n49200P52878K64511j52665j87170J606183j136813m25599
$$ plain form
6503 -6989944 -7468399 -6788322 -7646769 -7543906 -7940417 -7837845 -7628099 -7610281 -7102669 -6781879 -6398916
6492 -6398916 -7164166 -7108047 -6650577 -7032740 -7238249 -7342608 -6686129 -6596837 -7093687 -6323138 -6081086
6481 -6081086 -5499283 -5298503 -5064526 -5998133 -5961393 -6335053 -6130243 -5817039 -5704017 -5238517 -5030688
6470 -5030688 -3129879 -3703354 -3366385 -4173389 -4884555 -5912599 -6983177 -7332509 -7642042 -7301127
6460 -7301127 -8003273 -8076809 -7369205 -7363157 -7188291 -7940626 -7963471 -8411242 -8473234 -8665733 -6949340
6449 -6949340 -7560635 -8459523 -7986186 -7047927 -8122784 -8307792 -7876905 -8526348 -7951250 -8284475
6439 -8284475 -7925907 -8369278 -7198904 -7143517 -7423914 -7240279 -7289693 -7399106 -7382874 -7396478 -8071764
6428 -8071764 -7864183 -7836389 -7861336 -8410536 -7657658 -7393147 -7545812 -7732982 -6126799 -7263612 -7689211
6417g689211r5433l662n99313P51504J38516l67827O16205q75691O96519n65398j92397
6406h186188k10178N67011L31948O34107p46879O24369l464710K205906O85466q47500
6396h406648K38521J96937J99995M99999m95104k10686k63408K69375p38810k53045
6386h962874J358983o84716K12396k15682K01516N82831k17534M67231l14729k37750
6376g810328k43698L30807O13449l79881p4105n29466P84660k86825o23505j79496M48971
6365g949417n44452J22585L43678M16493L00045l83934m43240L88140k12180j04470J65556
6354g901196M03530Q4403n83911P5337O2233L38511k17256j7260N78913p30478p84260
6343h691434R86097K30488L36829n50436K95004N78791M79926N1155o62273p26427N3554
$$ plain form
6417 -7689211 -7784644 -7788306 -8387619 -7636115 -7497599 -7865426 -7249221 -8124912 -7428393 -7993791 -8186188
6406 -8186188 -8396366 -7829355 -7497407 -6863300 -7610179 -6985810 -10450520 -8244614 -7559148 -8406648
6396 -8406648 -8168127 -7971190 -7771195 -7271196 -7766300 -7976986 -8240394 -7971019 -8709829 -8962874
6386 -8962874 -7603891 -8288607 -8076211 -8291893 -8090377 -7507546 -7725080 -7257849 -7572578 -7810328
6376 -7810328 -8054026 -7723219 -7109770 -7489651 -7563756 -8093222 -7308562 -7595387 -8218892 -8398388 -7949417
6365 -7949417 -8493869 -8371284 -8027606 -7611113 -7311068 -7695002 -8138242 -7750102 -7962282 -8066752 -7901196
6354 -7901196 -7497666 -7413263 -7997174 -7921837 -7859604 -7521093 -7738349 -7755609 -7176696 -7907174 -8691434
6343 -8691434 -7705337 -7474849 -7138020 -7688456 -7393452 -6814661 -6334735 -6283580 -6945853 -7672280 -7618726
6332g618726p36724K48875N23440M64352l41766P44151m47044K24864M02155m59901k08475
6321g204799M18562m17492M2013J029618r43486N48344k85640l13731P48467J91359N69443
6310e617342j093595N42324r34526M05688m33354J67551j55549n94126k09481K70109
6300g652301k19680K10003M87313k66965m42355J34838N87314j11698O71648p70696j11814
6289g484393p21790J35226n6139J200691O8806o31384K97517l94m19478j73948O31980
6278g153306r64464p4966k85289k57871J506879o09316m82069J127643n99555j16133
6268g908447P10623r57225Q3315j34540O51174l59827L45674O48405k11646k27639j57292
6257g517425o1979P45597l04853m79357N0352r24598K01661P8659P52316l11972l34953
$$ plain form
6332 -7618726 -8355450 -8106575 -7583135 -7118783 -7460549 -6716398 -7163442 -6938578 -6536423 -6996324 -7204799
6321 -7204799 -6786237 -7203729 -7161716 -6132098 -7075584 -6527240 -6812880 -7126611 -6378144 -6186785 -5617342
6310 -5617342 -6710937 -6168613 -7103139 -6697451 -7130805 -6963254 -7118803 -7712929 -7922410 -7652301
6300 -7652301 -7871981 -7661978 -7174665 -7441630 -7883985 -7749147 -7161833 -7273531 -6601883 -7372579 -7484393
6289 -7484393 -8206183 -8070957 -8127096 -6926405 -6857599 -7488983 -7191466 -7191860 -7611338 -7785286 -7153306
6278 -7153306 -8117770 -8192736 -8478025 -8735896 -7229017 -7838333 -8320402 -7192759 -7792314 -7908447
6268 -7908447 -7197824 -8155049 -8071734 -8206274 -7555100 -7914927 -7569253 -6920848 -7132494 -7360133 -7517425
6257 -7517425 -7579404 -6833807 -7138660 -7618017 -7567665 -8492263 -8290602 -8211943 -7459627 -7771599 -8106552
6246h106552N48567o54794P75336J50631j12496L34279j351531L8894j24725k18863Q17167
6235g904087L00573K3788M61132m60589j11593m29849L01658J22712n68937N07608n2996
6224g810580m39424p7449R17200l37615P92101J6368j344577j6417Q82873p72221O38299
6213g551442J60885k50065M36948m83223N3169K1962j03404o46036j56337L78581N00244
6202g638718J51256k45022l13061m24281R08944K46969L7406n71562l6855L93377J70955
6191g320592n38127L95189k17450J75724O2238j123696P6591M2473O68373l42723J06965
6180h015035k48879m75143M85742m93727P78716K22539l95171K04967N40955J56849m71471
6169g709658P87055j77714n87230n3704O23393p62811m12923K03072P276M45083M87412
$$ plain form
6246 -8106552 -7557985 -8212779 -7437443 -7286812 -7399308 -7065029 -8416560 -8377666 -8502391 -8721254 -7904087
6235 -7904087 -7603514 -7579726 -7118594 -7579183 -7690776 -8120625 -7818967 -7696255 -8265192 -7757584 -7810580
6224 -7810580 -8250004 -8327453 -7410253 -7747868 -6955767 -6939399 -8283976 -8300393 -7417520 -8189741 -7551442
6213 -7551442 -7390557 -7640622 -7203674 -7686897 -7633728 -7611766 -7715170 -8361206 -8517543 -8138962 -7638718
6202 -7638718 -7487462 -7732484 -8045545 -8469826 -7560882 -7313913 -7276507 -7848069 -7884924 -7491547 -7320592
6191 -7320592 -7858719 -7463530 -7680980 -7505256 -7443018 -8566714 -8490123 -8447650 -7779277 -8122000 -8015035
6180 -8015035 -8263914 -8739057 -8253315 -8747042 -7968326 -7745787 -8140958 -7935991 -7395036 -7238187 -7709658
6169 -7709658 -6922603 -7100317 -7687547 -7741251 -7117858 -7880669 -8293592 -8090520 -8083244 -7638161 -7150749
6158g150749o17326j83347J61249N01666j039048M32905Q62455Q62858k020956J29891
6148h060402k84665l89490J441919p72709O471P7374j97252J207339k72329m76739N05738
6137g214745q60749J47199N55760M0116r83856L39538K23702k33501N05008p55427J082200
6126g154755j50849k27292m78112N33051Q65993M28088J76435J067844J475171M299348
6116H34922J9565126k9057987m25527n26695L87661r8956P48345J12588L90156Q18484
6106g251883j087772p6634k45181m62472M96128P38509l1184k90265N14324j99753k08922
6095h105105p67363O18996K33153m50226K65877o41684M98791L63475j32446l00671n66172
6084h983375J36L19066N42661m93856J68643M35158l33102K79156j56324j82003k60404
$$ plain form
6158 -7150749 -7768075 -7951422 -7790173 -7288507 -8327555 -7894650 -7032195 -6169337 -8190293 -8060402
6148 -8060402 -8345067 -8734557 -7292638 -8065347 -8058876 -7981502 -8178754 -6971415 -7243744 -7720483 -7214745
6137 -7214745 -8075494 -7928295 -7372535 -7332419 -8316275 -7976737 -7753035 -7986536 -7481528 -8236955 -7154755
6126 -7154755 -7305604 -7532896 -8011008 -7477957 -6611964 -6183876 -6007441 -4939597 -3464426 834922
6116 834922 20400048 -8657939 -9083466 -9610161 -9222500 -9321456 -8573111 -8460523 -8070367 -7251883
6106 -7251883 -8339655 -8416289 -8661470 -9123942 -8627814 -7889305 -7920489 -8210754 -7696430 -7896183 -8105105
6095 -8105105 -8872468 -8253472 -8020319 -8470545 -8204668 -8846352 -8347561 -7984086 -8116532 -8417203 -8983375
6084 -8983375 -8983239 -8664173 -8121512 -8615368 -8446725 -8011567 -8344669 -8065513 -8221837 -8403840 -8664244
6073h664244O8939K09184m8689J46379j11681j1286J050142j68348l2636o62958L89038
6062g836160k54838k24425N86372k72514J05061k66225o09322l44350l31371J031100M004
6051h412668K23627m52212j31889K66787Q2219l23207J11562J085991o69030N80994l49628
6040g987454j82445L75711o78832L68237l74733m2991O2708j76890p9379J330533n37083
6029g922618j01877L2942N6147Q0430L38444n36494j48198Q2504J52231n61004k02529
6018h730022J041558K97723l02230j093222Q16536M14668j300136K96616j17641j1788
6008h687938Q32665k35735P34651j953625K64218N02559M13270k53648j87283J21430
5998h449436n13183J132324N66k78206L83704k71655L80786k31336M75337o72323l8777
$$ plain form
6073 -8664244 -8595305 -8386121 -8434810 -8288431 -8400112 -8411398 -7361256 -7529604 -7562240 -8225198 -7836160
6062 -7836160 -8090998 -8315423 -7729051 -8001565 -7896504 -8162729 -8772051 -9116401 -9447772 -8416672 -8412668
6051 -8412668 -8189041 -8641253 -8773142 -8506355 -8424136 -8747343 -8635781 -7549790 -8218820 -7637826 -7987454
6040 -7987454 -8169899 -7794188 -8473020 -8104783 -8479516 -8522507 -8459799 -8636689 -8716068 -7385535 -7922618
6029 -7922618 -8024495 -7991553 -7935406 -7854976 -7516532 -8053026 -8201224 -8118720 -7966489 -8527493 -8730022
6018 -8730022 -7688464 -7390741 -7692971 -8786193 -7969657 -7554989 -8855125 -8558509 -8676150 -8687938
6008 -8687938 -7855273 -8091008 -7356357 -9309982 -9045764 -8543205 -8129935 -8383583 -8570866 -8449436
5998 -8449436 -8962619 -7830295 -7829729 -8107935 -7724231 -7995886 -7615100 -7846436 -7371099 -8043422 -8082199
5987h082199o8958J205190R9266o92102M1057q03644P33332p34000M5138M89414J36678
5976g630828j48003M7790m49808k63118K95206k41120J002934N33137k77883q11941j32843
5965h076477N56356O6960l9990L28219O04724j873436Q6750o48568K39874p0580O038
5954h820130L58963j76041J170557r5105l03983l83380M3234o21903J22472O53628n67468
5943h619156O2832Q81821J29720k432389J197329M16364J154704n76294R13732k70617
5933g141954o49063M1027L39801N25947m00698K617K31415N98740K90118j82173o6806
5922f411029M72234M1465m51100o52006O57496J31020j08806P17394J93068l82341k09814
5911f002419Q07968K95495q655o14874O95485K73207O34758n07288K02275l66901j72301
$$ plain form
5987 -8082199 -8151157 -6945967 -6846701 -7538803 -7497746 -8301390 -7568058 -8302058 -8256920 -7767506 -7630828
5976 -7630828 -7778831 -7731041 -8180849 -8443967 -8148761 -8389881 -7386947 -6853810 -7131693 -7943634 -8076477
5965 -8076477 -7520121 -7453161 -7493151 -7164932 -6560208 -8433644 -8346894 -8995462 -8755588 -8826168 -8820130
5954 -8820130 -8461167 -8637208 -7466651 -7561756 -7865739 -8249119 -8205885 -8827788 -8705316 -8051688 -8619156
5943 -8619156 -8556324 -7674503 -7544783 -9977172 -8779843 -8363479 -7208775 -7785069 -6871337 -7141954
5933 -7141954 -7791017 -7749990 -7410189 -6884242 -7284940 -7282323 -7050908 -6452168 -6162050 -6344223 -6411029
5922 -6411029 -5938795 -5897330 -6348430 -7000436 -6342940 -6211920 -6320726 -5603332 -5410264 -5792605 -6002419
5911 -6002419 -5194451 -4898956 -4907611 -5522485 -4827000 -4553793 -3919035 -4426323 -4224048 -4590949 -4763250
5900d763250N92753n61056R55127p15291m04522O73193m7337j84089J035516m97739j73633
5889d090328m76284p91724j143276K188937K17313P54991L31559O01706o42244J37493
5879b911857J45140O1198k56916N97013L37742N11832k7539O11073L1852P40507l11582
5868d71537N77440l15362N37720M31346o80240J248703J940663J418616J507395J802358
5858G997102K78892p58642M7830J68982N95968K531022L574303M585236M814322M166988
5848B8002003Q19584m376808o862988p494446n681002l245398k654973j290214m78097
5839c262339r86162j077739q80457j122624N3690Q9935J27977o14007J286899K79574
5829f105253j85669m40802R94377q71818n75367O86410j163927P86840O6943Q63596n19510
$$ plain form
5900 -4763250 -4170497 -4731553 -3776426 -4491717 -4896239 -4223046 -4270383 -4454472 -3418956 -3916695 -4090328
5889 -4090328 -4566612 -5358336 -6501612 -4312675 -4095362 -3340371 -3008812 -2407106 -3049350 -2911857
5879 -2911857 -2766717 -2705519 -2962435 -2365422 -2027680 -1515848 -1543387 -932314 -900462 -159955 -471537
5868 -471537 105903 -209459 328261 759607 79367 1328070 3268733 4687349 6194744 7997102
5858 7997102 8275994 7517352 7565182 7734164 8330132 10861154 14435457 19020693 23835015 28002003
5848 28002003 28821587 24444779 17581791 10087345 4406343 1160945 -1494028 -2784242 -3262339
5839 -3262339 -4248501 -5326240 -6206697 -7329321 -7275631 -7185696 -7057719 -7671726 -6384827 -6105253
5829 -6105253 -6290922 -6731724 -5737347 -6609165 -7184532 -6498122 -7662049 -6875209 -6808266 -5944670 -6464180
5818f464180m19018M83926o76024j471362L43919n9704j96111J099294L5227P7742j78182
5807g424473n16413N64575n6366l08798J50465M64761r34601M09036P41715k68543q04220
5796g982862M16109M42220R1714k76889l08436J114182j24851p8809k87585o72501j13632
5785g781340N54282o48582N69091Q6501o37726r5003j78631P18513Q03035l58073k58596
5774g226529L08720N17140j228235n4934l28236L4761O58751k87080L85371l50928L04815
5763g266384l8773l17516q967p37403N84154p7213K07310n1782k69182Q5150L44902j23241
5751g668945L7679J361031j279604q14376M41751Q34128J6266p08846P92162L69342p30816
5740g350228n95858p25055J87963p17745L02449j28988Q95736K61803M83364j06905q50947
$$ plain form
5818 -6464180 -6883198 -6399272 -7075296 -8546658 -8202739 -8262443 -8458554 -7359260 -7324033 -7246291 -7424473
5807 -7424473 -7940886 -7376311 -7432677 -7741475 -7591010 -7126249 -8060850 -7651814 -6910099 -7178642 -7982862
5796 -7982862 -7566753 -7124533 -7032819 -7309708 -7618144 -6503962 -6628813 -6707622 -6995207 -7667708 -7781340
5785 -7781340 -7227058 -7875640 -7306549 -7220048 -7857774 -7952777 -8131408 -7412895 -6609860 -6967933 -7226529
5774 -7226529 -6917809 -6400669 -7628904 -7683838 -8012074 -7977313 -7318562 -7605642 -7220271 -7571199 -7266384
5763 -7266384 -7305157 -7622673 -7631640 -8369043 -7784889 -7862102 -7654792 -7706574 -7975756 -7890606 -7545704 -7668945
5751 -7668945 -7631266 -6270235 -7549839 -8364215 -7922464 -7088336 -7072070 -7780916 -6988754 -6619412 -7350228
5740 -7350228 -7946086 -8671141 -8483178 -9200923 -8898474 -9027462 -8131726 -7869923 -7386559 -7493464 -8344411
5729h344411j21475L63323p31882M2424N58786k74207M083l03348q7462K86673l46679
5718h954175n66784P03854P59999l02139L19680j088547L22088R227q77425R90819O22546
5707h060857q41196J47134N8084m09598O77249N87577O03876o32790L62888q74409M85833
5696g896209p64881R05828k44813K34559q00621J62106N83930N94605J67954j109159
5686h166701N05527J39230O98766R75290Q44711K378591k4542974J1175028L082862R37043
5676a1972627L36951J666986J170925K6627n59002J25249j49340m48667J33776L37740
5666i331382O09882N69411m05564m74162l75285M8740L22207l31469M46888Q55358j341232
5655i406608j563045J268536k86051j34263J565148p21896m72795K69971m3094L51282
$$ plain form
5729 -8344411 -8465886 -8102563 -8834445 -8792021 -8233235 -8507442 -8503359 -8806707 -8894169 -8607496 -8954175
5718 -8954175 -9520959 -8817105 -8057106 -8359245 -8039565 -9128112 -8806024 -8796797 -9674222 -8683403 -8060857
5707 -8060857 -8902053 -8754919 -8696835 -9106433 -8429184 -7841607 -7237731 -7870521 -7507633 -8382042 -7896209
5696 -7896209 -8661090 -7755262 -8000075 -7765516 -8566137 -8404031 -7820101 -7225496 -7057542 -8166701
5686 -8166701 -7661174 -7521944 -6823178 -5847888 -5003177 -2624586 -27167560 -15992532 -12909670 -11972627
5676 -11972627 -11635676 -9968690 -8797765 -8771138 -9330140 -9204891 -9354231 -9802898 -9669122 -9331382
5666 -9331382 -8721500 -8152089 -8557653 -9031815 -9407100 -9358360 -9036153 -9367622 -8920734 -8065376 -9406608
5655 -9406608 -10969653 -9701117 -9987168 -10121431 -8556283 -9278179 -9750974 -9481003 -9524097 -9172815
5645i172815k49914L28776J94333l03711N94480M27557k33767K61840o88756j74235P06214
5634h309998p92025K3130o3894M92036J8080j018280J79770N29872J29020K50572n55506
5623i117223J81268k78884k601m50637M89791J602616p58676j117125J91731J251994
5613h007746k81693R4625J93565n50576j158014P58265L58032j74096n11279n05707J51741
5602i632883m453q4006l42567Q74784J55466m14806M89056J53767j066862L66389Q2906
5591i423209l93823j95090M58417n92350L56696J576003l41987N02914n83460k48718
5581h884607N79261m35498q05051J0379N64322K13541n57689J60503J87433N16539l20848
5570h771715o54959L07338l61688j77778j194884M05232J686384r5581K49271R1766k46030
$$ plain form
5645 -9172815 -9422729 -9093953 -8899620 -9203331 -8608851 -8181294 -8415061 -8153221 -8841977 -9016212 -8309998
5634 -8309998 -9102023 -9078893 -9142787 -8650751 -8632671 -9650951 -9471181 -8941309 -8812289 -8561717 -9117223
5623 -9117223 -8935955 -9214839 -9217440 -9668077 -9178286 -7575670 -8334346 -9451471 -9259740 -8007746
5613 -8007746 -8289439 -8194814 -8001249 -8551825 -9709839 -8951574 -8593542 -8767638 -9278917 -9784624 -9632883
5602 -9632883 -9637336 -9721342 -10063909 -9189125 -9033659 -9448465 -8959409 -8805642 -9872504 -9506115 -9423209
5591 -9423209 -9817032 -10012122 -9553705 -10146055 -9789359 -8213356 -8555343 -8052429 -8635889 -8884607
5581 -8884607 -8305346 -8740844 -9545895 -9535516 -8971194 -8757653 -9315342 -9154839 -8967406 -8450867 -8771715
5570 -8771715 -9426674 -9119336 -9481024 -9658802 -10853686 -10448454 -8762070 -8857651 -8608380 -8516614 -8762644
5559h762644J19342N83391o3852j63640l49343O6748n358R7049M7586l23031L0363M59662
5547h263727m32783L54335m65477j36028n36652J2609J061290K2223n59479k11116q31143
5536i985948J113204l14250J01030K58755N47493N82476q91942l42472Q18809o35605
5526h748450n70348k75069k60983P02982J077M11928l96504j33304k68131N48659J53402
5515h834741j013846N19530L1718J63437J92609n48633L82568Q47481p03450N71435o76226
5504i068118J49259k92802q6438M11332J60474L66549o2639R24753n69351L05758l25373
5493h086596j36213N47857j69680m92531J96026l36403N56729j208590M89995O66363
5483g973043j33352m54413K14762N67160m2420n64594j7924Q39877k72235r89947K25675
$$ plain form
5559 -8762644 -8643302 -8059911 -8123763 -8287403 -8636746 -8569998 -8575356 -8478307 -8430721 -8753752 -8723389 -8263727
5547 -8263727 -8696510 -8342175 -8807652 -8943680 -9480332 -9467723 -8406433 -8384210 -8943689 -9154805 -9985948
5536 -9985948 -8872744 -9186994 -9085964 -8827209 -8279716 -7697240 -8589182 -8931654 -8112845 -8748450
5526 -8748450 -9318798 -9593867 -9854850 -9151868 -9150791 -8738863 -9135367 -9268671 -9536802 -8988143 -8834741
5515 -8834741 -9848587 -9329057 -9297339 -9133902 -8941293 -9489926 -9107358 -8259877 -8963327 -8391892 -9068118
5504 -9068118 -8918859 -9211661 -9298099 -8886767 -8726293 -8359744 -8422383 -7497630 -8066981 -7761223 -8086596
5493 -8086596 -8222809 -7674952 -7844632 -8337163 -8141137 -8477540 -7920811 -9129401 -8639406 -7973043
5483 -7973043 -8106395 -8560808 -8346046 -7778886 -7821306 -8385900 -8403824 -7563947 -7836182 -8826129 -8600454
5472h600454K51564J815330l75391R18918o54976k176605J356488J064043q65205n58540
5462g824828p104513N252720K504321j744166J923610j626950J60655O5291J152709J1864
5452g229287L66124K36983J91093j013392N35216n35674J80115l09084J516821p83390
5442f844475O92610p05674L35795J08810n30170n1726M32970n21024R13987l52993r2131
5431f614021M0657q53174J14857K17621p67230J046015j010559J51786K21179O70793
5421f782076k28541n11335k94901K70583k55071N51338q81015N10248L06822j358762
5411h672710K54214J086775n51073k79827l03175J258100J65299m98522O4570o44467
5401h120816J041979l25089L95754p00760N32010K67203K77782l06377l16265n05019
$$ plain form
5472 -8600454 -8348890 -6533560 -6908951 -5990033 -6645009 -8821614 -7465126 -6401083 -7266288 -7824828
5462 -7824828 -14929341 -9676621 -7172300 -8916466 -6992856 -8619806 -8459151 -8393860 -7241151 -7229287
5452 -7229287 -6863163 -6626180 -6435087 -7448479 -6913263 -7448937 -7268822 -7577906 -6061085 -6844475
5442 -6844475 -6151865 -6857539 -6521744 -6412934 -6943104 -6994830 -6561860 -7082884 -6168897 -6521890 -6614021
5431 -6614021 -6573364 -7426538 -7311681 -7094060 -7861290 -6815275 -7825834 -7674048 -7452869 -6782076
5421 -6782076 -7010617 -7521952 -7816853 -7546270 -7801341 -7250003 -8131018 -7620770 -7313948 -8672710
5411 -8672710 -8418496 -7331721 -7882794 -8162621 -8465796 -7207696 -7042397 -7540919 -7476349 -8120816
5401 -8120816 -7078837 -7403926 -7008172 -7708932 -7176922 -6909719 -6631937 -6938314 -7254579 -7759598
5391g759598L95631o13542K75797k5814q08217J98417k64303P12062m94539k6399j27377
5380h537882L91466M0794j67041O9182m20067M20656L90364l29536K95453p60315L23471
5369h283455K74011r530j56165N16110K19404l83887q3707k82773q5441R86047j198800
5358h488186J281995k10721M45906K7343j278241O02754J17122p94739J088148j15522
5348g324141K0441l84507R80272q29123k60953N84867l84121L64856N87739j20917M97728
5337f267859j470785J135996N95488l17003l698k75520k06007j6961P5582N81149J56740
5326f012878j51765J153273j24821k2749J31938k69017l58794Q80150P41786l13525M93999
5315c852403O27014o28603N53662N42603j325939N28051k36963m40016j29885J863155
$$ plain form
5391 -7759598 -7363967 -7977509 -7701712 -7727526 -8535743 -8337326 -8601629 -7889567 -8384106 -8410505 -8537882
5380 -8537882 -8146416 -8105622 -8272663 -8203481 -8623548 -8202892 -7812528 -8142064 -7846611 -8606926 -8283455
5369 -8283455 -8009444 -8018974 -8175139 -7659029 -7439625 -7823512 -7907219 -8189992 -8275433 -7289386 -8488186
5358 -8488186 -7206191 -7416912 -6971006 -6943663 -8221904 -7619150 -7502028 -8296767 -7208619 -7324141
5348 -7324141 -7303700 -7688207 -6707935 -7537058 -7798011 -7213144 -7597265 -7232409 -6644670 -6765587 -6267859
5337 -6267859 -7738644 -6602648 -6007160 -6324163 -6327861 -6603381 -6809388 -6826349 -6750767 -6169618 -6012878
5326 -6012878 -6164643 -5011370 -5136191 -5158940 -5027002 -5296019 -5654813 -4774663 -4032877 -4346402 -3852403
5315 -3852403 -3225389 -3853992 -3300330 -2757727 -4083666 -3555615 -3792578 -4232594 -4362479 -2499324
5305b499324R75420p09722M8128j39507l92983P45537R16958M31631L31174M88289R60823
5294A156424K72500o07586m61717k109248j626430p53630J57256Q04739j558190J01580
5284d624302j89103o41866j29367N15771p9269L90129N54990L87653j23193l36552k64509
5273d539618o41489m18009P99384Q29481Q04916J718430j263275J172815J77122l80306
5263a740549k12069K37089n54078j36870R68022j022324N66823r9832l99362N14515j79128
5252b057763Q84589m98882Q05202Q50503L74313N70414J279531P093599Q628649k5053869
5242g123714K495935J320768J127444J01962Q05171P97726K40753P64248L79569N60891
5232A470753Q77382o18985q7415o03162m68269K84969q5684o98524k30703k1516M45875
$$ plain form
5305 -2499324 -1523904 -2233626 -2185498 -2325005 -2717988 -1972451 -1055493 -623862 -292688 195601 1156424
5294 1156424 1428924 821338 359621 -1749627 -3376057 -4129687 -3972431 -3167692 -4725882 -4624302
5284 -4624302 -4813405 -5455271 -5584638 -5068867 -5148136 -4758007 -4203017 -3815364 -3938557 -4275109 -4539618
5273 -4539618 -5181107 -5599116 -4799732 -3970251 -3165335 -1446905 -2710180 -1537365 -1360243 -1740549
5263 -1740549 -1952618 -1715529 -2269607 -2406477 -1438455 -2460779 -1893956 -1993788 -2393150 -1878635 -2057763
5252 -2057763 -1173174 -1672056 -866854 -16351 357962 928376 2207907 9301506 17930155 -7123714
5242 -7123714 -4627779 -3307011 -2179567 -2077605 -1272434 -474708 -233955 530293 909862 1470753
5232 1470753 2348135 1729150 1641735 1038573 570304 855273 769589 71065 -159638 -181154 264721
5221B64721m6061L1936p57685O89304J268362o03054J25770R29424O69070k70011R79163
5210C280939M01509J122152j145274M37001m0855K67231o05109P43350m31402L90581
5200D420123o30279J181412L68173P49024J184897K04992O37459O61825K9687o53034
5190H154279Q28703L64107Q24726O78304L47539m18625R91483o83901n38266J21887L05409
5179A0975645J447730J57618J401894Q62304k35557O33122K92234k96922q53295q27847
5169A3556926k88914o71726o95285N12025j39893N65608P42586J178916j00695J861758
5159A6521306Q76110P55204K133013J734014Q02291j603588j629928j886147k369369
5150A5332906Q18477K033591K892649J375302k101074l627852k732213J17472J630634
$$ plain form
5221 264721 218660 250596 -507089 182215 1450577 847523 973293 1902717 2571787 2301776 3280939
5210 3280939 3682448 4804600 3659326 4096327 4055472 4322703 3717594 4460944 4029542 4420123
5200 4420123 3789844 4971256 5339429 6088453 7273350 7478342 8115801 8777626 8807313 8154279
5190 8154279 8982982 9347089 10171815 10850119 11197658 10779033 11770516 11086615 10548349 10670236 10975645
5179 10975645 12423375 12580993 13982887 14845191 14609634 15242756 15534990 15238068 14384773 13556926
5169 13556926 13268012 12596286 11901001 12413026 12273133 12838741 13581327 14760243 14659548 16521306
5159 16521306 17397416 18152620 20285633 22019647 22821938 21218350 19588422 17702275 15332906
5150 15332906 16151383 18184974 21077623 22452925 20351851 16723999 13991786 14109258 15739892
5141A5739892K956421L035292K795787J869274J489585M95047K197585L555144M076243
5132C8210270N287147M985838L336758K649790R11050J844259L212592K735629M010389
5123F7183722M552487L528665M689608J740663J724585J429477K046967R66348M73948
5114H8336470N77242N81313J444904K124064L159186K644669L376497K104146K962106
5105A07310597K643392J807069M305657O731350Q588114R025150P741556N167118M893098
5096A58213101M784212N900796M694288J134264k481432o263886m133195l382019j417704
5087A57048425J881433L607641N669214O327942M661719N507649M269872J349501j97673
5078A90125723k79026K736047O267231O222585O533163P309792O552250M160753L077417
$$ plain form
5141 15739892 18696313 21731605 24527392 26396666 27886251 28381298 30578883 34134027 38210270
5132 38210270 43497417 48483255 51820013 54469803 55380853 57225112 60437704 63173333 67183722
5123 67183722 71736209 75264874 79954482 81695145 83419730 84849207 86896174 87862522 88336470
5114 88336470 88913712 89495025 90939929 93063993 96223179 98867848 102244345 104348491 107310597
5105 107310597 109953989 111761058 116066715 122798065 131386179 140411329 148152885 153320003 158213101
5096 158213101 162997313 168898109 173592397 174726661 172245229 165981343 161848148 158466129 157048425
5087 157048425 158929858 162537499 168206713 174534655 179196374 184704023 188973895 190323396 190125723
5078 190125723 189846697 192582744 198849975 205072560 211605723 218915515 225467765 229628518 232705935
5069B32705935L227417Q570007J2347637J8276945K0858942K4952423L0048123L6590268
5061C87577697M0078690L5500202K2886125Q737004l712018q723520p040213j930926
5053D73373041P192590J7146718K6611902L3896407L9132289M1564920L4957821K1813285
5045F95688973K0797295M2796163O5391402P6803516J02270694J62300905J82541874
5038A348590822Q7793328p6584636k26588401k59971629k32650746j83016885j21225482
5031C36346371p6261136m6724848l8499271l8501994l6690597k4915422r428486n569034
5023E9755583n09899O159400Q078944P112364L411528l372532m894714o962363o598501
5014F2179810l291125K435939K654716K674313k180176l245589k817469m013765l673711
$$ plain form
5069 232705935 235933352 244503359 256850996 275127941 295986883 320939306 350987429 387577697
5061 387577697 427656387 463156589 486042714 494779718 491067700 482344180 475303967 473373041
5053 473373041 480565631 497712349 524324251 558220658 597352947 638917867 673875688 695688973
5045 695688973 716486268 759282431 824673833 901477349 1003748043 1166048948 1348590822
5038 1348590822 1436384150 1359799514 1133211113 873239484 640588738 457571853 336346371
5031 336346371 260085235 213360387 174861116 136359122 99668525 74753103 65324617 59755583
5023 59755583 59245684 65405084 73484028 80596392 84007920 80635388 75740674 68778311 62179810
5014 62179810 58888685 61324624 63979340 66653653 64473477 61227888 58410419 54396654 50722943
5005E0722943l594629k327650o73712L16184n28723K078925K302523J929160p66907
4996D9458114k177384k733789m133575k805000k737521m12948J849956L287756M323070
4987D3918679L077987M490828M686580M725891K030259m012482p615488p849234p178727
4978C6274293q893192q374256n699037k209847k10323R12696K097487K533647K392056
4969A8823524J957112k71114j661595k706334j594556n58957J307707Q11149m80213l94414
4959A5232309q1575j5742K219825J956269K288144J442938L1551o73786r4577L54816
4949B2660172j06608j819265j646846k471780o49547J9029R94091O84464J898130K673849
4939B2235689J90231r45137k003151k397498R91732K553654K682311J680607l405082
$$ plain form
5005 50722943 47128314 44800664 44126952 44443136 43914413 45993338 48295861 50225021 49458114
4996 49458114 47280730 44546941 40413366 37608366 34870845 34457897 36307853 39595609 43918679
4987 43918679 46996666 51487494 56174074 60899965 62930224 58917742 51302254 43453020 36274293
4978 36274293 27381101 19006845 13307808 11097961 10887638 11800334 13897821 16431468 18823524
4969 18823524 20780636 20509522 18847927 16141593 14547037 13988080 15295787 16106936 15626723 15232309
4959 15232309 15150734 15134992 17354817 19311086 21599230 23042168 23073719 22399933 22305356 22660172
4949 22660172 22553564 20734299 19087453 16615673 15966126 15985155 16979246 17663710 19561840 22235689
4939 22235689 22425920 21480783 19477632 17080134 18071866 20625520 23307831 24988438 21583356
4930B1583356p918888j2166547j3364262j0579529n083314r28918J435675K703204K153233
4921b2165990J274462O66103M33943J594915J455291O92369J122023K50805l2605p99243
4911a5507927R67930m55745P50408J68480R17948J500652O68669R86595R27145Q01405
4901h274440L62148O12085O49546J171247N82942L02099Q78057L87161J30840j705998
4891d904313N57567J90221n40366O77478J34901m30273N52058j99137j40621J72898j65671
4880d095258o03636N09160J281196J91153q31349K21461k30376r46820o77476k89486
4870e471431j56621k23969k27820r16285L64396R52854j404961J47599o72014L67510
4860g240742N29318P74004M83464J06775K43297J33804k2002k35146J97002J42334K64621
$$ plain form
4930 21583356 13664468 1497921 -11866341 -22445870 -27529184 -28458102 -27022427 -24319223 -22165990
4921 -22165990 -20891528 -20225425 -19791482 -18196567 -16741276 -16048907 -14926884 -14676079 -14708684 -15507927
4911 -15507927 -14539997 -14995742 -14245334 -14076854 -13158906 -11658254 -10989585 -10002990 -9075845 -8274440
4901 -8274440 -7912292 -7300207 -6650661 -5479414 -4896472 -4594373 -3716316 -3329155 -3198315 -4904313
4891 -4904313 -4346746 -4156525 -4696891 -4019413 -3884512 -4314785 -3762727 -3961864 -4102485 -3929587 -4095258
4880 -4095258 -4698894 -4189734 -2908538 -2717385 -3548734 -3327273 -3557649 -4504469 -5181945 -5471431
4870 -5471431 -5628052 -5852021 -6079841 -6996126 -6631730 -5678876 -7083837 -6936238 -7608252 -7240742
4860 -7240742 -6711424 -5937420 -5453956 -5347181 -5103884 -4970080 -4992082 -5227228 -5030226 -4887892 -4623271
4849d623271r51459n1515j92849K55555r5783N97030O56861N58709J36453J62775o0800
4838c608294K74829l28977l2689J55982n3791j63355l21866L25263m64599P84836L60494
4827c072167o65975R98142o2982o18147K28521j08103l70343k86200O73636J52128j374091
4816d505581Q48213M68720j2924J049977N57013N58888J513671J113940k7529440P683669
4806a8253854P701761L843409J348431q01338P4319m546J219436k88980K45720l0883M2286
4795d904239J06361p01391J51592N51551l93083K85876M62090L51608L10576p76407n12
4784d555978N92018j72554l41756J411347J046226O92246J711864P93578l88953k71875
4774E16163j042805l488073j443121n88182N24826j230l49333q01756k79296J72371l54760
$$ plain form
4849 -4623271 -5574730 -5626245 -5819094 -5563539 -5659322 -5062292 -4405431 -3846722 -3710269 -3547494 -3608294
4838 -3608294 -3333465 -3662442 -3695131 -3539149 -3592940 -3756295 -4078161 -3752898 -4217497 -3432661 -3072167
4827 -3072167 -3738142 -2740000 -2802982 -3421129 -3192608 -3300711 -3671054 -3957254 -3283618 -3131490 -4505581
4816 -4505581 -3657368 -3188648 -3201572 -2151595 -1594582 -1035694 477977 1591917 -25937523 -18253854
4806 -18253854 -10552093 -6708684 -5360253 -6161591 -6087272 -6091818 -4872382 -5161362 -4915642 -4946525 -4904239
4795 -4904239 -4797878 -5499269 -5347677 -4796126 -5189209 -4903333 -4441243 -4089635 -3779059 -4555466 -4555978
4784 -4555978 -3963960 -4136514 -4478270 -3066923 -2020697 -1328451 383413 1176991 788038 516163
4774 516163 -526642 -4014715 -5457836 -6046018 -5521192 -5522422 -5871755 -6673511 -6952807 -6780436 -7135196
4763g135196p77044M6473N73197j0319j508j77314O06858L95181J4744j92440p8278o66768
4751g402414P74873j98334k05547N61513K21812j67403j246916L41101J173404m46748
4741f594659k72260N24703j97895m9183L14615K03749k7525K65113r3564m66957P49012
4730e644851n91851k65945n69791l33229M59366j34944P41075j256934O72185L97206
4720f527713l58307L23664o1755j37491k92889M2006j589222K91064L42542P11050K74499
4709f982552o50068P41236m93964J76018n53528J525792j213058R6113M62039j69245
4699g061217J19715j4579m82049k09937l25380M9156N09207K98747p10801j61102P59123
4688g229117j87519J86152j035506N09535J256672p70057m44407M1437K50919J67132
$$ plain form
4763 -7135196 -7912240 -7865767 -7292570 -7302889 -7304397 -7481711 -6874853 -6479672 -6464928 -6657368 -6735646 -7402414
4751 -7402414 -6627541 -6825875 -7031422 -6469909 -6248097 -6415500 -7662416 -7321315 -6147911 -6594659
4741 -6594659 -6866919 -6342216 -6540111 -6589294 -6274679 -6070930 -6098455 -5833342 -5926906 -6393863 -5644851
4730 -5644851 -6236702 -6502647 -7072438 -7405667 -6946301 -7081245 -6340170 -7597104 -6924919 -6527713
4720 -6527713 -6886020 -6562356 -6624111 -6761602 -7054491 -7012485 -8601707 -8310643 -7968101 -7257051 -6982552
4709 -6982552 -7632620 -6891384 -7385348 -7209330 -7762858 -6237066 -7450124 -7354011 -6891972 -7061217
4699 -7061217 -6941502 -6956081 -7438130 -7648067 -7973447 -7924291 -7415084 -7116337 -7827138 -7988240 -7229117
4688 -7229117 -7416636 -7230484 -8265990 -7756455 -6499783 -7269840 -7714247 -7672810 -7421891 -7254759
4678g254759m87220r618l21298k49448J07913n6675J48140j05271j95733Q7749K89422
4667h046798k93894L8434j45207L46655Q5005L68223J039837j329698l273k57122m65352
4656h663190O34368N9601q4153m93781l67858K07141l91571K37492Q86398o23904k57432
4645h856889J008583k35190K69774r9742k68593k42868j54809L51059n07024P27775l22117
4634h330041O52762K30049l72210r65200o2756J081888L04574r39986k02574k32142P87143
4623h048493M19191k12729L4466l0193k73752m85391N20986l98157l42758M54029J92176
4612h170625P86884n37870P3792L52681o83746o95258N45380j35241O15398O28828m88096
4601g707873L0733P38418J46658p21968L14264q20723L41347L65876L20371K1697q18988
$$ plain form
4678 -7254759 -7741979 -7751597 -8072895 -8322343 -8214430 -8271105 -8122965 -8228236 -8423969 -8336220 -8046798
4667 -8046798 -8340692 -8302258 -8447465 -8100810 -8015805 -7647582 -6607745 -7937443 -7940716 -8197838 -8663190
4656 -8663190 -8028822 -7969221 -8053374 -8547155 -8915013 -8707872 -9099443 -8861951 -7975553 -8599457 -8856889
4645 -8856889 -7848306 -8083496 -7813722 -7913464 -8182057 -8424925 -8579734 -8228675 -8735699 -8007924 -8330041
4634 -8330041 -7677279 -7447230 -7819440 -8784640 -8847396 -7765508 -7460934 -8400920 -8603494 -8835636 -8048493
4623 -8048493 -7629302 -7842031 -7807565 -7837758 -8111510 -8596901 -8075915 -8474072 -8816830 -8362801 -8170625
4612 -8170625 -7383741 -7921611 -7847819 -7495138 -8178884 -8874142 -8328762 -8464003 -7848605 -7219777 -7707873
4601 -7707873 -7677140 -6938722 -6792064 -7514032 -7199768 -8020491 -7679144 -7313268 -6992897 -6971200 -7790188
4590g790188J495606j294496M37911J52689o33446j00536J41413j25637j46217m54777
4580h317678L38446j051935J049591k43007K63203M46791O9045Q44021p59824o3819p0237
4569g495403k50200J47380k46597q5009m60713K89169K32212K96240o12319R05043o10260
4558g890457L9015K82310K56829m40059l02370J03260J41250K25175L42947q76757q4571
4547h203428m89081J222116r96231j94019O46568J32528J15111j12192n57633l1982
4537h468243J377400m29450o0365n03662l10360J073236j55569k26155l85428M52567
4527g636029n45394P2321M63649j595816j66203J022926L48579O38492o92905n84365
4517h674745M50249L62482l86958J70973K66680n84345O46933J62029l21477j09214M20703
$$ plain form
4590 -7790188 -6294582 -7589078 -7151167 -6998478 -7631924 -7732460 -7591047 -7716684 -7862901 -8317678
4580 -8317678 -7979232 -9031167 -7981576 -8224583 -7961380 -7514589 -7445544 -6601523 -7361347 -7425166 -7495403
4569 -7495403 -7745603 -7598223 -7844820 -7929829 -8390542 -8101373 -7869161 -7572921 -8185240 -7280197 -7890457
4558 -7890457 -7851442 -7569132 -7312303 -7752362 -8054732 -7951472 -7810222 -7585047 -7242100 -8118857 -8203428
4547 -8203428 -8692509 -7470393 -8466624 -8660643 -8014075 -7881547 -7766436 -7878628 -8436261 -8468243
4537 -8468243 -7090843 -7520293 -7580658 -8084320 -8394680 -7321444 -7477013 -7703168 -8088596 -7636029
4527 -7636029 -8181423 -8109102 -7645453 -9241269 -9407472 -8384546 -8035967 -7397475 -8090380 -8674745
4517 -8674745 -8224496 -7862014 -8248972 -8077999 -7811319 -8395664 -7748731 -7586702 -7908179 -8017393 -7596690
4506g596690Q10631l61560O96651r00554l64905K58601o14072L9131j4954J23217o88969
4495h613473N65802J49254M54551j78915L71893O0590M16194j190088O65820l69962p5458
4484g743792M31440j68401n40255N50436K10819K60941j437775K5193L19617J09231r0074
4473h072620O25568j08941J61586J0027n17749j6040K7008J10024k83151j93678m87591
4462h745557m4842O98485J18730k06529L96127q71411m62169J073348j356449O23968
4452h776299J69407J090557m49390N52459m62310R7698l48759l67021N75165K16698o94576
4441h396371L8789n55185L67644K0872L90575O74244j01148m82344p97869L44154Q78320
4430g618319p90391L52605J93661j57440J42988l84860M91889P62442q73956j27680m13087
$$ plain form
4506 -7596690 -6786059 -7147619 -6450968 -7351522 -7716427 -7457826 -8071898 -8032767 -8047721 -7924504 -8613473
4495 -8613473 -8047671 -7898417 -7443866 -7622781 -7250888 -7190298 -6774104 -7964192 -7298372 -7668334 -7743792
4484 -7743792 -7312352 -7480753 -8021008 -7470572 -7259753 -6998812 -8436587 -8411394 -8091777 -7982546 -8072620
4473 -8072620 -7447052 -7555993 -7394407 -7384380 -7902129 -7918169 -7891161 -7781137 -8064288 -8257966 -8745557
4462 -8745557 -8790399 -8091914 -7973184 -8179713 -7783586 -8654997 -9117166 -8043818 -9400267 -8776299
4452 -8776299 -8606892 -7516335 -7965725 -7413266 -7875576 -7777878 -8126637 -8493658 -7918493 -7701795 -8396371
4441 -8396371 -8357582 -8912767 -8545123 -8524251 -8133676 -7459432 -7560580 -8042924 -8840793 -8496639 -7618319
4430 -7618319 -8408710 -8056105 -7862444 -8019884 -7876896 -8261756 -7769867 -7007425 -7881381 -8009061 -8422148
4419h422148k68765K99661O99870l75253P21472o0724q64567K82252o904L06154l57046
4408h045998l36264L6722O44476j64735L29300l39364L66198m66365r2813N54378k41768
4397g756233n39044L79874r7176k87796N029K62844L67488m38980K0480o27346O7552
4386h643308M66538o14578J02224k9157M33080K68249m58442j622074J054427m98666
4376i541707m14159r50331q94689k279432o950192K0652039l180607j227662j738277
4367f525017l65156L93089j159153q4736J34048J83173k73073O24868k51474L4899j15187
4356g403719J20118n67438M71940k05741Q30392l44570k40617j02838p9742k85065m7228
4345g854508O34056k52085l97078K28192m8779J3792L18854K31135N96062j896360J039131
$$ plain form
4419 -8422148 -8690913 -8391252 -7691382 -8066635 -7345163 -7405887 -8270454 -7988202 -7995106 -7688952 -8045998
4408 -8045998 -8382262 -8345540 -7701064 -7865799 -7536499 -7875863 -7509665 -7976030 -8068843 -7514465 -7756233
4397 -7756233 -8295277 -7915403 -8012579 -8300375 -8295346 -8032502 -7665014 -8103994 -8083514 -8710860 -8643308
4386 -8643308 -8176770 -8791348 -8689124 -8718281 -8285201 -8016952 -8475394 -10097468 -9043041 -9541707
4376 -9541707 -9955866 -10906197 -11800886 -14080318 -21030510 -378471 -3559078 -4786740 -6525017
4367 -6525017 -6890173 -6497084 -7656237 -7740973 -7606925 -7423752 -7696825 -7071957 -7323431 -7288532 -7403719
4356 -7403719 -7283601 -7851039 -7379099 -7584840 -6754448 -7099018 -7339635 -7442473 -7522215 -7807280 -7854508
4345 -7854508 -7220452 -7472537 -7869615 -7641423 -7690202 -7676410 -7357556 -7126421 -6530359 -8426719 -7387588
4334g387588n35965Q4056m74557J44061K61927p13488K81296J668238j123478j59095
4324g954593k27729L86120j20557l80245O78465k31403J50110K1478O49964N8750n11986
4313g481626R95617n45560M07557j707415K60420P30491j196004J742383p59714M59936
4303g093915m37594r52850P88033l89761K76342O87612q06022L45228Q28818m15959j14469
4292g284537l83606N34704l71140m0352j0731l28761R22430k99699J64994n00944K44487
4281g353155o0204j16226K67373j941767J367619K15910n45454Q28150k01472J30822
4271g408404M77515k05588n84406J34102J910O716J19693L64744q97575M13956j47484
4260g724821K20456j09879J75585K05252m74217j38872J65461l77643O19739O0449l15192
$$ plain form
4334 -7387588 -7923553 -7839497 -8314054 -8169993 -7908066 -8621554 -8340258 -6672020 -7795498 -7954593
4324 -7954593 -8182322 -7796202 -7916759 -8297004 -7618539 -7849942 -7699832 -7678354 -7028390 -6969640 -7481626
4313 -7481626 -6486009 -7031569 -6624012 -8331427 -8071007 -7340516 -8536520 -6794137 -7553851 -7093915
4303 -7093915 -7531509 -8484359 -7696326 -8086087 -7809745 -7122133 -7928155 -7582927 -6754109 -7170068 -7284537
4292 -7284537 -7668143 -7133439 -7504579 -7544931 -7555662 -7884423 -6961993 -7261692 -7096698 -7597642 -7353155
4281 -7353155 -7413359 -7529585 -7262212 -9203979 -7836360 -7620450 -8165904 -7337754 -7539226 -7408404
4271 -7408404 -6930889 -7136477 -7720883 -7586781 -7584871 -7578155 -7458462 -7093718 -7991293 -7577337 -7724821
4260 -7724821 -7504365 -7614244 -7438659 -7233407 -7707624 -7846496 -7681035 -8058678 -7438939 -7378490 -7693682
4249g693682m481L42432K96079r04664k71235O59451Q5553l90050K34949l28896k14705
4238h189249O31206k01942K98909k42211M1767l37473L76995k16918J169m71637K64214
4227h045170P40781o14337R63975r93617m36788j427226J989972J57271J24392m33878
4217g974625K94401M14290n38153M0703K93613L57627o05349J17046n62321R90568k75222
4206g447422r8455l32094j58975M25871Q9280j25951l07274J05498J26146q3673l3112
4195g840161k71872L27572k28555J01585L20521J42971N00725q17257M56927k67010m03812
4184g978366P31863j82312L34679j22471k03344n62907L2152K83906M85792L528K05398
4173f972082n20355k61497L70397k42811j63268J75284j95875M24236n50359n8225K8719
$$ plain form
4249 -7693682 -7698163 -7355731 -7059652 -7964316 -8235551 -7576100 -7490547 -7880597 -7645648 -7974544 -8189249
4238 -8189249 -7558043 -7759985 -7461076 -7703287 -7661520 -7998993 -7621998 -7838916 -7837747 -8309384 -8045170
4227 -8045170 -7304389 -7918726 -6954751 -7948368 -8385156 -9812382 -7822410 -7665139 -7540747 -7974625
4217 -7974625 -7680224 -7265934 -7804087 -7763384 -7469771 -7112144 -7717493 -7600447 -8162768 -7172200 -7447422
4206 -7447422 -7545877 -7877971 -8036946 -7611075 -7521795 -7647746 -7955020 -7849522 -7723376 -7807049 -7840161
4195 -7840161 -8112033 -7784461 -8013016 -7911431 -7590910 -7447939 -6947214 -7764471 -7307544 -7574554 -7978366
4184 -7978366 -7246503 -7428815 -7094136 -7216607 -7419951 -7982858 -7950706 -7666800 -7181008 -7177480 -6972082
4173 -6972082 -7492437 -7753934 -7383537 -7626348 -7789616 -7614332 -7810207 -7385971 -7936330 -7994555 -7965836
4162g965836m62244J176957o69215M71299l52508l52617L90950L79381Q4804j214218
4152h513247J92252N79776m8159n67534R09256k64139L68855l01968J06187n9523l31984
4141g930228L83713M19747o03164N37605j43479n93449L15824M25427k99653l20481P64979
4130g043159q8976K37620o39957j93706o56774M54607J555754j232802j40133J79176L5045
4119g533305j68162L34146m19967L77465P5583K30516l57534P79501q66005K7621M245
4108g515896l62605M82787L17982n95033j17179N7699k78998L50115P35267j68528q0479
4097g174868j290595L62168K28047p427M22015K7251j93468n81076M19698j002682R25634
4086g865303L33758L51502J58753n86362K63177J53371k77794n14438J365393j244339
$$ plain form
4162 -7965836 -8428080 -7251123 -7920338 -7449039 -7801547 -8154164 -7763214 -7383833 -7299029 -8513247
4152 -8513247 -8320995 -7741219 -7789378 -8356912 -7447656 -7711795 -7342940 -7644908 -7538721 -7598244 -7930228
4141 -7930228 -7546515 -7126768 -7729932 -7192327 -7335806 -7929255 -7613431 -7188004 -7487657 -7808138 -7043159
4130 -7043159 -7132135 -6894515 -7534472 -7728178 -8384952 -7930345 -6374591 -7607393 -7747526 -7568350 -7533305
4119 -7533305 -7701467 -7367321 -7787288 -7409823 -7334240 -7103724 -7461258 -6681757 -7547762 -7520141 -7515896
4108 -7515896 -7878501 -7395714 -7077732 -7672765 -7789944 -7732245 -8011243 -7661128 -6925861 -7094389 -7174868
4097 -7174868 -8465463 -8103295 -7875248 -7882675 -7460660 -7433409 -7626877 -8207953 -7788255 -8790937 -7865303
4086 -7865303 -7531545 -7180043 -7021290 -7607652 -7344475 -7191104 -7468898 -7983336 -6617943 -7862282
4076g862282O46659m46900Q47656m88030L32547m82846j11382M9162k31443L72135m6416
4065g421140M83819o71099N95206n55214J73795J30301J6998k84974K84931j80337p4504
4054g502218p64564R16228N42723m04777K1320K23638k56158K60449q0172N95670j98705
4043f646566p89054j20039J089239r92571L06966L01373l91232N81499p42652M282M95765
4032f902990r92840J190601m81252r6490j202726O75495j88628O05009k73677l45966
4022h013464l85569O98164m37660L00934P01840j82476o36088O62212j28373J001178
4012f419302q54720j98732k85288k50872L17576L63026N98861l92589j94235J8028M12637
4001f885610o47210L61209j12855M71260r05975M6060L94472L54892R3389K07230O686
$$ plain form
4076 -7862282 -7215623 -7662523 -6814867 -7302897 -6970350 -7453196 -7564578 -7515416 -7746859 -7374724 -7421140
4065 -7421140 -6937321 -7608420 -7013214 -7568428 -7394633 -7264332 -7247334 -7532308 -7247377 -7427714 -7502218
4054 -7502218 -8266782 -7350554 -6807831 -7212608 -7191288 -6967650 -7223808 -6963359 -7043531 -6447861 -6646566
4043 -6646566 -7435620 -7555659 -6466420 -7458991 -7152025 -6850652 -7241884 -6660385 -7403037 -7398755 -6902990
4032 -6902990 -7895830 -6705229 -7186481 -7282971 -8485697 -7810202 -7998830 -7393821 -7667498 -8013464
4022 -8013464 -8399033 -7700869 -8138529 -7837595 -7135755 -7318231 -7954319 -7292107 -7420480 -6419302
4012 -6419302 -7274022 -7472754 -7758042 -8008914 -7691338 -7328312 -6729451 -7122040 -7316275 -7298247 -6885610
4001 -6885610 -7532820 -7171611 -7284466 -6813206 -7719181 -7673121 -7278649 -6923757 -6830368 -6623138 -6616452
3990f616452n20708n1343j86525J81748M43365j8743n06528n59714K11216J66227J98713
3979g258744R22682J116926j686655l21803K80885J15806n21530L09128N08889J47609
3969f386807j05249m64058n83668m26215L46440L64903n42282R11831k13728m86882j63409
3958g749124m01872Q30105k41532R51104M01843o42573J82145j32580p192j81702L73564
3947f617814k55155o51693L68018O8018P9358K17063L01405j67717m89205M14090J01403
3936f632229K684022j297881k72777j890905J86224P8361K64990r10002J332194o75748
3926g133751m9039o00437M91654J152870n21425q25927J43707J26246J56488O25174K3180
3915f411260o76138N13442n08332K41333Q38017q97839J250106R76122j118853r71133
$$ plain form
3990 -6616452 -7137160 -7188503 -7375028 -7193280 -6749915 -6768658 -7275186 -7834900 -7623684 -7457457 -7258744
3979 -7258744 -6336062 -5219136 -6905791 -7227594 -6946709 -6830903 -7352433 -7043305 -6534416 -6386807
3969 -6386807 -6492056 -6956114 -7539782 -7965997 -7619557 -7254654 -7796936 -6885105 -7098833 -7585715 -7749124
3958 -7749124 -8150996 -7320891 -7562423 -6611319 -6209476 -6852049 -6669904 -6802484 -6809676 -6991378 -6617814
3947 -6617814 -6872969 -7524662 -7156644 -7088626 -7009268 -6792205 -6490800 -6658517 -7147722 -6733632 -6632229
3936 -6632229 -3948207 -5246088 -5518865 -7409770 -7223546 -7145185 -6880195 -7790197 -6458003 -7133751
3926 -7133751 -7182790 -7783227 -7291573 -6138703 -6660128 -7486055 -7342348 -7216102 -7059614 -6434440 -6411260
3915 -6411260 -7087398 -6573956 -7082288 -6840955 -6002938 -6900777 -5650671 -4674549 -5793402 -6764535
3905f764535J144251j80657q11047N0331N04023o9983p70887J0875N0030L67664l49181
3894f819116M35112k78857R6060r78001J09247O29947m3925l95885n83705n30125O53580
3883g705668J610999p50745J48316L34194j25293K70533n22725N56101n63604O77067
3873f070825P73160n46131l2722o41249k73594o8032k82276J152825J30406j73278k27629
3862f259345O94310j283618K05649M56657N04973o18778o62804J64828Q5750Q74581m65300
3851f303097N32712j95944j40316n43952j12391O89064j50259M66096p77990J13153J02425
3840f320499o6330n08999K88815K517391k258573l44829R57951q630K11971o63875O9340
3829f126267l7259K45713L7872J78953M43132m71784K43358r17079Q83706K10333n15735
$$ plain form
3905 -6764535 -5620284 -5800941 -6611988 -6561657 -6057634 -6127617 -6898504 -6887629 -6837599 -6469935 -6819116
3894 -6819116 -6384004 -6662861 -6566801 -7544802 -7435555 -6805608 -6849533 -7245418 -7829123 -8359248 -7705668
3883 -7705668 -6094669 -6845414 -6697098 -6362904 -6488197 -6217664 -6740389 -6184288 -6747892 -6070825
3873 -6070825 -5297665 -5843796 -5876518 -6517767 -6791361 -6859393 -7141669 -5988844 -5858438 -6031716 -6259345
3862 -6259345 -5565035 -6848653 -6643004 -6186347 -5681374 -6300152 -6962956 -6798128 -6712378 -5837797 -6303097
3851 -6303097 -5770385 -5966329 -6106645 -6650597 -6762988 -6073924 -6224183 -5758087 -6536077 -6422924 -6320499
3840 -6320499 -6386829 -6895828 -6607013 -4089622 -6348195 -6693024 -5735073 -5743703 -5531732 -6195607 -6126267
3829 -6126267 -6163526 -5917813 -5879941 -5700988 -5257856 -5729640 -5486282 -6403361 -5519655 -5309322 -5825057
3818e825057o64983j11918O95854n37513l42598N65293L94346J95473k46242L9109K16841
3807e621395O00757n39111m7550n59632L66667M43296n45637k31892L09205Q26224J8779
3796d980289q85003k4679o05426J023938P6374l69248m37065N21079j88706K82041Q0604
3785e506380R1048R04747l94494o38066j94228J09023J71524q03575J88348L99840k33505
3774e905718L75218P6069N326M16932K9517l48775K13043n67579M1041L35245J62098
3763e167583L70752m64609j35927M15336J66034j88534m27533L07351j5275O11440Q820
3752d519728M47089o14081O8436l09761j071455O91359L54883m95659Q38606K7927L5286
3741d547098n83609O04645n19229N0451K65536M57075p67386L22131M17676M90526m90775
$$ plain form
3818 -5825057 -6490040 -6601958 -5906104 -6443617 -6786215 -6220922 -5826576 -5631103 -5877345 -5838236 -5621395
3807 -5621395 -5020638 -5559749 -5607299 -6166931 -5800264 -5356968 -5902605 -6134497 -5825292 -4999068 -4980289
3796 -4980289 -5865292 -5889971 -6495397 -5471459 -5395085 -5764333 -6201398 -5680319 -5869025 -5586984 -5506380
3785 -5506380 -5415332 -4510585 -4905079 -5543145 -5737373 -5628350 -5456826 -6260401 -6072053 -5672213 -5905718
3774 -5905718 -5530500 -5454431 -5449105 -5032173 -5002656 -5351431 -5138388 -5705967 -5664926 -5329681 -5167583
3763 -5167583 -4796831 -5261440 -5397367 -4982031 -4815997 -5004531 -5432064 -5124713 -5139988 -4528548 -4519728
3752 -4519728 -4072639 -4686720 -4618284 -4928045 -5999500 -5308141 -4953258 -5448917 -4610311 -4582384 -4547098
3741 -4547098 -5130707 -4526062 -5045291 -4994840 -4729304 -4272229 -5039615 -4717484 -4299808 -3809282 -4300057
3730d300057n19517J630657j043577j50130P3083J63045k83632m12750J82944k18662
3720d878596N14552O00315k59326l11486K38574j61957j51238K57289L13648n36104j00052
3709d474381J033535m75163j54806j54881O25765l04621L51792K5510p46830k63614N30417
3698d007277l40225N02506K0728j7491k12304J525397n71724l0428Q9396p2205o37993
3687c751620L84808m42006L27944K91132M10386K72501m91791m34481Q80126r53555J96568
3676c309988J37896N39515K59637n73743M6412L28213m89849P41724k45331k23702L35050
3665b454166J510823j379634J177232j115849p93392J130248m10342j97452P92485m49624
3655b189671j97868L54220K79454n35027k03465M88633J187882m54200p49403K32560
$$ plain form
3730 -4300057 -4819574 -3188917 -4232494 -4382624 -4309541 -4146496 -4430128 -4842878 -4659934 -4878596
3720 -4878596 -4364044 -3763729 -4023055 -4334541 -4095967 -4257924 -4409162 -4151873 -3838225 -4374329 -4474381
3709 -4474381 -3440846 -3916009 -4070815 -4225696 -3599931 -3904552 -3552760 -3527250 -4274080 -4537694 -4007277
3698 -4007277 -4347502 -3844996 -3824268 -3841759 -4054063 -2528666 -3100390 -3130818 -3041422 -3113627 -3751620
3687 -3751620 -3366812 -3808818 -3480874 -3189742 -2779356 -2506855 -2998646 -3433127 -2553001 -3506556 -3309988
3676 -3309988 -3172092 -2632577 -2372940 -2946683 -2900271 -2572058 -3061907 -2320183 -2565514 -2789216 -2454166
3665 -2454166 -943343 -2322977 -1145745 -2261594 -3054986 -1924738 -2335080 -2532532 -1740047 -2189671
3655 -2189671 -2387539 -2033319 -1753865 -2288892 -2492357 -2003724 -815842 -1270042 -2019445 -1786885
3645a786885j95035M03619L56638O41203J04776o85928j31546p85901J99286J59649Q48692
3634h71432n7887K09638p98598N25664j80819J285648L21384q05091K0724J227383j72331
3623G04283o49889M51457L53761n65754N86214l05568J73995k42802K36189J67216J76698
3612A085800k98708j13841J442938q51304j01148J39316k53992m63305J34220Q99608
3602A619584P92446L4842J7252M0140J04065M13362l14654M22519k0581M56294n48471
3591C016798j46416J2988M11993l98192N12892Q69158J87154M81257q21097O43698k64557
3580D505676j48592m610M81897K71663n97182R20410m64493N12350N32910J5070R6217
3569F121316K61368o78899N41727M8465n93766R71745J03299M04620m26001k5507P94077
$$ plain form
3645 -1786885 -1981920 -1578301 -1221663 -580460 -475684 -1161612 -1293158 -2079059 -1879773 -1720124 -871432
3634 -871432 -929319 -719681 -1518279 -992615 -1173434 112214 433598 -371493 -350769 876614 704283
3623 704283 54394 505851 859612 293858 880072 574504 748499 505697 741886 909102 1085800
3612 1085800 787092 673251 2116189 1264885 1163737 1303053 1049061 585756 719976 1619584
3602 1619584 2412030 2446872 2464124 2504264 2608329 3021691 2707037 3129556 3108975 3565269 3016798
3591 3016798 2870382 2883370 3295363 2897171 3410063 4279221 4466375 4947632 4126535 4770233 4505676
3580 4505676 4357084 4352474 4834371 5106034 4508852 5429262 4964769 5477119 6010029 6025099 6121316
3569 6121316 6382684 5703785 6245512 6293977 5700211 6671956 6775255 7179875 6753874 6728367 7522444
3558G522444r0612K74170J169923o35540M54504L43962r638l06366M70870M2155M07052
3547I642924k47476P04504M86614N20180M29340j57691J2374L05730J17934O65522O06049
3536A3086004M9849M77096k92881N34935o16751J116760L06296L13171K60960P90533j431
3525A6024541M33909k25165L88420N157K94553P1077P68097K48484J2980R7202O86728
3514A8805983P0738N48577Q5455L30833J019380j20945J078161n8958R10021J65283k37800
3503B2596728Q22716k49083L46359Q41857k602752L069013N73366J92190K03020P18314
$$ plain form
3558 7522444 7431832 7706002 8875925 8240385 8694889 9038851 9029213 8722847 9193717 9235872 9642924
3547 9642924 9395448 10099952 10586566 11106746 11536086 11378395 11390769 11696499 11814433 12479955 13086004
3536 13086004 13135853 13612949 13320068 13855003 13238252 14355012 14661308 14974479 15235439 16025972 16024541
3525 16024541 16458450 16233285 16621705 16626862 16921415 16992492 17760589 18009073 18022053 18119255 18805983
3514 18805983 18876721 19425298 19510753 19841586 20860966 20740021 21818182 21759224 22669245 22834528 22596728
3503 22596728 23419444 23170361 23516720 24358577 21755825 24824838 25398204 25590394 25793414 26511728
$$ [...]
-2730E70764  $$ checkpoint
##END NTUPLES=
##END=
