##TITLE= S#351052
##JCAMP-DX= 5.00 $$ JEOL NMR v1.10
##DATA TYPE= NMR SPECTRUM
##DATA CLASS= NTUPLES
##NUM DIM= 1
##ORIGIN= DELTA_NMR
##OWNER= organic
##SPECTROMETER/DATA SYSTEM= DELTA_NMR
##.OBSERVE FREQUENCY= 3.00529655924288E+02
##.OBSERVE NUCLEUS= ^1H
##.DELAY= (2.194E+02,2.194E+02)
##.ACQUISITION MODE= SIMULTANEOUS
##.FIELD= 7.0586013
##.FILTER WIDTH= 1.81675738660864
##.ACQUISITION TIME= 3.6339712
##.SPINNING RATE= 14
##.OBSERVE 90= 9.6
##NTUPLES= NMR SPECTRUM
##VAR NAME= FREQUENCY,    SPECTRUM/REAL, SPECTRUM/IMAG, PAGE NUMBER
##SYMBOL=   X,            R,             I,             N
##VAR TYPE= INDEPENDENT,  DEPENDENT,     DEPENDENT,     PAGE
##VAR FORM= AFFN,         ASDF,          ASDF,          AFFN
##VAR DIM=  16384, 16384, 16384, 2
##UNITS= PPM,     ARBITRARY UNITS, ARBITRARY UNITS, 
##FIRST=  1.2501033903057E+01, -3.89180654575889, 1.06608544650761, 1
##LAST=  -2.50011824950436, -4.00180922522699, 1.10062461371971E-01, 2
##FACTOR=  9.1565355261926E-04, 5.87632871094456E-04, 5.87632871094456E-04, 1
##PAGE= N=1
##DATA TABLE=(X++(R..R)), XYDATA
$$ [...]
12292a1690575Q85539m43482k77136j27934Q62667l34265q50052O29210j451315O63269
12282a2134074K95832L62285J11749p71216J155340p0138n11963L06717l86847l42532
12272a1984847L38871N33824j49580j68892K58154P0432J86969j163382N85890n68612
12262a2061173J39637N51940M22545P0933r01453R19942l57847K89890J28595k3287o3255
12251a0883533j326619R04543K72111j675j17076K20706r13907M78660m60926P33582
12241a1094134n67940m8421M27649o24239k25031J179617j60929n36080Q65343K18309
12231a0565856m89379m82088N8215p84895P72530q5921O12570r74188L34591O05566k23516
12220a1222371k15470p8995l9423p8151n5488Q18478p54636n17267J121304p8695k48581
$$ y = [-11690575, -10805036, -11248518, -11525654, -11653588, -10790921, -11125186, -11975238, -11346028, -12797343, -12134074, -11838242, -11475957, -11364208, -12135424, -10980084, -11050222, -11562185, -11255468, -11642315, -11984847, -11645976, -11112152, -11261732, -11430624, -11172470, -11102038, -10915069, -12078451, -11492561, -12061173, -11921536, -11369596, -10947051, -10876118, -11777571, -10857629, -11215476, -10925586, -10796991, -10820278, -10883533, -12210152, -11305609, -11033498, -11035173, -11152249, -10931543, -11845450, -11366790, -11827716, -11094134, -11662074, -11710495, -11282846, -11907085, -12132116, -10952499, -11113428, -11649508, -10784165, -10565856, -11055235, -11537323, -11479108, -12264003, -11491473, -11577394, -10964824, -11939012, -11604421, -10998855, -11222371, -11437841, -11516836, -11556259, -11634410, -11689898, -10871420, -11626056, -12143323, -11022019, -11100714, -11349295]
12209a1349295j345197J017624o69044N65629M57288M30502j301513J680443j208089p0931
12199a1792583l88140J581807n45227j055697P50056M88313k5667M05637L56701m76382
12189a0701182p80706L28737m46583L60724l94580n13057J003394k3091j013027J175602
12179a1003769K54090n28094q00000L75710J25682r88691J979065l48545j381354R54420
12169a1361486k6596l48915k17553O14484n11994J430493o78754j374714J668627n00857
12159a1307265J393387l63466r20814k16882Q65266J007042k755275N5255R29590l44261
12149a1657423m58882K2613M69572j78610L75992l10486p6896K02450k50947J145250r1909
12138a0809276p74346L89657l20089p61428O93787n82281J062908l81616l8403J0968
$$ y = [-11349295, -12694492, -11676868, -12345912, -11780283, -11322995, -10892493, -12194006, -10513563, -11721652, -11792583, -12180723, -10598916, -11144143, -12199840, -11449784, -10961471, -10987138, -10581501, -10224800, -10701182, -11481888, -11153151, -11599734, -11239010, -11633590, -12146647, -11143253, -11166344, -12179371, -11003769, -10749679, -11277773, -12077773, -11702063, -11576381, -12565072, -10586007, -10934552, -12315906, -11361486, -11388082, -11736997, -11954550, -11340066, -11852060, -10421567, -11100321, -12475035, -10806408, -11307265, -9913878, -10277344, -11198158, -11415040, -10549774, -9542732, -12298007, -12242752, -11313162, -11657423, -12116305, -12093692, -11624120, -11802730, -11426738, -11737224, -11814120, -11611670, -11862617, -10717367, -10809276, -11583622, -11193965, -11514054, -12275482, -11581695, -12163976, -11101068, -11482684, -11521087, -11510119]
12128a1510119Q03760m16125r88210j128095J146170Q60532K76637J82631j65226p48174
12118a1686219o68735K38603R79146j89037Q78276p37968k30676R50584p77007q83149
12108a2126182M50413j172343J454765o92995p42297Q14281j09021N08325Q56023l37588
12098a1096619M43388j49165m80168k37818j183766N04453Q48089k94990l08770N16847
12088a1438519j293507J118048m26900n66088M06227Q55280j167874O94667L73645j429045
12078a2874066L124543k105070R96944l93289j10770n97424N5385L18886l51719O00847
12068a1335733P9320M04638m68212q73278M82876P01634p84706M40337m91770j538507
12058a3383401J224599J99234J556530j140001J86545k72697P71436r20576j11048j81633
$$ y = [-11510119, -10706359, -11122484, -12110694, -13238789, -12092619, -11232087, -10955450, -10772819, -10938045, -11686219, -12354954, -12116351, -11137205, -11326242, -10447966, -11185934, -11416610, -10466026, -11243033, -12126182, -11675769, -12848112, -11393347, -12086342, -12828639, -12014358, -12123379, -11615054, -10759031, -11096619, -10653231, -10802396, -11282564, -11520382, -12704148, -12199695, -11351606, -11646596, -11955366, -11438519, -12732026, -11613978, -12040878, -12606966, -12200739, -11345459, -12513333, -11818666, -11445021, -12874066, -9749523, -11854593, -10857649, -11250938, -11361708, -11959132, -11903747, -11584861, -11936580, -11335733, -11256413, -10851775, -11319987, -12193265, -11710389, -11008755, -11793461, -11353124, -11844894, -13383401, -12158802, -11959568, -10403038, -11543039, -11356494, -11629191, -10857755, -11778331, -11889379, -12071012]
12048a2071012M6431L7004J54075R04636m74351N62734j232231L50950P67680o83523
12038a1637607p23548k23485J574603l39237R32421J731122j975626J87198j042453J89459
12028a1327153j9442j092283J013531J78476J07326q8637k66372k89844N48459o83012
12018a1918951R3398N94821q45138J109359N40103p40530J83533Q7741j084646J272560
12008a0707750j186642Q8067P75954N00278o32684R60860k19354J03513r7439p77795
11998a1192992K58166j84494j017066L15479O05431L66620N69220r54336J59186Q9727
11988a0985059J28490k36921R96815p13149J16709R37636j508903n36672O09706k47630
11978a1438978m99722j47442j78886J296998n66262o49596L5158N98982J019223p91901
$$ y = [-12071012, -12024581, -11987577, -11833502, -10928866, -11403217, -10840483, -12072714, -11721764, -10954084, -11637607, -12361155, -12584640, -11010037, -11349274, -10416853, -8685731, -10661357, -10474159, -11516612, -11327153, -11346595, -12438878, -11425347, -11246871, -11139545, -11228182, -11494554, -11784398, -11235939, -11918951, -11825553, -11230732, -12075870, -10966511, -10426408, -11166938, -10983405, -10895664, -11980310, -10707750, -11894392, -11806325, -11030371, -10530093, -11162777, -10201917, -10421271, -10317758, -10415197, -11192992, -10934826, -11119320, -12136386, -11820907, -11215476, -10848856, -10279636, -11233972, -11074786, -10985059, -10856569, -11093490, -10096675, -10809824, -10693115, -9755479, -11264382, -11801054, -11191348, -11438978, -11938700, -12086142, -12265028, -10968030, -11534292, -12183888, -12148730, -11549748, -10530525, -11322426]
11968a1322426N5987j562827R41238J621879o92281q48824J68270m92692Q07600j109615
11958a2433691M9647J72944J127257j398333J306698p35529j96519J1639L54397L31594
11948a1409896k42263M58622q29344K10896l84237R55435o70782J187159q30318j40533
11938a1695261o7240m98893L74115L16586j045263j520080L336096k03109j96350p57890
11928a1957289O21665L5646m60664L30463P6158j311092R98273M15871l48114M23320
11918a1175763o41234L03497j018058R06160n68137J648019l78099j350191K178334p27664
11908a0823136J02414q71649M79819J08557l5360N98070j108233R1069m34402J12132
11898a1780719J48960O09225l70614P933n44655M01818j049627J972777m12424O5277
$$ y = [-11322426, -11266439, -12829266, -11888028, -10266149, -10958430, -11807254, -11638984, -12131676, -11324076, -12433691, -12384044, -12211100, -11083843, -12482176, -11175478, -11911007, -12107526, -12095887, -11741490, -11409896, -11652159, -11193537, -12022881, -11811985, -12196222, -11240787, -11911569, -10724410, -11554728, -11695261, -11762501, -12261394, -11887279, -11570693, -12615956, -14136036, -10799940, -11003049, -11199399, -11957289, -11335624, -11299978, -11760642, -11430179, -11354021, -12665113, -11666840, -11250969, -11599083, -11175763, -11816997, -11513500, -12531558, -11625398, -12193535, -10545516, -10923615, -12273806, -10095472, -10823136, -10720722, -11592371, -11112552, -11003995, -11039355, -10441285, -11549518, -11458449, -11892851, -11780719, -11631759, -11022534, -11393148, -11385215, -11929870, -11528052, -12577679, -10604902, -11017326, -10952049]
11888a0952049j88651K63386n87487q28655K79241K83183Q94992n96537l84224l50902
11878a2167703J078685p9363P68182j797794O34369j50128l10005J278162j102461R09438
11868a0938618j075767R6501M014n9148K025792j450683K27100m0894Q44914j461027
11858a1827816N93088j458450Q23935m95522K37950K29212K74900O75909l97342n50964
11848a1895100M16038j008572P14396N51428n15822L84095J76542M89352l10466j01230
11838a1099339j043285J401593p71047Q0533N09987K99348r3867P1648o88102N06726
11828a0825805J18061r56643j241850P25166J390380r3302K46759m0462K80723l066792
11818a3463765K367813r35450P97530P36321n2259r63064J6065N42302r60992R2951N10091
$$ y = [-10952049, -11140700, -10877314, -11464801, -12293456, -12014215, -11731032, -10836040, -11432577, -11816801, -12167703, -11089018, -11168381, -10400199, -12197993, -11563624, -11713752, -12023757, -10745595, -11848056, -10938618, -12014385, -11917884, -11913870, -11973018, -9947226, -11397909, -11170809, -11211703, -10366789, -11827816, -11234728, -12693178, -11869243, -12364765, -12126815, -11897603, -11622703, -10946794, -11344136, -11895100, -11479062, -12487634, -11773238, -11221810, -11737632, -11353537, -11176995, -10687643, -10998109, -11099339, -12142624, -10741031, -11512078, -11431545, -10921558, -10622210, -10716077, -10644429, -11332531, -10825805, -10707744, -11664387, -12906237, -12181071, -10790691, -10883993, -10637234, -10677696, -10396973, -13463765, -11095952, -12031402, -11233872, -10497551, -10549810, -11512874, -11496809, -10954507, -11915499, -11822548, -11312457]
11807a1312457K84530J79894j036338L61646l39915R56998k34794L52336q34329K93886
11797a1328543r09706P73978J403219n99934j40969q19447j251441J92547m64982J365404
11787a1779874K8002l0217J006795K10646j450277J667930q84220m63333j6783K675977
11777i035354j009870j363344r26110J301831M19869o56898J0139K01924q72054N57320
11767a1372547l51047Q86070J1337l49842P885j45877k47589O73102j453313N52119m0085
11756a1829787J181740q26746n26523K03961J20697M89633j054377R77817j082032O36396
11746a1709221P69311j48398q71776J024121M11353j56846p44470j17650R71112p06060
11736a1278524J71027n14727k23361P85779p66891j44162N31345n79517K60347K18975
$$ y = [-11312457, -11027927, -10848033, -11884371, -11522725, -11862640, -10905642, -11140436, -10788100, -11622429, -11328543, -12238249, -11464271, -10061052, -10660986, -10801955, -11621402, -12872843, -12680296, -13145278, -11779874, -11751872, -11782089, -10775294, -10564648, -12014925, -10346995, -11231215, -11694548, -11711331, -9035354, -10045224, -11408568, -12334678, -11032847, -10612978, -11269876, -11259737, -11057813, -11929867, -11372547, -11723594, -10837524, -10826187, -11176029, -11168144, -11314021, -11561610, -10888508, -12341821, -11789702, -11829787, -10648047, -11474793, -12001316, -11797355, -11676658, -11187025, -12241402, -11263585, -12345617, -11709221, -10939910, -11088308, -11960084, -10935963, -10524610, -10681456, -11425926, -11543576, -10572464, -11278524, -11107497, -11622224, -11845585, -11059806, -11826697, -11970859, -11439514, -12019031, -11758684, -11539709]
11726a1539709M15768o90260k88073J326586k60496m44240J08907J72903j465574n54378
11716a3218566J279131N46157L45221M3198j318088m2151l3884R81349j24373j3862m78766
11705a2034634k81803J37061M49704k65999J00233N94960k12073k15794K55467j02648
11695a1575526N82352p97748p07900J829174j15505n14285q44290k103j337704J979671
11685a1503864K18786J30592J04111n80538m77273L40314n4059L81938l44209l32201
11675a2116403k50602Q90108M24720j020528K80553L64444j089108L36047J904681R6888
11665a0179200K45545k55553o01817j100245O11613k29818K10822l36495n1318O2310O025
11654a1618131K8028J80468M22890r4051j149038M31760k53907k29044J84317K20084
$$ y = [-11539709, -11123941, -11814201, -12102274, -10775688, -11036184, -11480424, -11371517, -11198614, -12664188, -13218566, -11939435, -11393278, -11048057, -11004859, -12322947, -12365098, -12398982, -11417633, -11542006, -11555868, -12034634, -12316437, -12179376, -11729672, -11995671, -11895438, -11300478, -11512551, -11728345, -11472878, -11575526, -10993174, -11790922, -12498822, -10669648, -10785153, -11299438, -12143728, -12145831, -13483535, -11503864, -11285078, -11154486, -11050375, -11630913, -12108186, -11767872, -11821931, -11439993, -11784202, -12116403, -12367005, -11476897, -11052177, -12072705, -11792152, -11427708, -12516816, -12180769, -10276088, -10179200, -9933655, -10189208, -10791025, -11891270, -11279657, -11509475, -11298653, -11635148, -11686466, -11624156, -11618131, -11590103, -11409635, -10986745, -11080796, -12229834, -11798074, -12051981, -12281025, -12096708, -11876624]
11644a1876624M40054Q6295j20482K96093r69421j03685K26882J64155L33292j93368
11634a1716809q81937L2092N57019K11526K52696o08421o03975J448425r74589q71373
11624a3155346l735225R654095j598531j274530k35602o15453J70634j007964N39624
11615a1258298L06263o75749L75196k47779N09621K90112m20703j173358J16016N17464
11605a1661215o82213J723878n81368n35043n28565J951415K89621r13466j14924M96700
11595a0555180j046698O74831o60475J14494M19179j52253L00621m05826N81385q01652
11585a1531574r83416N32801J260632j294927P3747N57169n16542L49789p7176J44984
11575a1484513j028999J114638R51114j235732J088191r96949L69798J45684q72470k17950
$$ y = [-11876624, -11436570, -11350275, -11470757, -11174664, -12144085, -12247770, -12020888, -11856733, -11523441, -11716809, -12598746, -12566654, -12009635, -11798109, -11545413, -12153834, -12757809, -11309384, -12283973, -13155346, -16890571, -7236476, -8835007, -10109537, -10345139, -10960592, -10789958, -11797922, -11258298, -10952035, -11627784, -11252588, -11500367, -10990746, -10700634, -11121337, -12294695, -12178679, -11661215, -12343428, -10619550, -11200918, -11735961, -12264526, -10313111, -10023490, -10936956, -11051880, -10555180, -11601878, -10927047, -11587522, -11473028, -11053849, -11206102, -10905481, -11311307, -10729922, -11531574, -12514990, -11982189, -10721557, -12016484, -11942737, -11385568, -11902110, -11552321, -11629497, -11484513, -12513512, -11398874, -10447760, -11683492, -10595301, -11592250, -11222452, -11076768, -11949238, -12167188]
11565a2167188j64051J670826j80169j346210j583203K963362k45861k63814k1956P91064
11555a0547200r79474N71196Q5748K71772k99432K9612J76079M55470l6313J084505j71571
11544i359608j277422r97640P64699K35792N11165R48465k335719m78515j94634M73184
11534a1710233k53822J274611k23080N6205q67231Q34241k9086P7227N41758j014811
11524a1314221p05753r25641n88572N65798j27880O53035O79876J85075M7074m18438R3890
11513a1855757k56740O17606J03279k30904J40713P22831o35094R03874J31133m08848
11503a0767907p60218N35729l01395R5466L94005o43146n94799K96816K8828j11036j12143
11492a1939800j54090L07248m99167j74412J437101Q8868k43700N5693O8864M05375M22680
$$ y = [-12167188, -12331239, -10660413, -10840582, -12186792, -13769995, -10806633, -11052494, -11316308, -11338264, -10547200, -11526674, -10955478, -10869730, -10597958, -10897390, -10867778, -10691699, -10236229, -10272542, -9188037, -9359608, -10637030, -11634670, -10869971, -10634179, -10123014, -9174549, -11510268, -11988783, -12183417, -11710233, -11964055, -10689444, -10912524, -10856319, -11723550, -10889309, -10918395, -10841168, -10299410, -11314221, -12019974, -12945615, -13534187, -12968389, -13096269, -12443234, -11763358, -11578283, -11531209, -11949647, -11855757, -12112497, -11494891, -11391612, -11622516, -11481803, -10758972, -11394066, -10490192, -10359059, -10767907, -11528125, -10992396, -11293791, -11198325, -10804320, -11447466, -12042265, -11745449, -11716621, -11827657, -11939800, -12093890, -11786642, -12285809, -12460221, -11023120, -10934252, -11177952, -11122259, -11053395, -10648020, -10225340]
11481a0225340p05209m34236j172155J210391m069p80538l62548K01466m03816P81708
11471a1894346O23266m94291l5335O46745L28815p4644k20764j01500k47734l16809J70825
11460a1615772M36312J69702j75R5964m63592l47880P54901k90693Q75630p48818o35456
11449a1769877L09596o45360J04508J63863J74706P98467k14742j4735J13886n44878
11439a1524566Q27471j257213J50023o7327l28559L10371P23707j375557J624776l82612
11429a1299486k40554l03626J76083M21150L5629q43346M58517j310454J059064M03560
11419a1443463L22726K68580k5440p38381R29446q8485J91650q53454l85633k67702
11409a2090156J144304k965q18389j44019L60095J126451p33319q44091j57046J391248
$$ y = [-10225340, -10930549, -11364785, -12536940, -11326549, -11330618, -12111156, -12473704, -12272238, -12676054, -11894346, -11271080, -11765371, -11800706, -11153961, -10825146, -10899790, -11120554, -11222054, -11469788, -11786597, -11615772, -11179460, -11009758, -11009933, -10913969, -11377561, -11725441, -10970540, -11261233, -10385603, -11134421, -11769877, -11460281, -12105641, -12001133, -11837270, -11662564, -10864097, -11078839, -11093574, -10979688, -11524566, -10697095, -11954308, -11804285, -11871612, -12200171, -11889800, -11166093, -12541650, -10916874, -11299486, -11540040, -11843666, -11667583, -11246433, -11210804, -12054150, -11595633, -12906087, -11847023, -11443463, -11120737, -10852157, -10877597, -11615978, -10686532, -10775017, -10583367, -11436821, -11822454, -12090156, -10945852, -10948817, -11767206, -11911225, -11551130, -10424679, -11157998, -12002089, -12159135, -10767887]
11399a0767887j91855q64366l25367J01185Q81773N96757j326257Q71025j460509Q82301
11389a1603200n73500R43962P68619m05226m93874j06172L60541p41893K12727k17802
11379a1855818J266423K23980j290068n30570L2674O562n9494L95360J58995q8843m33798
11368a2174597j23601J63469r51257J662362O52856j2722p11685m19442M27832P43902
11358a0742883j192414J348994l02628j47975M24289k67669j132113K06986o52866j38794
11348a2597073Q94906j46436P95537q79408J94188M84471N56384k49495M60778n34524
11338a1020672q23676j053711K14388R36291J9352M98614j04999o02040P73435k13420
11328a1376438N8660Q56193l77581m83107O88280j188977L16820m31729J359745m01129
$$ y = [-10767887, -10959742, -11824108, -12149475, -12048290, -11166517, -10569760, -11896017, -11024992, -12485501, -11603200, -12176700, -11232738, -10464119, -10869345, -11363219, -11469391, -11108850, -11850743, -11638016, -11855818, -10589395, -10365415, -11655483, -12186053, -12153379, -12146817, -12206311, -11810951, -11651956, -11740799, -12174597, -12298198, -12134729, -13085986, -11423624, -10770768, -10783490, -11495175, -11914617, -11486785, -10742883, -11935297, -10586303, -10888931, -11036906, -10612617, -10880286, -12012399, -11805413, -12458279, -12597073, -11702167, -11848603, -11053066, -11932474, -11738286, -11253815, -10697431, -10946926, -10486148, -11020672, -11844348, -12898059, -12683671, -11747380, -11728028, -11229414, -11334413, -11936453, -11163018, -11376438, -11317778, -10461585, -10839166, -11322273, -10633993, -11822970, -11506150, -11937879, -10578134, -10979263]
11318a0979263k61990m8504L93763Q51788j262569j36231n26170j030323J149318P28532
11308a1121649k16517m66724Q46937J81268m83964M6809l95055j22863l75158P00496m1803
11297a1448223m49619Q2890r06618J127874P09072p65626k59489L93938j11836N35461
11287a1092176N17309j176056O72476o83180L08290L83052r01858J337676Q69158k442098
11277a2207407P27965j80370M372N63491K2116K44655n04767p62859k1939L82661m41632
11266a2173714O18123R24107k985297K187290n94306N6875m69204O79409P05583j928441
11256a2979575Q25426O23974n83049k56420P94081j50584M62029o06566J302190r85030
11246a1553524l10960o30948K57865j03269R72474K27736n27231j48687L68854L16762
$$ y = [-10979263, -11241253, -11289757, -10895994, -10044206, -11306775, -11443006, -11969176, -12999499, -11850181, -11121649, -11338166, -11804890, -10957953, -10776685, -11260649, -11213840, -11608895, -11731758, -12106916, -11406420, -11448223, -11897842, -11814952, -12721570, -11593696, -10884624, -11650250, -11909739, -11515801, -11627637, -11092176, -10574867, -11750923, -11078447, -11761627, -11453337, -11070285, -11972143, -10634467, -9765309, -12207407, -11479442, -11659812, -11655440, -11091949, -11069833, -10825178, -11329945, -12092804, -12114743, -11732082, -12173714, -11555591, -10631484, -13616781, -11429491, -12023797, -11966922, -12436126, -11756717, -11051134, -12979575, -12154149, -11530175, -12113224, -12369644, -11575563, -11726147, -11264118, -11870684, -10568494, -11553524, -11864484, -12495432, -12237567, -12340836, -11368362, -11140626, -11667857, -11816544, -11447690, -11130928]
11236a1130928m34653j88982l9189J41265l69860J684875l76648j92278p6994j1492o24992
11225a1619876l82678R0587R31465q56947R26728N6314r13071k2394o03078o00544J311286
11214a1682208n07398O97052M62528m63100j33513R20053j683877O40464O71166m80744
11204a1559577l85178p53126J414912L89988L2684j777156R60548N2061J6668J54352
11194a1453824L03209p45916O95862m66912J308227n12603p27829K76572j122381O40994
11184a1804601K72303j29948o09904q08710M35428M05291L55759K55113N25885m36589
11174a1539973N87878M79195o28645r19834N07161J229914j402700K33267r18213Q03733
11164a1568217L84559j60919n32957J020160n51192l4509K98574N35209j893947J221655
$$ y = [-11130928, -11565581, -11754563, -11793752, -11652487, -12022347, -10337472, -10714120, -10906398, -10983392, -10994884, -11619876, -12002554, -11911967, -10980502, -11837449, -10910721, -10854407, -11767478, -11789872, -12392950, -12993494, -11682208, -12189606, -11492554, -11030026, -11493126, -11626639, -10706586, -12390463, -11749999, -11078833, -11559577, -11944755, -12697881, -11282969, -10892981, -10860297, -12637453, -11676905, -11624844, -11608176, -11453824, -11150615, -11896531, -11200669, -11667581, -10359354, -10871957, -11599786, -11323214, -12445595, -11804601, -11532298, -11662246, -12272150, -13080860, -12645432, -12240141, -11884382, -11629269, -11103384, -11539973, -10952095, -10472900, -11101545, -12021379, -11514218, -10284304, -11687004, -11453737, -12371950, -11568217, -11183658, -11344577, -11877534, -10857374, -11408566, -11443075, -11144501, -10609292, -12503239, -11281584]
11154a1281584K32558l7855l65530r39345J328714n4798M32171K12090r11160M7925O1982
11143a1274832P03848k131624J823000J029179q78438j521351O25681K6697K33980n78275
11133a1942135m65701J560170j781839J095747j83688O76616N9398o73200N44685l13036
11123a1422983m64768n50873L78629R35533l54913Q28343j769882R27778O24072j564267
11113a2433331J279779n71221K86930N40622J079213l842669J713531L63704l44683p08257
11103a2636382K45006j72317l23817O66037K40988R75490k343721J659410l24167k13196
11093a2226669N86740O45219n76086m5797m36680K61460Q5413o77647J342964K80394
11083a0760689j051180m51096l62401L87114R22700k04444M99250l21881p7001j59526
$$ y = [-11281584, -11049026, -11086881, -11452411, -12391756, -11063042, -11117840, -10685669, -10473579, -11384739, -11336814, -11274832, -10570984, -12702608, -10879608, -9850429, -10728867, -12250218, -11624537, -11597840, -11363860, -11942135, -12407836, -10847666, -12629505, -11533758, -11717446, -11040830, -10981432, -11654632, -11109947, -11422983, -11887751, -12438624, -12059995, -11124462, -11479375, -10651032, -12420914, -11493136, -10869064, -12433331, -11153552, -11724773, -11437843, -10897221, -9818008, -13660677, -11947146, -11583442, -11928125, -12636382, -12391376, -12563693, -12887510, -12221473, -11980485, -11004995, -13348716, -11689306, -12013473, -12226669, -11639929, -10994710, -11570796, -11616593, -12053273, -11791813, -11706400, -12384047, -11041083, -10760689, -11811869, -12262965, -12625366, -12238252, -11315552, -11519996, -11020746, -11342627, -11419628, -11579154]
11073a1579154L44055K125p01183j651333J184458K34180n52390R75657Q38030j75133
11063a1080688l52471k74630O61445o26585K77984k10404J051855o49488q45065o20448
11053a2668495K07507j96391K49797K394123r67974r71509N73159M02596n14465n77571
11043a2069223O39451m13963j15943M10511K66571l87395M03886p90147Q58877K61702
11033a0935673n7862m64052K52513K56910J64173j080128P78392q57858K313727j43723
11023i773581J0812o71141n89433P18527j331244J29556j032275L98903K86489l87744
11013a2241131J314739j637944P41152M58952K24201l87752L57356O6305m08920M84038
11003a1029004j74588p02341J214169j77959p80317m21525N11307j600195L50268J525153
$$ y = [-11579154, -11235099, -11232974, -11934157, -13585490, -12401032, -12166852, -12719242, -11743585, -10905555, -11080688, -11433159, -11707789, -11046344, -11672929, -11394945, -11605349, -10553494, -11202982, -12048047, -12668495, -12460988, -12657379, -12407582, -10013459, -10981433, -11952942, -11379783, -10977187, -11491652, -12069223, -11429772, -11843735, -11959678, -11549167, -11282596, -11669991, -11266105, -12056252, -11197375, -10935673, -10993535, -11457587, -11205074, -10948164, -10783991, -11864119, -11085727, -11943585, -9629858, -9773581, -9762769, -10433910, -11023343, -10304816, -11636060, -11506504, -12538779, -12139876, -11853387, -12241131, -10926392, -12564336, -11823184, -11364232, -11140031, -11527783, -11170427, -11104122, -11513042, -11029004, -11203592, -11905933, -10691764, -10869723, -11650040, -12071565, -11560258, -13160453, -12810185, -11285032]
10993a1285032n62983L82911R7088L62881m84758K92947N82044m12896P4352M74575j14493
10982a0593364K65492j729352k67771K19421M31733j548450J320311R22240r57298n39356
10972a2476394M41812m25412J422393m05869n48003R29731p98648N5718J05071K27902
10962a1471699M05571l0595K28121j50190o19759j55579N79563r60318J254439q45708
10952a1766154P51473n60037j106506J061550K1056P077k29746K80201L35937k19364
10942a1424513K85882Q2601k17969j042291J366417p47639N32051Q0389j7856j022875
10932a2125803J089796m57855L24844Q6220o85613J36002q39360J314404m04130q92239
10922a2453734J152926N78919q56162q3585L00348m67921L04582Q36857M60939j24121
$$ y = [-11285032, -11848015, -11465104, -11368016, -11005135, -11489893, -11196946, -10614902, -11027798, -10953446, -10478871, -10593364, -10327872, -12057224, -12324995, -12105574, -11673841, -13222291, -11901980, -10979740, -11937038, -12476394, -12034582, -12459994, -11037601, -11443470, -11991473, -11061742, -11860390, -11804672, -11699601, -11471699, -11066128, -11096723, -10868602, -11018792, -11638551, -11794130, -11214567, -12174885, -10920446, -11766154, -11014681, -11574718, -12681224, -11619674, -11598618, -11591541, -11821287, -11541086, -11205149, -11424513, -11138631, -11056030, -11273999, -12316290, -10949873, -11697512, -11165461, -11085072, -11102928, -12125803, -11036007, -11493862, -11169018, -11082798, -11768411, -11632409, -12471769, -11157365, -11561495, -12453734, -11300808, -10721889, -11578051, -11661636, -11361288, -11829209, -11524627, -10687770, -10226831, -10350952]
10912a0350952Q1750l875n00802o63070K20589l42616o02832L22731N41562p39568K000671
10901a0036412K17189p32585M11366l34330o31885p9279q26065q81297K367984l035226
10891a3560540P68060J817601k74724l1773o32733Q28489m58335M04497K73261M0746
10881a0825451p09096l07328N55320P35665q24069M41648L95886q08610j605926k77992
10871a3229953J450010l81506K96044m11643J061737l40435J364813k253503r1836N83922
10861a1952350n7795J357034o30735J64710K12581m25865L25186l28053k471Q45654
10851a0492104j238375o66230N83947Q55495J66084j114195m10324J059413m67261L46567
10841a1376983p23956O17707n65938J325366l94972o70890R67472p75335K61852K43866
$$ y = [-10350952, -10269202, -10273077, -10773879, -11436949, -11216360, -11558976, -12161808, -11839077, -11297515, -12037083, -10036412, -9819223, -10551808, -10140442, -10474772, -11106657, -11185936, -12012001, -12893298, -10525314, -13560540, -12792480, -10974879, -11249603, -11281376, -11914109, -11085620, -11543955, -11139458, -10866197, -10825451, -11534547, -11841875, -11286555, -10550890, -11374959, -10933311, -10537425, -11346035, -12951961, -13229953, -11779943, -12161449, -11865405, -12277048, -11215311, -11555746, -10190933, -12444436, -12536272, -11952350, -12010145, -10653111, -11283846, -11119136, -10906555, -11332420, -11007234, -11335287, -11337758, -10492104, -11730479, -12396709, -11812762, -10957267, -10791183, -11905378, -12315702, -11256289, -11723550, -11376983, -12100939, -11483232, -12049170, -10723804, -11118776, -11789666, -10822194, -11597529, -11335677, -11091811]
10831a1091811M79728p28984j59381l81815N32870j5275l14925M7957J54643L45617p40452
10820a1871828J07545k24905J231214r22099J412028o75829q4272l79662l47280J528678
10810a0226410r90678q588m91602o70770J329182P3761o88265Q94715J12768j032417
10800a1698304m02690R22178N1544k76006J060436q94931p74931K20407k63549P6585
10790a1979261J019276J15125r20975K36142p8689Q74254j291709R70304J60681O6289
10780a0828563o69747l38159J27422O7829J28692j78607Q35824l79474l81636r4019n17937
10769a2228375L01480K19375m20277M28446k63766Q43461J10251q59130K25006m74706
10759a2118235k67958j29345N31309O67689j88365M2336L11300m47485o30212K66956
$$ y = [-11091811, -10612083, -11341067, -11500448, -11882263, -11349393, -11364668, -11679593, -11631636, -11476993, -11131376, -11871828, -11764283, -11989188, -10757974, -11680073, -10268045, -10943874, -11028146, -11407808, -11755088, -10226410, -11217088, -11225676, -11717278, -12388048, -11058866, -10985105, -11673370, -10778655, -10665887, -11698304, -12100994, -11178816, -11127272, -11403278, -10342842, -11237773, -12012704, -11792297, -12055846, -11979261, -10959985, -10844860, -11765835, -11529693, -11608382, -10734128, -12025837, -11055533, -10894852, -10828563, -11498310, -11836469, -11709047, -11641218, -11512526, -11691133, -10855309, -11234783, -11616419, -11710438, -12228375, -11926895, -11707520, -12127797, -11699351, -11963117, -11119656, -11009405, -11868535, -11643529, -12118235, -12386193, -12515538, -11984229, -11316540, -11504905, -11462569, -11151269, -11598754, -12228966, -11962010]
10749a1962010j51933J088469m54555Q83526l78365k365320M69615L86390L31741l8643
10739a2191085J131955p68995K92556k21835k35373n26325R57038L46021j225796Q53770
10729a1588069q58152L26757N73979r6526m15201O84826L34813j066458L96012J35079
10719a1572940K66818N1962j092602m75647N2166N97746P08002L52454m23914L59705N3194
10708a1123056m05305M7968o63288Q56761J94856l35912M59454L26963r42863O88153
10698a0896269n52642k72985M86450K10030N5938P17636o97391j34822l88365r386l91425
10687a1873231Q82105l02531R26544j406198K57170k44633j3532N35827L32386o31372
10677a1537465m01235N27360L05742j280022M95187j83290n95077O61468P0575K17340
$$ y = [-11962010, -12113943, -11025474, -11480029, -10596503, -10974868, -13340188, -12870573, -12484183, -12152442, -12191085, -11059130, -11828125, -11535569, -11757404, -11992777, -12519102, -11562064, -11216043, -12441839, -11588069, -12446221, -12119464, -11545485, -11642011, -12057212, -11372386, -11037573, -12104031, -11708019, -11572940, -11306122, -11254160, -12346762, -12822409, -12770243, -12172497, -11464495, -11112041, -11535955, -11176250, -11123056, -11528361, -11480393, -12143681, -11286920, -11092064, -11427976, -10968522, -10641559, -11584422, -10896269, -11448911, -11721896, -11235446, -11025416, -10969478, -10251842, -10949233, -11084055, -11472420, -11481806, -11873231, -10991126, -11293657, -10367113, -11773311, -11516141, -11760774, -11774306, -11238479, -10906093, -11537465, -11938700, -11411340, -11105598, -12385620, -11890433, -12073723, -12668800, -12007332, -11936757, -11719417]
10667a1719417k2613J79528R10030r8580j31100m75316L70317n28187l99405J198825
10657a0715918j29513n11765m27905k76095k50175R68918j58846k065045J324757J110033
10647a1131554j066347M00449M80510k11342P87475p98307Q68625j567313M06588j84721
10637a2015937J002992J075261j589840j667928J243512k52998L82342l01780O53874
10628a1470502q22662m73911j34l35109K082338J30252k25191j441708J015558O43589
10618a0897480n13139m30281J641123j13387p55425L39566m612m00687R4663Q52377q24851
10607a1012133N02121j863077m72184J077832J625787j929802J35142k31306L01792L36581
10597a1529247p23516N73439L57370p76079J369591k64892o81354n79643P54311M3531
$$ y = [-11719417, -11742030, -11562502, -10652472, -10751052, -10882152, -11357468, -10987151, -11515338, -11914743, -10715918, -10845431, -11357196, -11785101, -12061196, -12311371, -11342453, -11501299, -13566344, -12241587, -11131554, -12197901, -11797452, -11316942, -11528284, -10740809, -11539116, -10670491, -12237804, -11831216, -12015937, -11012945, -9937684, -11527524, -13195452, -11951940, -12204938, -11822596, -12124376, -11470502, -12293164, -12767075, -12767209, -13102318, -11019980, -10889728, -11114919, -12556627, -11541069, -10897480, -11410619, -11840900, -10199777, -10313164, -11068589, -10729023, -10733635, -11134322, -11039659, -10187282, -11012133, -10510012, -12373089, -12845273, -11767441, -10141654, -12071456, -11936314, -12167620, -11865828, -11529247, -12252763, -11679324, -11321954, -12098033, -10728442, -10993334, -11674688, -12254331, -11500020, -11456489]
10587a1456489n15306M54175R85318k46453j289409P78266O4543o66618K16812l75425
10577a2050586J68145n7093m6985p25138N50008K77298M30203l03286J066509m99319
10567a1190244l53581N23394j437214J051744L37034R3951q59137l25932Q61351m27994
10557a1726628O87382j295728J111923Q13982o09666o19636j80781m63268J278179k32007
10547a1236248O27715K8347p21228j10333n13833M42957K98908l1195o04470J526466
10537a0292914j258156q02577Q539L79182o37198J209365m73834N09810l93062K96869
10527a1453976N17742j137733m1615M75615O8191J23429n4675J79100l38781L96411k63210
10516a1529502j123664P14182n46653k144531K317702M70372J101434L12395r21145l09041
$$ y = [-11456489, -11971795, -11517620, -10532302, -10778755, -12068164, -11289898, -11225355, -11891973, -11675161, -12050586, -11882441, -11939534, -11986519, -12711657, -12161649, -11884351, -11454148, -11757434, -10690925, -11190244, -11543825, -11020431, -12457645, -11405901, -11068867, -10974916, -11834053, -12159985, -11298634, -11726628, -11039246, -12334974, -11223051, -10409069, -11018735, -11638371, -11819152, -12282420, -11004241, -11236248, -10608533, -10580186, -11301414, -11411747, -11925580, -11482623, -11183715, -11214910, -11819380, -10292914, -11551070, -12353647, -12345108, -11965926, -12603124, -11393759, -11867593, -11357783, -11750845, -11453976, -10936234, -12073967, -12115582, -11639967, -11571776, -11448347, -11503022, -11323922, -11662703, -11266292, -11529502, -12653166, -11938984, -12485637, -14630168, -12312466, -11842094, -10740660, -10428265, -11349410, -11658451]
10506a1658451k01827m27195J488383l12342j092091j448681O11820J609933m07676
10497a1838127J075987o79464o44266J68767K3012j54358K29981O88935n06782J024446
10487a0611869p55967K63435o97620j56322k49072K50387M85821n3037R24228j336242
10477a1936258O2377k98364l79781Q04420Q54169m61535O81150L82088j842505J651900
10467a0482339r47782O28888j60795q08642M09105m47351O11559L34476J99714J18490
10457a0544677K76869j682950J033109p12609K25656J222827l52137r39096j129869J34123
10447a2468754K63375J196802o37373M7138J668791j685765J002112n59819q87031M18631
10437a1641893J113369j331773J8610J148513m50454m90041n48925N91747J104996j779824
$$ y = [-11658451, -11860278, -12287473, -10799090, -11111432, -12203523, -13652204, -13040384, -11430451, -11838127, -10762140, -11441604, -12085870, -11917103, -11894091, -12048449, -11818468, -11129533, -11636315, -10611869, -11367836, -11104401, -11802021, -11958343, -12207415, -11957028, -11471207, -11524244, -10600016, -11936258, -11873881, -12172245, -12552026, -11747606, -10893437, -11354972, -10673822, -10291734, -12134239, -10482339, -11430121, -10801233, -10962028, -11770670, -11361565, -11808916, -11197357, -10862881, -10663167, -10544677, -10267808, -11950758, -10917649, -11630258, -11404602, -10181775, -10533912, -11473008, -12602877, -12468754, -12205379, -11008577, -11645950, -11598812, -9930021, -11615786, -10613674, -11173493, -12060524, -11641893, -10528524, -11860297, -11841687, -10693174, -11143628, -11633669, -12182594, -11590847, -10485851, -12265675]
10427a2265675J202682m69434Q69402j395252p49833R94220J6650L33287N6969n12321
10417a1919305J097482p55150R62994j103868R52598l48160q98612Q56435o61843n2543
10407a1869972M15349M4493J42674l09247j64631j41720o73841K53209K51862J035273
10397a1016551n68642R01354n29590l02436P44344l56008r71771O98502K59018l61490
10387a1503270n3854l69670K16995l45377N32493j032578Q52195q79679j531917L132767
10377a0981895n48301k89760M69007o77840O41838k524P37466l49550J17604Q19305
10367a0064650j012316R3944j175187Q7409J239503j351171l05459N90567Q36831L64895
10357a0695634q51711j234514Q25383J8834j14892R6169R06369l4332n10715J7830M63831
$$ y = [-12265675, -11062993, -11532427, -10663025, -12058277, -12808110, -11813890, -11797240, -11463953, -11406984, -11919305, -10821823, -11576973, -10613979, -11717847, -10765249, -11113409, -12012021, -11155586, -11817429, -11869972, -11454623, -11410130, -11267456, -11576703, -11741334, -11883054, -12556895, -12303686, -12051824, -11016551, -11585193, -10683839, -11213429, -11515865, -10771521, -11127529, -12099300, -11400798, -11141780, -11503270, -11557124, -11926794, -11709799, -12055176, -11522683, -12555261, -11703066, -12582745, -14114662, -10981895, -11530196, -11819956, -11350949, -12028789, -11386951, -11389475, -10652009, -11001559, -10883955, -10064650, -11076966, -10983022, -12158209, -12070800, -10831297, -12182468, -12487927, -11897360, -11060529, -10695634, -11547345, -12781859, -11956476, -11937642, -12052534, -11956365, -11049996, -11084328, -11595043, -11577213, -11113382]
10346a1113382j363728O71059m34331L35531j21801P85508n09175q85523J340743r20868
10336a2215967K58040Q07250M25134j350669O17407n17074j98398o4832P34347l60632
10326a1865394q54112O99995R62453j454141J66677J75329J76383J6710J75921k29093k702
10315a2031974O81023p39826L32958m6453L29850o76930Q5699J884614j626598j888185
10305a3695822J563262J1813J96283L7815J272870p75080J80908P83410q59526l70945
10295a1655012q33606n48423K9663J548030l14749J196525j099119L66776k81081j46259
10285a1737255R83661M1021j314743O66749M87376o30010q81531m1256R12911L26342
10275a1186735P56143n40438r31202p60195J197532q08055M99294J71684L24593p6221
$$ y = [-11113382, -12477110, -11806051, -12240382, -11904851, -12026652, -11241144, -11750319, -12635842, -11295099, -12215967, -11957927, -11150677, -10725543, -12076212, -11458805, -11975879, -12174277, -12239109, -11504762, -11865394, -12719506, -12019511, -11057058, -12511199, -12344522, -12169193, -11992810, -11976100, -11800179, -12029272, -12031974, -11350951, -12090777, -11757819, -11804272, -11474422, -12151352, -12065653, -10181039, -11807637, -13695822, -12132560, -12120747, -11924464, -11886649, -10613779, -11388859, -11207951, -10424541, -11284067, -11655012, -12488618, -13037041, -13007378, -11459348, -11774097, -10577572, -11676691, -11309915, -11590996, -11737255, -10753594, -10712573, -12027316, -11360567, -10873191, -11503201, -12384732, -12425988, -11513077, -11186735, -10430592, -10971030, -11902232, -12662427, -11464895, -12272950, -11773656, -11601972, -11277379, -11353600]
10265a1353600M62200n06489N50344M99835r14472q72585Q23064m56156O73541j322255
10255a2416573P16186K04802J68475o6367m08997M02829m87560J394129j131113l23670
10245a1947859p31326J560772K5715J48896n95702Q13670p69316j047813R27606J87789
10235a1427568l3272j057358M62491k58184R9326J06682Q7087l5906o29831O25725M22899
10224a1637909m20205J175166q67777r5626M27082q91741M04790k64911P54941l27419
10214a1743609L66358K08784p56613M01092P5046K97338j16030J89247p44258l12569
10204a2135214N34987P31733L32577j042923o19094J881534m69716j002946p0539j02227
10194a1961828J10814p48637O85692K687671k287722L98491j66807K42644m87942K86378
$$ y = [-11353600, -10891400, -11397889, -10847545, -10347710, -11262182, -12134767, -11311703, -11767859, -11094318, -12416573, -11700387, -11495585, -11327110, -11393477, -11802474, -11399645, -11887205, -10493076, -11624189, -11947859, -12679185, -11118413, -11092698, -10943802, -11539504, -10725834, -11495150, -12542963, -11615357, -11427568, -11460840, -12518198, -12055707, -12313891, -12214565, -12107883, -12020796, -12056702, -12686533, -12060808, -11637909, -12058114, -10882948, -11750725, -11846351, -11419269, -12311010, -11906220, -12171131, -11416190, -11743609, -11377251, -11168467, -11925080, -11523988, -11448942, -11151604, -11267634, -11078387, -11822645, -12135214, -11600227, -10868494, -10535917, -11578840, -12197934, -10316400, -10786116, -11789062, -11859601, -11961828, -11851014, -12599651, -11913959, -9226288, -11514010, -11115519, -11282326, -11039682, -11527624, -11241246]
10184a1241246q40227n35347R41831Q5904o63091P63733k801m84937l07859O08898o16699
10173a2291841l37625N39381Q45293j169114O642L76360q09680N8188K774535j683333
10163a1691194p01578Q0899Q0192Q42162j70195k91129j28206m81070J067537j16967
10153a1509549o05035m9173o39979J784431N41121o32372r76935m21953Q09590m65305
10143a2165159k85933J395020o18099n27841n53161J988621j233496O18905m43122M64757
10133a1359508p44546P99364k83884p97299R12718l02251o85779J872672q41785J56736
10123a1273562q57607M15547N95586n08302k73819O79835m30904o437K60075m85897p5347
10112a1960832k12325j207986R69400K65926R71468o23928p75191O46608p99131L98189
$$ y = [-11241246, -12081473, -12616820, -11674989, -11589085, -12252176, -11488443, -11491244, -11976181, -12284040, -11675142, -12291841, -12629466, -12090085, -11244792, -12413906, -12407264, -12030904, -12840584, -12782396, -10007861, -11691194, -12392772, -12311873, -12231681, -11389519, -11559714, -11850843, -11979049, -12460119, -11392582, -11509549, -12114584, -12163757, -12803736, -11019305, -10478184, -11110556, -12087491, -12509444, -11699854, -12165159, -12451092, -11056072, -11674171, -12202012, -12755173, -10766552, -12000048, -11381143, -11824265, -11359508, -12104054, -11304690, -11588574, -12385873, -11473155, -11775406, -12461185, -10588513, -11430298, -11273562, -12131169, -11715622, -11120036, -11628338, -11902157, -11222322, -11653226, -11659663, -11399588, -11885485, -11960832, -12173157, -13381143, -12411743, -12145817, -11174349, -11798277, -12573468, -11926860, -12725991, -12327802]
10102a2327802R20320q60137L82939k45726l81552N80053n87009o4670K67322P13511
10092a1602751J34095L80929p63085n30578J341060n47737N45737M43383r05781j04769
10082a1609497j15500o07506l00810m48773K531234N1786j234698p99435Q72345l32739
10072a1993593j94985K69311R80697L0441j43623P47449o88082j393721J70932J322345
10062a0892829p7354j158695l35599L16951L38944N73976q81679o62863N847933k458484
10052i389699o66100k004556N9657N69845n87465m63715K68655M37370Q9487j332744
10042a3019265J198899P47941k65292k89038M18516j529615L77760Q35379P02065j594724
10032a2417374J098673M35621o79410L84137K25944m50621J391238m00602r87480N30833
$$ y = [-12327802, -11407482, -12267619, -11884680, -12130406, -12511958, -11931905, -12518914, -12583584, -12316262, -11602751, -11468656, -11087727, -11850812, -12381390, -11040330, -11588067, -11042330, -10598947, -11504728, -11609497, -11724997, -12332503, -12633313, -13082086, -10550852, -10499066, -11733764, -12533199, -11660854, -11993593, -12188578, -11919267, -10938570, -10908129, -11051752, -10304303, -10992385, -12386106, -12215174, -10892829, -10970183, -12128878, -12464477, -12147526, -11808582, -11234606, -12116285, -12779148, -6931215, -9389699, -10055799, -12060355, -12000698, -11430853, -12018318, -12482033, -12213378, -11776008, -11686521, -13019265, -11820366, -11072425, -11337717, -11626755, -11208239, -12737854, -12360094, -11524715, -10822650, -12417374, -11318701, -10883080, -11562490, -11178353, -10952409, -11403030, -10011792, -10412394, -11399874, -10869041]
10022a0869041o02451m27212M76889J62903j49315M1897o84254q7489l92048o1698J103902
10011a1487917l93684m47144n67677n21041N71516R99819P09400L82752k095679J250637
10001a1599018o98337N70731L0940L5765L2544j03783L8244J61861M25825j151776m08714
9990a2665718Q12864j085115Q05195N75335j38035J12795k96223P17658o41084l66739
9980a2169067q67702P27865m66759J534969l85833R10652j94965r65783L58585k92967
9970a1811005K8127M25421L8941j549316P84883J138885j260435K22457N32187L44718
9960a1105137m17080j17475k37615l52797n29903P1953N49274N27868q30009K20615J97975
9949a2022331k13505J070676j378400N12194L94192j868159j844493L502872Q85869j75856
$$ y = [-10869041, -11471492, -11898704, -11421815, -11258912, -11408227, -11366330, -12050584, -12138073, -12530121, -12591819, -11487917, -11881601, -12328745, -12896422, -13417463, -12845947, -11846128, -11136728, -10753976, -12849655, -11599018, -12297355, -11726624, -11695684, -11659919, -11627375, -11731158, -11692914, -11531053, -11105228, -12257004, -12665718, -11852854, -12937969, -12132774, -11557439, -11695474, -11582679, -11878902, -11161244, -11802328, -12169067, -13036769, -12308904, -12775663, -11240694, -11626527, -10715875, -10910840, -11876623, -11518038, -11811005, -11782878, -11357457, -11318516, -12867832, -12082949, -10944064, -12204499, -11982042, -11449855, -11105137, -11522217, -11639692, -11877307, -12230104, -12760007, -12688054, -12138780, -11610912, -12440921, -12220306, -12022331, -12235836, -11165160, -12543560, -12031366, -11637174, -13505333, -15349826, -11846954, -10961085, -11136941]
9939a1136941n84027l40801L12211r3677N99949n31234p0496J05077P18539J87850k14395
9928a1047945n42002O84060n52909j77490j10130J70822K67490J47392Q71257o97068j6689
9917a1003212o27627j73128q86011J105320k53912O52459j077171K289000r09115j183147
9907a2066544J59409l06415O81197n12866j24700J88997n69368L04755J08435M60327
9897a1676773j58318K72377J127946o60992k59447m63084P19240j086539k04252m20770
9887a2810612J881069m70879P17386K54856k05337q76955k60042k6879M26808r13239
9877a2283824R14844L84488n09558N45749j108796q8555o1379J073178k14348k98099
9867a1646300k44606K63788m25809k84310m67141j177534K014678J409032r23032j360519
$$ y = [-11136941, -11720968, -12061769, -11749558, -11843235, -11243286, -11774520, -11845016, -11739939, -11021400, -10833550, -11047945, -11589947, -10905887, -11458796, -11636286, -11746416, -11575594, -11308104, -11160712, -10289455, -10986523, -11003212, -11630839, -11803967, -12689978, -11584658, -11838570, -11186111, -12263282, -9974282, -10883397, -12066544, -11907135, -12213550, -11532353, -12045219, -12169919, -11980922, -12550290, -12245535, -12137100, -11676773, -11835091, -11562714, -10434768, -11095760, -11355207, -11818291, -11099051, -12185590, -12389842, -12810612, -10929543, -11400422, -10683036, -10428180, -10633517, -11510472, -11770514, -11797393, -11370585, -12283824, -11368980, -10984492, -11494050, -10948301, -12057097, -12145652, -12207031, -11133853, -11348201, -11646300, -11890906, -11627118, -12052927, -12337237, -12804378, -13981912, -11967234, -10558202, -11481234, -12841753]
9857a2841753J54650J426240j88903j05p15752P49538K84060r4934p38165N30594j750953
9846a3185483l44083J459689R51953j735020N77619K79735N5067l43934m46931o7552
9836a2798940q98122P31432K422317j658857j64670J692481k44865r45579P67071l78189
9826a1475921n97138r9655R68918M35663j154387j69996M33686P72329j039442R9316
9816a1826627n47179R93604n88518Q5269J017053q89689j71471o62213J750922N08576
9806a0330273P6726p72322j292074j09874M68007Q48470K52605j319809M43817j994975
9796a3729702J291712R27833M46340q06038P42650P92526L00377o37242j296134J123234
9786a0844444q23605j094m24951m83109P15988R08287q03445L82086m63947K69993p42066
$$ y = [-12841753, -12687103, -11260863, -11449766, -11449871, -12165623, -11416085, -11132025, -11226959, -11965124, -11434530, -13185483, -13529566, -12069877, -11117924, -12852944, -12275325, -11995590, -11940523, -12284457, -12731388, -12798940, -13697062, -12965630, -10543313, -12202170, -12366840, -10674359, -10919224, -11864803, -11097732, -11475921, -12073059, -12172714, -11203796, -10768133, -11922520, -12092516, -11658830, -10886501, -11925943, -11826627, -12373806, -11380202, -11968720, -11883451, -10866398, -11756087, -11927558, -12589771, -10838849, -10330273, -10253547, -11025869, -12317943, -12427817, -11959810, -11111340, -10858735, -12178544, -11734727, -13729702, -12437990, -11510157, -11063817, -11869855, -11127205, -10334679, -10034302, -10671544, -11967678, -10844444, -11668049, -11669143, -12094094, -12577203, -11861215, -10952928, -11756373, -11374287, -11838234, -11568241, -12310307]
9775a2310307M70743K23958p07898J62803P82391o82011r4911O96434k44806p20747L9314
9764a2385037J280579j721928O9167J18845o85480R32020J116301k67654k90642K35933
9754a1597896L59471q88669O96341O45389j782173O25348J394380n99776r23582j88293
9744a2259460N22335l54464Q3987J437r3135J91029N72681N63029n67154j2929j45725
9733a1498369J3579N13094O72278q87087m55834n08431Q56807N78961n32617N92359
9723a0655260k054442J059271j04335p44359N35633L01129K65435k68121j168395o5567
9713a2899011N25390L78433k51492j26232Q93301J34791m2877m89455o67109P93218N21272
9702a1229771k2241j139995K90191O76593P9161l2727N20609j58148j024664q6374L30177
$$ y = [-12310307, -11839564, -11615606, -12323504, -12160701, -11378310, -12060321, -12155232, -11458798, -11703604, -12424351, -12385037, -11104458, -12826386, -12757219, -12638374, -13323854, -12391834, -11275533, -11543187, -11833829, -11597896, -11238425, -12127094, -11430753, -10785364, -12567537, -11942189, -10547809, -11147585, -12071167, -12259460, -11737125, -12091589, -12007602, -12006165, -12099300, -11908271, -11335590, -10772561, -11339715, -11352644, -11498369, -11484790, -10971696, -10299418, -11186505, -11642339, -12150770, -11293963, -10715002, -11247619, -10655260, -12709702, -11650431, -11754766, -12499125, -11963492, -11662363, -11396928, -11665049, -12833444, -12899011, -12373621, -11995188, -12246680, -12372912, -11479611, -11344820, -11387697, -11877152, -12544261, -11751043, -11229771, -11252012, -12392007, -12101816, -11425223, -11346062, -11378789, -10858180, -11016328, -12040992, -12127366, -11797189]
9691a1797189k10682J44324K33870O28136Q67199o27601j184089O46680p19701M88883
9681a1530170j82175M91870n30512J242738j237094J90510O73813m17585L4649R54547
9671a0309409q25157J367417k861033o0086J187186l82498p12960Q28388J58874O43248
9661a0966030r79868L52938J77380l32598n82608K39817l55945k65849L14945j779676
9651a4177494J342134J11220O54158M24911J00055n11714p41247L81057k4258l55996
9641a2797174P40307m12878J932965o42205m24637j485544K25369M30999L07307J694999
9631a0430492j844925J279659l59365l59555p38787P34287N20565Q24311j09816j465037
9621a1949155q41302Q79154l35242j188352n28389L268637o44196j120445J25Q06173
$$ y = [-11797189, -12007871, -11863547, -11629677, -11001541, -10134342, -10761943, -11946032, -11299352, -12019053, -11530170, -11712345, -11220475, -11750987, -10508249, -11745343, -11554833, -10881020, -11298605, -11263956, -10309409, -11134566, -9767149, -12628182, -12688268, -11501082, -11883580, -12596540, -11768152, -11609278, -10966030, -11945898, -11592960, -11415580, -11748178, -12330786, -12090969, -12446914, -12712763, -12397818, -14177494, -12835360, -12724140, -12069982, -11645071, -11545016, -12056730, -12797977, -12416920, -12441178, -12797174, -12056867, -12469745, -10536780, -11178985, -11603622, -13089166, -12863797, -12432798, -12125491, -10430492, -12275417, -10995758, -11355123, -11714678, -12453465, -11719178, -11198613, -10374302, -10484118, -11949155, -12790457, -11911303, -12246545, -13434897, -13963286, -10694649, -11338845, -12459290, -12459165, -11652992]
9611a1652992J09064R5812l91163l67144M57174l3353R31105j513002K18818Q18578n11007
9600a1838110q50150K98067M32010R4555r34489J073421M26151o00085J09379K19421
9590a1569830j027797R76028p37619J021660K95565p20527J080758j85968l93271j1584
9580a1272585K31809J980192j886997j165265k34860L03369l31476N97865k4100j49674
9570a1951722p99530P90676o6738l79951n54835j533640K052213m91190J685906K542661
9560h706150j513506n28961l66122l99674n29961j9627k56593j36043N87653J39316o71169
9549a2400837Q66690L5394l24764Q59498q31297K43009j06063K88772j413603P22895
9539a2060306K46340m69554P7425j93960Q76375l54811m36927o8124l60915N95782L13584
$$ y = [-11652992, -11543928, -11448116, -11839279, -12206423, -11749249, -11782602, -10851497, -12364499, -12145681, -11327103, -11838110, -12688260, -12390193, -11958183, -11863628, -12798117, -11724696, -11298545, -11898630, -11789251, -11569830, -12597627, -11621599, -12359218, -11337558, -11041993, -11762520, -10681762, -10867730, -11261001, -11272585, -11040776, -9060584, -10947581, -12112846, -12347706, -12044337, -12375813, -11777948, -11802048, -11951722, -12751252, -11960576, -12027314, -12407265, -12962100, -14495740, -12443527, -12934717, -11248811, -8706150, -10219656, -10748617, -11114739, -11514413, -12044374, -12064001, -12320594, -12456637, -11868984, -11729668, -12400837, -11534147, -11498753, -11823517, -10964019, -11795316, -11552307, -11658370, -11369598, -12783201, -12060306, -11813966, -12283520, -12206095, -12400055, -11523680, -11878491, -12315418, -12383542, -12744457, -12148675, -11835091]
9528a1835091n40066l98995J04705J80638J73864k23055p51993M35301J130618n72692
9518a2296766M28556J079330o43104k16987j020293J000773p96551j188287J291335J11198
9508a2250796j37299L88729L08186j78843p41486J93553J0998N54314K9564o7734M19065
9497a1471749P06990p92433l06262p00456m85107J140468R1369l47802M4695K83099n04070
9486a2341258M19965p39208r20051J064944L82173l59998K9568j19898j07424m38021
9476a3129208J308064o66230L73767l90324N51705j326899j245423J167316J055683J56338
9466a2145211j69226K75104M90713K42704j677998N79475K22614M3848O24843r70417
9456a2483551K60309m86547J33132K00727l59379L44494Q7410l98031N4755q3840O61731
$$ y = [-11835091, -12375157, -12774152, -12669447, -12488809, -12314945, -12538000, -13289993, -12854692, -11724074, -12296766, -11868210, -10788880, -11431984, -11648971, -12669264, -11668491, -12465042, -13653329, -12361994, -12250796, -12388095, -11999366, -11691180, -11870023, -12611509, -12417956, -12406958, -11852644, -11823080, -11890814, -11471749, -10764759, -11557192, -11863454, -12563910, -13049017, -11908549, -11817180, -12164982, -12120287, -11837188, -12341258, -11921293, -12660501, -13580552, -12515608, -12133435, -12493433, -12463865, -12583763, -12691187, -13129208, -11821144, -12487374, -12113607, -12503931, -11952226, -13279125, -14524548, -13357232, -12301549, -12145211, -12314437, -12039333, -11548620, -11305916, -12983914, -12404439, -12181825, -12137977, -11513134, -12483551, -12223242, -12709789, -12576657, -12375930, -12735309, -12390815, -12303405, -12701436, -12646681, -12730521, -12068790]
9445a2068790K25085r1541n54178j223661J108543J40250r87708R88114J18322m20646n627
9434a2771837J341261p37661J46725J24844j004373P17280l4540n87644j21596N76498
9424a2351043m82796K24343K39046m52397M99071l2829l35770j062797K539307m84812
9414a1700677J1443P68923K36841n99218j721675J306330l03r4851j050121J092448
9404a1750860j363436M93456J01131J418604o98074p50007Q87471j143728L10769P90258
9394a1704416m81849r26772P79462M73995l49116J492631j205795j77125N84142P39301
9384a0775542n34170r00712K14539j066083Q6480K338621o14218p14692p06607m55410
9374a3127794l6052P50790j04139m36555J345168L37629k81409j007852m98897p05960
$$ y = [-12068790, -11843705, -11935246, -12489424, -13713085, -12604542, -12464292, -13452000, -12463886, -12345564, -12766210, -12771837, -11430576, -12168237, -12021512, -11896668, -12901041, -12183761, -12218301, -12805945, -12927541, -12351043, -12833839, -12609496, -12370450, -12822847, -12323776, -12356605, -12692375, -13755172, -11215865, -11700677, -11689234, -10920311, -10683470, -11282688, -13004363, -11698033, -11698336, -11793187, -12843308, -11750860, -13114296, -12620840, -12519709, -11101105, -11799179, -12549186, -11661715, -12805443, -12494674, -11704416, -12186265, -13113037, -12333575, -11859580, -12208696, -10716065, -11921860, -12098985, -11514843, -10775542, -11309712, -12210424, -11995885, -13061968, -12975488, -10636867, -11251085, -11965777, -12672384, -13127794, -13163846, -12413056, -12517195, -12953750, -11608582, -11270953, -11552362, -12560214, -13059111, -13765071]
9364a3765071J666445l53944K13852j091805J287216n15235n0401M075M16221M93134
9354a1695513p30890l49951P19365j422094J40845k70797k24796N97143M8734j45922
9344a3333876M61714m13680k05043j31243M53926M6504J169716n31990R18864q0825p79640
9333a2425573J114504n40173j061277k19307L2612M90704l45302P44562n64035n34831
9323a3308116K9445J53910j154699R40962J474798M95544j125922N69174N57557j276649
9313a2643996j46754M24573j8355k35603N69433n63889P56973p74414L55326K26372M86874
9302a1563460l88676j36782N7778L94827p79384J15946M05028j329860P7950M71981M26560
9291a2248092l09116j24091J199666j052083r3663l66236L3417N116J541320o20919
$$ y = [-13765071, -12098626, -12452570, -12238718, -13330523, -12043307, -12558542, -12608943, -12604868, -12188647, -11695513, -12426403, -12776354, -12056989, -13479083, -13338238, -13609035, -13833831, -13236688, -13187954, -13333876, -12872162, -13285842, -13490885, -13622128, -13168202, -13121698, -11951982, -12483972, -11565108, -11645933, -12425573, -11311069, -11851242, -12912519, -13131826, -13099214, -12608510, -12953812, -12209250, -12773285, -13308116, -13278671, -13124761, -14279460, -13338498, -11863700, -11368156, -12494078, -11924904, -11367347, -12643996, -12790750, -12366177, -12384532, -12620135, -12050702, -12614591, -11857618, -12632032, -12276706, -12050334, -11563460, -11952136, -12088918, -12031140, -11636313, -12415697, -12299751, -11894723, -13224583, -13146633, -12674652, -12248092, -12557208, -12681299, -11481633, -12533716, -12627379, -12993615, -12960198, -12955082, -11413762, -12034681]
9281a2034681j021341L62456k38732K40206K60426j11788k82382L61046j047973K9893
9271a3482870R71050J91137r14265Q54902M28318l20561n18354J232019j63375k76061K407
9260a1995653k81518l57239l67810k23745l07312P23215N18466M43417m59417l52331
9250a2659927k53522J03753J778784j592074m61147M75336k28903O97309k3458l0942
9240a2194791J242282j378030l13889N23566k07406n24232Q49268j91387K50641k00899
9230a2144877r9293l08801M70959M01305J68695n79657m60524L24715o02326L66028M5116
9219a2418660K86542l52141k71696P55949k02360P20900j418718j21924R95110M8936
9209a1978062p72389L234146k512360j64692K81720q56888l79565Q44725J64203l9840
$$ y = [-12034681, -13056022, -12693566, -12932298, -12692092, -12431666, -12543454, -12825836, -12464790, -13512763, -13482870, -12511820, -12320683, -13234948, -12380046, -11951728, -12272289, -12790643, -11558624, -11721999, -11998060, -11995653, -12277171, -12634410, -13002220, -13225965, -13533277, -12810062, -12291596, -11848179, -12307596, -12659927, -12913449, -12809696, -11030912, -12622986, -13084133, -12608797, -12837700, -12140391, -12163849, -12194791, -10952509, -12330539, -12644428, -12120862, -12328268, -12852500, -12003232, -12194619, -11943978, -12144877, -12244170, -12552971, -12082012, -11680707, -11512012, -12091669, -12552193, -12227478, -12829804, -12463776, -12418660, -12132118, -12484259, -12755955, -12000006, -12202366, -11481466, -12900184, -13022108, -12026998, -11978062, -12750451, -9516305, -12028665, -12193357, -11911637, -12768525, -13148090, -12303365, -12139162, -12179002]
9199a2179002j26796J887962j772000k46407R90988j87049j15770n94075n06642J072193
9189a1776598j055090J21772K66677P9487R4889j1434J142835n04777j61686l5466p37736
9178a2577127m32355J081095k24146o08136p7260L5166J04078P85482n66196Q93806k34184
9167a1819777r89715J005800L33624M41252l89035J164731l806041M21049N63202n33793
9157a3608703J293589j004911j5134Q39082J45055j63413l10164n04450l86193P05254
9147a3009988N68518Q61190j428983O78802R31814j268898J714720k98093q03996r10199
9137a2965113k9688J650175m76461l81238n20269Q29526o76260R34619n05017o14961P9322
9126a2675365l99622J59955N72676j6805j067374P04628m34267K00673J042707Q36271
$$ y = [-12179002, -12305798, -10417836, -12189836, -12436243, -11445255, -11632304, -11748074, -12342149, -12848791, -11776598, -12831688, -12709916, -12443239, -12363752, -12268863, -12280297, -11137462, -11642239, -11803925, -11839391, -12577127, -13009482, -11928387, -12152533, -12760669, -12837929, -12802763, -12698685, -11913203, -12479399, -11585593, -11819777, -12809492, -11803692, -11470068, -11028816, -11417851, -10253120, -14059161, -13638112, -13074910, -13608703, -12315114, -13320025, -13335159, -12496077, -12351022, -12514435, -12824599, -13329049, -13715242, -13009988, -12441470, -11580280, -13009263, -12330461, -11398647, -12667545, -10952825, -11250918, -12054914, -12965113, -12994801, -11344626, -11821087, -12202325, -12722594, -11893068, -12569328, -11634709, -12139726, -12754687, -12675365, -13074987, -12915032, -12342356, -12359161, -13426535, -12721907, -13156174, -12955501, -11912794, -11076523]
9116a1076523j706859j73762n6598k42324K8079Q94508j11035r56768O2510M55161J510103
9105a1373508j523090j36419k88370K20876M64340p22155M09824N64141l62523M09653
9095a2337231j67794J81893L09188o98716m15713J174929j13185n11563l34915j76305
9085a3089412M18288m64603l89762j66334M94523J064222J5561j05562q21326N09151
9075a2535254K95002k033r80894O30741n65015M20928M20693J589065L18782j876355
9065a2284340J27600n40312k82302m2645r00826R96072n65040K86304P93370O72741k57455
9054a1996833k80113m39762J34014O48828k87360L12540j143413j162640J411674N56855
9044a2246210n94243o3978r62516M64768o36973L49150P65904M78594j033289O15396
$$ y = [-11076523, -12783382, -12957144, -13013742, -13256066, -13227987, -12333479, -12444514, -13401282, -13338772, -12883611, -11373508, -12896598, -13033017, -13321387, -13100511, -12636171, -13358326, -12948502, -12384361, -12746884, -12337231, -12505025, -12323132, -12013944, -12712660, -13128373, -11953444, -12066629, -12578192, -12913107, -13089412, -12671124, -13135727, -13525489, -13691823, -13197300, -12133078, -12117517, -12223079, -13044405, -12535254, -12240252, -12242285, -13223179, -12592438, -13157453, -12736525, -12315832, -10726767, -10407985, -12284340, -12156740, -12697052, -12979354, -13021999, -13922825, -12926753, -13491793, -13205489, -12412119, -11739378, -11996833, -12276946, -12716708, -12582694, -11933866, -12221226, -11908686, -13052099, -14214739, -12803065, -12246210, -12840453, -12904431, -13866947, -13402179, -14039152, -13690002, -12924098, -12445504, -13478793, -12863397]
9034a2863397L88815p9716J05932k93698M034j25725l11433M36318J239614j711824L81985
9023a2829095R5326o11082M97145j6775O53647q38125j35039M73967o45732M48204J063557
9012a1844002l11898j168425J033814M89676p45992Q6866L31398p28318J22915O01844
9002a2132122n12246L64579j41579k40392j643017Q60338N29091m11085J535294j116797
8992a2907936J26376N14995K08824l71969J42433K49384j535135N79770J265780j28344
8982a1855822o55854j98266O24512j090476N96434J144541m74538K0285K00367j162171
8972a2850988N24553N1964k55056L15862l78202R99823j172872J30220M67294M5308J24540
8961a1997554j054421J090059p14627J08631k75322J21638j09729n00289P36386N74000
$$ y = [-12863397, -12474582, -12554298, -12448366, -12742064, -12738030, -12863755, -13175188, -12738870, -11499256, -13211080, -12829095, -12733769, -13344851, -12847706, -12864481, -12210834, -13048959, -13183998, -12710031, -13355763, -12907559, -11844002, -12155900, -13324325, -12290511, -11800835, -12546827, -12459961, -12128563, -12856881, -12733966, -12132122, -12644368, -12279789, -12421368, -12661760, -14304777, -13444439, -12915348, -13326433, -11791139, -12907936, -12781560, -12266565, -12057741, -12429710, -12287277, -12037893, -13573028, -12993258, -11727478, -11855822, -12511676, -12709942, -12085430, -13175906, -12579472, -11434931, -11909469, -11889184, -11688817, -12850988, -12326435, -12274471, -12529527, -12213665, -12591867, -11592044, -12764916, -12634696, -12167402, -12122094, -11997554, -13051975, -11961916, -12676543, -12567912, -12843234, -12721596, -12831325, -13331614, -12595228, -12021228]
8951a2021228m40682O51611J90516L42767j648972P0272k28140k24747k0432L94210k57515
8940a3192340K92762N66768n64538K78907j80274m86861J33824j66766l61323K219611
8930a1460230k46646K26350j383784J16176j73667j55917O20144o20440k85588J73500
8920a3190102Q39397j49774O03027p61102m24262j8510J83113j42626n22226n095R82191
8909a2605969j125723P34434p78967K69208J66427K91846j5224l31568J074385L08302
8899a2012849o58263j234160O72434M9290j70941M60229J88271p59283M40134P86990
8889a2238148n33310J020441p90982m06628P12355j08714M2774l36017k48508j174203
8879a4060940J163917j19826J79524j82553j065267O62511m96824L91387M76498J030626
$$ y = [-12021228, -12461910, -11810299, -11619783, -11277016, -12925988, -12855716, -13083856, -13308603, -13329035, -12934825, -13192340, -12899578, -12332810, -12897348, -12618441, -12798715, -13285576, -13151752, -13318518, -13679841, -11460230, -11706876, -11480526, -12864310, -12748134, -12921801, -13077718, -12457574, -13078014, -13363602, -13190102, -12350705, -12500479, -11897452, -12658554, -13082816, -13101326, -12918213, -13060839, -13583065, -13588160, -12605969, -13731692, -12997258, -13776225, -13507017, -13340590, -13048744, -13063968, -13395536, -12321151, -12012849, -12671112, -13905272, -13232838, -13183548, -13354489, -12894260, -12705989, -13465272, -13025138, -12238148, -12771458, -11751017, -12541999, -12948627, -12236272, -12344986, -12302212, -12638229, -12886737, -14060940, -12897023, -13016849, -12837325, -13019878, -14085145, -13422634, -13919458, -13528071, -13051573, -12020947]
8869a2020947o28728K30417p41150r58051P14624n56950J413095n17495j65031J75184
8859a3055032j40028q3864N22981p34364l1484J023431J81105j014653o0150J01344k24228
8848a3514942J250631j733254J060963o37772M56147r2572j31602J08206K66298n89567
8838a3557464J49065r0305m7243Q94594m18758K85447l53730K24238j009887j10101Q57402
8827a3176742k11907K65161l63612m89072k50185Q46806J09178J357021o83806N25736
8817a2071422k45129j508959j16247O52798M67150m48536l44150M34556K89917K01665
8807a2688357k71116J45086M50387l21909j098543K3024R30313m5931q21157Q08920m20798
8796a3310081k31388j67675O28502n50562K95703R13012j019051J06409K95319o01814
$$ y = [-12020947, -12649675, -12419258, -13160408, -14118459, -13403835, -13960785, -12547690, -13065185, -13230216, -13055032, -13195060, -13278924, -12755943, -13490307, -13521791, -12498360, -12317255, -13331908, -13392058, -13290714, -13514942, -12264311, -13997565, -12936602, -13574374, -13118227, -13210799, -13342401, -13234195, -12967897, -13557464, -13408399, -13498704, -13545947, -12651353, -13070111, -12784664, -13138394, -12914156, -13924043, -14034144, -13176742, -13388649, -13123488, -13487100, -13976172, -14226357, -13379551, -13270373, -11913352, -12597158, -12071422, -12316551, -13825510, -13941757, -13288959, -12821809, -13270345, -13614495, -13179939, -12890022, -12688357, -12959473, -12814387, -12364000, -12685909, -13784452, -13761428, -12831115, -12877046, -13698203, -12889283, -13310081, -13541469, -13709144, -13080642, -13631204, -13335501, -12422489, -13441540, -13335131, -13039812, -13641626]
8786a3641626k11121M84103Q51580l41394n04583p62483j38593m59907Q26196L56054
8776a3541774K37321L2874l75484K09278m70493J726328n71376m751j275159k34894Q55291
8765a3412839k918K60769o7971M08118m99823J81221l92778j50524O56797m27194j073288
8754a4520430J335640n01223n21320J242406J33467l79034M22135j663051J395982r01019
8744a3956447J649030j214796K58011o28159J249054J78289n86912l33138M62682L98070
8734a2524316j304311J631702k038027K01293J362069j099114M93928N73493o48784N24793
8724a2827274n58379L64299N32331k64397M5477l34210j71647R61655j103324L76504
8714a2978965p77987P14268q2229k39231Q7759P8314O9606l6242M2295J09014j74876
$$ y = [-13641626, -13852747, -13368644, -12517064, -12858458, -13363041, -14125524, -14264117, -14724024, -13897828, -13541774, -13304453, -13271579, -13647063, -13437785, -13908278, -12181950, -12753326, -12758077, -14033236, -14268130, -13412839, -13415757, -13154988, -13222959, -12814841, -13314664, -13133443, -13526221, -13676745, -13019948, -13447142, -14520430, -13184790, -13686013, -14207333, -12964927, -12831460, -13210494, -12788359, -14451410, -13055428, -13956447, -12307417, -13522213, -13264202, -13892361, -12643307, -12465018, -13051930, -13385068, -12922386, -12524316, -13828627, -12196925, -14234952, -14033659, -12671590, -13770704, -13276776, -12703283, -13352067, -12827274, -13385653, -13021354, -12489023, -12753420, -12707943, -13042153, -13213800, -12252145, -13355469, -12978965, -13756952, -13042684, -13124913, -13364144, -13276385, -13198071, -13128465, -13164707, -13122412, -13013398, -13188274]
8703a3188274J125617j048431r12645L86323p6582M69262k59395K72136k48641J04471
8693a3376159r7686J61941m59273K41654n68145N43739q16019k86833q46688K055713
8683a3447756k70456n12797m68603R99288O0741K51238P84084j167773n18570J192613
8673a3097991K14920j79944M79596r46277j76374k65591K009617r36315k56520l92416
8663a3547295N80973P890K3852K74828r16253O2279k26122k2134k20833m16787J039718
8652a3359884r20347J08301K51125L02333m09732N40250m40863J13033K104023j656131
8642a3367892k59640J029057o9609o16813m7729l62190O10443K0435J456559j006579
8632a2613958m66681o60402L86475k82194L07624L94637n39767o06242J37172Q17689
$$ y = [-13188274, -12062657, -13111088, -14023733, -13637410, -13713992, -13244730, -13504125, -13231989, -13480630, -13376159, -13473845, -13311904, -13771177, -13529523, -14097668, -13553929, -14369948, -14656781, -15503469, -13447756, -13718212, -14231009, -14699612, -13700324, -13639583, -13388345, -12604261, -13772034, -14290604, -13097991, -12883071, -13063015, -12583419, -13529696, -13706070, -13971661, -11962044, -12898359, -13154879, -13547295, -12966322, -12958432, -12934580, -12659752, -13576005, -13513726, -13739848, -13761982, -13982815, -14399602, -13359884, -14280231, -14171930, -13920805, -13618472, -14028204, -13487954, -13928817, -13815784, -11711761, -13367892, -13627532, -12598475, -12668084, -13284897, -13332626, -13694816, -13084373, -13063938, -11607379, -12613958, -13080639, -13741041, -13354566, -13636760, -13329136, -12934499, -13474266, -14080508, -13943336, -13125647]
8622a3125647L90671L22717r06105J22486L06555m53821K78551o47868l31224J272690
8612a2770995m18786q3600J48560M8517k88932P27069q8263j227081R60337j189066m76913
8601a4659153P73201P2395O70051P37607n81206k2664q2350l38808M98316l13450P46904
8590a2499157n84224P16094j412948m18318J157599k48442K6333n10441J027390r55165
8580a3701279O88024l15347J249307j002953m8377l58605Q4502J230465L90391q53577
8570a2637449k77186K87217m24633K8669O78050p70813K52026N61119Q18925o03293
8560a2087368j099022J04546L52963Q77559q55706j163158n34822M58849P82589J89045
8550a2974525N03453J078686j598535K2240N13671l68943M801M19035Q0744n4954R8884
$$ y = [-13125647, -12734976, -12412259, -13318364, -13195878, -12889323, -13343144, -13064593, -13712461, -14043685, -12770995, -13189781, -13273381, -13124821, -13076304, -13365236, -12638167, -12726430, -13953511, -12993174, -14182240, -14659153, -13885952, -13813557, -13143506, -12405899, -12987105, -13009769, -13092119, -13430927, -12932611, -13246061, -12499157, -13083381, -12367287, -13780235, -14198553, -13040954, -13289396, -13263063, -13773504, -12746114, -13701279, -13013255, -13328602, -12079295, -13082248, -13130625, -13489230, -13404728, -12174263, -11783872, -12637449, -12914635, -12627418, -13052051, -13023382, -12345332, -13116145, -12864119, -12303000, -11484075, -12087368, -13186390, -13081844, -12728881, -11851322, -12707028, -13870186, -14405008, -13946159, -13163570, -12974525, -12471072, -11392386, -12990921, -12968681, -12455010, -12823953, -12819152, -12400117, -12319373, -12374327, -12275443]
8539a2275443K83616n41287o79817K14279O67606j433230j105722N52986P49081N20810
8529a3047121p05268k978k26145k71900K325464q58751j25490j397344N50568M58733
8519a3300232J09115j105182R05649j164975M00176J133286j551099R30310j74459Q35682
8509a2981729q0512M2772p2463o0078q45248N91008M17255p04789J14559m93365K47671
8498a3824919O32896m86323J25008Q08211M81p14112n77897J251466j187402j05024M21290
8487a3656325Q44799n19845r05649r4034L65234k86241J886137p90758l39113N06135
8477a2989660n21813N96120M45935P843o63496N39809p73584l98835L48222R38491P0752
8466a2400216j170089L52825J60843M5468j08713q16718L94170O32986p57814j37372
$$ y = [-12275443, -11991827, -12533114, -13212931, -12998652, -12331046, -13764276, -14869998, -14317012, -13567931, -13047121, -13752389, -13755367, -13981512, -14253412, -11927948, -12786699, -12912189, -14309533, -13758965, -13300232, -13191117, -14296299, -13390650, -14555625, -14155449, -13022163, -14573262, -13642952, -13817411, -12981729, -13062241, -13019469, -13091932, -13152010, -13997258, -13406250, -12988995, -13693784, -13579225, -14072590, -13824919, -13192023, -13678346, -13553338, -12745127, -12744646, -13458758, -14036655, -12785189, -13972591, -14077615, -13656325, -12811526, -13331371, -14237020, -14331054, -13965820, -14252061, -12365924, -13156682, -13495795, -12989660, -13511473, -12915353, -12469418, -12461575, -13125071, -12585262, -13358846, -13757681, -13409459, -12470968, -12400216, -13570305, -13217480, -13056637, -13011169, -13119882, -13936600, -13542430, -12909444, -13667258, -13804630]
8456a3804630M80400n16551R86257m95043L1678j73932r60062O39254J37055R5475O28296
8445a2951803l14070k09868m03286K47297J99117j34730j5265j1058J77495n98188k74096
8434a4288455R22J282238q73251J86844R21284J70291l20506L6041l20205M31912K58971
8423a2513914l49960R72132j137066L01118k42302Q7706O46844O42579j04703j81238
8413a1878804J23984j281750J174546l09350k15527N3271n0635M05782j58819k48758
8403a2386060N10288R36269q83549K50213Q93659n16627N47057o56306p83098J192231
8393a0895923o58168j3487K92419o87227J562976m06035p36364j69405J67931R69723
8383a0573560j833034J058152K81862k57033L82364j056948K79285K34956O79689p86001
$$ y = [-13804630, -13324230, -13840781, -12854524, -13349567, -13317889, -13491821, -14451883, -13812629, -13675574, -13580099, -12951803, -13265873, -13475741, -13879027, -13631730, -13432613, -13567343, -13582608, -13593666, -13416171, -14014359, -14288455, -14287533, -13005295, -13878546, -13691702, -12770418, -12600127, -12920633, -12884592, -13204797, -12772885, -12513914, -12863874, -11891742, -13028808, -12727690, -12969992, -12882286, -12235442, -11592863, -11697566, -11878804, -11754820, -13036570, -11862024, -12171374, -12386901, -12333630, -12384265, -11978483, -12137302, -12386060, -11875772, -10939503, -11823052, -11572839, -10679180, -11195807, -10648750, -11305056, -12088154, -10895923, -11554091, -11567578, -11275159, -11962386, -10399410, -10805445, -11541809, -11711214, -11543283, -10573560, -12406594, -11348442, -11066580, -11323613, -10941249, -11998197, -11718912, -11483956, -10804267, -11590268]
8373a1590268m80276j93430K38055P14090J576666j271732K81711L74057q64648Q08504
8363a0407271j85073J220121m90874K06968m13725l35552P41680M41124J24310K75678
8353h822614J13052q13039O10779L65371P20704j441860N59049l30672J163485O66660
8343g209085K50308m02722j71087l0544K87284l66585m82571m64546J220439j081947
8333h451056J50592J472026P5014l92833J829136j03503o63981J136838j027948P05433
8323e270282Q2353K78725J333328r6856n30647j05676P97690N64601K25885k028953m23715
8312e173547J243439o57646L62998O46435M36080j069988j022800N21429J95235Q26060
8302c692305Q18425M7584Q34182l7070o82976L90976R7675K68507J406381L98285j029683
$$ y = [-11590268, -12070544, -12263974, -12025919, -11311829, -9735163, -11006895, -10725184, -10351127, -11215775, -10407271, -10592344, -9372223, -9863097, -9656129, -10069854, -10405406, -9663726, -9222602, -9098292, -8822614, -8709562, -9522601, -8911822, -8546451, -7825747, -9267607, -8708558, -9039230, -7875745, -7209085, -6958777, -7361499, -7532586, -7563130, -7275846, -7642431, -8125002, -8589548, -7369109, -8451056, -8300464, -6828438, -6753424, -7146257, -5317121, -5420624, -6084605, -4947767, -5975715, -5270282, -5187929, -4909204, -3575876, -3672732, -4203379, -4309055, -3511365, -2946764, -2720879, -4749832, -5173547, -3930108, -4587754, -4224756, -3578321, -3142241, -4212229, -5235029, -4713600, -4518365, -3692305, -2873880, -2826296, -1992114, -2029184, -2712160, -2321184, -2223509, -1955002, -548621, -150336, -1180019]
8291a180019j65867J020031j217728Q49395q46249j17937M20715J099641l93031M07925
8281a23124j73339m35448n11226o86599M57666m07265j312204M98159O24591K44532m472
8270a828729Q6251J224081O18598J465826k86322j42506m34350n4940J720574j336206
8260A032277J149300k56555K94131J894456j414727o30513P88150R79553O44257j48392
8250D331937N73394K182403N98251J098849J330781Q60694N0616M17393J172486k71242
8240A2345562J83008q5493O14988K8569n21507n61476M38077J463373p45499R02508k37647
8229A3824463M0177r97746n77711j617454p8851J58200K90812n28967J092810Q08004
8219A2413737M20995K35295J150926K446081P27207p5181J779337Q050q08963K08662
$$ y = [-1180019, -1345886, -325855, -1543583, -694188, -1540437, -1658374, -1237659, -138018, -531049, -123124, -296463, -731911, -1243137, -1929736, -1472070, -1879335, -3191539, -2693380, -2068789, -1824257, -1828729, -1742478, -518397, 100201, 1566027, 1279705, 1137199, 702849, 647909, 2368483, 1032277, 2181577, 1925022, 2219153, 4113609, 2698882, 2068369, 2856519, 3836072, 4480329, 4331937, 4905331, 7087734, 7685985, 8784834, 10115615, 10976309, 11026925, 11444318, 12616804, 12345562, 12528570, 12443077, 13058065, 13086634, 12565127, 12003651, 12441728, 13905101, 13159602, 14062110, 13824463, 13864640, 12866894, 12289183, 10671729, 10592878, 10751078, 11041890, 10512923, 11605733, 12413737, 12834732, 13070027, 14220953, 16667034, 17394241, 17319060, 19098397, 19106447, 18297484, 18506146]
8209A8506146j498614L70964J526670J071016N94866J178265J141538J663654K97851
8200B4852356J467626k10696O94778J495597m0229Q99743N18693M99771J362331J520149
8190C3060119J263092O23888O00500L74526k62533J21j356007J730250J686290J489484
8180C9209730P0189Q16227P36321L15127n97285q73173p70247n64666o59255M904K69030
8169C7956902L81116J119388J650236m73517J080234J739739J218584K516965P29516
8160D7919163K582012J503507J583610J984044J599429K694144P56716j141079J34430
8151E9615976m07078p18892L063906o0369J685722N51005R06068K089065J037785L005320
8141G0768508M338029M960020M575567N516699M082030M535411L741830j793867M78278
$$ y = [18506146, 17007532, 17378496, 18905166, 19976182, 20571048, 21749313, 22890851, 24554505, 24852356, 26319982, 26109286, 26804064, 28299661, 28259432, 29159175, 29677868, 30177639, 31539970, 33060119, 34323211, 34947099, 35547599, 35922125, 35659592, 35659713, 34303706, 36033956, 37720246, 39209730, 39279919, 40096146, 40832467, 41147594, 40550309, 39677136, 38906889, 38342223, 37682968, 37687872, 37956902, 38338018, 39457406, 41107642, 40634125, 41714359, 43454098, 44672682, 47189647, 47919163, 50501175, 52004682, 53588292, 55572336, 57171765, 59865909, 60622625, 59481546, 59615976, 59208898, 58490006, 61553912, 61493543, 63179265, 63730270, 64636338, 66725403, 67763188, 70768508, 75106537, 80066557, 84642124, 90158823, 94240853, 98776264, 102518094, 100724227, 101202505]
8132A01202505K476990K886222M56096J207018L410296K006025L250532K481114L73536
8123A19750334j432076m140053l190847q34688K467769L902559O276185L117854P481268
8114A33398305L862265N245322K524915L626251K261971J293142O182453M920327M065046
8105A67379997M641051N006736N945209M518472O476146P820809Q145252J0751086R620733
8096B30305491R088816Q439357R490691P264835Q782815J0448283R162528Q799761
8088C01782577J0744623J2238323J4231313J6954707J8318895J8770773J8143891J7447011
8080D28632113J5476388J7042024J4600729J4302073J5727363J5808546J5779861J6344992
8072E53714089J8238452J8887284J6753345J2021574O082565M33234k488881j021893
$$ y = [101202505, 103679495, 106565717, 107021813, 108228831, 111639127, 113645152, 116895684, 119376798, 119750334, 118318258, 114178205, 110987358, 110152670, 112620439, 116522998, 122799183, 125917037, 133398305, 137260570, 142505892, 145030807, 148657058, 150919029, 152212171, 158394624, 163314951, 167379997, 172021048, 177027784, 182972993, 187491465, 193967611, 201788420, 209933672, 220684758, 230305491, 239394307, 247833664, 257324355, 264589190, 273372005, 283820288, 292982816, 301782577, 312527200, 324765523, 338996836, 355951543, 374270438, 393041211, 411185102, 428632113, 444108501, 461150525, 475751254, 490053327, 505780690, 521589236, 537369097, 553714089, 571952541, 590839825, 607593170, 619614744, 625697309, 626130543, 623641662, 622619769]
8064F22619769L91445K516970M80782O541648J0557767J2926817J1778693J1193460
8056F79007351J0291483J6853793J9797606K3181227K3631446K6402208K6718761K8011705
8048H53895580K9350751L4214799L8976201M2001334M3506221M4885429M5205915M5509727
8040A177545957M4485083L2492840J5226417j593826j8507304k2383385o813283J2873221
8032A233325720L6873779N5134603O6536910O2785747N7245122M4440341L0279917
8025A586622139K5882964K9055611M0520420N9138627P4128188R0934176R0610145
8018A996892270Q2423733O1297541O870103p4510996j60724953k25570596k47120335
8011A439556767k18856499j66509204j13172871o4057627l3110770k0245491k1871543
$$ y = [622619769, 623011214, 625528184, 626008966, 632550614, 643108381, 656035198, 667813891, 679007351, 689298834, 706152627, 725950233, 749131460, 772762906, 799165114, 825883875, 853895580, 883246331, 917461130, 956437331, 998438665, 1041944886, 1086830315, 1132036230, 1177545957, 1222031040, 1254523880, 1269750297, 1268156471, 1249649167, 1227265782, 1220452499, 1233325720, 1270199499, 1325334102, 1391871012, 1454656759, 1511901881, 1556342222, 1586622139, 1612505103, 1641560714, 1682081134, 1741219761, 1815347949, 1906282125, 1996892270, 2079316003, 2140613544, 2147483647, 2072972651, 1912247698, 1686677102, 1439556767, 1220700268, 1054191064, 941018193, 876960566, 843849796, 823604305, 801732762]
8004H01732762k8883333l6336250l3852138k8734349j7808102r635390k327004k344765
7996F41811431p826884j7633111k4149311k7011308k5198603j9698995j5736086j3921472
7988D90635661j4702886j2646546j2625559l790378O887568J0646234O204918n926244
7980D64682768j6517891j9862862j2808991n974099j197783l021176k096254m028375
7972C99175337l626809l885503m531452n008729m663399l103486k146491m457989m564301
7963C63187178o039136n385857o784505j0168511j2675968j8911758k1775089k2975072
7955B58471282k3134137j8786152r800088q470101k324981N06290L169472o17863l496051
7946A95517671m865940n631095n790244o473233m378532p244600p874995p953451o570659
$$ y = [801732762, 772849429, 736513179, 702661041, 673926692, 656118590, 646483200, 644156196, 641811431, 633984547, 616351436, 592202125, 565190817, 539992214, 520293219, 504557133, 490635661, 475932775, 463286229, 450660670, 446870292, 453757860, 464404094, 470609012, 464682768, 448164877, 428302015, 415493024, 409518925, 408321142, 405299966, 403203712, 399175337, 395548528, 391663025, 387131573, 382122844, 377459445, 374355959, 372209468, 367751479, 363187178, 357148042, 351762185, 344977680, 334809169, 322133201, 303221443, 281446354, 258471282, 235337145, 216550993, 206750905, 198280804, 195955823, 196462113, 199631585, 199013722, 195517671, 190651731, 185020636, 179230392, 172757159, 168378627, 161134027, 153259032, 145305581, 138734922]
7937A38734922p576592o739776p128903o482832p344822q836483o741013n467393l955760
7928G8461348k149044k823728l659397k183973l858326l868533q46569m252353m931135
7919D9888290p117895j0291941p972765p175832n032435m532908l422169j094014k027024
7910A221307l520254l641988j862642j025344j007344n35729J116838k77059o34027j63264
7900a0329506K421411P40983J533814J849521K299395K353746K027483J167287P77117
7891D841251j041101j32126p95092j269886m09834j292264l138904J0164j635947j755540
7881f619279n72395l02057K15809j871086j148360j53383L71693O73868L88875m31590
7871i447905j99626n26083r70737j191316J58822N8776O7867p55743J56237r500k171737
$$ y = [138734922, 131158330, 124418554, 117289651, 110806819, 103461997, 94625514, 87884501, 82417108, 78461348, 76312304, 73488576, 69829179, 67645206, 63786880, 59918347, 59071778, 54819425, 49888290, 42770395, 32478454, 24505689, 17329857, 12297422, 7764514, 4342345, 3248331, 1221307, -2298947, -5940935, -7803577, -8828921, -9836265, -10371994, -9255156, -9532215, -10166242, -10329506, -7908095, -7167112, -5633298, -3783777, -1484382, 869364, 2896847, 4064134, 4841251, 3800150, 3668024, 2872932, 1603046, 1193212, -99052, -3237956, -3227792, -4863739, -6619279, -7191674, -7493731, -7277922, -9149008, -10297368, -10450751, -10079058, -9405190, -9016315, -9447905, -9647531, -10173614, -11144351, -12335667, -12176845, -12118069, -12050202, -12805945, -12649708, -12659208, -14830945]
7860a4830945L599137J0248Q35811p91921k90399k39801p62676l566037J246884K64561
7850a4525138N47125J97007J99004P27049O25569O228J900048l14352m26667O07153j58054
7839a0615028Q04511k92282L72239K270722J058688J119442j090136J35470r57056q6009
7829g279439r7609J579217l99850j173306N4357Q55750m19129n21823p09986j00710k33350
7818h445878J052437J57475r56039k60500r43517P34541K120333q20434J41291O13881
7808f606410J144268r14139J24958n36895K78735N43945j067895j327102N35491O56041
7798g169003k00699r57415n02493J32462M26445N48629Q59700Q49476P0237O71555K80909
7787d990197J208119O67816N02804Q07830J298989j383538P23017J319454Q30862j067861
$$ y = [-14830945, -11231808, -11221560, -10385749, -11177670, -11468069, -11707870, -12470546, -16036583, -14789699, -14525138, -13978013, -13781006, -13582002, -12854953, -12229384, -12223156, -10323108, -10637460, -11064127, -10456974, -10615028, -9810517, -10102799, -9730560, -7459838, -6401150, -5281708, -6371844, -6236374, -7193430, -7279439, -7377048, -5797831, -6197681, -7370987, -7316630, -6460880, -6880009, -7401832, -8111818, -8212528, -8445878, -7393441, -7235966, -8192005, -8452505, -9396022, -8661481, -6541148, -7361582, -7220291, -6606410, -5462142, -6376281, -6251323, -6788218, -6509483, -5965538, -7033433, -8360535, -7825044, -7169003, -7369702, -8327117, -8829610, -8697148, -8270703, -7722074, -6862374, -6012898, -5942661, -5271106, -4990197, -3782078, -3114262, -2611458, -1803628, -504639, -1888177, -1165160, 154294, 985156, -82705]
7777h2705j081103L07744J083581j37912P65854p62603j54130r59538M53328O96973o66067
7766e36578Q86418q41652L72194m04111L95564o75211L60310K44338J02050N05451R57503
7755A366276q65567m48251r8692K43528k72425r00547k47180m91730R48608M29302J58094
7744a78584J482884J0171J39095n95106K15494J211419n40144J72706k42736O66600l56281
7733A985518J98710o49493P89673r72489M37833j872830J356158J7144r92199K52020j8466
7722E31579o05659N79755k89802O32117p56277j237999Q69736r72968O49876J40287L94435
7711f4920k91482J47150J49177j656486m36391k0783j569396L65600K54995N70576n27004
7700c078964R22020l71529j000843l091928J895690M65268o09094N37591L79312r33601
$$ y = [-82705, -1163808, -856064, 227517, 89605, 855459, 92856, -61274, -1020812, -567484, 129489, -536578, 349840, -491812, -119618, -523729, -128165, -803376, -443066, -198728, -96678, 408773, 1366276, 500709, 52458, -46234, 197294, -75131, -975678, -1222858, -1714588, -765980, -336678, -178584, 1304300, 1314471, 1453566, 858460, 1073954, 2285373, 1745229, 1917935, 1675199, 2341799, 1985518, 2184228, 1534735, 2324408, 1351919, 1789752, -83078, 1273080, 1290224, 298025, 550045, 531579, -74080, 505675, 215873, 847990, 91713, -1146286, -276550, -1249518, -599642, -459355, -64920, -356402, -209252, -60075, -1716561, -2152952, -2173735, -3743131, -3377531, -3122536, -2551960, -3078964, -2156944, -2528473, -3529316, -6621244, -4725554, -4260286, -4869380, -4331789, -3952477, -4886078]
7690d886078k906680M058890n08579M5819o12660J317789L02246n06892K78611o35084
7680d052618L71074N79558L67341K55651j95416k084801J294318r50624n09462P12434
7670d212545l36447n91716R3636L4506j399744M10770K86664m07922r40720K69010K74739
7659f519769l684932L724610m2672k86997m29743r9928O54494p47758J67140Q67493q42206
7648g240268q60134M46651J48044N47644j799630L95844L76059o5325L61625l54127j29699
7637h173316M27128j05094L27559l85648M77178J59254l13526k51887K0512o25316l8357
7626h481513M61985M34255J19429N88075n95617J6620k68719M167j019329P39332J000506
7615g000809l08263K33117N94705n44789O73259n7503o35892K98213k88147m08115M44381
$$ y = [-4886078, -7792758, -3733868, -4242447, -4196628, -4809288, -3491499, -3189253, -3696145, -3417534, -4052618, -3681544, -3101986, -2734645, -2478994, -2674410, -4759211, -3464893, -4415517, -4924979, -4212545, -4548992, -5140708, -5047072, -5012566, -6412310, -6001540, -5714876, -6122798, -7063518, -6794508, -6519769, -10204701, -6480091, -6522763, -6809760, -7239503, -7339431, -6684937, -7432695, -7265555, -6398062, -7240268, -8100402, -7653751, -7505707, -6958063, -8757693, -8361849, -7985790, -8051115, -7689490, -8043617, -8173316, -7746188, -7851282, -7523723, -7909371, -7432193, -7272939, -7586465, -7838352, -7817840, -8443156, -8481513, -8019528, -7585273, -7465844, -6877769, -7473386, -7456766, -7725485, -7721318, -8740647, -8001315, -7000809, -7309072, -7075955, -6481250, -7026039, -6352780, -6410283, -7046175, -6747962, -7036109, -7444224, -6999843]
7604f999843L48604r13870L84549M96151O69161p20071j64058K4846k07716M64289j113289
7593g731247P27197K85737m7482M24327n39370J24889k57328j22868j408367P80908l20480
7582h084084k74842O73727l26913l10597l61934N18327r29467j59804O28908N93215j47666
7571h181130q5041J133382O03989o9971q45592J283458o88417k644m69793m93324L66615
7560g448468J026676j291455L98368M30497N7093J67646j003745J01537p32209M41129
7550g852931m71403J83786J521616j111790j94582K44929L70225L92825n61766n97344
7540h076435m64317J012801M21687m70260n10217J098205O00763o20103q26476J82065
7530g652287l37195m25088J17969p9834L75986L48873m49359l1747l86150N8031M06165
$$ y = [-6999843, -6651239, -7565109, -7180560, -6684409, -6015248, -6735319, -6899377, -6874531, -7082247, -6617958, -7731247, -7004050, -6718313, -6765795, -6341468, -6880838, -6755949, -7013277, -7136145, -8544512, -7763604, -8084084, -8358926, -7685199, -8012112, -8322709, -8684643, -8166316, -9095783, -9255587, -8626679, -8033464, -8181130, -8266171, -7132789, -6528800, -6598771, -7444363, -6160905, -6849322, -6851966, -7321759, -7815083, -7448468, -6421792, -7713247, -7314879, -6884382, -6827289, -6659643, -7663388, -7561851, -8294060, -7852931, -8324334, -8140548, -6618932, -7730722, -7925304, -7680375, -7310150, -6917325, -7479091, -8076435, -8540752, -7527951, -7106264, -7576524, -8086741, -6988536, -6387773, -7007876, -7834352, -7652287, -7989482, -8414570, -8296601, -8376435, -8000449, -7651576, -8100935, -8132682, -8518832, -8460801, -8054636]
7519h054636j253751K041288j5978r19924L0494J617909j042008j516398J606451r413
7509g515966j13280r22889L60049K82984r58979L51979k20602o92634N1113L69133r45508
7498i954600J587429l25168l30837q74584M21390j32141n01589M42642K57165N02107
7488h908186K40852p65533J468683K7418n72280k80198j85295R6031k36444Q76499j78785
7477h417238r88427L22484J316837l90378l54699n62682R908P80959j37352N9549o621
7466h367660P82418l14969M42289m14631K235938j616785j000646p49933J71021q43050
7456i676008P06037L53960M22660j12768O3133K1837M64460r6762n2051o47835Q94920
7445g658417J51415l4553K08361j274581J370829j119153l23652l5260L83509k76368
$$ y = [-8054636, -9308387, -7267099, -7283077, -8203001, -8172507, -6554598, -7596606, -9113004, -7506553, -7515966, -7629246, -8552135, -8192086, -7909102, -8868081, -8516102, -8736704, -9429338, -9378225, -9009092, -9954600, -8367171, -8692339, -9023176, -9897760, -9476370, -9608511, -10110100, -9667458, -9410293, -8908186, -8667334, -9432867, -7964184, -7936766, -8509046, -8789244, -8974539, -8878508, -9114952, -8238453, -8417238, -9405665, -9083181, -7766344, -8156722, -8511421, -9074103, -9064195, -8283236, -8420588, -8361039, -8367660, -7585242, -7900211, -7457922, -7872553, -5636615, -7253400, -8254046, -9003979, -8832958, -9676008, -8969971, -8616011, -8193351, -8306119, -8242986, -8221149, -7756689, -7853451, -7905502, -8553337, -7658417, -7507002, -7541555, -7333194, -8607775, -7236946, -8356099, -8679751, -8715011, -8331502, -8607870]
7435h607870N76555L66751l30620j449209J213701O79607n03487P0795O87006o26412
7425g923183p99701l5321j147374J233963k70290K58262J359905p83465p86943P12532
7415h181615R4016l78343M77631o64641J44269J16998J73653n46929N62922k34014m2945
7404h478998n44316Q89639k85247J62389K39425n25524o47312J279757M88180n79676
7394h001683K13156k97559q51579N94921o16773J094875p19595N09040P7763K1893o06221
7383h581762O7928N42166k0135q99346m68045m05506N50388P90167M56696o09675M23324
7372h153800K3309l26733n93983J254302j49578q01417M6771K15546K8237K55729q94169
7361i095786L30934P5794J77876r48303J173456p65303j0991q395n55321M96851P41502
$$ y = [-8607870, -8031315, -7664564, -7995184, -9444393, -8230692, -7551085, -8054572, -7983777, -7296771, -7923183, -8722884, -8758205, -9905579, -8671616, -8941906, -8683644, -7323739, -8107204, -8894147, -8181615, -8087599, -8465942, -7988311, -8652952, -8508683, -8391685, -8218032, -8764961, -8202039, -8436053, -8478998, -9023314, -8133675, -8418922, -8256533, -8017108, -8542632, -9189944, -7910187, -7422007, -8001683, -7788527, -8086086, -8937665, -8342744, -8959517, -7864642, -8584237, -8075197, -7997434, -7975541, -8581762, -8513834, -7971668, -7991803, -8891149, -9359194, -9764700, -9214312, -8424145, -7967449, -8577124, -8153800, -8130491, -8457224, -9051207, -7796905, -7946483, -8747900, -8701129, -8485583, -8457346, -8201617, -9095786, -8764852, -8689058, -8511182, -9459485, -8286029, -9051332, -9062323, -9070718, -9626039, -9129188, -8387686]
7350h387686k05144O42854q54632l99844N01686q15471L49116O4172L64689n8595p86616
7339i585471P1933N82485P24121k19287M14377j257523n64993O60359R79961p32229j4893
7328h941160K45839m24146j68177M51107r62861k9771Q65263J108963j464113R08204
7318h410852J87708n17058o60972j61677J079243J366349j115411o645o2854M4247J181479
7307g076443j547640J1903J079649r52109j633152J512601L4703p04735K00650K84469
7297h790104Q49644j19140J205065k647411k59841J569117M96008l93379r82871q5038
7287i157950K31560j29436J529o72113P90721n117o82840J487216L4125j89449j069420
7276i361174O01498P245L79724K81281l225770J349713J002706J061141M19389p20530
$$ y = [-8387686, -8592830, -7949976, -8804608, -9204452, -8702766, -9518237, -9169121, -9104949, -8740260, -8798855, -9585471, -9513538, -8931053, -8206932, -8426219, -8011842, -9269365, -9834358, -9173999, -8194038, -8926267, -8941160, -8695321, -9119467, -9287644, -8836537, -9799398, -9829169, -8963906, -7854943, -9319056, -8410852, -8223144, -8740202, -9401174, -9562851, -8483608, -7117259, -8232670, -8239315, -8302169, -8257922, -7076443, -8624083, -8612180, -7532531, -8484640, -10117792, -8605191, -8570488, -9275223, -9074573, -8790104, -7940460, -8059600, -6854535, -9501946, -9761787, -8192670, -7696662, -8090041, -9072912, -9157950, -8926390, -9055826, -9054297, -9726410, -8935689, -8940806, -9623646, -8136430, -8102305, -8291754, -9361174, -8759676, -8752431, -8372707, -8091426, -11317196, -9967483, -8964777, -7903636, -7484247, -8204777]
7266h204777m61456k2902r62723J617989r343O55552m19802n71588o59866K24690J19464
7255h694762K37872j055204l63412J402914m84888m0594M87846o32463L84481Q08582
7245g949628r39652o81723K30558L17312L65645J19368R56033p42033j114496L25836
7235i112780L96863m42930L89084O57644j225379O1460R26638Q74759j130347l40385k0305
7224h965678J12400J94811j33107J134693o47053j073861R77251k07882m13855q49858
7214i872139p42443J387413J418589q34839j74838J78557l44676J21429l3340o24315
7204i520602J179336p66205L80488J13017Q0m56585J15383J50211K99435j927489J567884
7193h865047k65070k68770M33169N43806O30404J80339p43298m06897Q7328n0037K63483
$$ y = [-8204777, -8666233, -8689135, -9651858, -8033869, -8043212, -7387660, -7807462, -8379050, -9038916, -8814226, -8694762, -8456890, -9512094, -9875506, -8472592, -8957480, -8998074, -8510228, -9142691, -8758210, -7949628, -8889280, -9571003, -9340445, -9023133, -8657488, -8538120, -7582087, -8324120, -9438616, -9112780, -8715917, -9158847, -8769763, -8112119, -9337498, -9276038, -8349400, -7474641, -8604988, -8945373, -8965678, -8853278, -8658467, -8791574, -7656881, -8303934, -9377795, -8400544, -8608426, -9022281, -9872139, -10614582, -9227169, -7808580, -8643419, -8818257, -8639700, -8984376, -8862947, -8896287, -9520602, -8341266, -9107471, -8726983, -8613966, -8613886, -9070471, -8955088, -8804877, -8505442, -10432931, -8865047, -9130117, -9398887, -8965718, -8421912, -7791508, -7611169, -8354467, -8761364, -8674036, -8724073, -8460590]
7182h460590K26406o44638k03948O69291J289103j548988J40748O38562j40889o25751
7172h660694K10392j25098j13945Q84219p06606k91940m56239j49837P70626l78581j24584
7161i142287P1098N56907l07966L6738n2906Q69557o17832m51208q32931L42646o77429
7150a0205613J446399L83488k1959j15819r35332Q73433l85418m82380K25654Q169J158191
7139h051187m96162J05996r38191J153435j294017m2314O05433r74721R38013Q19310
7129h174405j130279J330095n18855l60149L47617m25034M73971p33597m74629R1320
7119i573945K79819p65689L90075M49189l35421P70078m45350N46422p02949j8329L32942
7108i073158M60835O04954o61929K78805k09645p34350J10568j33425m21445J21999
$$ y = [-8460590, -8234184, -8878822, -9082770, -8413479, -7124376, -8673364, -8532616, -7894054, -8034943, -8660694, -8450302, -8575400, -8689345, -7805126, -8511732, -8803672, -9259911, -9409748, -8639122, -9017703, -9142287, -9071189, -8514282, -8822248, -8785510, -8838416, -7968859, -8586691, -9037899, -9870830, -9528184, -10205613, -8759214, -8375726, -8397685, -8513504, -9448836, -8575403, -8960821, -9443201, -9217547, -9209378, -8051187, -8547349, -8441353, -9379544, -8226109, -9520126, -9562440, -8957007, -9931728, -8993715, -8174405, -9304684, -7974589, -8493444, -8853593, -8505976, -8931010, -8457039, -9190636, -9665265, -9573945, -9294126, -10059815, -9669740, -9220551, -9555972, -8785894, -9231244, -8684822, -9387771, -9406100, -9073158, -8612323, -8007369, -8669298, -8390493, -8600138, -9334488, -9223920, -9357345, -9778790, -9656791]
7098i656791j029631L62822J142042o75514L28008k41M48895k90014m93958Q70233J28184
7087h865965m08049K168286j797765q74864M84281M62358J9820j34876r8856j79671Q04566
7076h420735j020169M03803j41711L80025k79771P1778m24675M6580j70936K08265k63855
7065i611401K74451N84071o68594m73746M00390P0324J888875j444174j32575p86048
7055i898427p29929J067829o48896J147826p27266L0829L26728n17091K19933m87739
7045a0216203J091572p4872j131332k05891j095264J13800K135649R51730j45691n30694
7035i107196O47660Q08907j838927P75812p48334O83546O55717j71768m0423m85494r23448
7024i743948J40946K67892l91515N43192j45385R99144O63049j538562q2460M331893
$$ y = [-9656791, -10686422, -10323600, -9181558, -9857072, -9529064, -9529305, -9080410, -9370424, -9864382, -8994149, -8865965, -9274014, -7105728, -8903493, -9778357, -9294076, -8831718, -8811898, -8946774, -9045630, -9225301, -8420735, -9440904, -9037101, -9178812, -8798787, -9078558, -9006780, -9431455, -9384875, -9555811, -9347546, -9611401, -9336950, -8752879, -9421473, -9895219, -9494829, -9424505, -7535630, -8979804, -9112379, -9898427, -10628356, -9560527, -10209423, -9061597, -9788863, -9758034, -9431306, -9948397, -9728464, -10216203, -9124631, -9199503, -10330835, -10536726, -11631990, -11518190, -9382541, -8430811, -8576502, -9107196, -8459536, -7650629, -9489556, -8713744, -9462078, -8778532, -8122815, -8294583, -8335006, -8820500, -9743948, -9603002, -9335110, -9726625, -9183433, -9328818, -8329674, -7666625, -9205187, -9287647, -4955754]
7014d955754m880756J34988Q16930o54433J47843K67103p76285P0842m97285j4617M38511
7003i902913O92582M59804K42510O762r94451J311285N26466j528364p6140J045951Q45803
6992g370705r54395Q93313J422212L456079k761230l730735p4717k16588O437R6339l50484
6981i584474R8617R4256p1682J17337m80816K56127O13612p42201k60635J88389J408341
6970h363129m39187l41027j069219J302165M95379j23853m33909N93496n82717m60099
6960i422100N81538k89369K26985M16450k3695L95548p39787q25416M94887l30779p23576
6949a0239314J668624r71958L53742o00439j647890K001857m83854P95914j43462J05224
6939i161556J71722l23641P7643j0090N0205L94559J3754n74101O01247m98146L94819
$$ y = [-4955754, -9836510, -9701522, -8884592, -9539025, -9391182, -9124079, -9900364, -9829522, -10326807, -10341424, -9902913, -9210331, -8750527, -8508017, -8501255, -9495706, -8184421, -7657955, -9186319, -9262459, -8216508, -7370705, -8325100, -7431787, -6009575, -2553496, -5314726, -9045461, -9120178, -9336766, -9330329, -9233990, -9584474, -9485857, -9391601, -9463283, -9345946, -9826762, -9570635, -8957023, -9699224, -9959859, -9771470, -8363129, -8802316, -9143343, -10212562, -8910397, -8415018, -8538871, -8972780, -8379284, -8962001, -9422100, -8840562, -9129931, -8902946, -8486496, -8510191, -8114643, -8854430, -9679846, -9184959, -9515738, -10239314, -8570690, -9542648, -9188906, -9789345, -11437235, -9435378, -9919232, -9123318, -9266780, -9161556, -8989834, -9313475, -9235832, -9245922, -9195717, -8801158, -8787404, -9361505, -8760258, -9258404, -8863585]
6928h863585K64009l82097j493384J070331J49772j51993J126509p33158O6241j175408
6918a0122763J272247j322607k33220P57017R03034m05144M66201q30822l03667O64272
6908i155452J20583n99991R3862n54935N43128L54767J06288n73193R18384J13576r58936
6897i591919k20437J3542N22040j209408J68248l69776J136272K49022l85336N05952J2266
6886i169534P26689m58014m67582O30758k89557N71851K87082r06294k97652J101595
6876h270658j077278m35783m64471J09269N05403L05557R39100r26297N86333n42155
6866i270980l23526Q59847K8295r79710O37414l41082k09371R40353j247144Q4910Q6104
6855i734890P7651O6748j48399m59816j87094J78210K41615J05010N4039M15202r721l7706
$$ y = [-8863585, -8599576, -8981673, -10475057, -9404726, -9254954, -9406947, -8280438, -9013596, -8947355, -10122763, -8850516, -10173123, -10406343, -9649326, -8746292, -9151436, -8685235, -9516057, -9819724, -9155452, -9034869, -9634860, -9540998, -10095933, -9552805, -9198038, -9091750, -9664943, -8746559, -8632983, -9591919, -9812356, -9798814, -9276774, -10486182, -10317934, -10687710, -9551438, -9302416, -9687752, -9181800, -9169534, -8442845, -8900859, -9368441, -8737683, -9027240, -8455389, -8168307, -9074601, -9372253, -8270658, -9347936, -9783719, -10248190, -10138921, -9633518, -9327961, -8388861, -9315158, -8728825, -9270980, -9594506, -8734659, -8706364, -9686074, -9048660, -9389742, -9599113, -8658760, -9905904, -9820994, -9734890, -9657239, -9590491, -9738890, -10198706, -10385800, -10207590, -9965975, -9860965, -9806926, -9391724, -9401445, -9439151]
6843i439151j55381Q09525P43005r91132p34656n85054L65286P98300K3655j91848r80811
6832a0338262J168382j30100P79005j87941r39256J802249r43729n8143K41333q04127
6822i410589M29721p20279K71996l41110j20679k91497K57674J034476o84836l86553
6812i961676R52666l0570l29274K40446J5515q5733j35340J047477k2294q13920N48254
6801h574449J0889k794601R00205J499292p77170m87339Q76593k68588M10542O19380
6791h585246P76002q11493k46857j34150j179266Q60499k24386n14360R4931O50374j10722
6780i424674j41916o28582N30367J039529n0726j314971N07906L11523J759148j230137
6770h642533j082806k33443O05356J031173k071173k25356P6069J88725P4373P84857
$$ y = [-9439151, -9594532, -8785007, -8042002, -9033134, -9767790, -10352844, -9987558, -9189258, -9165603, -9357451, -10338262, -9169880, -9299980, -8520975, -8708916, -9648172, -7845923, -8789652, -8847795, -8606462, -9410589, -8980868, -9701147, -9429151, -9770261, -9890940, -10182437, -9924763, -8890287, -9575123, -9961676, -9009010, -9039580, -9368854, -9128408, -9112893, -9198626, -9333966, -8286489, -8308783, -9122703, -8574449, -8563560, -11358161, -10457956, -8958664, -9735834, -10223173, -9346580, -9615168, -9204626, -8585246, -7809244, -8620737, -8867594, -9001744, -10181010, -9320511, -9544897, -10059257, -9964326, -9313952, -9424674, -9566590, -10195172, -9664805, -8625276, -8676002, -9990973, -9483067, -9171544, -7412396, -8642533, -9725339, -9958782, -9353426, -8322253, -10393426, -10618782, -10542713, -10353988, -10279615, -9494758]
6760i494758K33625J042616j357740l33912J362928q46440J175789r39794k29189n4215
6750i441090k24028R21840j22547r89860K00938j92877M95842l93867R44403l90544n00639
6739i692429M54339R80722o53297o38788k85578K76937J63423j93072K86747L59174m16551
6728i358373l6431p15595j76983N43421j30783R64899o18448J36099l86581j227204
6718a1005979J027888k92007O71739m65099K48742K59656K52142Q61234r98342p2986
6708i513012j489474N49329Q84223j50864m74947K92455k195834K706764j235329O97448
6698i929241o08816L56115P71844L79687p56117Q14205K00637L35090j486702l79048
6688a0302346J34468P41548Q19154N08069l39441j21948k07497j023889N14113o00606
$$ y = [-9494758, -9261133, -8218517, -9576257, -9910169, -8547241, -9393681, -8217892, -9157686, -9386875, -9441090, -9665118, -8743278, -8865825, -9855685, -9654747, -9847624, -9351782, -9745649, -8801246, -9191790, -9692429, -9238090, -8257368, -8910665, -9549453, -9835031, -9558094, -9394671, -9587743, -9300996, -8941822, -9358373, -9394804, -10110399, -10287382, -9743961, -9874744, -8909845, -9528293, -9392194, -9778775, -11005979, -9978091, -10270098, -9598359, -10063458, -9814716, -9555060, -9302918, -8441684, -9440026, -9513012, -11002486, -10453157, -9568934, -9719798, -10194745, -9902290, -12098124, -9391360, -10626689, -9929241, -10538057, -10181942, -9410098, -9030411, -9786528, -8972323, -8771686, -8436596, -9923298, -10302346, -10167878, -9426330, -8607176, -8099107, -8438548, -8560496, -8767993, -9791882, -9277769, -9878375]
6678i878375m39206P39539l94550M01502j96312K9639P67362k40907k35017q86227M72684
6667i859868K05369N595j625700R70475O0382j10345k11163J035526r49659Q20324m30030
6656a0089094O46625M53547j79180m35313m61752J099181p28293N60718Q43557j02580
6646h392584J217390j545264j495081r132n04160M33729j09126J07126L10507J243209
6636h743386k14971o60411l45190L62601K2301q37952L86289j82113k64154M83960J370437
6625h622589l99999l24171j140686j56974J139259p9486k05008J985867j342218l95324
6615i541329M65756l96710l79566L81096j63413J81048M1731n79034m03696J178914
6605i215203j109160J666138l51532o29681K319876m89293k287228k4547M49477k48186
$$ y = [-9878375, -10317581, -9578042, -9972592, -9571090, -9767402, -9737763, -8970401, -9211308, -9446325, -10332552, -9859868, -9654499, -9648904, -11274604, -10304129, -10243747, -10354092, -10565255, -9529729, -10479388, -9659064, -10089094, -9442469, -8988922, -9168102, -9603415, -10065167, -8965986, -9694279, -9133561, -8290004, -8392584, -7175194, -8720458, -10215539, -10224671, -10728831, -10295102, -10404228, -10297102, -9986595, -8743386, -8958357, -9618768, -9963958, -9601357, -9579056, -10417008, -10030719, -10212832, -10476986, -9993026, -8622589, -9022588, -9346759, -10487445, -10644419, -9505160, -9584646, -9789654, -7803787, -9146005, -9541329, -9075573, -9472283, -9851849, -9470753, -9634166, -9453118, -9411387, -9990421, -10394117, -9215203, -10324363, -8658225, -9009757, -9639438, -7319562, -7808855, -10096083, -10120630, -9671153, -9919339]
6595i919339J54114O26263j271765j685521K667844j039084J096042N34965j364771J708
6585a0199544Q93208m36917J49713l56628O33724K93277j89481j00038n95589J360705
6575h547570j249167o77888K96709P01687N82554J101104j966136L36307l57556K676
6565i777280J077068K18021j96705q70204J472067q36138K83071k89633m35721K918021
6555f437433K80580K669872P655086j0547173n499213K95627R32603p46851J01827j57716
6545a1452791j564840K73184Q62026K21207Q83315K29271j55990M45222J434189p28720
6535i553927j516014M45027p8431M7538J057599m99701j75908r14888J834349j817845
6525a1172201j50336J899018j192932L23893j23391o07758K91917q67394J00248N90866
$$ y = [-9919339, -9765225, -9138962, -10410727, -12096248, -9428404, -10467488, -9371446, -8836481, -10201252, -10199544, -9306336, -9743253, -9593540, -9950168, -9316444, -9023167, -9212648, -9312686, -9908275, -8547570, -9796737, -10474625, -10177916, -9476229, -8893675, -7792571, -9758707, -9422400, -9779956, -9777280, -8700212, -8482191, -8678896, -9549100, -8077033, -8913171, -8630100, -8919733, -9355454, -6437433, -6156853, -3486981, 4168105, -6379068, -11878281, -11582654, -10650051, -11396902, -11295075, -11452791, -13017631, -12744447, -11882421, -11661214, -10777899, -10548628, -10704618, -10259396, -8825207, -9553927, -11069941, -10624914, -10703345, -10655807, -9598208, -10097909, -10273817, -11188705, -9354356, -11172201, -11322537, -9423519, -10616451, -10292558, -10415949, -11023707, -10731790, -11599184, -11498936, -10908070]
6515a0908070m00692J563694n29441o58623N50520L925n34330J0543N07803l25321q64421
6504a1584413j62678J776520j279322P44587n99708J162500J089054k35595k29646k52533
6494i571234j071856O73197J9257j2339n36739L41066M21701k96283p00290N41067m54005
6483a0646458k95021J41665l78857m44951M28907J73912M65177J6373j133758J683924
6473i989087P73201q91866r60349k92855J823759J09928k080034R36180l70459N88165
6463a0353417L99098m75106N75984p51821M62866j79783j42850k84543l05924M76567
6453a0578929J132959o48356n08484l0878M73331p35961R58018J37475n57617P74208
6443i584234j96176l49432j094029R15783p0423j09479K30307o00904R63714j205879
$$ y = [-10908070, -11308762, -9745068, -10274509, -10933132, -10382612, -10378687, -10913017, -10902474, -10394671, -10719992, -11584413, -11747091, -9970571, -11249893, -10505306, -11105014, -9942514, -8853460, -9089055, -9318701, -9571234, -10643090, -9969893, -9950636, -9962975, -10499714, -10158648, -9736947, -10033230, -10733520, -10192453, -10646458, -10941479, -10799814, -11178671, -11623622, -11194715, -11020803, -10555626, -10539253, -11673011, -9989087, -9215886, -10107752, -11068101, -11360956, -9537197, -9427269, -11507303, -10571123, -10941582, -10353417, -9954319, -10429425, -9853441, -10605262, -10142396, -10322179, -10465029, -10749572, -11055496, -10578929, -9445970, -10094326, -10602810, -10633688, -10160357, -10896318, -9938300, -9800825, -10358442, -9584234, -9780410, -10129842, -11223871, -10308088, -10378511, -10487990, -10257683, -10858587, -9894873, -11100752]
6433a1100752K23638p54517J139662N64847p66793K58002M29293L46231o76539M16139
6423i920789o55555K32274m0933J498803j087283o75692M00424q65233N33233n53178
6413a1133929M17377J024484o7051L11984R8292M14270q48896O07926j9072r19642M89010
6402i625247m22022J630086m386575O65734J416441o80713J180055N17434l69984K32514
6392i842277j29654j240564N35610q4036l62740N32923J69945k1600M39208p83207k47153
6381a1033545m1656k46500O60185q82511J154869m63046O05678L83721q13067p881N26089
6370a0157664r96429P06337M54316j030016O7496q49121J518119n73647M55521j204381
6360a1609469j61091k45649J211441l32533N24674J75752M3585L20966K01104r82743
$$ y = [-11100752, -10877114, -11631631, -10491969, -9927122, -10693915, -10435913, -10006620, -9660389, -10336928, -9920789, -10576344, -10344070, -10385003, -8886200, -9973483, -10649175, -10248751, -11113984, -10580751, -11133929, -10716552, -9692068, -9759119, -9447135, -9348843, -8934573, -9783469, -9175543, -9194615, -10114257, -9625247, -10047269, -8417183, -12803758, -12138024, -10721583, -11402296, -10222241, -9704807, -10074791, -9842277, -9971931, -11212495, -10676885, -10760921, -11123661, -10590738, -10420793, -10442393, -10003185, -10786392, -11033545, -11075201, -11321701, -10661516, -11544027, -10389158, -10852204, -10246526, -9862805, -10675872, -10683753, -10157664, -11154093, -10447756, -9993440, -11023456, -10955960, -11805081, -10286962, -10860609, -10405088, -11609469, -11770560, -12016209, -10804768, -11137301, -10612627, -10436875, -10393290, -10072324, -9871220, -10853963]
6350a0853963M52569p7915J71053n14540k04262O3792j8396j46853K47870L82037J94557
6339a0304051m96367J41036Q84516n0339O0745j969824N47435M04256k59211J484895
6329i556909j047556n55124O25950m43220J37174j10896p1163l72576j84221m3954L27721
6318a1294774l4722N50020L29036r26590m06876O42692P87502K26880j75423k17719N33412
6307i986562j38534o1720K70651k58825r68345n1808l36693K63837K170n90353J691527
6296a0164655p03426o94625N50186P15094M62171O09276j352861J82779q52784J03567
6286a1145278O6538R9986N60427K55160l4487N56659k99015m23492r39010N29737L19528
6275a0453247n88144o14773M95472P43757j032615J87773K37329J16760L61018P87523
$$ y = [-10853963, -10401394, -10479309, -10308256, -10822796, -11027058, -10963266, -10981662, -11128515, -10880645, -10498608, -10304051, -10800418, -10659382, -9774866, -9825205, -9764460, -11734284, -11186849, -10782593, -11041804, -9556909, -10604465, -11159589, -10533639, -10976859, -10839685, -10950581, -11021744, -11394320, -11578541, -11622495, -11294774, -11329496, -10779476, -10450440, -11377030, -11783906, -11141214, -10353712, -10126832, -10302255, -10519974, -9986562, -10125096, -10186816, -9916165, -10174990, -11143335, -11195143, -11531836, -11267999, -11265829, -11856182, -10164655, -10868081, -11562706, -11012520, -10297426, -9835255, -9225979, -10578840, -10396061, -11248845, -11145278, -11078740, -10978754, -10418327, -10163167, -10197654, -9640995, -9940010, -10363502, -11302512, -10772775, -10453247, -11041391, -11656164, -11160692, -10416935, -11449550, -11261777, -11024448, -10907688, -10546670, -9759147]
6265i759147p48958K28411R13779j762122J89402k42120N96210O55841l67971j95968
6255a0492643k16744q49646L69886L68494M32525q12931K56195M4395L29591l75739
6245a0946617J036082j773646K68089M94099p39117L73494N38873N01317m8800j91627
6235a0487853n48296J44315L13687K46134l05251p67591K57450K64296O50853j46817
6225a0379073K31349M65023m99678K91856j15946R16674l597682P33436O20798l27147
6215a1660390P99053K29947J028700q43972L94231k87316k58503J20439k19198N35199
6205a0161810O02804q41269J3374L65811k08146j052106m08153M97010O80382l04122
6195a0816225j309227Q01242K81518M93920Q49894j564942L99756M01789P94685r42359
$$ y = [-9759147, -10508105, -10279694, -9365915, -11128037, -10938635, -11180755, -10584545, -9928704, -10296675, -10492643, -10709387, -11559033, -11189147, -10820653, -10388128, -11201059, -10944864, -10900469, -10570878, -10946617, -9910535, -11684181, -11416092, -10921993, -11661110, -11287616, -10748743, -10247426, -10296226, -10487853, -11036149, -10891834, -10578147, -10332013, -10637264, -11404855, -11147405, -10883109, -10232256, -10379073, -10147724, -9682701, -10182379, -9890523, -10006469, -9089795, -12687477, -11954041, -11333243, -11660390, -10861337, -10631390, -9602690, -10446662, -10052431, -10339747, -10598250, -10477811, -10697009, -10161810, -9559006, -10400275, -10386901, -10021090, -10229236, -11281342, -11689495, -11192485, -10512103, -10816225, -12125452, -11324210, -11042692, -10548772, -9698878, -11263820, -10864064, -10462275, -9667590, -10609949]
6185a0609949j075757n60785J510735M45769r33896M87729K29705j716297J386803j20378
6175a0956321j015396n57442R96315J034581k21153L49233J216943j111217p55986J576714
6165i443729j126178n21494k80832J18365M06227p34398l99489J77687o42025J000155
6155a1445711j88193P54606O98671J965J47464k01096p11650L70043j84647j19948j39895
6144a1018391l00458m69524J34456k76184L06664m20151L01572J467223K33582K27937
6134i813274j361078J37715p53885P60390M22323M40915j073911p04014P59336J33520
6124a1051963k70838o38920M15012K13008q97165O5955k548318o341490k5466983L3112603
6114a3409099J827315L01659J54863J235678p51387N36791q14634j4431k18122n27501
$$ y = [-10609949, -11685706, -12246491, -10735756, -10289987, -11223883, -10736154, -10506449, -12222746, -10835943, -10956321, -11971717, -12529159, -11532844, -10498263, -10719416, -10370183, -9153240, -10264457, -11020443, -9443729, -10569907, -11091401, -11372233, -11253868, -10847641, -11582039, -11981528, -11803841, -12445866, -11445711, -11633904, -10879298, -10180627, -10178662, -10031198, -10232294, -10943944, -10573901, -10758548, -10878496, -11018391, -11318849, -11788373, -11653917, -11930101, -11623437, -12043588, -11742016, -10274793, -10041211, -9813274, -11174352, -11036637, -11790522, -11030132, -10607809, -10166894, -11240805, -11944819, -11185483, -11051963, -11322801, -11961721, -11546709, -11333701, -12230866, -12164911, -14713229, -21054719, -46521702, -13409099, -11581784, -11280125, -11125262, -9889584, -10640971, -10104180, -10918814, -10933245, -11151367, -11678868]
6104a1678868l38091K269774n60863Q1339j396794P63905Q4177Q2240j60828J77476q3917
6093a0760450m48072o0083J13527L85172k39929L91200k27532l39405L04126N08476k70353
6082a0643323k22692L89106n04645n3354R21833o00783L58591J83269j349132J99741
6072a1321389j28993L77527M61970K09341m42297O4023j90863n11786N87822J66484Q42057
6061i886104l76775N7545J76422l23478Q40451j129660j94209l96153o02415O27535R9247
6050a1107594k27748p82400M45380O08835O95261l46157m28376N78751o782J014657p41714
6039a0297887l96015n73921k11972M12804k37173n72782M32083L48612Q790o30160J23315
6028a1594306J088416J0445n53236L06142M26262M0700L34551o97222k21887K93977N0044
$$ y = [-11678868, -12016959, -9747185, -10308048, -10226709, -11623503, -10859598, -10775421, -10693181, -10854009, -10676533, -10760450, -11208522, -11268605, -11155078, -10769906, -11009835, -10618635, -10846167, -11185572, -10881446, -10372970, -10643323, -10866015, -10476909, -10981554, -11034908, -10113075, -10713858, -10355267, -10171998, -11521130, -11321389, -11450382, -11072855, -10610885, -10401544, -10843841, -10779818, -10970681, -11482467, -10894645, -10728161, -9886104, -10262879, -10205334, -10028912, -10352390, -9511939, -10641599, -10835808, -11231961, -11834376, -11206841, -11107594, -11335342, -12117742, -11672362, -11063527, -10368266, -10714423, -11142799, -10564048, -10570830, -9556173, -10297887, -10693902, -11267823, -11479795, -11066991, -11304164, -11876946, -11444863, -11096251, -11087461, -11717621, -11594306, -10505890, -10495445, -11048681, -10742539, -10316277, -10275577, -9941026, -10638248, -10860135, -10566158, -10516114]
6017a0516114k68638j413415l03224J602891n27338N31780K08319j30378o51239O91833
6007a0775523M44306P01441m58865l12533O7976r73372M79133j35751M63893l94593j60674
5996a1054562K25614p63443J036731k24709J70028O32911L56794j005463J381310O48453
5986h596336l001340k69295P96923J109759j147395m92827M42958k56169o81469K03896
5976a1891295Q11874J61749L34365j30597p54623o8245M78524j071837J453388o09890
5966a1286587L12473m83953K6601k5121j067209l0525J476464J722733q17308j19353
5956a0291785o03112n92113L74041N64604o21937M95924j68078R12845n64570p83777
5946a1277958K49154J481335r16296o5419O3401j79785k343349J288350N16589n89718
$$ y = [-10516114, -10784752, -12198167, -12501391, -10898500, -11425838, -10894058, -10685739, -10816117, -11467356, -10775523, -10331217, -9629776, -10088641, -10401174, -10333198, -11306570, -10827437, -10963188, -10499295, -10893888, -11054562, -10828948, -11592391, -10555660, -10780369, -10610341, -9977430, -9620636, -10626099, -9244789, -8596336, -11597676, -11866971, -11070048, -9960289, -11107684, -11600511, -11157553, -11413722, -12095191, -11891295, -11079421, -10917672, -10583307, -10713904, -11468527, -11536772, -11058248, -12130085, -10676697, -11286587, -10974114, -11458067, -11431466, -11456587, -12523796, -12554321, -11077857, -9355124, -10172432, -10291785, -10894897, -11487010, -11112969, -10548365, -11170302, -10674378, -10842456, -9929611, -10494181, -11277958, -11028804, -9547469, -10463765, -10529184, -10465783, -10645568, -12988917, -11700567, -11183978, -11773696]
5936a1773696p39575O02324M76646O58611k48744k10289o45641O67542q01314J616425
5926a0397711l60662q02069L71459m18143P44010k22292j96929J78521N04401L50248
5916a0249167p88001o84597M39315m26633m35064J305170o77147l67830M19155q07618
5906a2272417l20578K192704l96704p57889J60176o8863N15116p09131P04882J947455
5896i005249j560766K3456m95555p60124R38861p95252P84615l0412j206100J887731
5886a0218795N59859j524382q65804J20311K62378p09001k08960J750116o90232j025648
5876a2550158J124639K78527N83333J6070n81788P10129j15315Q9291o76972m61390
5866a1583634J056026L09493p44091j107484L21755O39418J37497r7894K77692J08371
$$ y = [-11773696, -12513271, -11910947, -11434301, -10775690, -11024434, -11234723, -11880364, -11212822, -12014136, -10397711, -10758373, -11560442, -11188983, -11607126, -10863116, -11085408, -11282337, -11103816, -10599415, -10249167, -11037168, -11721765, -11282450, -11709083, -12144147, -10838977, -11516124, -11883954, -11464799, -12272417, -12592995, -10400291, -10796995, -11554884, -11394708, -11463571, -10948455, -11657586, -10952704, -9005249, -10566015, -10542559, -11038114, -11798238, -10859377, -11654629, -10870014, -10900426, -12106526, -10218795, -9658936, -11183318, -12049122, -11928811, -11666433, -12375434, -12584394, -10834278, -11524510, -12550158, -11425519, -11146992, -10563659, -10547589, -11129377, -10419248, -10534563, -10445272, -11122244, -11583634, -10527608, -10218115, -10962206, -12069690, -11747935, -11108517, -10971020, -11068914, -10791222, -10682851]
5856a0682851o34962q82829J780882j54884k33261n32228M53034m09910k09094l1675
5846a1537778K23277r85617O42051L18000J81936k58915J62923o19191O25970J53830
5836a1093514m17487J147389j211836M4633l15731J008595N32359l71739m35577k53439
5826a1366347R88610m98902k53469L84569K09353j060255k06722J110382K48639j392034
5816a1836176J398567J116570q50602j93909l05706Q90227j615781J60497p75758k31253
5806a2243324J251816j06663l76394K03699J6507m32325J426203r32646K64929P44009
5796a0184189n42182P59667j117733N09139k68881O66668o79392j241311J196744L58616
5786a0542854J69872L92966p05830J79881R55991j942617l07796L41079O43268J146745
$$ y = [-10682851, -11317813, -12200642, -10419760, -10574644, -10807905, -11340133, -10887099, -11297009, -11506103, -11537778, -11314501, -12300118, -11658067, -11340067, -11158131, -11417046, -11254123, -11873314, -11247344, -11093514, -11511001, -10363612, -11575448, -11530815, -11846546, -10837951, -10305592, -10677331, -11112908, -11366347, -10377737, -10876639, -11130108, -10745539, -10536186, -11596441, -11803163, -10692781, -10444142, -11836176, -10437609, -9321039, -10171641, -10365550, -10671256, -9781029, -11396810, -11236313, -12012071, -12243324, -10991508, -11098171, -11474565, -11270866, -11254359, -11686684, -10260481, -11193127, -10928198, -10184189, -10726371, -9966704, -11084437, -10575298, -10844179, -10177511, -10856903, -12098214, -10901470, -10542854, -10372982, -9980016, -10685846, -10505965, -9549974, -11492591, -11800387, -11459308, -10816040, -9669295]
5776i669295q15144p6558J272691j162473q4563l38513l9167l37072l51141N67689P89115
5765a0244431n62879M50537j463735J583570J23585O55381j182365J88247o1162P89014
5755i724238l17334j723189J46272P27337P08041j397158L69168L281k05982K89206
5745a1124596j002929J16815N45336N66123l86330q31026M69748l07605L53488o30148
5735a2231124O73808l03454j123569J355156R33037k52865l43044Q80070j017740n36504
5725a1966229L43042O18744j80838j201355K71927n20188J56153j05004P43535J141739
5715a0698474k059577J428706j446647J74162j038528k67414N47884J297075r76029n19141
5705a3557983R99521m46278P48410k57245o56812q24015P68234k11050K25411q05375
$$ y = [-9669295, -10484439, -10560997, -9288306, -10450779, -10535342, -10873855, -10913022, -11250094, -11601235, -11033546, -10244431, -10807310, -10356773, -11820508, -10236938, -10113353, -9457972, -10640337, -10452090, -10513252, -9724238, -10041572, -11764761, -11618489, -10891152, -10183111, -11580269, -11211101, -11207820, -11413802, -11124596, -12127525, -12010710, -11465374, -10899251, -11285581, -12116607, -11646859, -11954464, -11600976, -12231124, -11557316, -11860770, -12984339, -11629183, -10696146, -10949011, -11292055, -10411985, -11429725, -11966229, -11623187, -11004443, -11185281, -12386636, -12114709, -12634897, -12478744, -12583748, -11840213, -10698474, -12758051, -11329345, -12775992, -12601830, -13640358, -13907772, -13359888, -12062813, -13038842, -13557983, -12558462, -13004740, -12256330, -12513575, -13170387, -13994402, -13226168, -13437218, -13211807, -14017182]
5695a4017182N73574J40281r17540k42364L11255J339961j536357o72769l35950J03915
5685a5253176p70491j896001l106703l817960o967248Q2956650l5224739j1106511o014123
5676a200302j372062q39781k400937j219249q13831o41079J8333r0165j051128J82101
5666i428100N12168o44759M12973l91347K26656q44928l3431L29781N64434m67368K748052
5655g015869j988937j168006L69638l72745M58669M52367j61369m85101q22055Q0255
5645a0653153K06516P76063n56312q21134P81788N60579j58914K59189j840221k27537
5635a1673136L60818j27604O5958o3366q4183O22415K18126J05400L32220o53008k96830
5624a1193190L14709J061740j86411j027283J064958k89202j17251j848577j60800J239180
$$ y = [-14017182, -13443608, -13303327, -14220867, -14463231, -14151976, -12812015, -14348372, -15021141, -15357091, -15253176, -16023667, -17919668, -21026371, -24844331, -31811579, 51145071, 15920332, 4813821, -1200302, -2572364, -3412145, -5813082, -7032331, -7846162, -8487241, -8468908, -8559073, -9610201, -9428100, -8915932, -9560691, -9147718, -9539065, -9312409, -10157337, -10190768, -9860987, -9296553, -9763921, -7015869, -9004806, -10172812, -9803174, -10175919, -9717250, -9264883, -9426252, -9911353, -10733408, -10653153, -10446637, -9670574, -10226886, -11048020, -10266232, -9705653, -9864567, -9605378, -11445599, -11673136, -11312318, -11439922, -11373964, -11437330, -11521513, -10899098, -10680972, -10575572, -10243352, -10896360, -11193190, -10878481, -9816741, -10003152, -11030435, -9965477, -10254679, -10371930, -12220507, -12381307, -11142127]
5614a1142127O68372p75846O77624q8701o95916J177825J280768j847784k10137R95357
5604i960565o08925P1078N35485m13752o8762O4266J51037j196522K78599K29743n15197
5593a1433515M87505l01724R33727j78012J43124j71117J6994R7823k19587O2574o90718
5582a1252926P35969k12652m10178M6814p39845Q5881J276100j36727R6458m24736K41702
5571a0694140M00940l72796J73152o55864J653431n74134m01616k427293M02640Q37577
5561a1658103J100854j112991L1523l7986J103095n23774p90610N06997l61811o0891
5551a1803697m49837L3770J070148J71416q26748J25961l98381J01447o66802m44284
5541a3087007Q62675P20024J452L6861j201474J350208O7087j2164j96732K31003O31227
$$ y = [-11142127, -10473755, -11249601, -10571977, -10660678, -11356594, -10178769, -8898001, -10745785, -10955922, -9960565, -10569490, -10498412, -9962927, -10376679, -10445441, -10381175, -10230138, -11426660, -11148061, -10918318, -11433515, -10946010, -11247734, -10314007, -10492019, -10348895, -10520012, -10503018, -10405195, -10624782, -10562208, -11252926, -10516957, -10729609, -11139787, -11092973, -11832818, -11746937, -10470837, -10607564, -10511106, -10935842, -10694140, -10293200, -10665996, -10492844, -11148708, -9495277, -10069411, -10471027, -12898320, -12495680, -11658103, -10557249, -11670240, -11638717, -11676703, -10573608, -11097382, -11887992, -11380995, -11742806, -11803697, -12253534, -12219764, -11149616, -10978200, -11804948, -11678987, -12077368, -11975921, -12642723, -13087007, -12224332, -11504308, -11502856, -11465995, -12667469, -11317261, -11250174, -11262338, -11459070, -11228067, -10596840]
5530a0596840o54203m77147o2315k64406J320841j703570j44358q92446O01970J47989
5520a2724485o4943j030770P72844K222817Q02397n28954k46172o49623j53516L88259
5510a1212146r7620M36995r91090O7385M79536J63578J74834l03666O78758N00693L42505
5499i760238p33591n16556o55362j34179l83220P1954N32884p47968J228983L72327n09026
5488a1233992j043144M72666r1170J744078j310802m61960K17617N02423O43759o1929
5478a0622454j242811Q74360n41892R22218K40974j432347n64189O62195j711593J245253
5468a2170286k774131K040346J15697l56441r84792m830885J87324N236135J647866J7153
5458a1872014P53330j41174J781921p66947j41144n25038p11494R73035l72452N08219
$$ y = [-10596840, -11251043, -11728190, -11790505, -12054911, -10734070, -12437640, -12581998, -13474444, -12872474, -12724485, -12789428, -13820198, -13047354, -10824537, -10022140, -10551094, -10797266, -11446889, -11600405, -11212146, -11309766, -10872771, -11863861, -11796476, -11316940, -11153362, -10978528, -11282194, -10603436, -10102743, -9760238, -10493829, -11010385, -11665747, -11799926, -12183146, -12111192, -11578308, -12326276, -11097293, -10724966, -11233992, -12277136, -11804470, -11895640, -10151562, -11462364, -11924324, -11706707, -11204284, -10560525, -10622454, -11865265, -10990905, -11532797, -10610579, -10369605, -11801952, -12366141, -11703946, -13415539, -12170286, -14944417, -12904071, -12788374, -13144815, -14129607, -18960492, -18773168, -13537033, -11889167, -11872014, -11118684, -11259858, -9477937, -10244884, -10386028, -10911066, -11622560, -10649525, -11021977, -10513758]
5448a0513758k6930p05802L42197J617596o40286j811089M80448j43580r9229N59839
5438a0940594J38673O62501O90306J98747N4234k24769O33137j655316Q93900o35457
5428a0184638l50537O62478L99089r63917k21933J372060j638256k05994m68958L26773
5418a1273833N34586r32459J938968p68967k53839R27221q5659j719761J242280o47547
5408a1039010L55334J66415n28368r02675k66861P63119l13876l71725J188703L6553
5398a0912391l37526p67720k31724P62295p85136J682500j80117K85526O01339r60125
5388a0843079j038218J432940r55892P28502l60394j13983k64902J151809m36568J227
5378a0698558L22960O42386l67588m7286N07111R64382q96292J69052q9559J38152q30217
$$ y = [-10513758, -10540688, -11246490, -10904293, -9286697, -9926983, -11738072, -11257624, -11401204, -11500433, -10940594, -10801921, -10139420, -9449114, -9250367, -9196133, -9420902, -8787765, -10443081, -9549181, -10184638, -10535175, -9872697, -9473608, -10437525, -10659458, -9287398, -10925654, -11131648, -11600606, -11273833, -10739247, -11671706, -9732738, -10501705, -10755544, -9828323, -9913982, -11633743, -10391463, -11039010, -10683676, -10517261, -11045629, -11948304, -12215165, -11452046, -11765922, -12137647, -10948944, -10912391, -11249917, -12017637, -12249361, -11487066, -12272202, -10589702, -10769819, -10484293, -9882954, -10843079, -11881297, -10448357, -11404249, -10675747, -11036141, -11150124, -11415026, -10263217, -10699785, -10698558, -10375598, -9733212, -10100800, -10148086, -9640975, -8676593, -9572885, -9403833, -9493392, -9355240, -10185457]
5367a0185457N81311J62925l45260j50431l26448Q12012Q42756q98825j023413J286272
5357i244558n20649O08723K50553R422j047855j73868Q71949J041670j360209N22892
5347i041930Q50064o38827O82875j137128j14500L17998n16260p83665R43690O66756o9475
5336h840402Q2106M92812L34423J03462K28549J00669O35917J31379m74672K20671R03049
5325f082037n15782J58458l30735J337849m12191L25115J69782L04745K59525Q72496
5315c912775j001394R42439J019407n37744Q97166l00763N52291M21677J064176l69275
5305a224795l47941R69363j830819n11952j605869n26257k94037K28789j3502J32774q4373
5294e108619q61655j96838j580122N72082J388p26699l53064L990670j700009P142L09901
$$ y = [-10185457, -9604146, -9441221, -9786481, -9936912, -10263360, -9451348, -8608592, -9507417, -10530830, -9244558, -9765207, -9156484, -8905931, -8896509, -9944364, -10118232, -9246283, -8204613, -9564822, -9041930, -8191866, -8830693, -8147818, -9284946, -9399446, -9081448, -9597708, -10381373, -9437683, -8770927, -8840402, -8758296, -8265484, -7931061, -7827599, -7599050, -7498381, -6862464, -6731085, -7205757, -6985086, -6082037, -6597819, -6439361, -6770096, -5432247, -5844438, -5519323, -5349541, -5044796, -4785271, -3912775, -4914169, -3971730, -2952323, -3490067, -2592901, -2893664, -2341373, -1919696, -855520, -1224795, -1572736, -603373, -2434192, -2946144, -4552013, -5078270, -5372307, -5143518, -5157020, -5024246, -5108619, -5970274, -6167112, -7747234, -7175152, -7173764, -7900463, -8253527, -4262857, -5962866, -5955724, -5645823]
5283e645823M05069K007158J219978P75969K12401J14431O41274K67471M27696q89470
5273d63846N46522l61966J73117k81174j90339k407618K858726K07748K55593L28627
5263F65390p74650j97778p00885j318535j231200Q28698q09228q39070n5083q46376
5253e278717J215098L33807M25555l19365k56278j729314j939974j904692j1460030
5244b0913910l2217864P1905961p145191l236434k210242M88761J438451k12071n44236
5235G353225j517279O7123K369074r03364o1418J36242o80205N67096K184234J181159
5225A0695887n62772N93983Q17220m82305J96385k82155Q74673J157284q42514L18269
5215A2483955L42374P31378P19702J010955m16294j613354l9071j417583j803926j329464
$$ y = [-5645823, -5240754, -3233596, -2013618, -1237649, -1025248, -910817, -269543, -2072, 425624, -463846, 82676, -279290, -106173, -387347, -577686, -2985304, -126578, 81170, 336763, 665390, -109260, -307038, -1007923, -2326458, -3557658, -2728960, -3538188, -4377258, -4432341, -5278717, -4063619, -3729812, -3304257, -3623622, -3879900, -5609214, -7549188, -9453880, -20913910, -53131774, 18774187, 11628996, 8392562, 6182320, 6671081, 8109532, 7897461, 7353225, 5835946, 5903069, 8272143, 7368779, 7307361, 7443603, 6763398, 7330494, 9514728, 10695887, 10133115, 10727098, 11544318, 11062013, 11258398, 10976243, 11850916, 13008200, 12165686, 12483955, 12826329, 13557707, 14277409, 15288364, 14872070, 13258716, 13219645, 11802062, 9998136, 8668672]
5205H668672P37878j386512n89619O53999J517606l27163J211463j56846o74216J063488
5195A0718750Q78544J197360J215096P34576K708449k07446N61431o94569J227589M83810
5185A8823590j818794p11804m43549q35492M2456P32177J220383J282773K180581K17705
5175B0690026K745163L227359M336993K756308M546585J002225K99025j316699r30945
5166C7356040L38094J931171J167972P08301J681091J205136K766800j326368o29647
5157D5198590l031552n761252n843094k313339J472777L010006N245142N059411M023130
5148D7059819J857488l39393o03048m03517J447670r24348J255052K53502j352454J78133
5138D8428904O02206K662630J828521J436685P16595R66466M181431O917043N113844
$$ y = [8668672, 9406550, 8020038, 7430419, 8084418, 9602024, 9274861, 10486324, 10329478, 9655262, 10718750, 11597294, 12794654, 14009750, 14744326, 17452775, 17245329, 17806760, 17112191, 18339780, 18823590, 17004796, 16292992, 15849443, 15013951, 15056407, 15788584, 17008967, 18291740, 20472321, 20690026, 23435189, 26662548, 30999541, 33755849, 38302434, 39304659, 39603684, 38286985, 37356040, 37694134, 39625305, 40793277, 41501578, 43182669, 44387805, 47154605, 45828237, 45198590, 42167038, 36405786, 30562692, 28249353, 29722130, 32732136, 37977278, 43036689, 47059819, 48917307, 48577914, 47974866, 47571349, 49019019, 48094671, 49349723, 49603225, 48250771, 48428904, 49031110, 51693740, 53522261, 54958946, 55675541, 56642007, 60823438, 67740481, 72854325]
5129G2854325M143828K268404L50281J438808M281915P149441O193132N831412O914706
5120A11426252R672593J0595010J3397284J2497269J2122535R055913P124838M634411
5112A90526105P555175O802194Q400092J0203401N174242R995096R040073Q321088O875750
5103B62893216L617958k408130p579800r389277q788721m275117N90358J481587M882590
5094B41024664M623760M063918j709066L056663L085183N225410M537390K928230M721437
5085B71557589P223457J0749088J1767594J2458936J1812460J6312447K1375531K5267305
5077C88524407K8132469K9083083K5730302J4526739K847814k512547l841522n972168
5069D76518577n579723j140544J3848927L6200863N6123290P0882826P0300058N7215127
$$ y = [72854325, 76998153, 79266557, 79616838, 81055646, 85337561, 92487002, 98680134, 104511546, 111426252, 121098845, 131693855, 145091139, 157588408, 169710943, 178766856, 185891694, 190526105, 198081280, 204883474, 213283566, 223486967, 228661209, 238656305, 247696378, 256017466, 262893216, 266511174, 264103044, 256523244, 247133967, 238345246, 234070129, 234660487, 236142074, 241024664, 245648424, 249712342, 248003276, 251059939, 254145122, 259370532, 263907922, 266836152, 271557589, 278781046, 289530134, 301297728, 313756664, 325569124, 341881571, 363257102, 388524407, 416656876, 445739959, 471470261, 485997000, 488844814, 486332267, 482490745, 476518577, 470938854, 469798310, 483647237, 519848100, 575971390, 646854216, 717154274, 774369401]
5061G74369401L8610457K4189652J6309192L3912075N7248040Q1782233J03851363
5054A130272413J02200157R8795849Q5168068O5349442J6722275n6068769j45339729
5047A297099706k12252174k26752876j97573080j37607800q0386882m0017608j5759936
5040C86749350j4547337k4216067l7258366m3182788m1949009l2402065j9200026q101617
5032A65892075k322778m268514j1792676j8265041k6119279k6695914k2019000j4947096
5024C9461777q425770k142451K625980K735963L173897K197868N735314J2374482J1390855
5015F9127915O410699O34065r55965k517545n36992R40782K428907K323979l19235k895850
5005G4640760k666843j714173M00381J761082J674380J253941j564693k647870k736602
$$ y = [774369401, 812979858, 837169510, 853478702, 887390777, 944638817, 1026421050, 1130272413, 1232472570, 1331268419, 1416436487, 1481785929, 1498508204, 1442439435, 1297099706, 1084847532, 858094656, 660521576, 522913776, 442526894, 402509286, 386749350, 372202013, 347985946, 310727580, 267544792, 225595783, 193193718, 173993692, 165892075, 163569297, 159300783, 147508107, 129243066, 103123787, 76427873, 54408873, 39461777, 31036007, 28893556, 31519536, 34255499, 37429396, 39627264, 45362578, 57737060, 69127915, 75538614, 76172679, 75216714, 72699169, 72162177, 73102959, 75531866, 77855845, 77536610, 74640760, 71973917, 70259744, 70660125, 72421207, 74095587, 75349528, 73784835, 71136965, 68400363]
4996F8400363J15749n56019l980573q836080j1100411j1863457r879471o387870p42456
4987A5169775K063204K990744L672693K997103L309151j254753m82599K88854M62149
4978B9216321l47038k837911j482315l128448j418990m72998O2723j814476j500333
4969A6276535j881233j368904Q27956j299423q60022k675448l883749o320588j924844
4960c109720l54552N25950J388637p34307k125274k678862j723964o65444l077993l026622
4950a5582151j684292j958536j644935k928838o58604m14780k642139j908896j493896
4941c0917067J416292m06469P27463O39211J455395J184678M17963J909661L069193
4932b0503680L407882K733610L585619K725360J311766M35422J476377N41493m97444
$$ y = [68400363, 68516112, 67960093, 63979520, 55143440, 44043029, 32179572, 22300101, 15912231, 15169775, 17232979, 20223723, 23896416, 26893519, 30202670, 28947917, 28465318, 28754172, 29216321, 28869283, 26031372, 24549057, 21420609, 20001619, 19528621, 19591344, 17776868, 16276535, 14395302, 13026398, 13854354, 12554931, 11694909, 9019461, 5135712, -1184876, -3109720, -3464272, -2938322, -1549685, -2283992, -4409266, -7088128, -8812092, -9477536, -12555529, -15582151, -17266443, -19224979, -20869914, -23798752, -24457356, -24872136, -27514275, -29423171, -30917067, -29500775, -29907244, -29179781, -28540570, -27085175, -25900497, -25482534, -23572873, -20503680, -17095798, -14362188, -10776569, -8051209, -6739443, -6304021, -4827644, -4286151, -4783595]
4923d783595R89012m93082O5780k252948j564190M46033j891750j155632M05167K05159
4913a0030046O12073n7853k260504J056408P63466n98803P62978J24234m23543M33575
4903i618015j228497r20246k01542p93860Q03693Q25978l4899M19802K21892P86415q79126
4892a0618405k3538r07604M42567L4684j30958M97456q07417k14732K16606M17732j184278
4881a2277887J079934P6420O77297J346888k22962j422412L77021J13150p2090N81670
4871i742971J492155L93544m84879K43738J417950M70087p9531j462542l28765J052855
4861g028359j80568N2058J273207p8983l90099O7916p6742p30482J32649K93861k10601
4850f876143j318372Q80352M3193J41133L77223P13375K60764M65397l52275p66080J83250
$$ y = [-4783595, -3794583, -4287665, -4221885, -6474833, -8039023, -7592990, -9484740, -10640372, -10235205, -10030046, -9417973, -9475826, -11736330, -10679922, -9916456, -10515259, -9752281, -9628047, -10051590, -9618015, -10846512, -11766758, -11968300, -12762160, -11958467, -11132489, -11167388, -10747586, -10525694, -9739279, -10618405, -10641943, -11549547, -11106980, -11072296, -11203254, -10705798, -11513215, -11727947, -11511341, -11093609, -12277887, -11197953, -11121533, -10444236, -9097348, -9320310, -10742722, -10365701, -10252551, -10324641, -9742971, -8250816, -7857272, -8342151, -8098413, -6680463, -6210376, -6289907, -7752449, -8081214, -7028359, -7208927, -7156869, -5883662, -5962645, -6352744, -6284828, -6361570, -7092052, -6959403, -6665542, -6876143, -8194515, -7314163, -7270970, -7129837, -6752614, -6039239, -5778475, -5313078, -5665353, -6431433, -6248183]
4839f248183p41483o06448o24612j220266k8709l53112J072258j287995r46259M53608
4829a0531201J073527m99038k27534J088230P57365m48172O17511P36250N94084j26229
4819f965207N10963P46869J269568K70995J167127l72134p23508l25097j692287k988732
4809i101443n611695k1276218L8839411j835176j321073k026552K37292J47455m16704
4800b364703P47710R13502r34757n7905J130243J97577P48990O62054N3234J36390M00650
4789A632985J140098j560031j655703j640465j254485j289200j202038K87092k02014
4780e743761l13894j96284l88789N78198p70017j192285j99249n0245J348944l21383
4770g248765O19999K61800r35254J106125J62950Q33562o94876p30618l12050n48438
$$ y = [-6248183, -6989666, -7596114, -8220726, -9440992, -9469701, -9822813, -8750555, -10038550, -10984809, -10531201, -9457674, -9956712, -10184246, -9096016, -8338651, -8786823, -8169312, -7433062, -6838978, -6965207, -6454244, -5707375, -4437807, -4166812, -2999685, -3371819, -4095327, -4420424, -6112711, -9101443, -14713138, -35989356, 2850055, 1014879, -306194, -2332746, -2095454, -1947999, -2364703, -1616993, -703491, -1638248, -1696153, -565910, -368333, 380657, 1042711, 1095945, 1232335, 1632985, 2773083, 1213052, -442651, -2083116, -3337601, -4626801, -5828839, -5541747, -5743761, -6057655, -6253939, -6642728, -6064530, -6834547, -8026832, -8226081, -8276326, -6927382, -7248765, -6628766, -6366966, -7302220, -6196095, -6033145, -5199583, -5894459, -6625077, -6937127, -7485565]
4760g485565P06268j77724k84865J81545N05354j015787O92545O37842O26061k030674
4750g645000m48157K10476O53624l73528j496662O91966Q66491q13888J037613Q00034
4740f517031q11113m21539N54053N30092n14265j288480p24506J046460q08164Q63656
4730h090837K53409n57066P94707m47491M08300n27176j170641K351048M13701j122343
4720g694389J123153j54137l25128j76501N88992q50321Q47054o91160m02934P59807
4710f975564j210363J85874R74055m17969j153542p50007J132297j88196n4589j06353
4700h564357m58454J320235j020073n22084R1703M28615j18264n5744M67733K44217n30505
4689h716978J6609q00321l68806M89738j44320K25933J448893j338782J093255q45325
$$ y = [-7485565, -6779297, -6957021, -7241886, -7060341, -6554987, -7570774, -6878229, -6240387, -5614326, -7645000, -8093157, -7882681, -7229057, -7602585, -9099247, -8407281, -7540790, -8354678, -7317065, -6517031, -7328144, -7749683, -7195630, -6665538, -7179803, -8468283, -9192789, -8146329, -8954493, -8090837, -7837428, -8394494, -7599787, -8047278, -7638978, -8166154, -9336795, -6985747, -6572046, -7694389, -6571236, -6725373, -7050501, -7227002, -6638010, -7488331, -6641277, -7332437, -7735371, -6975564, -8185927, -8000053, -7025998, -7443967, -8597509, -9347516, -8215219, -8403415, -8458004, -8564357, -9022811, -7702576, -8722649, -9244733, -9153030, -8724415, -8842679, -8898423, -8430690, -8186473, -8716978, -8700369, -9500690, -9869496, -9379758, -9524078, -9298145, -7849252, -9188034, -8094779, -8940104]
4679h940104j316032N03037J185107o65161N15117l74564K38374J095252k084332J285316
4669h557990n67039N77509r00573J117250j39349k03293l90800m58161L58313M7802M26962
4658h689369j008209l69347J172223l76833J66307M75497l6001Q0672p62386Q45598j13932
4647h615780J87091R54256N13710o34412j47033k01615J16495p5165k25815P25417m20992
4636g823843n17721R3046N65470J91140j081073K62950K85496N45743r17270P90381K75619
4625g330062m48167o83627J68844j63448M79562K12255n72658K68044o43627O05306L55621
4614g751957k092680M59913J41596L68271j21409o80120P24656M3187J11645o63029
4604i459927J308425k5176O23856N92026j117493P028N74519n25340j06876l66198j47859
$$ y = [-8940104, -10256136, -9753099, -8567992, -9233153, -8718036, -9092600, -8854226, -7758974, -9843306, -8557990, -9125029, -8547520, -9448093, -8330843, -8470192, -8673485, -9064285, -9522446, -9164133, -9116331, -8689369, -9697578, -10066925, -8894702, -9271535, -9105228, -8629731, -8665732, -8585060, -9347446, -8501848, -8615780, -8428689, -7474433, -6960723, -7595135, -7742168, -7943783, -7827288, -7902453, -8128268, -7402851, -7823843, -8341564, -8248518, -7683048, -7491908, -8572981, -8310031, -8024535, -7478792, -8396062, -7605681, -7330062, -7778229, -8461856, -8293012, -8456460, -7976898, -7764643, -8337301, -8069257, -8712884, -8107578, -7751957, -9844637, -9384724, -9243128, -8874857, -8996266, -9676386, -8951730, -8908543, -8796898, -9459927, -8151502, -8176678, -7552822, -6960796, -8078289, -8071261, -7496742, -8022082, -8128958, -8495156, -8643015]
4593h643015J023903j374621j25868j326098J508916J115932q90854N69882J147675
4584f994148j718130J215731p22923j88353P33898o40098m37482j23186R4090J165737
4574g614864p20202j79176k62583M36417K91580K80871l40803m56558K29369J013080
4564g322869M52096K25075j253314N7986q0558n65546o7389j015708P40003J59156L69345
4553h301723q07235k28202M91213k1541O43164n84999j27286q91042N29774J28421q83701
4542a0053157K003351r17043n92471J15046M17293k07932j99380J31103k04952m15451
4532i923593N9873J89370M6905Q80862L5362k066960L86553j08583j182572K948588
4522h734195J118353j112745l44602K28137O11987q44351J087415j564378m62791M70903
$$ y = [-8643015, -7619112, -8993733, -9119601, -10445699, -8936783, -7820851, -8711705, -8141823, -6994148, -8712278, -7496547, -8219470, -8407823, -7673925, -8314023, -8751505, -8874691, -8780601, -7614864, -8335066, -8514242, -8776825, -8340408, -8048828, -7767957, -8108760, -8565318, -8335949, -7322869, -6870773, -6645698, -7899012, -7841026, -7921584, -8487130, -8554519, -9570227, -8830224, -8671068, -8301723, -9108958, -9337160, -8845947, -8867488, -8224324, -8809323, -8936609, -9827651, -9297877, -9169456, -10053157, -8049806, -8966849, -9559320, -9444274, -9026981, -9234913, -9434293, -9303190, -9508142, -9923593, -9863720, -9674350, -9627445, -8746583, -8711221, -10778181, -10391628, -10500211, -11682783, -8734195, -7615842, -8728587, -9073189, -8845052, -8233065, -9077416, -7990001, -9554379, -10017170, -9546267]
4512i546267J92273R68864p91561r59139M81152l79042O95715J242824M33797k237724
4502i899108J405004M02113q96320o58161J236759J13613J421471r91117L32479N71743
4492f961524j939921j54476K92433P07822o91906P4422m73163o233J65354k44951K59004
4481h973139q46920J815890j473851N06861P8722O60036O9609n16288l93777p8818K20236
4470h931439k6660J15411P67246l61570j85966J075598k23608l22339M41949q08408J89372
4459h270414j304368p8798J9520r7396P25012p04897M606J230464j854827M35813J06069
4448i789216J015800l53265R57457r97403j12773m4555j22365p45186L80639p54533R52139
4437i613261K80240l22393m20329k81092K53747J2503o1547J399154n30460j19193L65375
$$ y = [-9546267, -9353994, -8385130, -9176691, -10135830, -9654678, -10033720, -9338005, -8095181, -7661384, -9899108, -8494104, -8091991, -8988311, -9646472, -8409713, -8296100, -6874629, -7865746, -7533267, -6961524, -8901445, -9055921, -8763488, -8055666, -8747572, -8673150, -9146313, -9152546, -8987192, -9232143, -8973139, -9820059, -8004169, -9478020, -8971159, -8892437, -8232401, -8162792, -8679080, -9072857, -9151675, -8931439, -8958099, -8842688, -8075442, -8437012, -8622978, -7547380, -7770988, -8093327, -7651378, -8459786, -8270414, -9574782, -9653580, -9634060, -9731456, -9006444, -9711341, -9706735, -8476271, -10331098, -9895285, -9789216, -8773416, -9126681, -8169224, -9166627, -9279400, -9323955, -9446320, -10191506, -9810867, -10565400, -9613261, -9333021, -9655414, -10075743, -10356835, -10103088, -10090585, -10152132, -8752978, -9283438, -9402631, -9037256]
4426i037256n19414P866N16856l82047m83993N40301j73767O84389J55482m11280k18304
4415i321167l45167J968597k127223Q16628R07775p41161M3827J2775M63778j157444
4405i478782r32767Q4555O75955p44959P12424L64162j309416n5189L28708j05829M64637
4394i996501K68000p71603J46406m0764n92115K7770J192183j74168j15908l96289J69103
4383a0283886j232395N92868k5394m76244j7431R23758j493920k11807j519714j899811
4373a5643976m535309j2262418M5870054j2113221k883536k726587j416023l61762p52322
4364f825100k33512J19518O88766o17638n82690l57804n18981R56922o24557Q67056p63542
4353g891562o5074N62741k20887M0839R8934k082730O43664M46628k09689m7458K17611
$$ y = [-9037256, -9556670, -9548804, -9031948, -9413995, -9897988, -9357687, -9531454, -8847065, -8691583, -9102863, -9321167, -9666334, -7697737, -9824960, -9008332, -8100557, -8841718, -8797891, -8785116, -8321338, -9478782, -10411549, -10326994, -9651039, -10395998, -9683574, -9319412, -10628828, -10684017, -10355309, -10461138, -9996501, -9728501, -10500104, -10353698, -10394462, -10986577, -10958807, -9766624, -9940792, -10056700, -10452989, -10283886, -11516281, -10923413, -10948807, -11425051, -11442482, -10518724, -12012644, -12224451, -13744165, -15643976, -20179285, -32441703, 13428351, 1315130, -1568406, -4294993, -5711016, -6072778, -6825100, -7058612, -6939094, -6250328, -6867966, -7450656, -7808460, -8327441, -7370519, -7995076, -7128020, -7891562, -7956636, -7393895, -7614782, -7573943, -7475009, -9557739, -8914075, -8467447, -8677136, -8724594, -8506983]
4342h506983O02788j56508l22991m28569O32495p87768l75650L92166l77481Q95642L8229
4331h394630J242362j033347Q3191m85364m48540Q15600J39292R3362l277258J421475
4321i843857N47680j64304M72617p21952n88770M18310P80417k79668q71534J424121j9999
4310h846939j178889J76262P72941o24902J454314l15649j190086L08705R80959n99348
4300i062632P3611n00449K39041P55207K61496j001514O64869q80676j92603P63404k01273
4289i081519O85341j154848P45771m85152m31152o39820N26550K70015K40277r50317
4279a0274854k303604M534711m95360o9736K130014l39602j537890j321606K68101N06609
4269h903217O38724j2180p8167r22399Q64622p90452J399010r76411o9665l03731j02761
$$ y = [-8506983, -7904195, -8060703, -8383694, -8812263, -8179768, -8967536, -9343186, -8951020, -9328501, -8432859, -8394630, -7152268, -8185615, -8102424, -8587788, -9036328, -8220728, -8081436, -7988074, -11265332, -9843857, -9296177, -9460481, -8987864, -9709816, -10298586, -9880276, -9099859, -9379527, -10251061, -8826940, -8846939, -10025828, -9849566, -9076625, -9701527, -8247213, -8562862, -9752948, -9444243, -8463284, -9062632, -8989021, -9489470, -9250429, -8495222, -8233726, -9235240, -8570371, -9451047, -9643650, -8880246, -9081519, -8396178, -9551026, -8805255, -9290407, -9721559, -10361379, -9834829, -9564814, -9324537, -10274854, -12578458, -8043747, -8539107, -8608843, -6478829, -6818431, -8356321, -9677927, -9409826, -8903217, -8264493, -8276673, -8354840, -9277239, -8412617, -9203069, -7804059, -8780470, -8850135, -9153866, -9256627]
4258i256627m4226N39295K59520o9919q37983l52312o5373J030021n50270k33847M32892
4247i148829O90082j203686O00216L3375L84665j515906P37184K17228O8393j443089
4237a0580367J108995J411564J35536o2500j451716O03301k12067R161p09510r6356
4227i843959J281443P0227l78121L22412j44681J972042j586830o3232M21441k99152
4217h248410m91043O19333l17459K34963M1042K01649j370647j50901K65141R46969K37107
4206h032256j48691o85350o97679M82791l5691R1829O54962q59551L94759P3016p4282
4195h836143J14658J31124j30360p16660P94016M7648N69782N93914j133103n24367O1351
4184i028140l27800l25077J92457m8640m18908Q81375J84586n13784K30894n39942O74381
$$ y = [-9256627, -9300853, -8761558, -8502038, -8571957, -9409940, -9762252, -9827625, -8797604, -9347874, -9581721, -9148829, -8458747, -9662433, -9062217, -9028842, -8644177, -10160083, -9422899, -9205671, -9137278, -10580367, -9471372, -8059808, -7924272, -7986772, -9438488, -8835187, -9047254, -9038093, -9747603, -9843959, -8562516, -8492289, -8870410, -8547998, -8692679, -6720637, -8307467, -8370699, -7949258, -8248410, -8739453, -8120120, -8437579, -8202616, -8161574, -7959925, -9330572, -9481473, -9216332, -8269363, -8032256, -8180947, -8866297, -9563976, -9081185, -9116876, -9025047, -8370085, -9229636, -8834877, -8761861, -8836143, -8721485, -8590361, -8720721, -9437381, -8643365, -8595717, -8025935, -7432021, -8565124, -9089491, -9028140, -9355940, -9681017, -9488560, -9537200, -9956108, -9074733, -8890147, -9403931, -9173037, -9712979, -9038598]
4173i038598M68932m47511L81812j474217J624248r36505J07588R03948j420514R5796
4163i735021K81876k9314L71756n67603J050955j50134o55683O32976N28809k8954q10975
4152i111312K7523j29586L1765k99939k89771M02523O46150l28605j415169J705252K54164
4141h507005j652662K74569M44654n09933J761377j260466L78396q41037N99532K12197
4131i100378O5935j229530L85471L00143P81201J18811k8880J342650k15440q70787L42735
4120h108069l86548j107425n08838K97283J176851N20765o97510p62588o6370K07512
4110i434937L27557N032n31700Q12915j116517o1984M72749L41177Q7191q36693j03122
4099a0038332L65407M14813J178711j294603L02425O0624l76729Q0307k28361o013k80093
$$ y = [-9038598, -8569666, -9017177, -8635365, -10109582, -8485334, -9421839, -9314251, -8410303, -9830817, -9735021, -9453145, -9482459, -9110703, -9678306, -8627351, -8777485, -9433168, -8800192, -8271383, -8300337, -9111312, -9083789, -9213375, -9181610, -9481549, -9771320, -9368797, -8722647, -9051252, -10466421, -8761169, -8507005, -10159667, -9885098, -9440444, -9950377, -8189000, -9449466, -9071070, -9912107, -9312575, -9100378, -9034443, -10263973, -9878502, -9578359, -8797158, -8678347, -8707227, -7364577, -7580017, -8450804, -8108069, -8494617, -9602042, -10110880, -9813597, -8636746, -8115981, -8813491, -9576079, -9642449, -9434937, -9107380, -9102348, -9634048, -8821133, -9937650, -9999634, -9526885, -9185708, -9098517, -9935210, -10038332, -9672925, -9258112, -8079401, -9374004, -9071579, -9010955, -9387684, -9307377, -9535738, -9541751, -9821844]
4088i821844m29459N08365R27748j049029R51032j328077L87101P01328J33317n91023
4078i610541N69335p01322J71579K63608J61778Q84752j116219j32553N57427N6086q42675
4067i738745O50170N9564J161749j094580K62386j539954n03P49103J034631j339377N1137
4056i744419O28616K18093m23669J688849j219493N77916p98541k80313j45142L70650
4046i127453o16493N12627p64159L21443k49122r8085r4118Q27279m84521p10847J560152
4035h923297n9707n99317o33367J35688N84799l72157j644910R97391J350991M9331
4025i114555j289311j03402J244687Q7638o73111m1822P65550Q50080j069816L68892
4015h975170j663964P83702q837r2213R34684r21571J95950K8038J165011r37885k00680
$$ y = [-9821844, -10251303, -9742938, -8815190, -9864219, -8913187, -10241264, -9854163, -9152835, -9019518, -9610541, -9041206, -9742528, -9570949, -9307341, -9145563, -8260811, -9377030, -9509583, -8952156, -8896070, -9738745, -9088575, -9029011, -7867262, -8961842, -8699456, -10239410, -10239913, -9490810, -8456179, -9795556, -9744419, -9115803, -8897710, -9321379, -7632530, -8852023, -8274107, -9072648, -9352961, -9498103, -9127453, -9743946, -9231319, -9995478, -9674035, -9923157, -10021242, -10115360, -9288081, -9772602, -10483449, -8923297, -8983004, -9582321, -10215688, -10080000, -9495201, -9867358, -11512268, -10514877, -9163886, -9114555, -10403866, -10507268, -9262581, -9174943, -9848054, -9889876, -9124326, -8274246, -9344062, -8975170, -10639134, -9855432, -9864269, -9956482, -9021798, -9943369, -9747419, -9719381, -8554370, -9492255, -9692935]
4004i692935N43592M08953j63264j119085O25433N90362N28470j127677M76516k97972
3994i227607L87886R5302o76174J046928n29907j05880l15139m88205K64624j318852
3984a0867024j35894O91609M16865k17337L52639J883274m46540j081225k11485K14675
3974i400443L26853J329460j364925k61297K3489P01152j208741N12086n81033k14322
3964a0137721R04438l61834k42127O13829R90503j008661p36073P2933P23898K89787
3954h891028m26917J4125n21606Q99845l08643r06576K07013N70966m76669P51731o15364
3943i703123M40904n82087O70236p35245n3634P50250K79648J124550o143633M245196
3933i706938j212960J218900j5971j24386J268121j031194q65097P28380J478162o05659
$$ y = [-9692935, -9149343, -8740390, -8903654, -10022739, -9397306, -8806944, -8278474, -9406151, -8929635, -9227607, -8839721, -8744419, -9420593, -8373665, -8903572, -9009452, -9324591, -9812796, -9548172, -10867024, -11002918, -10311309, -9894444, -10111781, -9759142, -7875868, -8322408, -9403633, -9615118, -9400443, -9073590, -7744130, -9109055, -9370352, -9346863, -8645711, -9854452, -9342366, -9923399, -10137721, -9233283, -9595117, -9837244, -9223415, -8232912, -9241573, -9977646, -9904713, -9180815, -8891028, -9317945, -9303820, -9825426, -8925581, -9234224, -10140800, -9933787, -9362821, -9839490, -9087759, -9703123, -9262219, -9844306, -9174070, -9909315, -9962949, -9212699, -8933051, -7808501, -13952134, -9706938, -10919898, -9700998, -9716969, -9841355, -8573234, -9604428, -10469525, -9741145, -8262983, -8868642]
3923h868642j42257p38049n28268K61889J471106n03028p10452O60273p80194M96184
3913i381438L12687j273553m58036J247502J232954J443179n46494j605933K86944K28943
3903h513245p6128k70145m03472m46608O02985k56256o51893O32489k49775q31823L36265
3892a0127606O24203l14193k09018Q10188M47004k045824J767861J036712p8090k851026
3882a0939789J638836m95039m22437K7471k20444M62413K72178K01521n77417j75484
3872a0228191J202488M87662O04330k396104m7646O59781o00842n71845J078753J98441
3862i613173k28930l9626M68166j90317N56958P73778j226314n80544l71082J335380
3852i115704K72932p53005K70100j197658M95829P19267p05025L55437P52266j164564
$$ y = [-8868642, -9010899, -9748948, -10277216, -10015327, -8544221, -9047249, -9757701, -9097428, -9877622, -9381438, -9068751, -10342304, -10800340, -9552838, -8319884, -6876705, -7423199, -9029132, -8742188, -8513245, -8589373, -8859518, -9262990, -9709598, -9106613, -9362869, -10014762, -9382273, -9632048, -10463871, -10127606, -9503403, -9817596, -10026614, -9216426, -8769422, -10815246, -9047385, -8010673, -8088763, -10939789, -9300953, -9795992, -10218429, -10190958, -10411402, -9948989, -9676811, -9475290, -10052707, -10228191, -9025703, -8538041, -7933711, -10329815, -10377461, -9717680, -10318522, -10890367, -9811614, -9613173, -9842103, -9881729, -9413563, -9603880, -9046922, -8273144, -9499458, -10080002, -10451084, -9115704, -8842772, -9595777, -9325677, -10523335, -10027506, -9308239, -10013264, -9657827, -8905561, -10070125]
3842a0070125R16203k76486j72998M79615M96773J83544p52541K2554k78460O06237m79151
3831i324835j596157R62622k81413N55275R51888n5526M74802r39064P97689n49019m53342
3820i457080n58819Q29163k21249k5361j60615p20356R1059L91473o66941k5838O55659
3809i868905R81738o10816n65665l01693M02151j5712j8628k01459M54199J434955j9305
3798h329140j545825Q53858j557052J059267l01320j63446P63694o12505Q81342J69555
3788h781572r44014k82087p0366m03690o19888J690560n90817P04497n32793J112709
3778h717461q26240J93154L16597o15185m39303j22761P00295Q19232k67213q26340m38885
3767a0224110L30960N35341L00288o07654M1969k59025P15810j71366k94612N79821m47911
$$ y = [-10070125, -9153922, -9430408, -9603406, -9123791, -8627018, -8443474, -9196015, -9173461, -9451921, -8845684, -9324835, -10920992, -9958370, -10239783, -9684508, -8732620, -8788146, -8313344, -9252408, -8454719, -9003738, -9457080, -10015899, -9186736, -9407985, -9433346, -9593961, -10314317, -10223258, -9831785, -10498726, -10524564, -9868905, -8887167, -9497983, -10063648, -10365341, -9963190, -9978902, -9997530, -10198989, -9744790, -8309835, -8329140, -9874965, -9021107, -10578159, -9518892, -9820212, -9983658, -9219964, -9832469, -8951127, -8781572, -9725586, -10007673, -10078039, -10481729, -11101617, -9411057, -10001874, -9297377, -9830170, -8717461, -9543701, -9350547, -9033950, -9649135, -10088438, -10211199, -9510904, -8691672, -8958885, -9785225, -10224110, -9893150, -9357809, -9057521, -9665175, -9623206, -9882231, -9166421, -9337787, -9632399, -9052578, -9500489]
3756i500489p7011l98988J188643K82322j707423J271145k30243k23015n76442N80630
3746i390871O40868l19199j207256J61147L40354Q0671K88108l92721n64731O801k90078
3735a0646907J655881j233367j59276K36627r05174N94527K406529k189454J10693M84356
3725i645565M49914j134455N84885L6498K70864N16503m72854p50593l90005P83770j80842
3714i931880k68921M9164j049585K21027R66963P33288N55708j496713Q99777n8498J89594
$$ y = [-9500489, -9577500, -9976488, -8787845, -8505523, -10212946, -8941801, -9172044, -9395059, -9971501, -9390871, -8750003, -9069202, -10276458, -10115311, -9774957, -9694286, -9406178, -9798899, -10363630, -10356829, -10646907, -8991026, -10224393, -10383669, -10147042, -11052216, -10457689, -8051160, -10240614, -10129921, -9645565, -9195651, -10330106, -9745221, -9708723, -9437859, -8921356, -9394210, -10144803, -10534808, -9751038, -9931880, -10200801, -10151637, -11201222, -10980195, -10013232, -9279944, -8724236, -10220949, -9321172, -9379670, -9190076]
$$ [...]
-2730C18733  $$ checkpoint
##END NTUPLES=
##END=
