##TITLE= S#352628
##JCAMP-DX= 5.00 $$ JEOL NMR v1.10
##DATA TYPE= NMR SPECTRUM
##DATA CLASS= NTUPLES
##NUM DIM= 1
##ORIGIN= DELTA_NMR
##OWNER= organic
##SPECTROMETER/DATA SYSTEM= DELTA_NMR
##.OBSERVE FREQUENCY= 3.00529655924288E+02
##.OBSERVE NUCLEUS= ^1H
##.DELAY= (2.194E+02,2.194E+02)
##.ACQUISITION MODE= SIMULTANEOUS
##.FIELD= 7.0586013
##.FILTER WIDTH= 1.81675738660864
##.ACQUISITION TIME= 3.6339712
##.SPINNING RATE= 16
##.OBSERVE 90= 9.6
##NTUPLES= NMR SPECTRUM
##VAR NAME= FREQUENCY,    SPECTRUM/REAL, SPECTRUM/IMAG, PAGE NUMBER
##SYMBOL=   X,            R,             I,             N
##VAR TYPE= INDEPENDENT,  DEPENDENT,     DEPENDENT,     PAGE
##VAR FORM= AFFN,         ASDF,          ASDF,          AFFN
##VAR DIM=  16384, 16384, 16384, 2
##UNITS= PPM,     ARBITRARY UNITS, ARBITRARY UNITS, 
##FIRST=  1.2501033903057E+01, -2.0961955141838, 2.86288125225471E-01, 1
##LAST=  -2.50011824950436, -2.06284942443438, -5.34020483953046E-02, 2
##FACTOR=  9.1565355261926E-04, 3.47650913772487E-04, 3.47650913772487E-04, 1
##PAGE= N=1
##DATA TABLE=(X++(R..R)), XYDATA
$$ [...]
$$ plain form
12145 -16115928 -17333450 -15736063 -16636206 -17094365 -17396587 -16902117 -17204713 -17685600 -17846697 -17781572
12135 -17781572 -18274462 -17646104 -19396353 -18887633 -17072305 -16113343 -15557333 -16476080 -16303772 -16746510
12125 -16746510 -17879922 -15108021 -17847477 -16431271 -16986627 -15944084 -15906232 -16279622 -15554774 -16401367
12115 -16401367 -15823650 -17927062 -15333239 -15154036 -16161259 -15321129 -14733295 -17010722 -17014098 -18804474
12105 -18804474 -17692218 -18776558 -18401636 -18250741 -18003077 -16845700 -16173553 -16993207 -17407262 -16655529
12095 -16655529 -16711817 -16974405 -16721312 -16943940 -16947637 -17239876 -19166494 -17730350 -16064527 -18098950
12085 -18098950 -17575560 -18603416 -17859769 -16263023 -18240069 -15171575 -17224576 -21221071 -16664477
12076 -16664477 -18332551 -17857493 -16638146 -15399711 -15591335 -17871995 -17708310 -17418144 -16872800 -16268356
$$ packed form
12145a6115928j217522J597387r00143m58159l02222M94470l02596m80887j61097O5125
12135a7781572m92890O28358j750249N08720J815328R58962N56010r18747J72308m42738
12125a6746510j133412K771901k739456J416206n55356J042543L7852l73390P24848q46593
12115a6401367N77717k103412K593823J79203j007223Q40130N87834k277427l376j790376
12105a8804474J112256j084340L74922J50895K47664J157377O72147q19654m14055P51733
12095a6655529n6288k62588K53093k22628l697k92239j926618J436144J665823k034423
12085a8098950N23390j027856P43647J596746j977046L068494k053001l996495M556594
12076a6664477j668074M75058J219347J238435j91624k280660J63685K90166N45344O04444
$$ plain form
12066 -16268356 -16142906 -17492034 -16171723 -17083336 -17805257 -16337428 -16376943 -17239055 -16056310 -17441534
12056 -17441534 -17552916 -18456049 -16328019 -16367126 -16324353 -18386709 -17940951 -19109780 -18244804 -17149985
12046 -17149985 -17111204 -17587895 -17755022 -16957106 -16281477 -17323818 -16118634 -16235268 -16941015 -15878381
12036 -15878381 -16983143 -16684817 -18677039 -20687974 -18029045 -17256623 -16998272 -16240572 -16489692 -16291468
12026 -16291468 -16449845 -16495227 -16290503 -15973544 -18021139 -17008369 -17168295 -16523463 -17289462 -16332470
12016 -16332470 -16198429 -17774451 -19467468 -18532715 -18572073 -18880917 -15421775 -15304336 -16839079 -17347118
12006 -17347118 -16753477 -17393932 -17354312 -16392275 -18414190 -16877276 -15876385 -17562245 -16916159 -16374698
11996 -16374698 -16557110 -17650072 -16937739 -18092204 -17304070 -17274842 -17563196 -17506210 -17488092 -17151359
$$ packed form
12066a6268356J25450j349128J320311r11613p21921J467829l9515q62112J182745j385224
12056a7441534j11382r03133K128030l9107M2773k062356M45758j168829Q64976J094819
12046a7149985L8781m76691j67127P97916O75629j042341J205184j16634p05747J062634
12036a5878381j104762K98326j992222k010935K658929P72422K58351P57700k49120J98224
12026a6291468j58377m5382K04724L16959k047595J012770j59926O44832p65999R56992
12016a6332470J34041j576022j693017R34753l9358l08844L459142J17439j534743n08039
12006a7347118N93641o40455L9620R62037k021915J536914J000891j685860O46086N41461
11996a6374698j82412j092962P12333j154465P88134K9228k88354N6986J8118L36733
$$ plain form
11986 -17151359 -17817788 -17298773 -17603648 -21537707 -17207015 -17067975 -17277868 -16404319 -16695804 -16392663
11976 -16392663 -17514945 -18092747 -17223464 -18006606 -16667423 -16000582 -16998100 -17686006 -17895963 -18318693
11966 -18318693 -17175786 -16128286 -16161665 -17044710 -15764952 -16100986 -18181364 -17884787 -16658425 -17524935
11956 -17524935 -18318652 -15369345 -15530382 -16673811 -17027781 -17012404 -16975800 -17406224 -19231555 -17841108
11946 -17841108 -18672839 -18614461 -18517689 -18259322 -16602238 -17510268 -17020147 -17421800 -17209246 -14880943
11936 -14880943 -16114256 -16586615 -15324103 -15105663 -20145374 -17197103 -17156141 -16656627 -16597822 -17452020
11926 -17452020 -18163120 -16098917 -16690073 -17684636 -18162352 -16867694 -18362972 -16796907 -16786951 -16791929
11916 -16791929 -17073114 -17124617 -23119835 -20059502 -17935354 -17246753 -19158780 -17643980 -17158483 -16928091
$$ packed form
11986a7151359o66429N19015l04875l934059M330692J39040k09893Q73549k91485L03141
11976a6392663j122282n77802Q69283p83142J339183O66841r97518o87906k09957m22730
11966a8318693J142907J047500l3379q83045J279758l36034k080378K96577J226362q66510
11956a7524935p93717K949307j61037j143429l53970J5377L6604m30424j825331J390447
11946a7841108q31731N8378R6772K58367J657084r08030M90121m01653K12554K328303
11936a4880943j233313m72359J262512K18440n039711K948271M0962M99514N8805q54198
11926a7452020p11100K064203n91156r94563m77716J294658j495278J566065R956m978
11916a6791929k81185n1503n995218L060333K124148O88601j912027J514800M85497K30392
$$ plain form
11906 -16928091 -17928503 -17854189 -16917661 -16958563 -16985850 -17640521 -17085925 -17146085 -16343981 -15049642
11896 -15049642 -16684566 -16473699 -17289012 -15806558 -18125595 -18470340 -18233768 -17026229 -16949937 -18560222
11886 -18560222 -17782027 -16232448 -16693111 -17223191 -15560850 -17625261 -17171136 -14866613 -15337362
11877 -15337362 -16768887 -16886324 -19150828 -18800875 -17590977 -17726181 -17905893 -18776406 -19470021 -17463367
11867 -17463367 -17701199 -17679907 -18899658 -21203332 -17114091 -17317090 -17435681 -17521540 -18334939 -17517281
11857 -17517281 -17181414 -16879431 -16187348 -17392823 -19936009 -17826856 -19236550 -17790524 -18077800
11848 -18077800 -17579533 -17476833 -18024635 -18112945 -18670330 -18186129 -19389452 -19040341 -17183811 -17914835
11838 -17914835 -17221181 -16928508 -17962063 -17150212 -18217713 -18120021 -18189641 -17167620 -15746375 -18877387
$$ packed form
11906a6928091j000412P4314R36528m0902k7287o54671N54596o0160Q02104J294339
11896a5049642j634924K10867q15313J482454k319037l44745K36572J207539P6292j610285
11886a8560222P78195J549579m60663n30080J662341k064411M54125K304523m70749
11877a5337362j431525j17437k264504L49953J209898j35204j79712q70513o93615K006654
11867a7463367k37832K1292j219751k303674M089241k02999j18591q5859q13399Q17658
11857a7517281L35867L01983O92083j205475k543186K109153j409694J446026k87276
11848a8077800M98267J02700n47802q8310n57385M84201j203323L49111J856530p31024
11838a7914835O93654K92673j033555Q11851j067501R7692o9620J022021J421245l131012
$$ plain form
11828 -18877387 -17665194 -19393764 -18069659 -18030002 -16768768 -16775813 -17080931 -17476605 -18644269 -13215150
11818 -13215150 -15698708 -17103965 -17472887 -18363640 -17496939 -16873367 -17497112 -17053838 -18050273 -18234384
11808 -18234384 -17723725 -17047943 -17640277 -17061873 -17457618 -18238428 -18479489 -18873354 -16845123 -15879912
11798 -15879912 -16444460 -16971645 -18828394 -17677509 -16111724 -16665815 -17152778 -17161690 -14795168 -16579459
11788 -16579459 -17403810 -17988771 -15514092 -18094360 -17664521 -18357968 -18644833 -17119113 -18333463 -18257553
11778 -18257553 -15620206 -16958669 -17700431 -18510802 -17427412 -17199519 -17590685 -17889523 -18012554 -17010525
11768 -17010525 -17104060 -17383365 -16623963 -15307022 -15522993 -18583449 -15744655 -15519455 -15402746 -16387769
11758 -16387769 -16087809 -15744460 -16892379 -16247928 -16176327 -16517915 -17116845 -16561228 -16507329 -16646807
$$ packed form
11828a8877387J212193j728570J324105L9657J261234p045l05118l95674j167664N429119
11818a3215150k483558j405257l68922q90753Q66701O23572o23745M43274r96435j84111
11808a8234384N10659O75782n92334N78404l95745p80810k41061l93865K028231R65211
11798a5879912n64548n27185j856749J150885J565785n54091m86963q912K366522j784291
11788a6579459q24351n84961K474679k580268M29839o93447k86865J525720j214350P5910
11778a8257553K637347j338463p41762q10371J083390K27893l91166k98838j23031J002029
11768a7010525r3535k79305P59402J316941k15971l060456K838794K25200J16709r85023
11758a6387769K99960L43349j147919O44451P1601l41588n98930N55617N3899j39478
$$ plain form
11748 -16646807 -16133890 -16338738 -16291927 -17681828 -17833095 -17428203 -17040858 -17828092 -18051462 -19370814
11738 -19370814 -17402012 -16849131 -19028350 -19090345 -17268369 -17052502 -16794973 -17013878 -18820805 -16514293
11728 -16514293 -16308883 -16871578 -17206697 -17426066 -19109673 -16990713 -16888278 -18021987 -15710624
11719 -15710624 -19311075 -18371686 -16983136 -16400156 -19168785 -18382146 -16902691 -17415658 -18055998 -18601186
11709 -18601186 -17812792 -19711392 -18693082 -18146737 -17959971 -17546002 -16391250 -15924677 -17296046 -17079336
11699 -17079336 -18404328 -17045029 -17997096 -16959409 -17234841 -19275139 -18036596 -16900054 -18031228
11690 -18031228 -18427757 -19077019 -17394085 -18167185 -15277628 -16277056 -15579236 -16752181 -16845994 -17198163
11680 -17198163 -17265928 -15117840 -17977006 -17651254 -18043531 -16998862 -16371403 -16415101 -18047555 -18203833
$$ packed form
11748a6646807N12917k04848M6811j389901j51267M04892L87345p87234k23370j319352
11738a9370814J968802N52881k179219o1995J821976K15867K57529k18905j806927K306512
11728a6514293K05410n62695l35119k19369j683607K118960J02435j133709K311363
11719a5710624l600451R39389J388550N82980k768629P86639J479455n12967o40340n45188
11709a8601186P88394j898600J018310N46345J86766M13969J154752M66573j371369K16710
11699a7079336j324992J359299r52067J037687k75432k040298J238543J136542j131174
11690a8031228l96529o49262J682934p73100K889557r99428O97820j172945r3813l52169
11680a7198163o7765K148088k859166L25752l92277J044669O27459m3698j632454j56278
$$ plain form
11670 -18203833 -16514523 -15850989 -15092722 -17333875 -17773656 -18846253 -17593646 -17446389 -18178222 -17204747
11660 -17204747 -17969887 -16226060 -17466330 -16830538 -16310306 -17342053 -17962337 -17221859 -18613309
11651 -18613309 -15668739 -18147320 -17367631 -16566083 -16855317 -17173800 -18078882 -16273913 -17261370 -18082718
11641 -18082718 -18194649 -18882651 -18234268 -18671664 -18134588 -15918660 -18746043 -17902385 -18480542 -19627817
11631 -19627817 -24146886 -19158372 -18515063 -18052303 -17360542 -15407349 -17955609 -16773306 -17630581
11622 -17630581 -18298672 -16613081 -16999988 -16192196 -17994977 -17565936 -17209984 -17947592 -16172296 -16885019
11612 -16885019 -18298914 -16905879 -17976617 -18333719 -19120083 -16680819 -16040461 -17725424 -18121225 -18196287
11602 -18196287 -17128145 -16959050 -16227057 -16786081 -17869926 -17465324 -17007529 -16639371 -17208189 -18273810
$$ packed form
11670a8203833J689310O63534P58267k241153m39781j072597J252607J47257p31833R73475
11660a7204747p65140J743827j240270O35792N20232j031747o20284P40478j391450
11651a8613309K944570k478581P79689Q01548k89234l18483r05082J804969r87457q21348
11641a8082718j11931o88002O48383m37396N37076K215928k827383Q43658n78157j147275
11631a9627817m519069M988514O43309M62760O91761J953193k548260J182303q57275
11622a7630581o68091J685591l86907Q07792j802781M29041L55952p37608J775296p12723
11612a6885019j413895J393035j070738l57102p86364K439264O40358j684963l95801p5062
11602a8196287J068142J69095P31993n59024j083845M04602M57795L68158n68818j065621
$$ plain form
11592 -18273810 -17987595 -16650498 -16742643 -17013610 -17474754 -19036442 -18290903 -18561825 -17089835 -14697158
11582 -14697158 -18055529 -17144460 -17249940 -16573889 -16644632 -16993431 -16321468 -16289130 -15875482 -17345683
11572 -17345683 -18007709 -17207173 -16835304 -17346104 -16833386 -17897834 -17583456 -17663223 -17031423 -19044147
11562 -19044147 -17657128 -18379072 -14593992 -15793418 -15031671 -16193113 -17889228 -15713368 -16036894
11553 -16036894 -17398122 -16270360 -16821830 -16965045 -15725697 -15984453 -15427230 -16234687 -21911357
11544 -21911357 -17996578 -17595875 -17680689 -17371973 -16556846 -16207216 -12899944 -14257815 -15224065 -16719901
11534 -16719901 -17809213 -18842479 -18952068 -17354186 -16476834 -17373164 -17159052 -16159153 -16883671 -18380582
11524 -18380582 -18228911 -19710707 -17615848 -18814480 -20116817 -19192463 -17108928 -16847517 -17868872
$$ packed form
11592a8273810K86215J337097r2145k70967m61144j561688P45539k70922J471990K392677
11582a4697158l358371R11069j05480O76051p0743l48799O71963L2338M13648j470201
11572a7345683o62026Q00536L71869n10800N12718j064448L14378p9767O31800k012724
11562a9044147J387019p21944L785080j199426P61747j161442j696115K175860l23526
11553a6036894j361228J127762n51470j43215J239348k58756N57223q07457n676670
11544b1911357L914779M00703q4814L08716Q15127L49630L307272j357871r66250j495836
11534a6719901j089312j033266j09589J597882Q77352q96330K14112R99899p24518j496911
11524a8380582J51671j481796K094859j198632j302337R24354K083535K61411j021355
$$ plain form
11515 -17868872 -16873233 -17276589 -17278315 -14400203 -16267768 -16922274 -17014560 -16389514 -16175482 -18386261
11505 -18386261 -18482145 -17357261 -16298709 -18207455 -16949642 -16755991 -18660151 -18594671 -16305289 -17138102
11495 -17138102 -16385840 -16228395 -16223635 -16095927 -16994769 -18079723 -18660745 -17656886 -17612108 -16613769
11485 -16613769 -18369341 -16759882 -17906291 -18183495 -17214703 -15791583 -16374991 -18212935 -16777967
11476 -16777967 -17955695 -16167364 -18237987 -18489681 -19473836 -18158649 -19473152 -17603104 -18332523
11467 -18332523 -17730878 -17047865 -17598518 -17870167 -17699767 -18276866 -16994552 -18663586 -17589805 -18478865
11457 -18478865 -18456226 -17668473 -16145288 -16185812 -15844040 -17663543 -17271923 -17317589 -16968266 -15489594
11447 -15489594 -17481137 -17082638 -16376690 -16421790 -17332118 -17130721 -17555381 -17308102 -17384462 -18291603 -18218886
$$ packed form
11515a7868872R95639m03356j726K878112j867565o54506r2286O25046K14032k210779
11505a8386261r5884J124884J058552j908746J257813J93651j904160O5480K289382q32813
11495a7138102P52262J57445M760J27708q98842j084954n81022J003859M4778R98339
11485a6613769j755572J609459j146409k77204R68792J423120n83408j837944J434968
11476a6777967j177728J788331k070623k51694r84155J315187j314503J870048p29419
11467a8332523O01645O83013n50653k71649J70400n77099J282314j669034J073781q89060
11457a8478865K2639P87753J523185m0524L41772j819503L91620m5666L49323J478672
11447a5489594j991543L98499P05948m5100r10328K01397m24660K47279p6360r07141P2717
$$ plain form
11436 -18218886 -17916943 -17476339 -18155101 -17335401 -17778728 -17684941 -17429932 -16666184 -18310841 -18892274
11426 -18892274 -17621144 -17934895 -17659402 -16833857 -17161834 -16052906 -14750601 -15530521 -16861899 -17216154
11416 -17216154 -17691567 -14358667 -16409609 -16801254 -18227572 -19608009 -19401736 -17756966 -17022303
11407 -17022303 -17378232 -16957886 -17272588 -18167600 -18253477 -18796940 -17039546 -16202676 -17454811 -17161852
11397 -17161852 -17082068 -16953875 -17320696 -17188120 -16503538 -15963041 -17235679 -17178574 -17680130 -16682900
11387 -16682900 -16228549 -16331634 -15873883 -18570464 -17536939 -17353144 -18941789 -18536285 -18226535 -18328702
11377 -18328702 -16665845 -15624595 -16734135 -14351692 -16379747 -17466609 -19141416 -16646703 -18435028
11368 -18435028 -17275100 -17081501 -16069632 -15845258 -19082040 -18363358 -16742481 -16804773 -16072071 -16648219
$$ packed form
11436a8218886L01943M40604o78762Q19700m43327R3787K55009P63748j644657n81433
11426a8892274J271130l13751K75493Q25545l27977J108928J302305p79920j331378l54255
11416a7216154m75413L332900k050942l91645j426318j380437K06273J644770P34663
11407a7022303l55929M20346l14702q95012q5877n43463J757394Q36870j252135K92959
11397a7161852P9784J28193l66821J32576O84582N40497j272638N7105n01556R97230
11387a6682900M54351j03085M57751k696581J033525J83795j588645M05504L09750j02167
11377a8328702J662857J041250j109540K382443k028055j086862j674807K494713j788325
11368a8435028J159928J93599J011869K24374l236782P18682J620877o2292P32702n76148
$$ plain form
11358 -16648219 -17688182 -19058876 -18168363 -15674582 -17632159 -19140419 -18380740 -16775635 -16359800
11349 -16359800 -15991062 -15890578 -17827018 -17392488 -16712050 -17333428 -18782924 -16565868 -18580736
11340 -18580736 -17365762 -16795552 -17943951 -16115131 -18703852 -18030856 -16821576 -19281040 -18353472
11331 -18353472 -17194732 -17326707 -16315312 -18301749 -18493844 -18512131 -17872283 -16049133 -17380072 -18165890
11321 -18165890 -17614951 -17894110 -20155596 -19404137 -17375073 -17822706 -17528211 -17066889 -18530173 -18769073
11311 -18769073 -17607609 -18071021 -16298521 -19787154 -18939764 -17856847 -17714490 -16832842 -17422134
11302 -17422134 -19250935 -18945629 -17303760 -15706128 -18812357 -19274096 -19022400 -17630579 -18021376
11293 -18021376 -17355430 -17992999 -18062246 -17986362 -18125147 -18270793 -17645228 -16449233 -16306549 -17316635
$$ packed form
11358a6648219j039963j370694Q90513K493781j957577j508260P59679J605105M15835
11349a6359800L68738J00484j936440M34530O80438o21378j449496K217056k014868
11340a8580736J214974N70210j148399J828820k588721O72996J209280k459464R27568
11331a8353472J158740j31975J011395j986437j92095j8287O39848J823150j330939p85818
11321a8165890N50939k79159k261486P51459K029064m47633K94495M61322j463284k38900
11311a8769073J161464m63412J772500l488633Q47390J082917J42357Q81648n89292
11302a7422134j828801L05306J641869J597632l106229m61739K51696J391821l90797
11293a8021376O65946o37569o9247P5884j38785j45646O25565J195995J42684j010086
$$ plain form
11283 -17316635 -17511314 -17357754 -17847569 -17883974 -16973911 -18941932 -18840099 -17904684 -18793697 -18074949
11273 -18074949 -16929417 -16595075 -16680992 -18344714 -17361690 -16201746 -17529052 -16622907 -16060920 -14549008
11263 -14549008 -16298524 -17184577 -16579252 -17453954 -17088226 -17852355 -17639540 -16194132 -16925131 -12476233
11253 -12476233 -16889080 -16491461 -17914483 -17796271 -17670620 -19962612 -17480204 -17712938 -18099975 -18537539
11243 -18537539 -18249396 -18825535 -18148527 -18522290 -18699945 -18327389 -18622777 -17158678 -17477265 -19296786
11233 -19296786 -18378839 -17283337 -16637026 -16969756 -17606730 -16806046 -17026356 -17158821 -17700353 -16482515
11223 -16482515 -18095853 -18077665 -16137190 -17537438 -17672822 -17048205 -18376850 -17017889 -18143543 -18148587
11213 -18148587 -17278821 -17384674 -19719624 -15985651 -17029213 -14804010 -16182004 -17386702 -17763730
$$ packed form
11283a7316635j94679J53560m89815l6405R10063j968021J01833R35415q89013P18748
11273a8074949J145532L34342q5917j663722R83024J159944j327306R06145N61987J511912
11263a4549008j749516q86053O05325q74702L65728p64129K12815J445408p30999M448898
11253a2476233m412847L97619j423022J18212J25651k291992K482408k32734l87037m37564
11243a8537539K88143n76139O77008l73763j77655L72556k95388J464099l18587j819521
11233a9296786R17947J095502O46311l32730o36974Q00684k20310j32465n41532J217838
11223a6482515j613338J8188J940475j400248j35384O24617j328645J358961j125654n044
11213a8148587Q69766j05853k334950L733973j043562K225203j377994j204698l77028
$$ plain form
11204 -17763730 -17280498 -18576146 -17929727 -17829734 -17132039 -18246623 -18022375 -17730782 -16819001 -16913686
11194 -16913686 -16843246 -17169361 -16611323 -16674941 -16303460 -15937764 -16702314 -17908009 -17615233 -18121205
11184 -18121205 -18356763 -17515520 -16095787 -18336131 -17980958 -18448931 -17832338 -16807167 -18125144 -17952526
11174 -17952526 -15400582 -15820204 -18603169 -15610210 -16328251 -19399017 -14984622 -16034539 -18378330
11165 -18378330 -15564699 -14939820 -17236445 -17614996 -19107623 -19155711 -16334503 -18379945 -15886234
11156 -15886234 -16674696 -16873488 -17831416 -17957903 -17926967 -16569847 -19531246 -18862223 -16931402 -19319708
11146 -19319708 -18316205 -18462240 -18224345 -19053297 -17396293 -18233491 -18588740 -16672354 -15717838 -18821561
11136 -18821561 -17545927 -18208529 -19961981 -18238355 -17758979 -18291339 -18617424 -16861116 -18187389
$$ packed form
11204a7763730M83232j295648O46419R9993O97695j114584K24248K91593R11781r4685
11194a6913686P0440l26115N58038o3618L71481L65696p64550j205695K92776n05972
11184a8121205k35558Q41243J419733k240344L55173m67973O16593J025171j317977J72618
11174a7952526K551944m19622k782965K992959p18041l070766M414395j049917k343791
11165a8378330K813631O24879k296625l78551j492627m8088K821208k045442K493711
11156a5886234p88462j98792r57928j26487L0936J357120k961399O69023J930821k388306
11146a9319708J003503j46035K37895q28952J657004q37198l55249J916386R54516l103723
11136a8821561J275634o62602j753452J723626M79376n32360l26085J756308j326273
$$ plain form
11127 -18187389 -17973185 -17143003 -17760936 -17169362 -18197848 -19939737 -17797466 -17741295 -17643943 -18788014
11117 -18788014 -18602225 -19380460 -17377963 -16390385 -17182375 -16775358 -17127958 -17212790 -17536168 -21308773
11107 -21308773 -17759352 -18129461 -18224358 -17879492 -17835902 -17717894 -17085796 -17394854 -17969405 -19045220
11097 -19045220 -17688565 -16109793 -15012829 -16321911 -15433776 -15687315 -17145976 -16810380 -15661751
11088 -15661751 -16522303 -18654080 -18151098 -17188106 -17502871 -18888976 -17201715 -18274073 -17151927 -17243072
11078 -17243072 -15378512 -15818956 -16805287 -16473038 -13627715 -15178256 -15647247 -13939941 -11980006
11069 -11980006 -17345157 -17569382 -17426509 -18194259 -18882452 -17570546 -17192305 -17144535 -16459607 -19617155
11059 -19617155 -17388842 -18060476 -19186477 -17318505 -17687852 -16767143 -17061792 -15602136 -17719069
$$ packed form
11127a8187389K14204Q30182o17933N91574j028486j741889K142271N6171R7352j144071
11117a8788014J85789p78235K002497R87578p91990M07017l52600q4832l23378l772605
11107b1308773L549421l70109r4897L44866M3590J18008O32098l09058n74551j075815
11097a9045220J356655J578772J096964j309082Q88135k53539j458661L35596J148629
11088a5661751q60552k131777N02982R62992l14765j386105J687261j072358J122146r1145
11078a7243072J864560m40444r86331L32249K845323j550541m68991J707306J959935
11069a1980006n365151k24225J42873p67750o88193J311906L78241M7770O84928l157548
11059a9617155K228313o71634j126001J867972l69347R20709k94649J459656k116933
$$ plain form
11050 -17719069 -17258710 -18349487 -16988327 -14811654 -16622520 -17467368 -15719869 -17292439 -17105225
11041 -17105225 -16559274 -14955742 -15879521 -18616618 -19481461 -17703076 -17850342 -18374155 -18543009 -17439280
11031 -17439280 -17623519 -16796876 -17051162 -16267856 -16280389 -16349764 -17067927 -19909432 -18886772 -18667323
11021 -18667323 -18418451 -19241216 -20110323 -19099886 -17743483 -16282959 -17915349 -17055664 -15384587
11012 -15384587 -16063131 -16509817 -16223110 -17283212 -19254656 -17366559 -16667911 -16525306 -16351034 -16341095
11002 -16341095 -16022081 -16526292 -17423920 -17791246 -16615664 -16967702 -16347091 -16147281 -17873626 -16171977
10992 -16171977 -16693266 -15701561 -15308413 -15138952 -17521255 -15435347 -16388823 -15743252 -18496581 -16938094
10982 -16938094 -15434259 -15517118 -15766742 -12878367 -14738078 -15087940 -14537223 -14569951 -15586873 -14208704
$$ packed form
11050a7719069M60359j090777J361160K176673j810866q44848J747499j572570J87214
11041a7105225N45951J603532r23779k737097q64843J778385j47266n23813j68854J103729
11031a7439280j84239Q26643k54286P83306j2533o9375p18163k841505J022660K19449
11021a8667323K48872q22765q69107J010437J356403J460524j632390Q59685J671077
11012a5384587o78544m46686K86707j060102j971444J888097O98648J42605J74272R939
11002a6341095L19014n04211q97628l67326J175582l52038O20611J99810j726345J701649
10992a6171977n21289R91705L93148J69461k382303K085908r53476O45571k753329J558487
10982a6938094J503835q2859k49624K888375j859711l49862N50717l2728j016922J378169
$$ plain form
10972 -14208704 -12487305 -14134048 -14855775 -15079260 -13556966 -13996343 -13694769 -13007704 -13025809 -11601050
10962 -11601050 -12174914 -11201201 -13453381 -12683235 -13355490 -12743738 -11529897 -11165524 -13241289 -13032474
10952 -13032474 -12937469 -12407837 -12603306 -11107943 -11542990 -10993724 -12123619 -10517027 -10893790 -9463176
10942 -9463176 -11589343 -11465081 -12968769 -10296412 -11223849 -11319148 -10239612 -10710664 -9093198 -9172833
10932 -9172833 -8920498 -10140003 -8712989 -8783872 -9388884 -10841550 -10709883 -11724776 -13070780 -10693487
10922 -10693487 -7619268 -6379375 -8029581 -7145875 -6767268 -5439034 -5083122 -4309853 -3735524
10913 -3735524 -2234142 -1645426 -1767673 319007 2379208 2411447 3574644 4984826 5734981 4061282
10903 4061282 4804270 -1963173 -3775165 -6545098 -9080785 -11566842 -11868143 -14115031 -14205954
$$ packed form
10972a4208704J721399j646743p21727k23485J522294m39377L01574O87065j8105J424759
10962a1601050n73864R73713k252180P70146o72255O11752J213841L64373k075765K08815
10952a3032474R5005N29632j95469J495363m35047N49266j129895J606592l76763J430614
10942i463176k126167J24262j503688K672357r27437r5299J079536m71052J617466p9635
10932i172833K52335j219505J427014p0883o05012j452666J31667j014893j346004K377293
10922a0693487L074219J239893j650206Q83706L78607J328234L55912P73269N74329
10913c735524J501382N88716j22247K086680K060201L2239J163197J410182P50155j673699
10903D061282P42988o767443j811992k769933k535687k486057l01301k246888r0923
$$ plain form
10894 -14205954 -13068320 -13501862 -16535334 -15542902 -17096458 -16793397 -15105609 -16333816 -16783140
10885 -16783140 -18091735 -18842119 -18681943 -19005183 -20380058 -19803815 -18696486 -17164807 -18741499
10876 -18741499 -18494090 -21642998 -20390136 -19275988 -16806680 -18139419 -17218231 -19191999 -17803038
10867 -17803038 -17731103 -18338219 -18192965 -15689957 -16879839 -16908119 -18150551 -16779665 -18502664 -18095544
10857 -18095544 -16970896 -18753322 -19667097 -17701031 -16855956 -17752285 -18505503 -17413442 -16275800
10848 -16275800 -16094156 -17130022 -19043037 -17354715 -18186693 -18596963 -18746074 -17547254 -17198868 -17883908
10838 -17883908 -17705356 -16517434 -17224333 -17230923 -17570940 -16696635 -16144056 -17294054 -17536502 -18332346
10828 -18332346 -16085140 -16959625 -17009745 -17875145 -18211856 -19074666 -18044221 -18841476 -19321795 -17251082
$$ packed form
10894a4205954J137634m33542l033472R92432j553556L03061J687788j228207m49324
10885a6783140j308595p50384J60176l23240j374875N76243J107329J531679j576692
10876a8741499K47409l148908J252862J114148K469308j332739R21188j973768J388961
10867a7803038P1935o07116J45254K503008j189882k8280j242432J370886j722999M07120
10857a8095544J124648j782426r13775J966066Q45075q96329p53218J092061J137642
10848a6275800J81644j035866j913015J688322q31978m10270j49111J198820L48386o85040
10838a7883908J78552J187922p06899o590l40017Q74305N52579j149998k42448p95844
10828a8332346K247206q74485n0120q65400l36711q62810J030445p97255m80319K070713
$$ plain form
10818 -17251082 -17754338 -18446159 -17407515 -17653456 -16772424 -18076482 -18889029 -18769560 -18263156 -18019094
10808 -18019094 -18541089 -17484903 -19239269 -19205205 -18983486 -17718493 -18277434 -20142604 -16013055
10799 -16013055 -17950069 -17086676 -17551113 -17862540 -17879669 -17053549 -16978059 -17503606 -16064880 -18061648
10789 -18061648 -17497388 -16703367 -17924734 -17705562 -18093645 -18239087 -17307168 -16604929 -16707380 -15652521
10779 -15652521 -15514626 -19215765 -18032912 -16787046 -16482678 -18079570 -18365455 -17467008 -18894604
10770 -18894604 -18263459 -19768954 -17937469 -19592005 -18755453 -17108673 -18393230 -18333760 -16513851
10761 -16513851 -16790845 -18368616 -16390939 -16035978 -18949301 -17679726 -15736454 -14937357 -15292297
10752 -15292297 -17735302 -18478372 -15182412 -17116296 -16280469 -15940336 -14880961 -14849065 -14608483 -20352484
$$ packed form
10818a7251082n03256o91821J038644k45941Q81032j304058q12547J19469N06404K44062
10808a8019094n21995J056186j754366L4064K21719J264993n58941j865170M129549
10799a6013055j937014Q63393m64437l11427j7129Q26120P5490n25547J438726j996768
10789a8061648N64260P94021j221367K19172l88083j45442R31919P02239j02451J054859
10779a5652521J37895l701139J182853J245866L04368j596892k85885Q98447j427596
10770a8894604O31145j505495J831485j654536Q36552J646780j284557N9470J819909
10761a6513851k76994j577771J977677L54961k913323J269575J943272P99097l54940
10752a5292297k443005p43070L295960j933884Q35827L40133J059375L1896K40582n744001
$$ plain form
10742 -20352484 -19204724 -18156614 -16336278 -17901381 -18469164 -17447244 -19497720 -18750783 -19062444
10733 -19062444 -18858194 -20404368 -19785021 -19413137 -18569104 -19457982 -19520374 -19281036 -17882245 -16980450
10723 -16980450 -18095461 -19205286 -18331536 -17258673 -18221203 -17953118 -16650919 -18076237 -19845580
10714 -19845580 -16342435 -16340416 -15907869 -15842299 -18258908 -18744824 -19580102 -18616396 -18456002 -19330854
10704 -19330854 -17213020 -18898776 -17583290 -17450231 -18662673 -18394752 -16047927 -17048746 -15656821
10695 -15656821 -14617576 -16442594 -19036222 -19693462 -18491623 -18824256 -18629271 -17244636 -18471306
10686 -18471306 -19359124 -19134511 -17346738 -17654754 -17932151 -17429978 -16817013 -17556135 -16556231 -17642076
10676 -17642076 -16259241 -14816614 -17266057 -17417005 -18002340 -17863475 -17887654 -17327576 -17024022 -16109765
$$ packed form
10742b0352484J147760J048110J820336j565103n67783J021920k050476P46937l11661
10733a9062444K04250j546174O19347L71884Q44033q88878o2392K39338J398791R01795
10723a6980450j115011j109825Q73750J072863r62530K68085J302199j425318j769343
10714a9845580L503145K019M32547O5570k416609m85916q35278R63706J60394q74852
10704a9330854K117834j685756J315486J33059j212442K67921K346825j000819J391925
10695a5656821J039245j825018k593628o57240J201839l32633J94985J384635j226670
10686a8471306q87818K24613J787773l08016k77397N02173O12965p39122R99904j085845
10676a7642076J382835J442627k449443j50948n85335J38865k4179N60078L03554R14257
$$ plain form
10666 -16109765 -17130207 -17145007 -17534199 -17350579 -16966427 -16508620 -18656029 -14874936 -16500010 -15560023
10656 -15560023 -17899597 -17725461 -16425977 -16624580 -18175551 -18306986 -18717994 -17574105 -18360595
10647 -18360595 -20314897 -17559025 -18872948 -17320714 -18168623 -17697186 -19323059 -17980693 -18839365
10638 -18839365 -18367343 -17782028 -18061872 -17073520 -17617725 -17470381 -17277863 -16190637 -18086309 -17088716
10628 -17088716 -18230883 -17635860 -18266933 -17501371 -15127393 -17349255 -18436053 -15628523 -17951076
10619 -17951076 -18389671 -18069603 -17874250 -17402130 -19210406 -18572227 -18098705 -17780957 -18322790 -18782054
10609 -18782054 -18920033 -19382761 -20081361 -21895862 -16353777 -16619421 -15508731 -16480483 -17456072 -19262321
10599 -19262321 -18260440 -17664816 -18949576 -18512673 -17455764 -17660044 -17033876 -17092369 -16689206 -17092940
$$ packed form
10666a6109765j020442j4800l89192J83620L84152M57807k147409L781093j625074R39987
10656a5560023k339574J74136J299484j98603j550971j31435m11008J143889p86490
10647a8360595j954302K755872j313923J552234q47909M71437j625873J342366q58672
10638a8839365M72022N85315k79844R88352n44205J47344J92518J087226j895672R97593
10628a7088716j142167N95023o31073P65562K373978k221862j086798K807530k322553
10619a7951076m38595L20068J95353M72120j808276O38179M73522L17748n41833m59264
10609a8782054j37979m62728o98600j814501N542085k65644J110690r71752r75589j806249
10599a9262321J001881N95624j284760M36903J056909k04280O26168n8493M03163m03734
$$ plain form
10589 -17092940 -16751560 -18048739 -17021405 -18458321 -17840938 -15396683 -16324544 -17211299 -16891523 -16606776
10579 -16606776 -18335046 -18767030 -16149903 -17490101 -17693400 -19013605 -18446767 -17893348 -17096676 -16906921
10569 -16906921 -17643301 -17416601 -17454152 -17314170 -16822216 -17127419 -18209601 -17776009 -17970175 -17161138
10559 -17161138 -17945333 -18631019 -17178049 -16440735 -15570035 -16416608 -15782490 -17453091 -18648626 -17996763
10549 -17996763 -17999296 -18488845 -17979724 -17635798 -15725881 -16585445 -18667234 -18340919 -17705928 -17650327
10539 -17650327 -17835435 -18807457 -18532211 -18646467 -18313903 -19033689 -18700545 -18588100 -17410456 -16980758
10529 -16980758 -17008310 -17637443 -17569023 -18172884 -17695296 -17088712 -17939244 -17875852 -16644561 -17064611
10519 -17064611 -18535309 -16940027 -15537678 -19475121 -17071263 -17350400 -17315843 -19415005 -18543723
$$ packed form
10589a7092940L41380j297179J027334j436916O17383K444255r27861q86755L19776K84747
10579a6606776j728270m31984K617127j340198k03299j320205N66838N53419P96672J89755
10569a6906921p36380K26700l7551J39982M91954l05203j082182M33592j94166Q09037
10559a7161138p84195o85686J452970P37314Q70700q46573O34118j670601j195535O51863
10549a7996763k533m89549N09121L43926J909917q59564k081789L26315O34991N5601
10539a7650327j85108r72022K75246j14256L32564p19786L33144J12445J177644M29698
10529a6980758k7552o29133O8420o03861M77588O06584q50532O3392J231291m20050
10519a7064611j470698J595282J402349l937443K403858k79137L4557k099162Q71282
$$ plain form
10510 -18543723 -18005701 -19075746 -17820560 -17449113 -16534866 -17455402 -18482399 -16615018 -17383430
10501 -17383430 -16275972 -19111940 -19309541 -20183827 -20648982 -18288667 -18128600 -19692236 -19102367
10492 -19102367 -17910690 -18497581 -17171400 -17764344 -18388261 -18461729 -18982158 -19445448 -16885747 -16364583
10482 -16364583 -18287062 -18407810 -18766837 -16647279 -16698487 -16458630 -17834586 -17993645 -17708286 -18212270
10472 -18212270 -18754538 -18678558 -19368548 -16894163 -17385770 -17858479 -18580218 -16482092 -18195476 -18020454
10462 -18020454 -18313588 -17484443 -17688713 -19492844 -18948585 -16881458 -16963163 -18743111 -17803913 -18579519
10452 -18579519 -14353697 -14481652 -15617158 -15934389 -17376338 -16957414 -16619652 -15763643 -15706322 -17733248
10442 -17733248 -16800912 -18245629 -17817016 -17299280 -16391437 -17357583 -17946070 -17404194 -17312394 -17391181
$$ packed form
10510a8543723N38022j070045J255186L71447R14247r20536j026997J867381p68412
10501a7383430J107458k835968j97601q74286m65155K360315J60067j563636N89869
10492a9102367J191677n86891J326181n92944o23917p3468n20429m63290K559701N21164
10482a6364583j922479j20748l59027K119558n1208K39857j375956j59059K85359n03984
10472a8212270n42268P5980o89990K474385m91607m72709p21739K098126j713384J75022
10462a8020454k93134Q29145k04270j804131N44259K067127q1705j779948R39198p75606
10452a8579519M225822j27955j135506l17231j441949M18924L37762Q56009N7321k026926
10442a7733248R32336j444717M28613N17736R07843r66146n88487N41876R1800p8787
$$ plain form
10432 -17391181 -17753384 -17696091 -17497091 -17943197 -19052449 -19158292 -19125211 -18737200 -18965776 -19894868
10422 -19894868 -18577569 -18575666 -18555211 -19180759 -16976391 -16970314 -17749468 -18492690 -17096131 -17864697 -17372491
10411 -17372491 -17003140 -17696036 -16864103 -17641061 -17156655 -18877111 -17341475 -19218405 -19398717 -19506587
10401 -19506587 -19034124 -18849307 -19744062 -19619102 -17349530 -19355577 -18575629 -17621622 -17191322 -16114546
10391 -16114546 -17061345 -17276847 -17934768 -18359766 -17102744 -19072708 -18009224 -18054095 -19371450 -18721657
10381 -18721657 -17922327 -16814855 -16068369 -17810612 -16800148 -17224837 -16104374 -16749008 -18210074
10372 -18210074 -18800111 -18775825 -16103745 -15183200 -14200279 -18930322 -18159809 -17343020 -18301203 -19279311
10362 -19279311 -19364764 -18307375 -18266652 -16556525 -19054085 -17061830 -14908806 -16429707 -17405539 -17570635
$$ packed form
10432a7391181l62203N7293J99000m46106j109252j05843L3081L88011k28576r29092
10422a9894868J317299J903K0455o25548K204368O077p79154p43222J396559p68566M92206
10411a7372491L69351o92896Q31933p76958M84406j720456J535636j876930j80312j07870
10401a9506587M72463J84817q94755J24960K269572k006047P79948R54007M30300J076776
10391a6114546r46799k15502o57921m24998J257022j969964J063484m4871j317355O49793
10381a8721657P99330J107472P46486j742243J010464m24689J120463o44634j461066
10372a8210074n90037K4286K672080R20545R82921m730043P70513Q16789r58183r78108
10362a9279311q5453J057389M0723J710127k497560J992255K153024j520901r75832j65096
$$ plain form
10352 -17570635 -18166612 -17057009 -16900115 -17956814 -16690314 -18151968 -18047164 -16777070 -17238934
10343 -17238934 -18308292 -18330427 -18878039 -18490712 -18455142 -18118398 -17997842 -18056016 -18705736 -18446118 -18884537
10332 -18884537 -17464833 -17792025 -17680078 -18063798 -18714564 -17483232 -17046062 -16674243 -18975403 -18007963
10322 -18007963 -17293216 -18832809 -17466899 -15596330 -16419691 -17594073 -17564859 -17656100 -17973238 -18225925
10312 -18225925 -18330493 -16780163 -16537681 -16242547 -16882155 -19864686 -17564522 -19373733 -17272297
10303 -17272297 -16700600 -16416303 -18057350 -19521582 -18900001 -17016838 -18561494 -17008836 -17937992
10294 -17937992 -18246533 -17190801 -17376716 -16706758 -17741447 -18788982 -17127663 -17262300 -17632200 -18129338
10284 -18129338 -19082712 -17285001 -15508623 -17003429 -17511868 -17987837 -18330208 -19221536 -18373084 -16741277
$$ packed form
10352a7570635n95977J109603J56894j056699J266500j461654J04804J270094m61864
10343a7238934j069358k2135n47612L87327L5570L36744J20556n8174o49720K59618m38419
10332a8884537J419704l27192J11947l83720o50766J231332M37170L71819k301160R67440
10322a8007963P14747j539593J365910J870569q23361j174382K9214r1241l17138k52687
10312a8225925j04568J550330K42482K95134o39608k982531K300164j809211K101436
10303a7272297N71697K84297j641047j464232O21581J883163j544656J552658r29156
10294a7937992l08541J055732j85915O69958j034689j047535J661319j34637l69900m97138
10284a8129338r53374J797711J776378j494806n08439m75969l42371q91328Q48452J631807
$$ plain form
10274 -16741277 -17032558 -18918573 -19585793 -19491655 -20156121 -16774840 -16339544 -17790356 -16706672 -17571163
10264 -17571163 -19766694 -19723919 -18309723 -18365677 -17974203 -16355886 -15677366 -16342429 -17431737 -17697369
10254 -17697369 -17086861 -17687550 -17979606 -17904875 -17088964 -16346049 -16478387 -17930054 -18250941 -18682159
10244 -18682159 -17704104 -17566893 -19172448 -17982182 -18386568 -19251243 -18384194 -15219642 -17147610 -17435291
10234 -17435291 -18848382 -19681266 -19441411 -18459395 -17118061 -18814271 -18676919 -18690426 -17977524 -19802695
10224 -19802695 -17028533 -17559821 -18210992 -18214909 -16576717 -16272088 -17908048 -17744522 -17403294 -17332622
10214 -17332622 -16999595 -16661313 -17149687 -21692904 -18504231 -19129014 -18031851 -19489369 -16468001
10205 -16468001 -18352679 -18154711 -17555291 -19117595 -20574063 -17967536 -17158498 -18646431 -17048535
$$ packed form
10274a6741277k91281j886015o67220R4138o64466L381281M35296j450812J083684q64491
10264a7571163k195531M2775J414196n5954L91474J618317O78520o65063j089308k65632
10254a7697369O10508o00689k92056P4731Q15911P42915j32338j451667l20887m31218
10244a8682159R78055J37211j605555J190266m04386q64675Q67049L164552j927968k87681
10234a7435291j413091q32884K39855R82016J341334j696210J37352j3507P12902j825171
10224a9802695K774162n31288o51171l917J638192L04629j635960J63526L41228P0672
10214a7332622L33027L38282m88374m543217L188673o24783J097163j457518L021368
10205a6468001j884678J97968N99420j562304j456468K606527Q09038j487933J597896
$$ plain form
10196 -17048535 -17915738 -16779301 -15829984 -17781445 -17443178 -19042646 -18671492 -17490941 -16961913 -17740232
10186 -17740232 -17505257 -18353426 -17628707 -18534309 -17917838 -19252252 -18692612 -17971737 -18990829 -18008409
10176 -18008409 -17596630 -17796643 -19171865 -18374596 -19704929 -19055421 -19538008 -17503166 -19337096 -18532316
10166 -18532316 -17877983 -16474047 -17670362 -15936494 -16514570 -17553000 -16528083 -18711575 -18646432
10157 -18646432 -18472306 -19804588 -18969077 -19511761 -18494953 -18384363 -18560458 -19583543 -18369195 -18661553
10147 -18661553 -19340405 -19148651 -17424258 -16856493 -18800338 -18466192 -20750605 -18677810 -18059593
10138 -18059593 -19443097 -18167745 -19447578 -18280325 -18652065 -20092661 -17566822 -17235115 -15477183
10129 -15477183 -17931318 -18454211 -17647188 -16514311 -16028552 -17253925 -17964286 -17534368 -17429999 -18161052
$$ packed form
10196a7048535q67203J136437R49317j951461L38267j599468L71154J180551N29028p78319
10186a7740232K34975q48169P24719r05602O16471j334414N59640P20875j019092R82420
10176a8008409M11779k00013j375222P97269j330333O49508m82587K034842j833930Q04780
10166a8532316O54333J403936j196315J733868n78076j038430J024917k183492O5143
10157a8646432J74126j332282Q35511n42684J016808J10590j76095j023085J214348k92358
10147a8661553o78852J91754J724393N67765j943845L34146k284413K072795O18217
10138a8059593j383504J275352j279833J167253l71740j440596K525839L31707J757932
10129a5477183k454135n22893Q07023J132877M85759j225373p10361M29918J04369p31053
$$ plain form
10119 -18161052 -16821137 -15935323 -18277591 -17056451 -17670917 -18499510 -18088839 -17855351 -18505564 -18046476
10109 -18046476 -16954568 -19966274 -18411761 -17939473 -17062501 -17970843 -15660479 -17537455 -18132427
10100 -18132427 -17167418 -16631613 -16744383 -16762398 -17127754 -16547691 -17958628 -18936876 -18174982 -18458453
10090 -18458453 -18309529 -16481396 -17843666 -17693615 -17724312 -16834880 -16269704 -16173909 -16547380 -16095509
10080 -16095509 -16559281 -23265254 -19313042 -18426966 -17945692 -17855074 -18759396 -18240865 -17802225 -18281916
10070 -18281916 -16944920 -17755813 -18568739 -20053549 -17006487 -16681962 -16210698 -15914631 -17435663 -17765061
10060 -17765061 -15553909 -18004670 -16852420 -15420471 -16739249 -16575030 -23165415 -20279061 -18383048
10051 -18383048 -19738243 -20062263 -18799049 -18537581 -19419478 -17649991 -18222520 -17573240 -19690555
$$ packed form
10119a8161052J339915Q85814k342268J221140o14466q28593M10671K33488o50213M59088
10109a8046476J091908l011706J554513M72288Q76972r08342K310364j876976n94972
10100a8132427R65009N35805j12770j8015l65356N80063j410937r78248P61894k83471
10090a8458453J48924J828133j362270J50051l0697Q89432N65176R5795l73471M51871
10080a6095509m63772o705973L952212Q86076M81274R0618r04322N18531M38640m79691
10070a8281916J336996q10893q12926j484810L047062L24525M71264K96067j521032l29398
10060a7765061K211152k450761J152250J431949j318778J64219o590385K886354J896013
10051a8383048j355195l24020J263214K61468q81897J769487n72529O49280k117315
$$ plain form
10042 -19690555 -17781919 -18274633 -18751063 -18107417 -18563819 -19372958 -20496807 -18584631 -18685704 -18827422
10032 -18827422 -18655296 -18479885 -18397129 -17647692 -19551117 -17526980 -17284371 -17095823 -17436444 -17412437
10022 -17412437 -16883292 -18621912 -17273870 -17864288 -17619244 -17707116 -17706825 -19102878 -16467461 -17792063
10012 -17792063 -18757500 -17698880 -18209274 -18202318 -17443660 -16946437 -15386040 -18387824 -17770267 -22515850
10002 -22515850 -19053079 -18339751 -18867517 -19534450 -19121824 -17485373 -18027138 -19345777 -19691576 -17511246
9992 -17511246 -16952541 -18227134 -18388438 -15491697 -16856402 -18592392 -18032241 -18563595 -17377542
9983 -17377542 -19854741 -18618054 -20484193 -18597685 -19487775 -18353555 -20465673 -19380047 -16005897
9974 -16005897 -15567780 -19117876 -17443951 -17611235 -16659647 -15758123 -16203916 -18647836 -19824898 -18619006
$$ packed form
10042a9690555J908636m92714m76430O43646m56402q09139j123849J912176j01073j41718
10032a8827422J72126J75411Q2756P49437j903425K024137K42609J88548l40621K4007
10022a7412437N29145j738620J348042n90418K45044q7872K91j396053K635417j324602
10012a7792063r65437J058620n10394O956P58658M97223J560397l001784O17557m745583
10002b2515850L462771P13328n27766o66933M12626J636451n41765j318639l45799K180330
9992a7511246N58705j274593j61304K896741j364705j735990N60151n31354J186053
9983a7377542k477199J236687j866139J886508q90090J134220k112118J085626L374150
9974a6005897M38117l550096J673925j67284R51588R01524m45793k443920j177062J205892
$$ plain form
9964 -18619006 -18986082 -19321756 -18050229 -18433316 -17693520 -18402281 -18751446 -17691384 -17312994 -17235883
9954 -17235883 -15868381 -16973281 -17856094 -17396001 -16981681 -17155051 -17947956 -18609004 -17063657 -17062082
9944 -17062082 -15145179 -12092607 -19857402 -18762938 -18291164 -18423854 -18005957 -20248619 -18274398 -18344843
9934 -18344843 -19967909 -20565005 -19254860 -19038973 -19169101 -19281642 -19032915 -19457212 -18668876 -17653051
9924 -17653051 -17019779 -17910007 -19343194 -20582437 -17889469 -17381855 -18684202 -20516787 -19906974
9915 -19906974 -18728550 -17170762 -17702022 -18264717 -20197780 -17921735 -17047797 -16093393 -17628374 -17807928
9905 -17807928 -17067769 -18061060 -17399370 -18732724 -19548628 -17795697 -17917811 -19168264 -18952607 -20320938
9895 -20320938 -19568070 -16367064 -18238703 -19679197 -17486094 -17850000 -18554758 -19758515 -18901091
$$ packed form
9964a8619006l67076l35674J271527l83087P39796p08761l49165J060062L78390P7111
9954a7235883J367502j104900q82813M60093M14320j73370p92905o61048J545347J575
9944a7062082J916903L052572p764795J094464M71774j32690M17897k242662J974221p0445
9934a8344843j623066n97096J310145K15887j30128j12541K48727m24297P88336J015825
9924a7653051O33272q90228j433187j239243K692968N07614j302347j832585O09813
9915a9906974J178424J557788n31260n62695j933063K276045Q73938R54404j534981j79554
9905a7807928P40159r93291O61690j333354q15904J752931j22114j250453K15657j368331
9895b0320938P52868L201006j871639j440494K193103l63906p04758j203757Q57424
$$ plain form
9886 -18901091 -20156900 -19993646 -19002203 -19002465 -19599829 -19636426 -18887231 -18491351 -19411059 -19780394 -20151196
9875 -20151196 -20965246 -19432895 -20257647 -18730930 -18969910 -18225062 -17646097 -19277917 -19958602 -19269808
9865 -19269808 -18569144 -18918016 -18821544 -23447180 -19211580 -19425262 -20343266 -19521282 -19860025 -19772666
9855 -19772666 -19302014 -20193933 -18558613 -18438709 -18051975 -18987870 -19685379 -19827447 -17309977 -17855708
9845 -17855708 -18942741 -19686703 -19652536 -18730525 -18909752 -19056134 -18052340 -18857564 -19517802 -18518938
9835 -18518938 -17968800 -14840373 -17380671 -17180675 -17753706 -19381088 -18822416 -19692699 -19379903 -18422130
9825 -18422130 -18089294 -17403292 -18221882 -17284858 -16584053 -16168512 -18151711 -18608788 -19740601 -19888612
9815 -19888612 -17504717 -18562933 -19021857 -18170783 -19315436 -18317051 -20058695 -20234157 -16208873
$$ packed form
9886a8901091j255809J63254R91443k62n97364l6597P49195L95880r19708l69335l70802
9875b0151196q14050J532351q24752J526717k38980P44848N78965j631820o80685O88794
9865a9269808P00664l48872R6472m625636M235600k13682r18004Q21984l38743Q7359
9855a9772666M70652q91919J635320J19904L86734r35895o97509j42068K517470n45731
9845a7855708j087033p43962L4167R22011j79227j46382J003794q05224o60238R98864
9835a8518938N50138L128427k540298J99996n73031j627382N58672q70283L12796R57773
9825a8422130L32836O86002q18590R37024P00805M15541j983199m57077j131813j48011
9815a9888612K383895j058216m58924Q51074j144653R98385j741644j75462M025284
$$ plain form
9806 -16208873 -17634042 -19412540 -17680305 -18938497 -18424308 -18331793 -16982766 -16442100 -17547299
9797 -17547299 -21449055 -21690459 -20680600 -18985752 -17990745 -16027729 -15377256 -17608970 -16264670
9788 -16264670 -18715850 -16842047 -19759072 -20383466 -19102893 -19430746 -18559331 -17748053 -17847009 -18145972
9778 -18145972 -19626333 -18303362 -18903233 -18915769 -19012340 -19534270 -18541362 -18920616 -17618902 -17347038
9768 -17347038 -18632344 -18477433 -19258854 -18940084 -17792327 -16905085 -18157310 -18545254 -17546502 -18502850
9758 -18502850 -19262945 -17144669 -18039083 -18803319 -16792745 -15904085 -21304540 -20178606 -19548906 -20270953
9748 -20270953 -18611749 -17175635 -19121649 -19574994 -19216580 -19538285 -19755003 -20125211 -19715778 -18565646
9738 -18565646 -20655464 -18981020 -17572228 -16826672 -18126168 -19046968 -18478424 -18064669 -18046065 -19740014
$$ packed form
9806a6208873j425169j778498J732235j258192N14189R2515J349027N40666j105199
9797a7547299l901756k41404J009859J694848R95007J963016O50473k231714J344300
9788a6264670k451180J873803k917025o24394J280573l27853Q71415Q11278r8956k98963
9778a8145972j480361J322971n99871j2536r6571n21930R92908l79254J301714K71864
9768a7347038j285306J54911p81421L18770J147757Q87242j252225l87944R98752r56348
9758a8502850p60095K118276q94414p64236K010574Q88660n400455J125934O29700p22047
9748b0270953J659204J436114j946014m53345L58414l21705k16718l70208M09433J150132
9738a8565646k089818J674444J408792P45556j299496r20800N68544M13755J8604j693949
$$ plain form
9728 -19740014 -19461553 -20397573 -18303631 -16755664 -17928625 -18739882 -19034902 -18941439 -18886634 -17272519
9718 -17272519 -16468225 -18933979 -18069317 -18001742 -17737901 -19058198 -20565800 -19752980 -17802379 -18560799
9708 -18560799 -20258962 -19642704 -18203114 -18224021 -19656089 -17745593 -19046581 -19804366 -19583289 -18765783
9698 -18765783 -17584472 -17045484 -18758834 -18317931 -17549716 -18093803 -17580676 -17082061 -18289381 -17962786
9688 -17962786 -17676686 -17257862 -18867844 -19377469 -20393218 -19916981 -18762376 -17919876 -18848141 -17786875
9678 -17786875 -17943708 -18698296 -17661176 -18428871 -19377478 -19062586 -17483470 -18096598 -20944910 -20514472
9668 -20514472 -19026819 -19301683 -20758296 -20297873 -19113255 -18674335 -18684428 -18767398 -17825186 -16816597
9658 -16816597 -18946076 -17758109 -17635806 -18114309 -18926442 -20589545 -18226412 -17041074 -17579117 -17647024
$$ packed form
9728a9740014K78461r36020K093942J547967j172961q11257k95020R3463N4805J614115
9718a7272519Q04294k465754Q64662O7575K63841j320297j507602Q12820J950601p58420
9708a8560799j698163O16258J439590k0907j432068J910496j300988p57785K21077Q17506
9698a8765783J181311N38988j713350M40903P68215n44087N13127M98615j207320L26595
9688a7962786K86100M18824j609982n09625j015749M76237J154605Q42500r28265J061266
9678a7786875j56833p54588J037120p67695r48607L14892J579116o13128k848312M30438
9668b0514472J487653k74864j456613M60423J184618M38920j0093q2970R42212J008589
9658a6816597k129479J187967J22303m78503q12133j663103K363133J185338n38043o7907
$$ plain form
9648 -17647024 -18461328 -17676307 -17809743 -18844780 -20164909 -18335504 -19160581 -19028286 -18401370 -18558470
9638 -18558470 -18565671 -19029286 -18477877 -17636357 -19428186 -20133779 -19567274 -18148939 -17378754 -20510186
9628 -20510186 -20207458 -20125220 -19156009 -18813210 -18654811 -19276704 -20142322 -21209098 -16979186 -18436491
9618 -18436491 -20336554 -20840374 -15158257 -18765161 -18376246 -21478128 -18480797 -18875722 -18073555 -17982627
9608 -17982627 -20398753 -19753802 -18995401 -19979440 -17866838 -19280758 -18307503 -17647932 -17352956 -17156170
9598 -17156170 -17953283 -17205836 -17037900 -17462727 -18119679 -18775644 -19738600 -18631334 -19432291 -17277084
9588 -17277084 -17403307 -18743544 -16970633 -17665518 -19551768 -17460268 -16605039 -17790910 -16833512
9579 -16833512 -24027103 -19657355 -18477497 -17828419 -18144040 -19223641 -19117828 -18977266 -18532349 -18988672
$$ packed form
9648a7647024q14304P85021j33436j035037j320129J829405q25077J32295O26916j57100
9638a8558470p201m63615N51409Q41520j791829p05593N66505J418335P70185l131432
9628b0510186L02728Q2238R69211L42799J58399o21893q65618j066776M229912j457305
9618a8436491j900063n03820N682117l606904L88915l101882K997331l94925Q02167R0928
9608a7982627k416126O44951P58401r84039K112602j413920R73255O59571K94976J96786
9598a7156170p97113P47447J67936m24827o56952o55965r62956J107266q00957K155207
9588a7277084j26223j340237J772911o94885j886250K091500Q55229j185871R57398
9579a6833512p193591M369748J179858O49078l15621j079601J05813J40562M44917m56323
$$ plain form
9569 -18988672 -17621118 -20237389 -18897770 -16746275 -16440682 -18837225 -20541247 -20826868 -22518947
9560 -22518947 -20515635 -20409247 -18202195 -17642765 -20407559 -20036971 -19505652 -18537688 -18841242 -18239476
9550 -18239476 -19322263 -20330614 -19821108 -17259715 -18056835 -20479949 -19237414 -19901901 -20523139 -20633252
9540 -20633252 -20210260 -17044094 -18478145 -18541213 -19032344 -19565957 -17464285 -18281892 -19297137 -18377878
9530 -18377878 -18216938 -17276167 -17813222 -19164886 -17948720 -20651966 -18495875 -18698624 -19364674 -17686532
9520 -17686532 -16999562 -16326924 -18135308 -17392661 -18221877 -19698315 -19334077 -17468085 -15944204 -18573171
9510 -18573171 -20193664 -19170016 -16533047 -19840877 -18992086 -17910447 -18716792 -17964395 -19034569
9501 -19034569 -19285331 -18342203 -19563645 -19971941 -19247935 -19440261 -17687743 -19407762 -19157501 -17688681
$$ packed form
9569a8988672J367554k616271J339619K151495L05593k396543j704022k85621j692079
9560b2518947K003312J06388K207052N59430k764794L70588N31319R67964l03554O01766
9550a8239476j082787j008351N09506K561393p97120k423114J242535o64487o21238j10113
9540b0633252M22992L166166j434051o3068m91131n33613K101672q17607j015245R19259
9530a8377878J60940R40771n37055j351664J216166k703246K156091k02749o66050J678142
9520a7686532O86970O72638j808384P42647q29216j476438L64238J865992J523881k628967
9510a8573171j620493J023648K636969l307830Q48791J081639q06345P52397j070174
9501a9034569k50762R43128j221442m08296P24006j92326J752518j720019K50261J468820
$$ plain form
9491 -17688681 -18692531 -19819804 -18559549 -18039415 -20257553 -18967886 -20140901 -19702318 -16002003
9482 -16002003 -16520228 -17697912 -19499399 -18354922 -18700512 -17428547 -16789253 -19300411 -18462168
9473 -18462168 -20019049 -20076489 -18286029 -18558922 -19692708 -18045024 -18764940 -17577573 -17218113 -16610609
9463 -16610609 -17402649 -16780628 -18471948 -17308661 -17746537 -16486032 -18369302 -17004599 -17769442 -18283113
9453 -18283113 -15976015 -18002170 -18681571 -19338307 -19569154 -19159061 -18819346 -17915005 -17823195 -16013749
9443 -16013749 -17241138 -20067187 -19616973 -19164028 -19992074 -18621340 -18909923 -18508024 -20686726 -20009933
9433 -20009933 -18648929 -19449441 -18670729 -18463487 -19571256 -16629487 -18991484 -19075170 -20071944 -19007762
9423 -19007762 -18943111 -19617227 -18295687 -20605814 -18288215 -16397191 -16105369 -21739920 -19448077 -19274712
$$ packed form
9491a7688681j003850j127273J260255N20134k218138J289667j173015M38583L700315
9482a6002003n18225j177684j801487J144477l45590J271965O39294k511158Q38243
9473a8462168j556881n7440J790460k72893j133786J647684p19916J187367L59460O07504
9463a6610609p92040O22021j691320J163287m37876J260505j883270J364703p64843n13671
9453a8283113K307098k026155o79401o56736k30847M10093L39715R04341R1810J809446
9443a6013749j227389k826049M50214M52945q28046J370734k88583M01899k178702O76793
9433b0009933J361004q00512P78712K07242j107769K941769k361997q3686r96774J064182
9423a9007762O4651o74116J321540k310127K317599J891024K91822n634551K291843J73365
$$ plain form
9413 -19274712 -20746528 -19589146 -19265326 -19152416 -19597096 -20126992 -19086704 -19070362 -18425302 -17911359
9403 -17911359 -20516637 -20317315 -20849358 -19448954 -17453797 -19583822 -18450136 -18483562 -18895100 -17941617
9393 -17941617 -20070938 -18597648 -20929242 -18610002 -18912145 -19842311 -17583404 -18313214 -18858339 -18526370
9383 -18526370 -18202973 -18997352 -19005324 -19242566 -19733695 -20356345 -17699723 -18266275 -19671496 -18203013
9373 -18203013 -18893212 -19776761 -19423515 -19385287 -18927381 -19164258 -19310490 -18426498 -19245993 -18496962 -18566416
9362 -18566416 -19381616 -19000207 -18122394 -17914997 -16483203 -18905374 -20010012 -18941364 -19390368 -20753891
9352 -20753891 -18794273 -18944937 -18350720 -19704882 -18738083 -19003352 -19846070 -21019794 -21092664 -18729986
9342 -18729986 -20134678 -20016807 -21124641 -20885863 -21736803 -18602672 -19501115 -21173995 -19040187
$$ packed form
9413a9274712j471816J157382L23820J12910m44680n29896J040288J6342O45060N13943
9403a7911359k605278J99322n32043J400404J995157k130025J133686l3426m11538R53483
9393a7941617k129321J473290k331594K319240l02143r30166K258907p29810n45125L31969
9383a8526370L23397p94379p972k37242m91129o22650K656622n66552j405221J468483
9373a8203013o90199q83549L53246L8228M57906k36877j46232Q83992q19495P49031o9454
9362a8566416q15200L81409Q77813K07397J431794k422171j104638J068648m49004j363523
9352b0753891J959618j50664N94217j354162R66799k65269q42718j173724p2870K362678
9342a8729986j404692J17871j107834K38778q50940L134131q98443j672880K133808
$$ plain form
9333 -19040187 -17456871 -19232211 -20032572 -19335525 -18821524 -17137960 -19745913 -19135944 -18927732 -18751794
9323 -18751794 -19508007 -20375025 -18385345 -21670110 -20793989 -19237742 -21598506 -20620484 -18306186 -17877856
9313 -17877856 -20179011 -20250551 -20426866 -21179468 -20957328 -20085078 -18850086 -18608954 -20365488 -18701071
9303 -18701071 -19057458 -18120219 -19143545 -19774301 -18733629 -20255853 -18113736 -19551697 -19653029
9294 -19653029 -18485971 -20085344 -21298331 -19915802 -20317085 -19383903 -18982846 -18165315 -17479917 -19461900
9284 -19461900 -19549969 -19636266 -19240497 -19313394 -18982632 -17052772 -17348110 -18711389 -14970341 -18906253
9274 -18906253 -19699168 -19278928 -18242437 -19633831 -20516316 -20003048 -18818244 -18841661 -17849485 -17970921
9264 -17970921 -20750920 -20457741 -20464288 -18538622 -18316739 -20449542 -19743661 -19292072 -18675605 -19247981
$$ packed form
9333a9040187J583316j775340q00361O97047N14001J683564k607953O09969K08212J75938
9323a8751794p56213q67018J989680l284765Q76121J556247k360764R78022K314298M28330
9313a7877856k301155p1540j76315p52602K22140Q72250J234992K41132j756534J664417
9303a8701071l56387R37239j023326o30756J040672j522224K142117j437961j01332
9294a9653029J167058j599373j212987J382529m01283R33182M01057Q17531O85398j981983
9284a9461900q8069q6297L95769p2897L30762J929860k95338j363279L741048l935912
9274a8906253p92915M20240J036491j391394q82485N13268J184804k3417R92176j21436
9264a7970921k779999K93179o547J925666K21883k132803P05881M51589O16467n72376
$$ plain form
9254 -19247981 -18295688 -18251967 -17911322 -18664225 -18651915 -19613783 -20445889 -19755057 -18558499 -17818827 -18290350
9243 -18290350 -18586841 -19526374 -20350525 -18743605 -18081193 -18810911 -19949507 -19560111 -18874341 -19469804
9233 -19469804 -20634375 -19330561 -20235954 -20253257 -19605174 -19386882 -18674107 -18944410 -19167316 -20749614
9223 -20749614 -19883136 -20891146 -20242217 -19076810 -18874835 -20470134 -19753812 -19680349 -21021794 -19873133
9213 -19873133 -20709993 -21867913 -19555026 -20385954 -20545036 -16178008 -18942008 -18253497 -18248414 -18358610
9203 -18358610 -17033254 -17770276 -20101616 -20055899 -19172911 -20788213 -20231231 -18374592 -19843247 -19185958
9193 -19185958 -18326429 -18122584 -17732295 -19850837 -20586046 -21007125 -19759996 -20423470 -21358261 -18331117
9183 -18331117 -19086455 -17826820 -17998036 -20174330 -20284115 -21252290 -19712391 -20408512 -18081527 -19462295
$$ packed form
9254a9247981R52293M3721L40645p52903J2310r61868q32106O90832J196558P39672m71523
9243a8290350k96491r39533q24151J606920O62412p29718j138596L89396O85770n95463
9233a9469804j164571J303814r05393j7303O48083K18292P12775k70303k22906j582298
9223b0749614Q66478j008010O48929J165407K01975j595299P16322P3463j341445J148661
9213a9873133q36860j157920K312887q30928j59082M367028k764000O88511N083j10196
9203a8358610J325356p37022k331340M5717Q82988j615302N56982J856639j468655O57289
9193a9185958Q59529K03845L90289k118542p35209m21079J247129o63474r34791L027144
9183a8331117p55338J259635j71216k176294j09785r68175J539899o96121K326985j380768
$$ plain form
9173 -19462295 -20504908 -19085144 -18803062 -17764221 -16763935 -18247041 -20473716 -19024978 -18983547
9164 -18983547 -18625707 -18674622 -19732743 -22992572 -19159448 -20325365 -20346841 -21357868 -19595572 -20939470
9154 -20939470 -20347368 -20083422 -17948753 -18937602 -18210182 -19367434 -19637541 -19644969 -20896351 -19407400
9144 -19407400 -20052792 -19856603 -20378665 -19559773 -15700739 -18506443 -20931969 -21054120 -21308099 -16513262
9134 -16513262 -18169577 -17448337 -17716307 -18168007 -18066872 -17841121 -19401758 -18568024 -18088676 -17833483
9124 -17833483 -19020810 -19331759 -19919634 -19078620 -18586956 -17688055 -18362002 -16562464 -17398891 -18944795
9114 -18944795 -18866609 -17898380 -19548773 -18916846 -20847174 -18934133 -18439803 -17154696 -16708407 -18048778
9104 -18048778 -18472232 -17509576 -18616101 -17097763 -17968609 -18916512 -17216945 -19050359 -20209751 -19721399
$$ packed form
9173a9462295j042613J419764K82082J038841J000286j483106k226675J448738M1431
9164a8983547L57840m8915j058121l259829L833124j165917k1476j011027J762296j343898
9154b0939470N92102K63946K134669r88849P27420j157252k70107p428j251382J488951
9144a9407400o45392J96189n22062Q18892L859034k805704k425526j22151k53979M794837
9134a6513262j656315P21240k67970m51700J01135K25751j560637Q33734M79348K55193
9124a7833483j187327l10949n87875Q41014M91664Q98901o73947J799538q36427j545904
9114a8944795P8186R68229j650393O31927j930328J913041M94330J285107M46289j340371
9104a8048778m23454R62656j106525J518338q70846r47903J699567j833414j159392M88352
$$ plain form
9094 -19721399 -19143937 -19843712 -20817328 -19083932 -17706960 -19088308 -17500190 -19154013 -20007833
9085 -20007833 -18084910 -18394044 -18112835 -19453794 -19007799 -18643059 -17534581 -17081148 -17737682 -16746809
9075 -16746809 -17411940 -18003063 -19288406 -18806651 -19138793 -18798340 -18643833 -17281474 -16551225 -16992566
9065 -16992566 -17174363 -18405985 -18068204 -18318204 -18765512 -18918964 -17352254 -17192425 -18802693 -17504716
9055 -17504716 -19255668 -18409886 -18657177 -18851453 -18268336 -17566358 -16596659 -18806194 -17347033 -18892609
9045 -18892609 -19013050 -16658920 -17632928 -18896387 -19256074 -17949691 -19150246 -20521120 -21026434
9036 -21026434 -19359018 -19403114 -19625118 -20237006 -19553836 -19640658 -18983220 -17906219 -18062612 -17500395
9026 -17500395 -17339877 -18149654 -17670884 -17245078 -17683024 -17808232 -18518126 -19358401 -20634502 -21323264
$$ packed form
9094a9721399N77462o99775r73616J733396J376972j381348J588118j653823q53820
9085b0007833J922923l09134K81209j340959M45995L64740J108478M53433o56534R90873
9075a6746809o65131n91123j285343M81755l32142L40453J54507J362359P30249m41341
9065a6992566j81797j231622L37781k50000m47308j53452J566710J59829j610268J297977
9055a7504716j750952Q45782k47291j94276N83117P01978R69699k209535J459161j545576
9045a8892609j20441K354130r74008j263459l59687J306383j200555j370874n05314
9036b1026434J667416m4096k22004o11888O83170q6822O57438J077001j56393N62217
9026a7500395J60518q09777M78770M25806m37946j25208p09894q40275j276101o88762
$$ plain form
9016 -21323264 -15564850 -16119273 -18222923 -15967822 -16630966 -18374516 -19096694 -18039512 -18439653 -18209256
9006 -18209256 -18533277 -18607714 -17871514 -16444488 -16708076 -16947317 -15424715 -17538904 -17311174 -15686572
8996 -15686572 -17935365 -17360445 -16337014 -16932056 -17398668 -17308021 -17743300 -16737258 -16013187 -16134021
8986 -16134021 -17238784 -16929265 -17122673 -17748747 -18002388 -17972307 -14809574 -17230197 -15848454 -14886724
8976 -14886724 -14903777 -15748896 -14873714 -15287855 -14942703 -15664878 -14546079 -16247256 -15033740 -12791282
8966 -12791282 -14737996 -14324762 -13968350 -15936952 -13632411 -14033539 -14930933 -13055329 -15190605
8957 -15190605 -12879847 -13788112 -14027936 -12696764 -13298497 -13685064 -13872688 -12635567 -11228019 -13392148
8947 -13392148 -13411705 -11448437 -11201511 -11592780 -12925882 -12561521 -11988343 -13435792 -11341624 -11033008
$$ packed form
9016b1323264N758414n54423k103650K255101o63144j743550p22178J057182m00141K30397
9006a8209256l24021p4437P36200J427026k63588k39241J522602k114189K27730J624602
8996a5686572k248793N74920J023431n95042m66612R0647m35279J006042P24071j20834
8986a6134021j104763L09519j93408o26074k53641L0081L162733k420623J381743R61730
8976a4886724j7053q45119Q75182m14141L45152p22175J118799j701177J213516K242458
8966a2791282j946714M13234L56412j968602K304541m01128q97394J875604k135276
8957a5190605K310758r08265k39824J331172o01733l86567j87624J237121J407548k164129
8947a3392148j9557J963268K46926l91269j333102L64361N73178j447449K094168L08616
$$ plain form
8937 -11033008 -10776686 -10751924 -9159890 -9924591 -8288497 -8816253 -8998262 -7278004 -8833871 -7603090
8927 -7603090 -5223968 -4945650 -6921449 -4670267 -5099350 -4862114 -5428350 -5469525 -4304477 -3492330
8917 -3492330 -2813006 -3017012 -3436774 -182865 -2360026 -2296682 145038 175923 2428006 1480124
8907 1480124 2534548 2201503 1595264 4946671 5768439 6430850 7307041 8682155 11111426 10071967
8897 10071967 12712125 13640488 13742164 15482855 15340443 18112275 19365019 19180973 20363842 21272169
8887 21272169 22250047 24850946 23873580 25154254 25893843 26624532 28423925 29605617 31765426 32555173
8877 32555173 33600319 36592613 38374490 39208071 41158844 43170324 45966113 48546331 49890877
8868 49890877 52010599 52672958 54048083 57719985 61399313 63158657 62686085 64596693 65454667
$$ packed form
8937a1033008K56322K4762J592034p64701J636094n27756j82009J720258j555867J230781
8927g603090K379122K78318j975799K251182m29083K37236n66236m1175J165048Q12147
8917c492330O79324k04006m19762L253909k177161O3344K441720L0885K252083r47882
8907A480124J054424l33045o06239L351407Q21768O62411Q76191J375114K429271j039459
8897A0071967K640158R28363J01676J740691j42412K771832J252744j84046J182869R08327
8887B1272169R77878K600899r77366J280674P39589P30689J799393J181692K159809P89747
8877C2555173J045146K992294J781877Q33581J950773K011480K795789K580218J344546
8868D9890877K119722O62359J375125L671902L679328J759344m72572J910608Q57974
$$ plain form
8859 65454667 66214387 66902522 68668823 73308474 74682782 77438706 80400865 80860127 85458562
8850 85458562 90277087 94328301 98956616 103529791 109626679 116310104 119372640 123615757 131540523
8841 131540523 137664771 143402077 144061194 145375687 143993070 145609598 140870262 135642447 131553514
8832 131553514 127709274 122437497 115888609 112075842 107354536 104014716 98559614 94567300 91742942
8823 91742942 88589735 88419042 84542833 85990906 86335091 89344163 91485474 94586652 96028093
8814 96028093 95882375 98634641 101097877 105039443 108683697 104618265 97993161 89457438 84689811
8805 84689811 82808549 77945138 73218776 62927337 57663933 48205251 37875771 31120650 27776532
8796 27776532 22338261 18999880 14011634 9478084 3690818 -2311258 -4966104 -4378799 -8272365
$$ packed form
8859F5454667P59720O88135J766301M639651J374308K755924K962159M59262M598435
8850H5458562M818525M051214M628315M573175O096888O683425L062536M243117P924766
8841A31540523O124248N737306O59117J314493j382617J616528m739336n227815m088933
8832A31553514l844240n271777o548888l812767m721306l339820n455102l992314k824358
8823I1742942l153207j70693l876209J448073L44185L009072K141311L101178J441441
8814I6028093j45718K752266K463236L941566L644254m065432o625104q535723m767627
8805H4689811j881262m863411m726362j0291439n263404r458682j0329480o755121l344118
8796B7776532n438271l338381m988246m533550n787266o002076k654846N87305l893566
$$ plain form
8787 -8272365 -9883768 -11450400 -13509111 -13590429 -15610761 -16338657 -16188591 -16764348 -17081650 -16522340
8777 -16522340 -14581476 -16773630 -17374543 -17246182 -15879911 -14663296 -13531576 -11438392 -11870252
8768 -11870252 -12887962 -14638334 -12401028 -12671990 -13985376 -15666354 -15616954 -14508461 -16300876
8759 -16300876 -14873639 -15413319 -16103983 -15848637 -17056838 -16127515 -16610682 -17259440 -15712631 -17422785
8749 -17422785 -16760160 -10918617 -14199266 -14778763 -14235658 -15291260 -15669326 -15813933 -14633866 -15418433
8739 -15418433 -16330106 -16724327 -18320728 -15610512 -13965692 -14638437 -15372173 -16548845 -17342715 -16743492
8729 -16743492 -15148602 -17701280 -17378524 -18331726 -18987539 -18481096 -17227552 -19031564 -16644826 -17233461
8719 -17233461 -17480141 -17666502 -20098498 -19444700 -20136214 -18807365 -18235723 -21053053 -19316544 -20140879
$$ packed form
8787h272365j611403j566632k058711q1318k020332p27896J50066n75757l17302N59310
8777a6522340J940864k192154o00913J28361J366271J216615J131720K093184m31860
8768a1870252j017710j750372K237306k70962j313386j680978M9400J108493j792415
8759a6300876J427237n39680o90664K55346j208201R29323m83167o48758J546809j710154
8749a7422785O62625N841543l280649n79497N43105j055602l78066j44607J180067p84567
8739a5418433r11673l94221j596401K710216J644820o72745p33736j176672p93870N99223
8729a6743492J594890k552678L22756r53202o55813N06443J253544j804012K386738n88635
8719a7233461k46680j86361k431996O53798o91514J328849N71642k817330J736509q24335
$$ plain form
8709 -20140879 -20284836 -19794423 -19026252 -20047393 -18035736 -17053960 -18727135 -19393927 -20355954 -19232388
8699 -19232388 -19000809 -21343901 -19294033 -17999626 -18298989 -19392414 -19385823 -18965084 -20471195 -18844057
8689 -18844057 -19381778 -18722964 -18579188 -18124605 -16981911 -17995595 -19307146 -17501686 -17978992 -17836750
8679 -17836750 -17622823 -17445787 -17531312 -16244611 -17176938 -16365129 -16148676 -14266343 -15154189 -15471097
8669 -15471097 -14708615 -16023224 -17748509 -13654227 -13412067 -12647760 -12534483 -12944465 -11995843 -12727045
8659 -12727045 -14128730 -12029675 -10791553 -10963105 -11408833 -10810208 -9280605 -9060765 -9546651 -10227124
8649 -10227124 -8600224 -9033590 -8051220 -9155960 -7313418 -8201030 -7002216 -7663169 -7953965 -6496022
8639 -6496022 -5670221 -6445922 -6969674 -5367236 -5577091 -4409280 -5284026 -4532491 -3937683 -923403
$$ packed form
8709b0140879j43957M90413P68171j021141K011657R81776j673175o66792r62027J123566
8699a9232388K31579k343092K049868J294407k99363j093425O591M20739j506111J627138
8689a8844057n37721O58814J43776M54583J142694j013684j311551J805460m77306J42242
8679a7836750K13927J77036q5525J286701r32327Q11809K16453J882333q87846l16908
8669a5471097P62482j314609j725285M094282K42160P64307J13277m09982R48622p31202
8659a2727045j401685K099055J238122j71552m45728N98625J529603K19840m85886o80473
8649a0227124J626900m33366R82370j104740J842542q87612J198814o60953k90796J457943
8639f496022Q25801p75701n23752J602438k09855J167811q74746P51535N94808L014280
$$ plain form
8629 -923403 -3010643 -894177 442254 -802180 287118 2254071 3215046 4446315 6054744
8620 6054744 5600473 3983445 4214386 4192934 5192465 4081514 2354304 733282 -1103163 -4084335
8610 -4084335 -4063866 -2710417 -4364700 -6790487 -4835578 -6513205 -4357386 -3313207 -5023652 -5071800
8600 -5071800 -3151117 -2952100 -2314051 -2279837 -1998547 -728185 -1359576 -1071747 211470 1622175
8590 1622175 -1020465 -747597 -4053446 -5072480 -5543767 -7356048 -8526869 -10832788 -13341397
8581 -13341397 -15063615 -16750849 -15976832 -17108085 -17615043 -17032650 -17920385 -16972368 -18335569 -24035529
8571 -24035529 -20751088 -21657338 -21519996 -18991540 -19870228 -21262318 -19921148 -19678755 -20991300 -20860158
8561 -20860158 -19764112 -19161966 -20729865 -19382346 -20496606 -18985640 -19039866 -16624351 -18692825
$$ packed form
8629i23403k087240K116466J336431j244434J089298J966953R60975J231269J608429
8620F054744m54271j617028K30941k1452R99531j110951j727210j621022j836445k981172
8610d084335K0469J353449j654283k425787J954909j677627K155819J044179j710445m8148
8600e071800J920683J99017O38049L4214K81290J270362o31391K87829J283217J410705
8590A622175k642640K72868l305849j019034m71287j812281j170821k305919k508609
8581a3341397j722218j687234P74017j131253n06958N82393q87735R48017j363201n699960
8571b4035529L284441r06250J37342K528456q78688j392090J341170K42393j312545J31142
8561b0860158J096046O02146j567899J347519j114260J510966n4226K415515k068474
$$ plain form
8552 -18692825 -18969702 -19076490 -20946893 -20698773 -19155003 -19761577 -17927090 -17325372 -19568244 -19540755
8542 -19540755 -20427344 -19444810 -20102750 -18373580 -17778220 -18724059 -19347810 -18110567 -16837011 -18735999
8532 -18735999 -16981081 -15005900 -16668215 -18645123 -18072230 -17678245 -20085572 -17246027 -16636096 -16550878
8522 -16550878 -16813061 -18474005 -18760727 -16496897 -17562733 -18812215 -18968779 -17992617 -18438964 -18863755
8512 -18863755 -17979793 -18778002 -18848351 -18240633 -18417698 -18705636 -17969147 -19385118 -19594779 -16419985
8502 -16419985 -16943169 -18097908 -19431892 -18551117 -16587571 -19268845 -19361027 -19295093 -19782484 -18836963
8492 -18836963 -18589143 -18067462 -18468940 -18870785 -19303973 -18450326 -18857393 -18789258 -18602324 -17670491 -18107556
8481 -18107556 -17893939 -18122996 -18463609 -19615771 -19737914 -19315160 -17914697 -17426679 -18738192 -20060724
$$ packed form
8552a8692825k76877j06788j870403K48120J543770o06574J834487O01718k242872K7489
8542a9540755q86589R82534o57940J729170N95360r45839o23751J237243J273556j898988
8532a8735999J754918J975181j662315j976908N72893L93985k407327K839545O09931Q5218
8522a6550878k62183j660944k86722K263830j065836j249482j56564R76162m46347m24791
8512a8863755Q83962p98209p0349O07718j77065k87938P36489j415971k09661L174794
8502a6419985n23184j154739j333984Q80775J963546k681274r2182O5934m87391R45521
8492a8836963K47820N21681m01478m01845m33188Q53647m07067O8135J86934R31833m37065
8481a8107556K13617k29057l40613j152162j22143M22754J400463M88018j311513j322532
$$ plain form
8471 -20060724 -17990590 -17273175 -17555027 -16247051 -15121262 -17067689 -16676331 -17474685 -18194714 -17149858
8461 -17149858 -17291052 -18232811 -16666513 -18194622 -16889759 -17076981 -18722005 -16096663 -13718784
8452 -13718784 -15650827 -14616759 -16392130 -16789480 -18520846 -17505253 -16257558 -16143812 -16627470
8443 -16627470 -15200342 -16561524 -16804129 -16040064 -13767501 -14064715 -15184249 -13814432 -13670777 -13528045
8433 -13528045 -14420422 -14926129 -15163240 -16589586 -14069905 -14838153 -14306026 -15307646 -14535071 -13946544
8423 -13946544 -13159818 -12596264 -12589938 -13457421 -12900598 -12956393 -13361334 -12456487 -11160293 -12049036 -10650730
8412 -10650730 -12058326 -11789956 -11691239 -12505227 -10287591 -9494589 -10613190 -11840437 -8744196 -9652089
8402 -9652089 -10536407 -11308612 -9001866 -8875172 -7720533 -7800792 -8111537 -8326012 -7138585 -6009262
$$ packed form
8471b0060724K070134P17415k81852J307976J125789j946427L91358p98354p20029J044856
8461a7149858j41194r41759J566298j528109J304863j87222j645024K625342K377879
8452a3718784j932043J034068j775371l97350j731366J015593J247695J13746m83658
8443a6627470J427128j361182k42605P64065K272563k97214j119534J369817J43655J42732
8433a3528045q92377n05707k37111j426346K519681p68248N32127j001620P72575N88527
8423a3946544P86726N63554O326q67483N56823n5795m04941R04847J296194q88743J398306
8412a0650730j407596K68370R8717q13988K217636P93002j118601j227247L096241r07893
8402i652089q84318p72205K306746J26694J154639q0259l10745k14475J187427J129323
$$ plain form
8392 -6009262 -7487159 -8388103 -8167852 -7054133 -6083137 -6712601 -7439828 -5818999 -5234194 -6241403
8382 -6241403 -4693397 -4629579 -4102212 -2525641 -1314632 -840739 -422744 -1738280 -1183993 298169
8372 298169 -843126 -128924 1189768 -1319613 855253 -115479 893294 328526 1527503 3069179
8362 3069179 3021080 3329187 5230707 5721527 4094301 3684040 5589884 6367476 7977778 8600961
8352 8600961 9860807 11337156 12172185 12952883 10801584 13804145 16162273 16612655 19316801
8343 19316801 17901358 19444080 17906338 17667351 16243677 16951448 18304129 17939138 17458115
8334 17458115 18933703 19147768 20422934 21307243 22650863 22360761 23150817 25695353 27230161
8325 27230161 25413207 27432365 27926943 30214725 33225763 35032291 35974767 36461659 36422039 39543478
$$ packed form
8392f009262j477897r00944K20251J113719R70996o29464p27227J620829N84805j007209
8382f241403J548006O3818N27367J576571J211009M73893M17995j315536N54287J482162
8372B98169j141295P14202J318692k509381K174866r70732J008773n64768J198977J541676
8362C069179m8099L08107J901520M90820j627226m10261J905844P77592J610302O23183
8352H600961J259846J476349Q35029P80698k151299L002561K358128M50382K704146
8343A9316801j415443J542722j537742k38987j423674P07771J352681l64991m81023
8334A7458115J475588K14065J275166Q84309J343620k90102P90056K544536J534808
8325B7230161j816954K019158M94578K287782L011038J806528R42476M86892l9620L121439
$$ plain form
8315 39543478 39238346 37971628 36330792 37196409 39503379 41154012 42537232 42631676 43820854 43480851
8305 43480851 44704762 47581337 48150614 47139995 50115598 50360581 51955445 54210987 56654374
8296 56654374 56378344 56218381 59496358 60579070 65335165 68624756 71545430 69932257 72263877
8287 72263877 73087420 74780823 76403507 75827624 76265893 76142687 75989433 75092049 75592487 75886003
8277 75886003 77431272 79002346 76795020 78245071 78993094 80241443 80172582 79883427 81878220
8268 81878220 85589536 87570968 90326288 90239896 91919239 97659542 97527556 100465709 103185520
8259 103185520 101788606 99044384 94145129 93259109 90816532 88207996 86863495 83804335 80118367
8250 80118367 75050980 74131690 70678638 67671046 66638680 63491535 64117388 64797547 65114891 64340471
$$ packed form
8315C9543478l05132j266718j640836Q65617K306970J650633J383220R4444J189178l40003
8305D3480851J223911K876575N69277j010619K975603K44983J594864K255542K443387
8296E6654374k76030j59963L277977J082712M756095L289591K920674j613173K331620
8287G2263877Q23543J693403J622684n75883M38269j23206j53254q97384N00438K93516
8277G5886003J545269J571074k207326J450051P48023J248349o8861k89155J994793
8268H1878220L711316J981432K755320q6392J679343N740303j31986K938153K719811
8259A03185520j396914k744222m899255q86020k442577k608536j344501l059160l685968
8250H0118367n067387r19290l453052l007592j032366l147145O25853O80159L17344p74420
$$ plain form
8240 64340471 65696246 66207995 68410516 71851347 71446731 71154622 74134095 76266758 78257293
8231 78257293 76661426 73458683 70268760 70379882 67803315 67827693 65269786 63793007 62413850
8222 62413850 60977922 61963371 61874680 59901281 60393660 63153439 65394594 67722614 68363031 68925080
8212 68925080 71730448 73140485 74708100 76311033 82081383 84066426 87725838 90049073 90284303
8203 90284303 92732162 95380143 96526752 100777328 101720589 104317965 103189279 106839559 109037153
8194 109037153 111998605 113942308 116330993 120488420 123253596 126565536 129495502 131442128 133649717
8185 133649717 134365291 140194364 143765925 146404187 149153423 152943221 156726144 159186479 162407016
8176 162407016 165035208 168655709 173103086 181270704 184213558 189687802 194329624 199559929 207050700
$$ packed form
8240F4340471J355775N11749K202521L440831m04616k92109K979473K132663J990535
8231G8257293j595867l202743l189923J11122k576567K4378k557907j476779j379157
8222F2413850j435928R85449q8691j973399M92379K759779K241155K328020O40417N62049
8212F8925080K805368J410037J567615J602933N770350J985043L659412K323235K35230
8203I0284303K447859K647981J146609M250576R43261K597376j128686L650280K197594
8194A09037153K961452J943703K388685M157427K765176L311940K929966J946626K207589
8185A33649717P15574N829073L571561K638262K749236L789798L782923K460335L220537
8176A62407016K628192L620501M447377Q167618K942854N474244M641822N230305P490771
$$ plain form
8167 207050700 213481585 222128956 231242510 242016115 250715678 259543917 270860441 281153079
8159 281153079 288036074 293959212 299682035 306723615 311632504 315590348 318626667 322050664 323983141
8150 323983141 326995312 332667042 335979487 336292345 335290626 328184378 324544449 323928479 325141743
8141 325141743 324624131 324157126 328211315 332469709 341160743 347747055 356944891 366112861 377831818
8132 377831818 385048345 391878553 396347396 395752156 397851904 400810402 401404136 400981517 398602507
8123 398602507 395171929 392154876 390748564 394445609 394006493 389737288 382380275 374121532 366807067
8114 366807067 368716125 373160851 376206202 379860152 383145970 387176055 396021019 399560698 405358564
8105 405358564 411331652 417456676 418390424 421215650 432353611 442671244 451951790 462865913
$$ packed form
8167B07050700O430885Q647371R113554J0773605Q699563Q828239J1316524J0292638
8159B81153079O882995N923138N722823P041580M908889L957844L036319L423997J932477
8150C23983141L012171N671730L312445L12858j001719p106248l639929o15970J213264
8141C25141743n17612m67005M054189M258394Q691034O586312R197836R167970J1718957
8132C77831818P216527O830208M468843n95240K099748K958498N93734m22619k379010
8123C98602507l430578l017053j406312L697045m39116m269205p357013q258743p314465
8114C66807067J909058M444726L045351L653950L285818M030085Q844964L539679N797866
8105D05358564N973088O125024R33748K825226J1137961J0317633R280546J0914123
$$ plain form
8097 462865913 476719697 495225693 511440517 524895060 537615685 551668891 560612619 570209711
8089 570209711 578627995 589457326 608280748 627238332 636538570 642449739 651411012 664320784
8081 664320784 682321388 698397827 719808759 746952231 772009100 784741373 786972292 794974408
8073 794974408 804110172 819196698 841838878 862381087 876943887 885073710 888053285 893078297
8065 893078297 905141017 920208746 936821644 958644540 968677002 975057202 989788952 1012819394
8057 1012819394 1040772569 1071844243 1102855015 1129377307 1154888145 1189820149 1233150445
8050 1233150445 1272907042 1299752871 1329640757 1360068824 1383389009 1409872581 1449663801
8043 1449663801 1491095121 1528800642 1557437443 1579431564 1600273967 1638785673 1704437698
$$ packed form
8097D62865913J3853784J8505996J6214824J3454543J2720625J4053206Q943728R597092
8089E70209711Q418284J0829331J8823422J8957584R300238N911169Q961273J2909772
8081F64320784J8000604J6076439K1410932K7143472K5056869J2732273K230919Q002116
8073G94974408R135764J5086526K2642180K0542209J4562800Q129823K979575N025012
8065H93078297J2062720J5067729J6612898K1822896J0032462O380200J4731750K3030442
8057A012819394K7953175L1071674L1010772K6522292K5510838L4932004M3330296
8050A233150445L9756597K6845829K9887886L0428067K3320185K6483572L9791220
8043A449663801M1431320L7705521K8636801K1994121K0842403L8511706O5652025
$$ plain form
8036 1704437698 1769749406 1792694734 1811352495 1871550771 1905010894 1873752688 1821571934
8029 1821571934 1775493515 1739461149 1728007366 1767470806 1857320111 1948875142 2020095690
8022 2020095690 2068559270 2075663010 2065237233 2114212753 2147483647 2028933634 1777070949
8015 1777070949 1493450055 1240144942 1036869134 893568218 805868919 740111035 688982028
8008 688982028 652047501 635672237 608442376 561781975 515109523 480897775 457822393 441735224
8000 441735224 432283558 412967902 383733096 352662304 331459249 323798658 326325300 329884726
7992 329884726 328618798 323726233 327209596 339710299 353699810 366349448 382147086 396392831
7984 396392831 399374741 396563738 391576049 387042481 386838506 386681506 387437755 385881640 385899823
$$ packed form
8036A704437698O5311708K2945328J8657761O0198276L3460123l1258206n2180754
8029A821571934m6078419l6032366j1453783L9463440Q9849305R1555031P1220548
8022B020095690M8463580P103740j0425777M8975520L3270894j18550013k51862685
8015A777070949k83620894k53305113k03275808j43300916q7699299o5757884n1129007
8008F88982028l6934527j6375264k7229861m6660401m6672452l4211748k3075382j6087169
8000D41735224r451666j9315656k9234806l1070792k1203055p660591K526642L559426
7992C29884726j265928m892565L483363J2500703J3989511J2649638J5797638J4245745
7984C96392831K981910k811003m987689m533568k03975j57000P56249j556115J8183
$$ plain form
7975 385899823 390322735 396110960 392300336 384276812 375819225 363508717 358460250 363200501 362122286
7966 362122286 352396160 341508140 333869476 327009598 314867374 304344269 301032226 304974673
7958 304974673 307225491 306990181 307225470 315515766 325641208 325408962 310465238 287214784 265164964
7949 265164964 247033488 221528376 197528429 186081659 181634898 175744237 169574846 166678264
7941 166678264 162790192 157372856 154185256 147122900 140690115 136853177 132535211 125139626 117974210
7932 117974210 106141332 98482955 92548854 90339423 88165002 85587119 81988691 79131679 79776848
7923 79776848 80304139 80023178 75771392 75073911 71307554 62525727 49815887 41018137 36189658
7914 36189658 32398437 26915253 23907825 22934061 20424055 20818048 20264267 16803657 14015618
$$ packed form
7975C85899823M422912N788225l810624q023524q457587j2310508n048467M740251j078215
7966C62122286r726126j0888020p638664o859878j2142224j0523105l312043L942447
7958C04974673K250818k35310K35289Q290296J0125442k32246j4943724k3250454k2049820
7949B65164964j8131476k5505112k3999947j1446770m446761n890661o169391k896582
7941A66678264l888072n417336l187600p062356o432785l836938m317966p395585p165416
7932A17974210j1832878p658377n934101k209431k174421k577883l598428k857012O45169
7923G9776848N27291k80961m251786o97481l766357q781827j2709840q797750m828479
7914C6189658l791221n483184l007428r73764k510006L93993n53781l460610k788039
$$ plain form
7905 14015618 8773424 5234148 5272186 2027440 555052 -4968809 -8871523 -8636188 -8100426 -7525278
7895 -7525278 -6713668 -5151106 -5153363 -3451157 -4355005 -2316630 -1065262 -285571 -1740873 -2811681
7885 -2811681 -3789947 -2602731 -1021384 -1759359 -298987 -1261626 -18029 -208079 -850201 -1218698
7875 -1218698 -1225629 -551168 -7487 413313 -1485246 -1114727 -577425 1912814 1033145 813347 301843
7864 301843 -1015580 -842447 10463 457680 -611325 -1722226 -2976645 -5067324 -5354420 -5721640
7854 -5721640 -3558790 -5449295 -6724541 -7170035 -7026886 -8870867 -6851330 -7342913 -4731811
7845 -4731811 -2000667 -2273020 -2570971 -2315415 -2753394 -2837489 -3334825 -3038267 -3171839 -4702916
7835 -4702916 -4214111 -993864 -3119739 -4702045 -6319908 -5441696 -6870769 -4950602 -5494651
$$ packed form
7905A4015618n242194l539276L8038l244746j472388n523861l902714K35335N35762N75148
7895g525278Q11610J562562k257J702206r03848K038375J251368P79691j455302j070808
7885b811681r78266J187216J581347p37975J460372r62639J243597j90050o42122l68497
7875a218698o931O74461N43681M20800j898559L70519N37302K490239q79669k19798n11504
7864C01843j317423J73133Q52910M47217j069005j110901j254419k090679k87096l67220
7854e721640K162850j890505j275246m45494J43149j843981K019537m91583K611102
7845d731811K731144k72353k97951K55556m37979q4095m97336K96558j33572j531077
7835d702916M88805L220247k125875j582306j617863Q78212j429073J920167n44049
$$ plain form
7826 -5494651 -3222440 -1546822 -1177995 -1061423 -4005738 -4406769 -4934044 -3084962 -2263655 -4698864
7816 -4698864 -5508957 -6887853 -6210237 -5114929 -4802537 -4861278 -4409013 -4828372 -5941466 -5926581
7806 -5926581 -7182295 -8313742 -8578171 -8112173 -9502400 -8886685 -9423564 -9330023 -9000962 -9720448
7796 -9720448 -9883121 -9162628 -9697051 -10219084 -12266575 -11825619 -12260767 -13356228 -13877430 -13591347
7786 -13591347 -12570379 -12383613 -11823655 -12769996 -12628260 -11609518 -8885716 -7696154 -7574552 -7027632
7776 -7027632 -4836598 -3559774 -4456912 -3417897 -2879749 -2719377 -1222781 -109949 -278723 -308174
7766 -308174 -537965 -677643 352555 429734 803735 -1114331 -544883 -1322047 -602686 -109199
7756 -109199 2534052 1309658 1803865 1550045 2268328 2424790 2598253 2947006 3097305 2833766
$$ packed form
7826e494651K272211J675618L68827J16572k944315m01031n27275J849082Q21307k435209
7816d698864q10093j378896O77616J095308L12392n8741M52265m19359j113094J4885
7806e926581j255714j131447k64429M65998j390227O15715n36879R3541L29061p19486
7796i720448j62673P20493n34423n22033k047491M40956m35148j095461n21202K86083
7786a3591347J020968J86766N59958r46341J41736J018742K723802J189562J21602N46920
7776g027632K191034J276824q97138J039015N38148J60372J496596J112832j68774k9451
7766c08174k29791j39678J030198P7179L74001j918066N69448p77164P19361M93487
7756a09199K643251j224394M94207k53820P18283J56462J73463L48753J50299k63539
$$ plain form
7746 2833766 2963669 1592414 2033345 2998463 3893842 3197202 2210762 2011786 1679151 2208396
7736 2208396 3392646 816767 621323 -519084 -580724 -1624361 -2160611 -2357642 -2641958 -1912196
7726 -1912196 -2531898 -2217199 -2068499 -3517245 -2809932 -4341980 -6127512 -5197840 -5701892 -5226967
7716 -5226967 -4701419 -6060630 -6362057 -5677879 -5928479 -6661423 -6557226 -5532441 -4473210 -6916999
7706 -6916999 -8533219 -5796617 -5784740 -5478044 -6015571 -6783696 -5574292 -8399418 -8202183 -10723740
7696 -10723740 -8731163 -7862219 -7933068 -6278427 -9057876 -7984425 -10470371 -8515690 -7355468
7687 -7355468 -5422602 -5789784 -6282049 -4484737 -5448421 -5262189 -6711792 -5539696 -4912246 -5167556
7677 -5167556 -6515683 -5885920 -6753568 -7046168 -7087089 -8304684 -8949958 -7269396 -7752300 -9582823
$$ packed form
7746B833766J29903j371255M40931R65118Q95379o96640r86440j98976l32635N29245
7736B208396J184250k575879j95444j140407o1640j043637n36250j97031k84316P29762
7726a912196o19702L14699J48700j448746P07313j532048j785532R29672n04052M74925
7716e226967N25548j359211l01427O84178k50600p32944J04197J024785J059231k443789
7706f916999j616220K736602J1877L06696n37527p68125J209404k825126J97235k521557
7696a0723740J992577Q68944p0849J654641k779449J073451k485946J954681J160222
7687g355468J932866l67182m92265J797312r63684J86232j449603J172096O27450k55310
7677e167556j348127O29763q67648k92600m0921j217595o45274J680562m82904j830523
$$ plain form
7667 -9582823 -10146949 -11121194 -9440336 -9592888 -8450763 -8458212 -8299276 -7979443 -9446364 -8224763
7657 -8224763 -9675124 -9146032 -11621210 -11967935 -10464423 -10221296 -9596528 -10668996 -10501918 -10433920
7647 -10433920 -9872429 -9445960 -10223264 -9106944 -8751954 -11089961 -8461440 -8875065 -9230644 -10300171
7637 -10300171 -9174377 -10684723 -10271939 -11138525 -9913297 -10629853 -9847291 -8859596 -12352294 -9230272
7627 -9230272 -11374628 -9614407 -9529878 -8656999 -9065966 -9826528 -9420588 -10977406 -9467137 -8539324
7617 -8539324 -9838229 -9387937 -10542086 -11012697 -8733654 -10144507 -8710819 -11648174 -10243423
7608 -10243423 -10689767 -11183050 -10659704 -11554387 -11060145 -10935558 -11840626 -11280760 -11199953 -10442265 -10604029
7597 -10604029 -10404703 -10422005 -11672180 -12500127 -11240879 -10822602 -11578536 -10836031 -9928604 -11392561
$$ packed form
7667i582823n64126r74245J680858j52552J142125p449J58936L19833j466921J221601
7657h224763j450361N29092k475178l46725J503512K43127O24768j072468J67078O7998
7647a0433920N61491M26469p77304J116320L54990k338007K628521m13625l55579j069527
7637a0300171J125794j510346M12784q66586J225228p16556P82562R87695l492698L122022
7627i230272k144356J760221Q4529Q72879m08967p60562M05940j556818J510269R27813
7617h539324j298905M50292j154149m70611K279043j410853J433688k937355J404751
7608a0243423m46344m93283N23346q94683M94242J24587r05068N59866Q0807P57688j61764
7597a0604029J99326j7302j250175q27947J259248M18277p55934P42505R07427j463957
$$ plain form
7587 -11392561 -9010534 -13838934 -12174269 -13331406 -13145834 -12489896 -9180633 -11390202 -10527563
7578 -10527563 -9327229 -11001703 -10610991 -11455926 -11859739 -11665505 -9668399 -12146368 -11024200
7569 -11024200 -9859008 -9964999 -10054603 -12229721 -11516129 -11246378 -10397939 -10762734 -10642738 -12960921
7559 -12960921 -11522319 -10387797 -10807402 -9416167 -10344137 -10339530 -8880785 -9975967 -9352795 -9906123
7549 -9906123 -9190707 -9555564 -9921253 -10483256 -9063849 -9594775 -8909625 -8805865 -8859442 -10430126
7539 -10430126 -9570449 -8945216 -8329745 -10021070 -10669525 -10264775 -10048997 -8686057 -9330643 -9301709
7529 -9301709 -9505079 -8434547 -10301143 -10046540 -10501576 -10052832 -9648028 -9418931 -10106779 -9305547
7519 -9305547 -9489585 -10558466 -10024453 -9770494 -11823390 -11187773 -8944041 -10637464 -10132272 -9183655
$$ packed form
7587a1392561K382027m828400J664665j157137J85572O55938L309263k209569Q62639
7578a0527563J200334j674474L90712q44935m03813J94234J997106k477969J122168
7569a1024200J165192j05991q9604k175118P13592K69751Q48439l64795J19996k318183
7559a2960921J438602J134522m19605J391235r27970M607J458745j095182O23172n53328
7549i906123P15416l64857l65689n62003J419407n30926O85150J03760n3577j570684
7539a0430126Q59677O25233O15471j691325o48455M04750K15778J362940o44586K8934
7529i301709k03370J070532j866596K54603m55036M48744M04804K29097o87848Q01232
7519i305547j84038j068881N34013K53959k052896O35617K243732j693423N05192R48617
$$ plain form
7509 -9183655 -10093570 -10496671 -8920605 -9235109 -8814747 -10025572 -10862025 -10787824 -9057365 -8011869
7499 -8011869 -8304566 -9592471 -9987823 -10329990 -10588567 -10112361 -11183604 -11049753 -12354992 -11006294
7489 -11006294 -11533350 -11756503 -10306308 -9908939 -7958587 -9548845 -11440710 -11833310 -9842296 -9873367
7479 -9873367 -10276619 -9260236 -9520009 -9632154 -10107262 -10109550 -10009130 -8921775 -10468194 -10384846 -10763094
7468 -10763094 -10343842 -9629463 -10237586 -11332882 -9584578 -8788606 -11091196 -11383699 -11024901 -12220700
7458 -12220700 -11007731 -9318266 -10071655 -11664233 -11709930 -10383991 -10716635 -11239162 -9520812 -11529518
7448 -11529518 -11494996 -11664731 -10426144 -10006222 -11534369 -11948122 -12113658 -11436952 -15406891 -11034789
7438 -11034789 -11569409 -11490361 -11444707 -13406291 -14507364 -12024781 -11787086 -7700158 -8665728 -8301906
$$ packed form
7509i183655r09915m03101J576066l14504M20362j210825q36453P4201J730459J045496
7499h011869k92697j287905l95352l42167k58577M76206j071243J33851j305239J348698
7489a1006294n27056k23153J450195L97369J950352j590258j891865l92600J991014l1071
7479i873367m03252J016383k59773j12145m75108k288J00420J087355j546419Q3348l78248
7468a0763094M19252P14379o08123j095296J748304P95972k302590k92503L58798j195799
7458a2220700J212969J689465p53389j592578m5697J325939l32644n22527J718350k008706
7448a1529518L4522j69735J238587M19922j528147m13753j65536O76706l969939M372102
7438a1034789n34620P9048M5654j961584j101073K482583K37695M086928r65570L63822
$$ plain form
7428 -8301906 -8503325 -9549132 -9850053 -7229113 -14241433 -11836090 -12633876 -11720424 -10306010 -11591702
7418 -11591702 -12771436 -11367385 -9975154 -10640247 -11236130 -11841275 -11900736 -10907194 -10901047 -10193068
7408 -10193068 -11114915 -12513825 -11613106 -12056697 -11603768 -11559611 -11963154 -12188286 -12194784 -10768571 -10946529
7397 -10946529 -11468071 -12714072 -12241981 -11235828 -11715161 -12120594 -11697316 -11817730 -10366710 -10082236
7387 -10082236 -12234085 -10378702 -9735100 -9074838 -10655262 -10628870 -11506190 -10234589 -10794844 -10391449
7377 -10391449 -9314086 -9859561 -9587166 -10986460 -10207854 -10615625 -9691662 -8753394 -10471822 -9614689
7367 -9614689 -10206058 -9519661 -10912027 -9600121 -10375989 -11437029 -9691571 -10859766 -10494986 -11362668
7357 -11362668 -11065844 -11659262 -13042778 -12479289 -11616520 -11121631 -10447770 -12096103 -12620319 -11657816
$$ packed form
7428h301906k01419j045807l00921K620940p012320K405343p97786R13452J414414j285692
7418a1591702j179734J404051J392231o65093n95883o05145n9461R93542O147P07979
7408a0193068r21847j398910R00719m43591M52929M4157m03543k25132o498J426213j77958
7397a0946529n21542j246001M72091J006153m79333m05433M23278j20414J451020K84474
7387a0082236k151849J855383O43602O60262j580424K6392q77320J271601n60255M03395
7377a0391449J077363n45475K72395j399294P78606m07771R23963R38268j718428Q57133
7367i614689n91369O86397j392366J311906p75868j061040J745458j168195L64780q67682
7357a1362668K96824n93418j383516N63489Q62769M94889O73861j648333n24216R62503
$$ plain form
7347 -11657816 -12009110 -12411151 -11747110 -11707121 -10707920 -11868168 -12075761 -11244765 -10701620 -10387038
7337 -10387038 -10558439 -11684202 -12748644 -12809681 -11495286 -11937635 -12569729 -12160089 -13058048 -12119525
7327 -12119525 -12496213 -10372007 -11587939 -11047235 -11745195 -10703786 -11993859 -12695598 -13365853 -12862004
7317 -12862004 -13628048 -13993733 -13313177 -13326765 -10896753 -11722186 -11139716 -12920917 -13480517 -13838143
7307 -13838143 -12736954 -11617752 -9620572 -11501333 -13488641 -13659994 -10929055 -11621251 -8521347
7298 -8521347 -10397155 -11434453 -11251585 -14716140 -13969537 -13986214 -14313301 -12397943 -13147456 -12909355
7288 -12909355 -11375751 -11537483 -11884414 -10746696 -14234251 -13784827 -13116629 -11499630 -13070370 -12795449
7278 -12795449 -12605359 -12021821 -14966616 -14269907 -16271929 -17054472 -8418662 -11337377 -11541258 -12149829
$$ packed form
7347a1657816l51294m02041O64041L9989R99201j160248k07593Q30996N43145L14582
7337a0387038j71401j125763j064442o1037J314395m42349o32094M09640q97959R38523
7327a2119525l76688K124206j215932N40704o97960J041409j290073p01739o70255N03849
7317a2862004p66044l65685O80556j3588K430012q25433N82470j781201n59600l57626
7307a3838143J101189J119202J997180j880761j987308j71353K730939o92196L099904
7298h521347j875808j037298J82868l464555P46603j6677l27087J915358p49513K38101
7288a2909355J533604j61732l46931J137718l487555M49424O68198J616999j570740K74921
7278a2795449J90090N83538k944795O96709k002022p82543Q635810k918715k03881o08571
$$ plain form
7268 -12149829 -12262263 -13723054 -11919149 -11679737 -14354057 -13280373 -11854870 -12672089 -14630027
7259 -14630027 -12998233 -10692357 -11365347 -12652482 -11604854 -11450437 -11182397 -12307348 -12992324
7250 -12992324 -11226935 -11131367 -12853659 -13899399 -11988242 -13780685 -12369265 -11536434 -12417312 -13163774
7240 -13163774 -13940325 -12873300 -13986658 -13074335 -11750488 -11452183 -13031618 -12535602 -13117240 -14562554
7230 -14562554 -15750121 -13513177 -13912695 -12736841 -12780883 -14884368 -14060003 -13589975 -12887104 -12872832
7220 -12872832 -13220607 -14140963 -11360806 -13143355 -14994161 -15460574 -13347479 -12529735 -12717617 -13506461
7210 -13506461 -13635282 -13502302 -11072883 -13330287 -10849929 -12615647 -12792398 -12927554 -12520998 -13356151
7200 -13356151 -14772139 -12642295 -13059083 -13241229 -13656868 -16180430 -11133584 -11988529 -11940521 -13129296
$$ packed form
7268a2149829j12434j460791J803905K39412k674320J073684J425503q17219j957938
7259a4630027J631794K305876o72990j287135J047628J54417K68040j124951o84976
7250a2992324J765389R5568j722292j045740J911157j792443J411420Q32831q80878p46462
7240a3163774p76551J067025j113358R12323J323847K98305j579435M96016n81638j445314
7230a4562554j187567K236944l99518J175854m4042k103485Q24365M70028P02871J4272
7220a2872832l47775r20356K780157j782549j850806m66413K113095Q17744j87882p88844
7210a3506461j28821J32980K429419k257404K480358j765718j76751j35156M06556q35153
7200a3356151j415988K129844m16788j82146m15639k523562N046846q54945M8008j188775
$$ plain form
7190 -13129296 -11544317 -12816834 -14061748 -13905810 -13045297 -12845135 -12678218 -12478364 -11271100 -12422891
7180 -12422891 -12546914 -14240557 -14040520 -11479307 -11445190 -12268705 -11857532 -10938765 -11484820 -11607793
7170 -11607793 -11568786 -11590331 -10139182 -11149855 -12993786 -12103406 -10515420 -10095133 -11325549 -11540404
7160 -11540404 -12108518 -12132558 -12257606 -11236025 -13035818 -13776786 -13429681 -12774566 -11145383 -11699285
7150 -11699285 -11912285 -11991260 -12928249 -14695587 -14104393 -12951409 -13290112 -11876130 -12649260 -12570129
7140 -12570129 -13720373 -12526270 -13119964 -13721993 -11113987 -12101714 -11366077 -11440101 -11822483 -11507625
7130 -11507625 -11065635 -13521324 -12902621 -9611638 -11282434 -13035873 -12991360 -12604619 -11395476 -13492560
7120 -13492560 -12374713 -12483117 -12666200 -12454792 -12918741 -11604379 -11811436 -11666472 -12206096 -12885895
$$ packed form
7190a3129296J584979j272517j244914J55938Q60513K00162J66917J99854J207264j151791
7180a2422891j24023j693643K00037K561213L4117q23515M11173R18767n46055j22973
7170a1607793L9007k1545J451149j010673j843931Q90380J587986M20287j230416k14855
7160a1540404n68114k4040j25048J021581j799793p40968L47105O55115J629183n53902
7150a1699285k13000p8975r36989j767338N91194J152984l38703J413982p73130P9131
7140a2570129j150244J194103n93694o02029K608006r87727P35637p4024l82382L14858
7130a1507625M41990k455689O18703L290983j670796j753439M4513L86741J209143k097084
7120a3492560J117847j08404j83083K11408m63949J314362k07057J44964n39624o79799
$$ plain form
7110 -12885895 -12415059 -13563912 -13781626 -13318840 -11769238 -14867590 -13871039 -13837124 -14106675 -12915819
7100 -12915819 -13396674 -11982990 -12667831 -13287676 -12460549 -15024620 -12706315 -14176809 -12465735 -12810625
7090 -12810625 -13088956 -13107890 -12003112 -12484971 -14037647 -14326314 -13510601 -12653621 -12461740 -12417506
7080 -12417506 -11845175 -11390549 -13448992 -11654128 -11331837 -12732858 -10458276 -9958723 -11712117
7071 -11712117 -13314998 -14452319 -13486213 -13916898 -15071412 -13916156 -13415535 -13395948 -14560919 -14356631
7061 -14356631 -14792147 -14232559 -15584454 -13835562 -13225366 -13037290 -13727099 -14039089 -13046385 -12927801
7051 -12927801 -12598102 -12341293 -12977761 -13901101 -13093996 -13656916 -12920520 -11330160 -11635383 -11370763
7041 -11370763 -12926794 -16714006 -13779269 -14362471 -12592861 -15679040 -15423123 -14612015 -13639757 -13798471
$$ packed form
7110a2885895M70836j148853k17714M62786J549602l098352R96551L3915k69551J190856
7100a2915819m80855J413684o84841o19845Q27127k564071K318305j470494J711074l44890
7090a2810625k78331j8934J104778m81859j552676k88667Q15713Q56980J91881M4234
7080a2417506N72331M54626k058443J794864L22291j401021K274582M99553j753394
7071a1712117j602881j137321R66106m30685j154514J155256N00621J9587j164971K04288
7061a4356631m35516N59588j351895J748892O10196J88076o89809l11990R92704J18584
7051a2927801L29699K56809o36468r23340Q07105n62920P36396J590360l05223K64620
7041a1370763j556031l787212K934737n83202J769610l086179K55917Q11108R72258j58714
$$ plain form
7031 -13798471 -14360990 -13921401 -13246293 -14133097 -12597190 -12942723 -13684984 -12976019 -14165831 -14517543
7021 -14517543 -14617215 -14735379 -14713535 -13435334 -12878865 -14356554 -7345201 -8795515 -10362506 -12323735
7011 -12323735 -12043210 -12712245 -12191729 -12847930 -12562458 -12636268 -12366448 -11659997 -12564577 -12991781 -12525029
7000 -12525029 -13198469 -15026731 -11524637 -12808682 -12206267 -9117113 -12364182 -10653908 -9613365
6991 -9613365 -10503413 -7417588 1726401 -30767396 -21321738 -18805882 -18254915 -16888030 -15540940
6982 -15540940 -13731632 -14594653 -14427421 -13894448 -14188332 -14961791 -15357003 -14345871 -13430728 -14351568
6972 -14351568 -14233362 -14517135 -13046894 -14255944 -16121217 -12956639 -12364318 -14033655 -12327026
6963 -12327026 -14096661 -13684834 -13159822 -13702983 -14616224 -14460118 -13037939 -13191484 -13221317 -14514546
$$ packed form
7031a3798471n62519M39589O75108q86804J535907l45533p42261P08965j189812l51712
7021a4517543r9672j18164K1844J278201N56469j477689P011353j450314j566991j961229
7011a2323735K80525o69035N20516o56201K85472p3810K69820P06451r04580m27204M66752
7000a2525029o73440j828262L502094j284045O02415L089154l247069J710274J040543
6991i613365q90048L085825R143989l2493797R445658K515856N50967J366885J347090
6982a5540940J809308q63021J67232N32973k93884p73459l95212J011132R15143r20840
6972a4351568J18206k83773J470241j209050j865273L164578N92321j669337J706629
6963a2327026j769635M11827N25012n43161r13241J56106J422179j53545k9833j293229
$$ plain form
6953 -14514546 -13017976 -12945713 -12014728 -13211238 -12750921 -13184013 -14234760 -13564136 -11410941 -13440779
6943 -13440779 -13503641 -13692470 -14703625 -14065493 -14000195 -14477626 -13534186 -15245224 -15046139 -13871853
6933 -13871853 -15013370 -13364400 -15215174 -15104852 -15424013 -14688678 -12942760 -13739066 -14970497 -14017850
6923 -14017850 -13999018 -13501646 -13854674 -13811034 -13806084 -11535473 -13667449 -13556753 -14153615 -13787097 -13881577
6912 -13881577 -15009595 -13905690 -14356361 -13799908 -14909761 -13127885 -14411211 -14745720 -15664582 -15513198
6902 -15513198 -15260791 -14767397 -13238396 -12682405 -13347883 -14041760 -15737017 -15012424 -12417774 -12287210
6892 -12287210 -10483796 -12684774 -13349616 -13221084 -12420306 -13028120 -13567017 -12914453 -13376264 -13461215
6882 -13461215 -13524133 -13851393 -13923942 -13997564 -13635697 -13026824 -13389851 -14309300 -13446691 -13313515 -14947701
$$ packed form
6953a4514546J496570P2263R30985j196510M60317m33092j050747O70624K153195k029838
6943a3440779o2862j88829j011155O38132O5298m77431R43440j711038J99085J174286
6933a3871853j141517J648970j850774J10322l19161P35335J745918p96306j231431R52647
6923a4017850J8832M97372l53028M3640M950K270611k131976J10696n96862L66518r4480
6912a3881577j128018J103905m50671N56453j109853J781876j283326l34509r18862J51384
6902a5513198K52407M93394J529001N55991o65478o93877j695257P24593K594650J30564
6892a2287210J803414k200978o64842J28532Q00778o07814n38897O52564m61811q4951
6882a3461215o2918l27260p2549p3622L61867O08873l63027r19449Q62609J33176j634186
$$ plain form
6871 -14947701 -14786728 -13664552 -15244596 -16152468 -14434520 -15614121 -14924290 -16296998 -14332804
6862 -14332804 -13376134 -15162539 -14952942 -13868094 -14120390 -15176124 -14238921 -14677305 -17272101 -16182413
6852 -16182413 -13694548 -14971494 -14387935 -14396619 -14710388 -14911189 -14161673 -13852025 -13026823 -14400030
6842 -14400030 -14037290 -14231024 -13856410 -12434580 -13563336 -15093197 -14548596 -15419026 -14408947 -14567224
6832 -14567224 -14618144 -14642255 -14758384 -15282263 -14480233 -14074147 -13187858 -15107061 -13415466 -12557698
6822 -12557698 -12812145 -12694296 -12451061 -14442264 -15549935 -14819446 -14862783 -14234897 -15718218 -14923701
6812 -14923701 -13529803 -14030074 -16358588 -14213452 -16064911 -13853788 -14952946 -15871743 -15807998 -15768108
6802 -15768108 -15573387 -12983933 -12158339 -13566742 -14900725 -14910219 -13775441 -14962005 -14333832 -14700378
$$ packed form
6871a4947701J60973J122176j580044r07872J717948j179601O89831j372708J964194
6862a4332804R56670j786405K09597J084848k52296j055734R37203m38384k594796J089688
6852a6182413K487865j276946N83559q684l13769k00801P49516L09648Q25202j373207
6842a4400030L62740j93734L74614J421830j128756j529861N44601q70430J010079j58277
6832a4567224n0920k4111j16129n23879Q02030M06086Q86289j919203J691595Q57768
6822a2557698k54447J17849K43235j991203j107671P30489m3337O27886j483321P94517
6812a4923701J393898n00271k328514K145136j851459K211123j099158r18797O3745L9890
6802a5768108J94721K589454Q25594j408403j333983r494J134778j186564O28173l66546
$$ plain form
6792 -14700378 -14580482 -15924870 -15551277 -14638509 -14275522 -15066992 -14029260 -12941509 -13362551 -13617525
6782 -13617525 -14254109 -14575890 -14196416 -13469150 -14118466 -12778289 -12267235 -14058422 -14315143 -14859467
6772 -14859467 -14925337 -16769921 -13249596 -13489852 -13610619 -12836637 -12770388 -13485002 -14701244 -15177175
6762 -15177175 -14240518 -13523285 -13180693 -11662542 -14918741 -14719435 -15037980 -16265377 -16163321 -14384211
6752 -14384211 -14108413 -13253595 -13801161 -13550541 -13685215 -15738968 -14356117 -12934876 -13641116 -13232724
6742 -13232724 -13514811 -13595977 -14565596 -14431920 -14643767 -13929433 -14081387 -12939787 -12801378 -14438377
6732 -14438377 -15166817 -14493344 -12976659 -14489469 -14250010 -14916600 -16520249 -15311688 -14340700 -14777214
6722 -14777214 -13915902 -15378847 -14211995 -13492761 -13697395 -15562290 -15499386 -15240444 -16446846 -13718683
$$ packed form
6792a4700378J19896j344388L73593R12768L62987p91470J037732J087751m21042k54974
6782a3617525o36584l21781L79474P27266o49316J340177N11054j791187k56721n44324
6772a4859467o5870j844584L520325k40256j20767P73982O6249p14614j216242m75931
6762a5177175R36657P17233L42592J518151l256199J99306l18545j227397J02056J779110
6752a4384211K75798Q54818n47566K50620j34674k053753J382851J421241p06240M08392
6742a3232724k82087q1166r69619J33676k11847P14334j51954J141600J38409j636999
6732a4438377p28440O73473J516685j512810K39459o66590j603649J208561R70988m36514
6722a4777214Q61312j462945J166852P19234k04634j864895O2904K58942j206402K728163
$$ plain form
6712 -13718683 -14980478 -14757390 -15932892 -14366757 -13321232 -12992110 -14786566 -14751444 -16300583 -15486648
6702 -15486648 -13819195 -13191229 -13736018 -14404198 -14201602 -14911425 -14611093 -14137439 -14765183 -13719319
6692 -13719319 -12474710 -14234877 -16040449 -17207800 -14839708 -14283631 -14000815 -17117595 -15434890
6683 -15434890 -14947903 -14004321 -13323461 -14642499 -15011788 -13632215 -14808202 -13112676 -15000428 -14494101
6673 -14494101 -14889455 -13670584 -14801279 -13939369 -13593477 -14738589 -15612293 -14117110 -14008743 -12921088
6663 -12921088 -13251917 -13102230 -14210378 -14180578 -13845272 -12633292 -12851523 -14715105 -14815417 -14985825
6653 -14985825 -13556931 -13364669 -13443348 -13583943 -14022610 -16659824 -14035832 -11193795 -17784779 -15531750
6643 -15531750 -16039740 -14759085 -14332084 -15027039 -13681588 -13991453 -12601221 -13312055 -15249411 -15409970
$$ packed form
6712a3718683j261795K23088j175502J566135J045525L29122j794456L5122j549139Q13935
6702a5486648J667453O27966n44789o68180K02596p09823L00332M73654o27744J045864
6692a3719319J244609j760167j805572j167351K368092N56077K82816l116780J682705
6683a5434890M86987R43582O80860j319038l69289J379573j175987J695526j887752N06327
6673a4494101l95354J218871j130695Q61910L45892j145112q73704J495183J08367J087655
6663a2921088l30829J49687j108148K9800L35306J211980k18231j863582j00312j70408
6653a4985825J428894J92262p8679j40595m38667k637214K623992K842037o590984K253029
6643a5531750n07990J280655M27001o94955J345451l09865J390232p10834j937356j60559
$$ plain form
6633 -15409970 -14517556 -14567840 -13265591 -14549647 -14503739 -13951167 -12954307 -12997608 -15640562 -15659067 -14777493
6622 -14777493 -12201042 -13308670 -14653246 -15793348 -15594514 -15752978 -12859310 -13846510 -14745107 -15619039
6612 -15619039 -14768580 -15546058 -16245584 -16195147 -15053222 -11808666 -12625076 -14526397 -14091268 -14326294
6602 -14326294 -14149835 -15320546 -14548214 -13826622 -14743401 -15025409 -14578971 -13423547 -14713389 -15864951
6592 -15864951 -16986273 -14820629 -15810815 -14103949 -16271942 -15841037 -15465057 -15044548 -14355030 -14886292
6582 -14886292 -14859009 -14695784 -13736087 -13487476 -13780102 -12254484 -15268518 -14523827 -15524923 -15469109
6572 -15469109 -15453807 -15153558 -14704700 -14936628 -13468153 -14552747 -16499038 -15019676 -15727650 -14754242
6562 -14754242 -16075781 -13000900 -14132707 -14261788 -14747334 -16565182 -15202029 -14368835 -12327422
$$ packed form
6633a5409970Q92414n0284J302249j284056M5908N52572R96860m3301k642954j8505Q81574
6622a4777493K576451j107628j344576j140102J98834j58464K893668r87200q98597q73932
6612a5619039Q50459p77478o99526N0437J141925L244556q16410j901321M35129k35026
6602a4326294J76459j170711P72332P21592r16779k82008M46438J155424j289842j151562
6592a5864951j121322K165644r90186J706866k167993M30905L75980M20509O89518n31262
6582a4886292K7283J63225R59697K48611k92626J525618l014034P44691j001096N5814
6572a5469109J5302L00249M48858k31928J468475j084594j946291J479362p07974R73408
6562a4754242j321539L074881j131807j29081m85546j817848J363153Q33194K041413
$$ plain form
6553 -12327422 -8161996 -53076654 -22431978 -18182485 -16843511 -18658130 -18332245 -18316951 -15597438
6544 -15597438 -15851403 -15631037 -14973768 -15316740 -14775380 -16805604 -14551318 -15121356 -14599870 -15985493
6534 -15985493 -15965356 -15393851 -16266744 -16736848 -16125907 -15223789 -15286361 -16817879 -14615847 -14441347
6524 -14441347 -15521843 -16426353 -14270010 -14873617 -14702837 -12402058 -11634104 -13037687 -15030936 -14861618
6514 -14861618 -14826060 -15498033 -13911709 -15432352 -16813450 -15929835 -15642272 -15302843 -16162429 -16273296
6504 -16273296 -15364844 -16046047 -17629224 -16183030 -15782845 -15175493 -14987881 -15328223 -16935533 -15329552
6494 -15329552 -16241584 -15454183 -16669075 -14056025 -13624822 -15292326 -15487811 -16231827 -15261069 -14432858
6484 -14432858 -16045001 -15705802 -15103613 -14744956 -15157237 -14168738 -15776578 -15066083 -14275348 -13998257
$$ packed form
6553a2327422M165426m4914658L0644676M249493J338974j814619L25885J5294K719513
6544a5597438k53965K20366O57269l42972N41360k030224K254286n70038N21486j385623
6534a5985493K0137N71505q72893m70104O10941R02118o2572j531518K202032J74500
6524a4441347j080496r04510K156343o03607J70780K300779P67954j403583j993249J69318
6514a4861618L5558o71973J586324j520643j381098Q83615K87563L39429q59586j10867
6504a6273296R08452o81203j583177J446194M00185O07352J87612l40342j607310J605981
6494a5329552r12032P87401j214892K613050M31203j667504j95485p44016R70758Q28211
6484a4432858j612143L39199O02189L58657m12281R88499j607840P10495P90735K77091
$$ plain form
6474 -13998257 -14778889 -14829256 -16602273 -15805443 -15467745 -16296751 -15466985 -16002352 -14555778 -14551408 -15266802
6463 -15266802 -15825245 -15715725 -15822752 -16403438 -16106175 -13345012 -15027479 -14985173 -16853975 -14171927
6453 -14171927 -15868475 -16063913 -16433067 -14134815 -14321757 -14562525 -16670186 -15416470 -15508065 -16049329
6443 -16049329 -15113720 -15598190 -15518526 -16079321 -15955510 -15720078 -14394292 -14300378 -14857560 -14822492 -16396343
6432 -16396343 -16313233 -12669856 -13852103 -12859614 -13494775 -16461834 -15190430 -14625709 -14404482 -13259981
6422 -13259981 -14970804 -15484455 -17726443 -17125155 -16035216 -14457861 -14670129 -15606919 -16322748 -16346370
6412 -16346370 -16395083 -15223831 -15649014 -15680793 -13355450 -14159018 -15887924 -15150820 -15028343 -14532362
6402 -14532362 -14471879 -15096607 -21676437 -14839294 -13240126 -15447814 -16109179 -15870752 -16224608 -16621451
$$ packed form
6474a3998257p80632n0367j773017P96830L37698q29006Q29766n35367J446574M370p15394
6463a5266802n58443J09520j07027n80686K97263K761163j682467M2306j868802K682048
6453a4171927j696548j95438l69154K298252j86942k40768k107661J253716r1595n41264
6443a6049329R35609m84470P9664n60795J23811K35432J325786R3914n57182L5068j573851
6432a6396343Q3110L643377j182247R92489o35161k967059J271404N64721K21227J144501
6422a3259981j710823n13651k241988O01288J089939J577355k12268r36790p15829k3622
6412a6346370m8713J171252m25183l1779K325343q03568j728906P37104J22477M95981
6402a4532362O0483o24728o579830O837143J599168k207688o61365K38427l53856l96843
$$ plain form
6392 -16621451 -15084064 -15459190 -15518611 -15049257 -16218520 -17382276 -17400409 -15849852 -15285373 -16191816
6382 -16191816 -15256867 -17498952 -17069871 -18234037 -18137229 -14478090 -14325666 -14531218 -14282681 -14454397
6372 -14454397 -15252573 -16802359 -15676887 -15041536 -15870796 -14314599 -15947236 -15105573 -16392159 -15407923
6362 -15407923 -14902848 -13628336 -14396847 -13997870 -14341892 -14924183 -15211235 -15419709 -15517998 -15081082
6352 -15081082 -13900787 -14137569 -13495258 -14550034 -13467845 -13881949 -14636932 -15080645 -15249818 -14670772
6342 -14670772 -16417564 -15174329 -13725102 -14168707 -14024426 -14064270 -14275591 -14938683 -11186292 -14818482
6332 -14818482 -14372040 -15002980 -14852621 -12901473 -14780441 -15094980 -15747861 -13867371 -14470489 -13886194
6322 -13886194 -15028866 -14742846 -15808408 -15766776 -16149690 -15911265 -14670445 -15327359 -14438201 -15057144
$$ packed form
6392a6621451J537387l75126n9421M69354j169263j163756j8133J550557N64479r06443
6382a6191816R34949k242085M29081j164166R6808L659139J52424k05552K48537j71716
6372a4454397p98176j549786J125472O35351q29260J556197j632637Q41663j286586R84236
6362a5407923N05075J274512p68511L98977l44022n82291k87052k08474r8289M36916
6352a5081082J180295k36782O42311j054776J082189m14104p54983m43713j69173N79046
6342a4670772j746792J243235J449227m43605J44281l9844k11321o63092L752391l632190
6332a4818482M46442o30940J50359J951148j878968l14539o52881J880490o03118N84295
6322a3886194j142672K86020j065562M1632l82914K38425J240820o56914Q89158o18943
$$ plain form
6312 -15057144 -15975689 -15101926 -15084484 -15506426 -13853280 -15861901 -15915390 -14907476 -15914851 -14316476
6302 -14316476 -13324678 -15167212 -14235987 -14069308 -14213276 -14849191 -14135959 -15529136 -16466911 -16191230
6292 -16191230 -15804584 -16411863 -15019084 -16821401 -16771760 -17469038 -16667345 -15135554 -17694395 -16726835
6282 -16726835 -14231531 -16037645 -15353534 -15450367 -15657813 -14962801 -13434304 -15403570 -16268254 -17331941
6272 -17331941 -16161746 -15525036 -14987617 -14780563 -16518689 -15005047 -15277090 -16283969 -16595163 -14064194
6262 -14064194 -15144352 -16009014 -15281182 -14988162 -16013073 -15239793 -16421134 -17807905 -16183208 -17034332
6252 -17034332 -15424150 -14982933 -15353903 -15512537 -15552068 -16211959 -16827725 -12986379 -13284620 -15807724
6242 -15807724 -16023459 -14556776 -12806304 -14621992 -15024080 -16801068 -16254509 -16223019 -16691050 -14619876
$$ packed form
6312a5057144r18545Q73763J7442m21942J653146k008621n3489J007914j007375J598375
6302a4316476R91798j842534R31225J66679j43968o35915P13232j393177r37775K75681
6292a6191230L86646o07279J392779j802317M9641o97278Q01693J531791k558841R67560
6282a6726835K495304j806114O84111r6833k07446O95012J528497j969266q64684j063687
6272a7331941J170195O36710N37419K07054j738126J513642k72043j006879l11194K530969
6262a4064194j080158q64662P27832K93020j024911P73280j181341j386771J624697q51124
6252a7034332J610182M41217l70970j58634l9531o59891o15766L841346k98241k523104
6242a5807724k15735J466683J750472j815688m02088j776988N46559L1490m68031K071174
$$ plain form
6232 -14619876 -14475506 -15758486 -14722842 -14627321 -15392476 -15052756 -16254738 -14674574 -16208658 -15812979
6222 -15812979 -17596512 -16964380 -18878773 -13211324 -12724085 -14921450 -15623107 -14741938 -14451042 -14902638
6212 -14902638 -13918337 -14863794 -16103337 -16509169 -15669076 -15731875 -16689542 -13341820 -14074759 -14372763
6202 -14372763 -15695932 -15490193 -12582659 -14385515 -15326196 -13328306 -14933500 -15790563 -14625724
6193 -14625724 -14229100 -16299097 -16991157 -14484601 -17207474 -16527146 -15322591 -15621639 -16738761 -16040874
6183 -16040874 -16157259 -15418533 -14116784 -13521515 -12722316 -16877257 -15478961 -15799548 -14661138 -16881369
6173 -16881369 -14759782 -14823634 -15823397 -14313059 -15767985 -15896382 -15483032 -16207732 -14648411 -15062217
6163 -15062217 -13702721 -14293803 -15860011 -15185126 -15545494 -15605889 -15046723 -16051317 -14856125 -16583646
$$ packed form
6232a4619876J44370j282980J035644R5521p65155L39720j201982J580164j534084L95679
6222a5812979j783533O32132j914393N667449M87239k197365p01657Q81169K90896m51596
6212a4902638R84301r45457j239543m05832Q40093o2799r57667L347722p32939k98004
6202a4372763j323169K05739K907534j802856r40681J997890j605194q57063J164839
6193a4625724L96624k069997o92060K506556k722873O80328J204555k99048j117122O97887
6183a6040874j16385P38726J301749N95269P99199m154941J398296l20587J138410k220231
6173a6881369K121587o3852r99763J510338j454926j28397M13350p24700J559321m13806
6163a5062217J359496n91082j566208O74885l60368o0395N59166j004594J195192j727521
$$ plain form
6153 -16583646 -15674031 -15805620 -18602011 -18571570 -16527836 -17339599 -15619517 -14416546 -16150356 -18350538
6143 -18350538 -17574473 -18083814 -16755646 -15301139 -14544825 -13909950 -16000563 -16048119 -15674600 -14205524
6133 -14205524 -15827688 -15513231 -15623458 -16648221 -15328424 -15993908 -16193653 -15736854 -16778653 -15868013
6123 -15868013 -16578188 -17819693 -18564378 -20698216 -22014352 -27182355 -42392739 -72198748 -9216823
6114 -9216823 -8989075 -10128530 -10981027 -10494183 -12456611 -12384651 -12811602 -14421064 -13247361 -12689236
6104 -12689236 -14060686 -12786676 -12531083 -11949976 -14446588 -12495985 -14157274 -14444134 -15298096 -14657106
6094 -14657106 -13530854 -11648601 -13146515 -16124915 -13210897 -12842240 -13419138 -14634589 -13731288
6085 -13731288 -13524407 -14747448 -15573887 -15277143 -14299290 -14004899 -12988933 -14748470 -15051409 -14063522
$$ packed form
6153a6583646R09615j31589k796391L0441K043734q11763J720082J202971j733810k200182
6143a8350538P76065n09341J328168J454507P56314O34875k090613m7556L73519J469076
6133a4205524j622164L14457j10227j024763J319797o65484j99745M56799j041799R10640
6123a5868013p10175j241505p44685k133838j316136n168003j5210384k9806009O2981925
6114i216823K27748j139455q52497M86844j962428P1960m26951j609462J173703N58125
6104a2689236j371450J274010K55593N81107k496612J950603j661289k86860q53962O40990
6094a4657106J126252J882253j497914k978400K914018L68657n76898j215451R03301
6085a3731288K06881j223041q26439K96744R77853K94391J015966j759537l02939R87887
$$ plain form
6075 -14063522 -14470376 -14530312 -15280715 -13628194 -14309423 -14662226 -15297563 -13666389 -14649337 -15740209
6065 -15740209 -16672899 -14350150 -14787702 -14178499 -15527468 -15968204 -17398678 -15229984 -15152577 -14844459
6055 -14844459 -14511313 -14771510 -15490381 -17121911 -17657855 -15175804 -15572455 -16141739 -13362949 -14258265
6045 -14258265 -14894692 -13636817 -14769036 -13215783 -13624611 -12843436 -13955099 -13845668 -13811559 -13991050
6035 -13991050 -13811866 -12653714 -14761054 -15499957 -12216235 -13323105 -12919160 -13570625 -13790206 -13002061
6025 -13002061 -12666222 -13288107 -12385913 -11518252 -11062288 -12634936 -12619481 -13461423 -13585674 -14119406
6015 -14119406 -13184482 -14021850 -16771635 -14239488 -13282313 -12783907 -15094286 -13871363 -12459937
6006 -12459937 -11450826 -13411982 -13897071 -14411659 -13007529 -12436688 -14281278 -14032375 -13596281 -14229515
$$ packed form
6075a4063522m06854n9936p50403J652521o81229l52803o35337J631174r82948j090872
6065a5740209r32690K322749m37552O09203j348969m40736j430474K168694P7407L08118
6055a4844459L33146k60197p18871j631530n35944K482051l96651n69284K778790q95316
6045a4258265o36427J257875j132219J553253m08828P81175j111663J09431L4109j79491
6035a3991050J79184J158152k107340p38903L283722j106870M03945o51465k19581P88145
6025a3002061L35839o21885R02194Q67661M55964j572648J5455q41942j24251n33732
6015a4119406R34924q37368k749785K532147R57175M98406k310379J222923J411426
6006a2459937J009111j961156m85089n14588J404130N70841j844590K48903M36094o33234
$$ plain form
5996 -14229515 -14355068 -14488384 -13567096 -12739404 -12620208 -14325480 -12292018 -11178997 -11847006 -10459727
5986 -10459727 -6255319 -10206533 -10250230 -10123113 -11774241 -9826637 -9406794 -10567306 -9681060 -10979642
5976 -10979642 -8976693 -10913224 -10340053 -10177389 -8085459 -8438647 -10171177 -9009456 -7954801
5967 -7954801 -9011601 -8557248 -8492285 -8907763 -8621593 -9115086 -4488329 -10495322 -8928571 -8053872
5957 -8053872 -9433900 -9532478 -11226092 -10855596 -10789615 -9093936 -7635708 -8203626 -6635150 -7329870
5947 -7329870 -7271378 -7180784 -6820590 -4532357 -5036489 -4453732 -3575169 -6729138 -3607065 -3457805
5937 -3457805 -3660491 -2419883 -1340205 -2242714 -2008152 -1141291 -1319642 611976 826917 1518234
5927 1518234 1694223 3809777 5390274 4760356 7556129 6831319 6677692 5686590 8146786 8191063
$$ packed form
5996a4229515j25553j33316R21288Q27692J19196j705272K033462J113021o68009J387279
5986a0459727M204408l951214m3697J27117j651128J947604M19843j160512Q86246j298582
5976a0979642K002949j936531N73171J62664K091930l53188j732530J161721J054655
5967g954801j056800M54353O4963m15478K86170m93493M626757o006993J566751Q74699
5957h053872j380028r8578j693614L70496O5981J695679J458228n67918J568476o94720
5947g329870N8492R0594L60194K288233n04132N82757Q78563l153969L122073J49260
5937c457805k02686J240608J079678r02509K34562Q66861j78351J931618K14941O91317
5927A518234J75989K115554J580497o29918K795773p24810j53627r91102K460196M4277
$$ plain form
5917 8191063 9408419 11559415 12197853 11739507 11498934 13472467 13474243 15497340 18246255 20052636
5907 20052636 22126290 23348684 24465210 27085909 28697459 30077604 30417331 30806229 31472418
5898 31472418 34121970 30669726 30192213 30661877 30274470 31698126 31938969 31878427 33436894 35132880
5888 35132880 38177975 40829988 45031462 48597082 49940400 50804908 54172332 55159218 57077717
5879 57077717 58039332 59767589 61160665 60266561 60993091 59437385 61153533 61720589 61827014 61291865
5869 61291865 60954000 61807659 64259000 69296155 74467153 80202907 89007439 96310647 100859014
5860 100859014 104423566 109507472 113305872 121216563 131171593 143571912 155081680 166835379
5852 166835379 176157445 183840942 188929792 191346557 189531131 178155207 155276352 130021634
$$ packed form
5917H191063J217356K150996O38438m58346k40573J973533J776K023097K748915J806381
5907B0052636K073654J222394J116526K620699J611550J380145L39727L88898O66189
5898C1472418K649552l452244m77513M69664l87407J423656K40843o0542J558467J695986
5888C5132880L045095K652013M201474L565620J343318Q64508L367424R86886J918499
5879E7077717R61615J728257J393076q94104P26530j555706J716148N67056J06425n35149
5869F1291865l37865Q53659K451341N037155N170998N735754Q804532P303208M548367
5860A00859014L564552N083906L798400P910691R955030J2400319J1509768J1753699
5852A66835379R322066P683497N088850K416765j815426j1375924k2878855k5254718
$$ plain form
5844 130021634 103243769 77679161 58149029 45777229 37008390 30708988 26379915 21195285
5836 21195285 17086007 11880838 6779317 3804177 893606 -4389486 -6107563 -8341093 -10259612
5827 -10259612 -11498064 -14239270 -14475650 -14238774 -13844620 -16392814 -16617704 -16215944 -16778421 -15750418
5817 -15750418 -15465409 -17588169 -12083270 -11032392 -11138314 -9825646 -11013557 -10091055 -8029784
5808 -8029784 -8678102 -8367706 -11512956 -12282755 -12641085 -12793313 -11900061 -14458830 -13004586 -13185868
5798 -13185868 -13325980 -9957439 -10010765 -10283737 -9792355 -10944253 -10441535 -9459393 -9631326 -10527708
5788 -10527708 -8783140 -9198632 -7211629 -6822882 -5789249 -6181233 -8788905 -5991626 -5969423 -5492380
5778 -5492380 -7443723 -8577000 -10754018 -10121768 -11079647 -11023537 -8961955 -9279528 -8870304 -10931405
$$ packed form
5844A30021634k6777865k5564608j9530132j2371800q768839o299402m329073n184630
5836B1195285m109278n205169n101521k975140k910571n283092j718077k233530j918519
5827a0259612j238452k741206k36380K36876L94154k548194k24890M01760n62477J028003
5817a5750418K85009k122760N504899J050878j05922J312668j187911R22502K061271
5808h029784o48318L10396l145250p69799l58330j52228Q93252k558769J454244j81282
5798a3185868j40112L368541n3326k72972M91382j151898N02718R82142j71933q96382
5788a0527708J744568m15492J987003L88747J033633l91984k607672K797279K2203M77043
5778e492380j951343j133277k177018O32250r57879N6110K061582l17573M09224k061101
$$ plain form
5768 -10931405 -11395809 -12525075 -12840360 -13343569 -11809563 -12217544 -14011261 -13835295 -13561151 -13142409
5758 -13142409 -13161974 -13220216 -13877912 -13587083 -15988108 -15329635 -14372853 -15435603 -18686488 -16946856
5748 -16946856 -15166034 -16376270 -14124337 -13888704 -14524727 -13253835 -13422060 -15308888 -15025815 -15065092
5738 -15065092 -14746718 -14892467 -14079021 -15976975 -15010331 -15442964 -15110055 -16442024 -16965692 -15093545
5728 -15093545 -15708084 -17453865 -16564225 -16822175 -16657454 -16599448 -16470051 -15623029 -15400594 -15532364 -15624734
5717 -15624734 -16790408 -16178024 -15929126 -15886313 -15136313 -14625106 -15720080 -14353924 -14740027 -13355059
5707 -13355059 -14889098 -15222139 -12535201 -12628857 -14905478 -13854613 -13365874 -13639647 -15643349 -14696711
5697 -14696711 -14388581 -15106531 -13950228 -14096926 -15263394 -15129576 -14615049 -16473531 -18355222 -16184046
$$ packed form
5768a0931405m64404j129266l15285n03209J534006m07981j793717J75966K74144M18742
5758a3142409j9565n8242o57696K90829k401025O58473R56782j062750l250885J739632
5748a6946856J780822j210236K251933K35633o36023J270892j68225j886828K83073l9277
5738a5065092L18374j45749Q13446j897954R66644m32633L32909j331969n23668J872147
5728a5093545o14539j745781Q89640k57950J64721N8006J29397Q47022K22435j31770r2370
5717a5624734j165674O12384K48898M2813P50000N11207j094974J366156l86103J384968
5707a3355059j534039l33041K686938r3656k276621J050865M88739k73773k003702R46638
5697a4696711L08130p17950J156303j46698j166468J33818N14527j858482j881691K171176
$$ plain form
5687 -16184046 -15842390 -15635356 -16490363 -16638975 -17037726 -18125876 -27092802 -108909915 -15865473
5678 -15865473 -18145402 -16463444 -14723826 -13341182 -15935230 -12587864 -12696378 -13690244 -14763684
5669 -14763684 -15168336 -14736896 -13634627 -14549266 -16301896 -16869046 -14766991 -15010904 -15134350 -16671521
5659 -16671521 -16026263 -15299092 -15033819 -9088325 -12919840 -14072959 -16391135 -14461413 -14599886
5650 -14599886 -13402237 -15116443 -13641026 -13871473 -15907642 -15802848 -16348360 -15523724 -15180138 -14589567
5640 -14589567 -14801223 -14859777 -13914773 -18007676 -16006980 -16161630 -15333443 -15156785 -15760974 -16883471
5630 -16883471 -17180192 -15761995 -15308038 -15138401 -15964643 -16422672 -14711364 -15667719 -15613670 -16453600
5620 -16453600 -15149888 -15636999 -13012641 -17513830 -16828263 -17260565 -14914317 -15642985 -15271677 -16485526
$$ packed form
5687a6184046L41656K07034q55007j48612l98751j088150q966926q1817113R3044442
5678a5865473k279929J681958J739618J382644k594048L347366j08514r93866j073440
5669a4763684m04652M31440J102269r14639j752630n67150K102055k43913j23446j537171
5659a6671521O45258P27171K65273N945494l831515j153119k318176J929722j38473
5650a4599886J197649j714206J475417k30447k036169J04794n45512Q24636L43586N90571
5640a4589567k11656n8554R45004m092903K000696j54650Q28187J76658o04189j122497
5630a6883471k96721J418197M53957J69637q26242m58029J711308r56355N4049q39930
5620a6453600J303712m87111K624358m501189O85567m32302K346248p28668L71308j213849
$$ plain form
5610 -16485526 -14791351 -13809490 -15322881 -16494394 -15664062 -14714211 -15975214 -16190793 -16729207 -16135254
5600 -16135254 -15241465 -14636497 -15045348 -14744878 -16460901 -14641988 -14103497 -15225095 -14410572 -15938110
5590 -15938110 -12149328 -13412296 -12753894 -13085179 -15351173 -13984801 -11804531 -16071996 -15577843
5581 -15577843 -16057714 -12625107 -14427285 -14558812 -13352982 -13995236 -16554780 -14572218 -13083461
5572 -13083461 -15899041 -14556213 -15049824 -13811477 -13483988 -14100747 -14889236 -17827484 -14952533 -15580434
5562 -15580434 -14638742 -14970764 -13613145 -12930473 -14463907 -15730419 -15703612 -16317393 -15118775 -15342335
5552 -15342335 -15035653 -16970292 -16761558 -17084317 -15583670 -14906843 -15064630 -15032216 -15371633 -14856187
5542 -14856187 -15188987 -14802650 -16048851 -15114493 -15832824 -13534410 -13607641 -13117051 -12477980 -13961212
$$ packed form
5610a6485526J694175R81861j513391j171513Q30332R49851j261003k15579n38414N93953
5600a6135254Q93789O04968m08851L00470j716023J818913N38491j121598Q14523j527538
5590a5938110L788782j262968O58402l31285k265994J366372K180270m267465M94153
5581a5577843m79871L432607j802178j31527J205830o42254k559544J982562J488757
5572a3083461k815580J342828m93611J238347L27489o16759p88489k938248K874951o27901
5562a5580434R41692l32022J357619O82672j533434j266512K6807o13781J198618k23560
5552a5342335L06682j934639K08734l22759J500647O76827j57787L2414l39417N15446
5542a4856187l32800L86337j246201R34358p18331K298414p3231M90590O39071j483232
$$ plain form
5532 -13961212 -15152163 -12918345 -13790169 -13492304 -15481323 -15577201 -14448025 -16196137 -14598014 -15482423
5522 -15482423 -14040168 -15954522 -14970214 -12362357 -14728608 -15701748 -13736555 -13457491 -14239433
5513 -14239433 -12820792 -11847547 -12947915 -16112249 -15054277 -14424615 -15718610 -14758946 -14510064
5504 -14510064 -15690586 -13765375 -15004003 -15544959 -16979759 -17004972 -16697338 -19071625 -16302954 -16009748
5494 -16009748 -17068691 -17411368 -15656015 -13905033 -16968369 -15062520 -14731522 -14313634 -14764871
5485 -14764871 -16854470 -15347231 -14637298 -14212911 -14053187 -15623021 -15680053 -13088125 -14336101 -14998615
5475 -14998615 -14423394 -13286626 -13034040 -16497641 -13315460 -15617345 -16226801 -15296698 -14657897 -14356802
5465 -14356802 -15821880 -12374863 -14964420 -11545524 -22913597 -21324647 -18501808 -16663923 -16464187
$$ packed form
5532a3961212j190951K233818q71824K97865j989019r5878J129176j748112J598123q84409
5522a5482423J442255j914354R84308K607857k366251r73140J965193K79064p81942
5513a4239433J418641R73245j100368l164334J057972O29662j293995R59664K48882
5504a4510064j180522J925211j238628n40956j434800k5213L07634k374287K768671K93206
5494a6009748j058943l42677J755353J750982l063336J905849L30998M17888m51237
5485a4764871k089599J507239P09933M24387J59724j569834n7032K591928j247976o62514
5475a4998615N75221J136768K52586l463601L182181k301885o09456R30103O38801L01095
5465a4356802j465078L447017k589557L418896j1368073J588950K822839J837885J99736
$$ plain form
5456 -16464187 -14272187 -11422963 -11822071 -13606064 -12964149 -12068818 -16324688 -16802444 -16821474 -15505357
5446 -15505357 -17122458 -16263439 -17109097 -16247387 -16437888 -14355107 -15103863 -15511781 -16534646 -17237595
5436 -17237595 -17956009 -16284399 -16346333 -15921189 -15217300 -13821955 -16037467 -17030736 -17303978 -16325623
5426 -16325623 -16468765 -14480688 -16533247 -17300033 -14526770 -16939307 -15663829 -15476018 -16269173 -16289140
5416 -16289140 -17807844 -15574377 -15599975 -15264852 -16273251 -16878973 -15522338 -14795449 -14837069 -15482767
5406 -15482767 -14960094 -15537100 -14442203 -15252447 -14627519 -13855850 -14392462 -16024583 -15182846 -14516063
5396 -14516063 -15663188 -14424170 -12267754 -13155658 -13223949 -12855071 -12389705 -12431708 -13977590 -12118464
5386 -12118464 -13330194 -14394390 -14190041 -13670415 -12195361 -13814628 -13934599 -12425599 -14385976
$$ packed form
5456a6464187K192000K849224l99108j783993O41915Q95331m255870m77756j9030J316117
5446a5505357j617101Q59019q45658Q61710j90501K082781p48756m07918j022865p02949
5436a7237595p18414J671610o1934M25144P03889J395345k215512r93269k73242R78355
5426a6325623j43142J988077k052559p66786K773263k412537J275478J87811p93155j9967
5416a6289140j518704K233467k5598L35123j008399o05722J356635P26889m1620o45698
5406a5482767N22673n77006J094897q10244O24928P71669n36612j632121Q41737O66783
5396a4516063j147125J239018K156416q87904o8291L68878M65366m2003j545882J859126
5386a2118464j211730j064196K04349N19626J475054j619267j19971J509000j960377
$$ plain form
5377 -14385976 -14970596 -16378371 -15659446 -15277871 -15133166 -15174495 -15211464 -15654171 -14775039 -13995445 -14446129
5366 -14446129 -12861379 -12098934 -12535693 -12562910 -11854942 -11938715 -10356665 -15268788 -12942202 -12976612
5356 -12976612 -11736436 -11318403 -11387825 -11361942 -9585668 -9996961 -10582598 -8358286 -6659998 -6952172
5346 -6952172 -7203506 -7456108 -7055169 -6842933 -4601868 -5745819 -3841660 -4667128 -5258019 -1302670
5336 -1302670 -2566910 -3479465 -2167857 172779 1294428 -288381 -2412759 -3626506 -5394493
5327 -5394493 -6278837 -5494117 -7420365 -6558050 -6879448 -5419805 -3819319 -4534091 -5857226 -4084473
5317 -4084473 -4403003 -6198433 -5804999 -5856474 -5978239 -7753046 -8217669 -10110106 -10705373 -11327183
5307 -11327183 -13538539 -9763246 -11486961 -11018978 -11409839 -11451521 -14075779 -11576208 -12936324 -11962926
$$ packed form
5377a4385976n84620j407775P18925L81575J44705m1329l6969m42707Q79132P79594m50684
5366a4446129J584750P62445m36759k7217P07968q3773J582050m912123K326586l4410
5356a2976612J240176M18033o9422K5883J776274m11293n85637K224312J698288k92174
5346f952172k51334k52602M00939K12236K241065j143951J904159q25468n90891L955349
5336a302670j264240r12555J311608K340636J121649j582809k124378j213747j767987
5327e394493q84344P84720j926248Q62315l21398J459643J600486p14772j323135J772753
5317d084473l18530j795430L93434n1475j21765j774807m64623j892437n95267o21810
5307a1327183k211356L775293j723715M67983l90861m1682k624258K499571j360116R73398
$$ plain form
5297 -11962926 -13031046 -11653648 -13797710 -13168474 -11004097 -11447526 -11378495 -12096543 -11588113 -11856901
5287 -11856901 -12562450 -10719711 -12564536 -10823276 -11499034 -11499536 -10986947 -9961838 -10567007 -10834231
5277 -10834231 -9710578 -9627872 -8690624 -6923801 -8838095 -7031759 -5605718 -4592516 -3639961
5268 -3639961 -6762487 -4810089 -3559539 -4053841 -4005455 -2504132 -1428452 -2565000 -3734800
5259 -3734800 -2475562 -1997507 -841082 755125 -96681 956960 1413696 -96860 244548 2927284
5249 2927284 1255558 3767553 3569875 2798425 10494975 97720666 12816164 4645391 1703834
5240 1703834 2553206 1677876 -361282 -3676806 -2224406 -110616 -1202402 -3337516 -2459218 -3125573
5230 -3125573 -1958464 -814406 -1576283 -77773 1428454 2316851 2573291 3021876 4246055 5023377
$$ packed form
5297a1962926j068120J377398k144062O29236K164377m43429O9031p18048N08430k68788
5287a1856901p05549J842739j844825J741260o75758n02N12589J025109o05169k67224
5277a0834231J123653Q2706R37248J766823j914294J806336J426041J013202R52555
5268c639961l122526J952398J250550m94302M8386J501323J075680j136548j169800
5259c734800J259238M78055J156425J596207q51806J053641M56736j510556L41408K682736
5249B927284j671726K511995j97678p71450P696550Q7225691q4904502q170773k941557
5240A703834Q49372q75330k039158l315524J452400K113790j091786k135114Q78298o66355
5230c125573J167109J144058p61877J498510J506227Q88397K56440M48585J224179P77322
$$ plain form
5220 5023377 9557883 9061064 12707958 13586791 13623722 15401456 16645734 18075266 19275097 19895990
5210 19895990 21387124 22340841 21624039 22330913 25694381 27890066 29272895 30198451 29512193 31718113
5200 31718113 31175540 32541899 32813258 31451949 31062447 31577356 31793928 32330558 34254692 34573905
5190 34573905 33238323 33612761 32461871 32335994 31427697 28632341 28564196 25767782 21602629 23880252
5180 23880252 25759713 34069877 40066045 42971189 47114249 49009191 52121308 56004625 61828796
5171 61828796 65556320 68550756 71763389 75541724 76279218 77761041 79833326 83402043 85073424
5162 85073424 87187665 88724792 89977485 93751952 101163012 108086946 116184907 124388875 131845555
5153 131845555 134503713 137268154 140922829 146193536 151843355 155224320 158591802 169144809
$$ packed form
5220E023377M534506m96819L646894Q78833L6931J777734J244278J429532J199831O20893
5210A9895990J491134R53717p16802P06874L363468K195685J382829R25556o86258K205920
5200C1718113n42573J366359K71359j361309l89502N14909K16572N36630J924134L19213
5190C4573905j335582L74438j150890j25877r08297k795356o8145k796414m165153K277623
5180B3880252J879461Q310164N996168K905144M143060J894942L112117L883317N824171
5171F1828796L727524K994436L212633L778335P37494J481823K072285L568717J671381
5162H5073424K114241J537127J252693L774467P411060O923934Q097961Q203968P456680
5153A31845555K658158K764441L654675N270707N649819L380965L367482J0553007
$$ plain form
5145 169144809 179506095 183980984 187207445 184889477 190430514 197493238 208819968 224423477
5137 224423477 242684179 260524735 273024814 282137795 289426700 293212194 297106367 305472963
5129 305472963 312560890 317053303 316680936 312996817 310911819 311872933 314315072 322112935 331794364
5120 331794364 338021230 340236272 346015181 357924209 374280501 391461124 412272127 430059836
5112 430059836 445451405 459898996 477168535 491103577 507305784 517412804 523590911 524905488
5104 524905488 529319755 536226203 542797624 548856543 552082632 543604971 528667976 523089855
5096 523089855 534526394 562764794 593939284 634152252 701682269 759425444 804299261 837616347
5088 837616347 870875358 900818305 932325809 989211706 1078218847 1176121578 1267467071 1346741646
$$ packed form
5145A69144809J0361286M474889L226461k317968N541037P062724J1326730J5603509
5137B24423477J8260702J7840556J2500079R112981P288905L785494L894173Q366596
5129C05472963P087927M492413l72367l684119k084998R61114K442139P797863R681429
5120C31794364O226866K215042N778909J1909028J6356292J7180623K0811003J7787709
5112D30059836J5391569J4447591J7269539J3935042J6202207J0107020O178107J314577
5104E24905488M414267O906448O571421O058919L226089q477661j4936995n578121
5096E23089855J1436539K8238400L1174490M0212968O7530017N7743175M4873817L3317086
5088H37616347L3259011K9942947L1507504N6885897Q9007141R7902731R1345493P9274575
$$ plain form
5080 1346741646 1389679041 1404748251 1458294556 1520674485 1478577369 1328515943 1132369035
5073 1132369035 912850632 713279037 560045564 459724656 381800622 323264107 281590279
5066 281590279 255306610 229169178 192858118 154478901 122412037 96078359 73810218 60924532
5058 60924532 47302275 28626086 9108691 -3070198 -7520927 -4944503 -2322274 -8695789
5050 -8695789 -16619933 -23249983 -23104795 -19714924 -11372320 -2637012 5166057 9975676 12023827
5041 12023827 15071185 19940040 25606372 28671987 31869118 31069552 28432585 25723544 24204383
5032 24204383 20738002 15477511 8800548 4805416 2895192 662324 2170599 10308963 16226722
5023 16226722 21665889 24892794 25701478 24214089 21302330 23775924 26205805 27720679 30120319
$$ packed form
5080A346741646M2937395J5069210N3546305O2379929m2097116j50061426j96146908
5073A132369035k19518403j99571595j53233473j00320908p7924034n8536515m1673828
5066B81590279k6283669k6137432l6311060l8379217l2066864k6333678k2268141j2885686
5058F0924532j3622257j8676189j9517395j2178889m450729K576424K622229o373515
5050h695789p924144o630050J45188L389871Q342604Q735308P803069M809619K048151
5041A2023827L047358M868855N666332L065615L197131p99566k636967k709041j519161
5032B4204383l466381n260491o676963l995132j910224k232868J508275Q138364N917759
5023A6226722N439167L226905Q08684j487389k911759K473594K429881J514874K399640
$$ plain form
5014 30120319 40498470 48288959 55405232 54769205 50333973 44288717 37617173 29282379 19385263
5005 19385263 13626596 10214502 11576520 13173155 12431220 14315366 15870547 15394665 13902268
4996 13902268 8017539 5133624 4230369 1469495 2140626 -1358987 -2303192 -2166161 566796 1063867
4986 1063867 -1058022 -5036484 -7985753 -5720740 -5025805 -7280682 -7259111 -8158007 -7293594 -6050879
4976 -6050879 -6913882 -8468976 -8029655 -5551864 -4469448 -4986696 -5285127 -4233779 -3796857 -5143265
4966 -5143265 -5409424 -7517772 -11111954 -7952034 -13040140 -13280970 -17236123 -17238321 -17517430 -18738419
4956 -18738419 -18931585 -19401817 -18922803 -19376852 -16291071 -16029663 -15974652 -14502709 -14259479 -14012327
4946 -14012327 -13444253 -15001483 -15644063 -15761743 -14431493 -14543690 -12685894 -14820494 -14185931 -11055044
$$ packed form
5014C0120319J0378151P790489P116273o36027m435232o045256o671544q334794r897116
5005A9385263n758667l412094J362018J596635p41935J884146J555181m75882j492397
4996A3902268n884729k883915r03255k760874O71131l499613r44205J37031K732957M97071
4986A063867k121889l978462k949269K265013O94935k254877K1571q98896Q64413J242715
4976f050879q63003j555094M39321K477791J082416n17248k98431J051348M36922j346408
4966e143265k66159k108348l594182L159920n088106k40830l955153k198k79109j220989
4956a8738419j93166m70232M79014m54049L085781K61408N5011J471943K43230K47152
4946a4012327N68074j557230o42580j17680J330250j12197J857796k134600O34563L130887
$$ plain form
4936 -11055044 -14093127 -12704489 -12690625 -12611283 -10712370 -10138694 -10620512 -8149442 -6559737 -7971737
4926 -7971737 -8481442 -7383500 -8785126 -8218175 -9059565 -9828464 -9433439 -9009678 -10759286 -13648446
4916 -13648446 -12762040 -13525671 -14012407 -15652090 -14520380 -15822677 -14487820 -15540779 -16146658 -16310167
4906 -16310167 -13580395 -12157467 -10427694 -9937166 -9635860 -9799865 -10639653 -10108477 -10609470 -9982774
4896 -9982774 -9260390 -9124732 -9313447 -9830672 -10301953 -11805094 -10970456 -11067109 -9836298 -10288299
4886 -10288299 -9818044 -9645506 -8939562 -8771582 -8480199 -6063841 -7301394 -5688089 -6347885 -6432926
4876 -6432926 -8931421 -9045999 -8813493 -6985287 -7156696 -8008035 -7101773 -7250037 -7180791 -8794096
4866 -8794096 -10358535 -10162023 -11646643 -9046260 -11015945 -11852306 -12067702 -11311904 -11725830 -11540922
$$ packed form
4936a1055044l038083J388638J3864P9342J898913N73676m81818K471070J589705j412000
4926g971737n09705J097942j401626N66951q41390p68899L95025M23761j749608k889160
4916a3648446Q86406p63631m86736j639683J131710j302297J334857j052959o05879j63509
4906a6310167K729772J422928J729773M90528L01306j64005q39788N31176n00993O26696
4896i982774P22384J35658j88715n17225m71281j503141Q34638r6653J230811m52001
4886a0288299M70255J72538P05944J67980K91383K416358j237553J613305o59796q5041
4876f432926k498495j14578K32506J828206j71409q51339R06262j48264O9246j613305
4866h794096j564439J96512j484620K600383j969685q36361k15396P55798m13926J84908
$$ plain form
4856 -11540922 -11684416 -10722399 -11580996 -11951937 -12886962 -13851964 -14246684 -14474343 -14700918 -15356014
4846 -15356014 -14594414 -16033579 -15577416 -15528388 -14662971 -16122454 -15289822 -15754600 -13444025 -13563035
4836 -13563035 -11940587 -13674680 -12947133 -11131308 -10672663 -10882382 -9669597 -9760658 -7203356 -7996835
4826 -7996835 -7094473 -7041605 -6015636 -5937305 -6212679 -4827549 -6188173 -4251107 -8637691 -7248665
4816 -7248665 -6669098 -6880126 -7996195 -10019317 -12602894 -15469330 -18055885 -20182002 25312694
4807 25312694 27996037 8158840 2886441 -1845750 -5896807 -5524117 -3210203 -7223144 -5997988
4798 -5997988 -6859825 -6334581 -6370486 -10021249 -7980276 -7515884 -9790648 -8666382 -8916773 -8350978
4788 -8350978 -9090397 -8408789 -8753043 -9052605 -9967184 -10012894 -10524025 -11303037 -12575630 -10739638
$$ packed form
4856a1540922j43494R62017q58597l70941r35025r65002l94720k27659k26575o55096
4846a5356014P61600j439165M56163M9028Q65417j459483Q32632m64778K310575j19010
4836a3563035J622448j734093P27547J815825M58645k09719J212785r1061K557302p93479
4826g996835R02362N2868J025969P8331k75374J385130j360624J937066m386584J389026
4816g248665N79567k11028j116069k023122k583577k866436k586555k126117M5494696
4807B5312694K683343j9837197n272399m732191m051057L72690K313914m012941J225156
4798e997988q61837N25244l5905l650763K040973M64392k274764J124266k50391N65795
4788h350978p39419O81608l44254k99562r14579m5710n11131p79012j272593J835992
$$ plain form
4778 -10739638 -10576288 -10059084 -11555745 -11278231 -10389572 -5666817 -10119239 -11236123 -13387530
4769 -13387530 -11892350 -11702849 -11824573 -10236825 -11376001 -11918145 -10787864 -12553529 -10707353
4760 -10707353 -11318420 -12089740 -12878578 -12562222 -13040301 -11613383 -11386303 -10607081 -11898540 -13274454
4750 -13274454 -11559647 -11367484 -10706307 -11535992 -11816474 -10804988 -11540268 -11153023 -8957717 -11149193
4740 -11149193 -9605799 -9475479 -10672003 -12102879 -12043331 -10877494 -11212410 -12141857 -11636707 -9846146
4730 -9846146 -10227384 -10672585 -11585684 -13323613 -12407067 -11324480 -9015495 -9750914 -10217506 -9475605
4720 -9475605 -10344065 -12505785 -13458606 -12690769 -11055369 -12649559 -13014580 -14052667 -14016953 -14471111
4710 -14471111 -12262404 -12979049 -11983125 -12935059 -11742787 -9542840 -11689039 -13416561 -13373963 -12509573
$$ packed form
4778a0739638J63350N17204j496661K77514Q88659M722755m452422j116884k151407
4769a3387530J495180J89501j21724J587748j139176n42144J130281j765665J846176
4760a0707353o11067p71320p88838L16356m78079J426918K27080P79222j291459j375914
4750a3274454J714807J92163O61177q29685k80482J011486p35280L87245K195306k191476
4740a1149193J543394J30320j196524j430876N9548J165837l34916r29447N05150J790561
4730i846146l81238m45201r13099j737929R16546J082587K308985p35419m66592P41901
4720i475605q68460k161720r52821P67837J635400j594190l65021j038087L5714m54158
4710a4471111K208707p16645R95924r51934J192272K199947k146199j727522M2598Q64390
$$ plain form
4700 -12509573 -12915618 -11386902 -10856329 -12306084 -13725433 -14470106 -12880093 -11382028 -13421090 -13388801
4690 -13388801 -14254671 -14395052 -13642599 -15075901 -13815983 -11774645 -10976257 -12638141 -13363958 -13898171
4680 -13898171 -12913933 -12954067 -12142630 -13367915 -13988927 -14085995 -13293032 -12694125 -10770664 -11542090
4670 -11542090 -10111204 -13378914 -12771615 -13114971 -13939860 -14769309 -14089232 -13072623 -14784615 -13317032
4660 -13317032 -12215882 -12300583 -13809493 -14147398 -13033399 -13963926 -14305844 -13303310 -12566269 -13683155
4650 -13683155 -14509521 -12407961 -14437408 -14479388 -12411367 -12634992 -12855024 -12983464 -11807401 -11839430
4640 -11839430 -13740650 -13759020 -11685414 -12352259 -12551882 -12117308 -11650091 -11157524 -11573772 -13506096
4630 -13506096 -12774939 -11044731 -13310900 -13382365 -13047695 -11940274 -12940896 -13103995 -11814423 -13111664
$$ packed form
4700a2509573m06045J528716N30573j449755j419349p44673J590013J498065k039062L2289
4690a3388801q65870j40381P52453j433302J259918K041338P98388j661884p25817n34213
4680a3898171R84238m0134Q11437j225285o21012r7068P92963N98907J923461p71426
4670a1542090J430886l267710O07299l43356q24889q29449O80077J016609j711992J467583
4660a3317032J101150q4701j508910l37905J113999r30527l41918J002534P37041j116886
4650a3683155q26366K101560k029447m1980K068021k23625k20032j28440J176063l2029
4640a1839430j901220j8370K073606o66845j99623M34574M67217M92567m16248j932324
4630a3506096P31157J730208k266169p1465L34670J107421j000622j63099J289572j297241
$$ plain form
4620 -13111664 -12642275 -13847701 -11124832 -12197351 -12894050 -12650141 -11623812 -13068406 -12834362 -12924478
4610 -12924478 -14132967 -13498717 -12495097 -12493981 -11697376 -12858529 -12007627 -11445212 -13432953 -12328668 -12328580
4599 -12328580 -12664802 -12467162 -14132078 -12174199 -12894337 -11696528 -11644412 -13841194 -13331599 -11420702
4589 -11420702 -14107532 -12292698 -12734204 -13302647 -12748506 -13981366 -13261420 -14228986 -12481382 -11363561
4579 -11363561 -11312252 -12589078 -12559228 -11900636 -10904876 -11712953 -11495582 -11453771 -12297265 -11901858 -11324410
4568 -11324410 -12782646 -13165581 -13259631 -14543424 -13714903 -12256850 -12068030 -11647282 -13956756 -12807015
4558 -12807015 -12563421 -12893164 -14865776 -12487741 -11773226 -12496223 -13523519 -13027709 -11563221 -11489377
4548 -11489377 -11984718 -11972167 -14010496 -11469942 -12359266 -11003509 -10521884 -11362768 -12022444 -11433661
$$ packed form
4620a3111664M69389j205426K722869j072519o96699K43909J026329j444594K34044r0116
4610a2924478j208489O34250J003620J116P96605j161153Q50902N62415j987741J104285Q8
4599a2328580l36222J97640j664916J957879p20138J197809N2116k196782N09595J910897
4589a1420702k686830J814834m41506n68443N54141j232860P19946r67566J747604J117821
4579a1363561N1309j276826K9850O58592R95760q08077K17371M1811q43494L95407N77448
4568a1324410j458236l82935r4050j283793Q28521J458053J88820M20748k309474J149741
4558a2807015K43594l29743j972612K378035P14515p22997j027296M95810J464488P3844
4548a1489377m95341J2551k038329K540554q89324J355757M81625q40884o59676N88783
$$ plain form
4538 -11433661 -11719740 -12550177 -10352928 -11446536 -13328898 -13295704 -12422690 -11953306 -13009032 -13817830
4528 -13817830 -13688425 -13326867 -11345604 -12071669 -14435192 -15230352 -13873400 -13544098 -13577456 -14128567
4518 -14128567 -13188741 -13948665 -12333342 -11939813 -12546520 -12078247 -13017493 -12963580 -12745732 -13969503
4508 -13969503 -15315975 -13866146 -12976962 -16271693 -16827618 -13276207 -12363951 -11874575 -12406474 -12244118
4498 -12244118 -13282267 -13385388 -13809711 -13569243 -13323483 -13018829 -12258425 -12580176 -9488005 -13087902
4488 -13087902 -12557102 -13661535 -13221750 -14424991 -12940215 -12460070 -12833815 -14241491 -13416734 -13374025
4478 -13374025 -13047785 -14148569 -12398514 -11624625 -11776554 -13641469 -12668746 -11889134 -13544785 -16020128
4468 -16020128 -14493557 -14050102 -14037342 -13321647 -14021485 -14091742 -14384236 -13971499 -14127570 -12184877
$$ packed form
4538a1433661k86079q30437K197249j093608j882362L3194Q73014M69384j055726q08798
4528a3817830J29405L61558J981263p26065k363523p95160J356952L29302l3358n51111
4518a4128567R39826p59924J615323L93529o06707M68273r39246N3913K17848j223771
4508a3969503j346472J449829Q89184l294731n55925L551411R12256M89376n31899J62356
4498a2244118j038149j03121m24323K40468K45760L04654P60404l21751L092171l599897
4488a3087902N30800j104433M39785j203241J484776M80145l73745j407676Q24757M2709
4478a3374025L26240j100784J750055P73889j51929j864915R72723P79612j655651k475343
4468a6020128J526571M43455J2760P15695o99838p0257k92494M12737j56071J942693
$$ plain form
4458 -12184877 -11892470 -12927014 -13722809 -13855789 -13679859 -13717725 -12473889 -14895153 -12836500 -13781972
4448 -13781972 -13300605 -12683861 -12262971 -12194495 -10490604 -14168610 -12270482 -13373101 -11996847 -13279642
4438 -13279642 -13795465 -13583388 -13753348 -13354114 -12078097 -12339303 -12492280 -12433414 -14035522 -13424872
4428 -13424872 -12685641 -12141449 -13743564 -12464658 -14398778 -11975088 -13554552 -12813403 -14974904
4419 -14974904 -15889960 -13709386 -13202122 -12179640 -12636311 -12941835 -12584350 -12779404 -12121966 -11879967
4409 -11879967 -13506760 -14744025 -15077118 -9168609 -12431457 -12542666 -12747089 -12551070 -12825165 -13194773
4399 -13194773 -13485995 -14881773 -12407719 -13303436 -14858421 -15189532 -14654626 -13084373 -14302899 -13519243
4389 -13519243 -15225863 -14083497 -14491914 -15216117 -14959366 -15155170 -15399648 -14076093 -15243794 -14790543
$$ packed form
4458a2184877K92407j034544p95795j32980J75930l7866J243836k421264K058653r45472
4448a3781972M81367O16744M20890O8476J703891l678006J898128j102619J376254j282795
4438a3279642n15823K12077j69960L99234J276017k61206j52977N8866j602108O10650
4428a3424872P39231N44192j602115J278906j934120K423690j579464P41149k161501
4419a4974904r15056K180574N07264J022482m56671l05524L57485j95054O57438K41999
4409a1879967j626793j237265l33093N908509l262848j11209k04423J96019k74095l69608
4399a3194773k91222j395778K474054q95717j554985l31111N34906J570253j218526P83656
4389a3519243j706620J142366m08417p24203K56751j95804k44478J323555j167701M53251
$$ plain form
4379 -14790543 -15105743 -13549317 -15028614 -16047770 -16728808 -17900543 -21391965 -41014581 -5951728
4370 -5951728 -8361461 -10280740 -9643801 -12487129 -12397349 -11950613 -12600081 -13343557 -13645005 -12736778
4360 -12736778 -13073250 -14088282 -14738178 -13138755 -13598909 -13699726 -12873841 -13229296 -14499179 -13642160
4350 -13642160 -14523358 -14191720 -12351237 -11247833 -11627075 -13277420 -12895180 -11776763 -13217845
4341 -13217845 -15886178 -13243356 -12653882 -13923842 -14952340 -13186092 -12499685 -14739284 -14974425
4332 -14974425 -13346216 -13434645 -13478422 -11094449 -11852250 -12209480 -11496579 -12387514 -13083683 -13501292
4322 -13501292 -12891149 -13038094 -12700780 -14270938 -16212406 -15706950 -14411495 -13554774 -13052477 -12102974
4312 -12102974 -13956047 -14817816 -14076709 -11499992 -12427585 -12864996 -12955194 -12402249 -12770929 -14000714
$$ packed form
4379a4790543l15200J556426j479297j019156o81038j171735l491422j9622616L5062853
4370e951728k409733j919279O36939k843328Q9780M46736o49468p43476l01448R08227
4360a2736778l36472j015032o49896J599423m60154j00817Q25885l55455j269883Q57019
4350a3642160q81198L31638J840483J103404l79242j650345L82240J118417j441082
4341a3217845k668333K642822N89474j269960j028498J766248O86407k239599k35141
4332a4974425J628209q8429m3777K383973p57801l57230P12901q90935o96169m17609
4322a3501292O10143j46945L37314j570158j941468N05456J295455Q56721N02297R49503
4312a2102974j853073q61769P41107K576717r27593m37411r0198N52945l68680j229785
$$ plain form
4302 -14000714 -12344950 -14332880 -13776922 -15034384 -12332103 -13161963 -13295748 -13352683 -13226337 -13473115
4292 -13473115 -13220268 -13819684 -13127978 -12696955 -13593457 -14624390 -14085828 -13411610 -13517520 -12771165
4282 -12771165 -14380347 -14996998 -15968467 -19604465 -13617494 -13264390 -14658311 -14702441 -12815257 -13701799
4272 -13701799 -14595962 -13660987 -14298221 -14993126 -14271694 -13871493 -13188229 -12308519 -15251323 -14060255
4262 -14060255 -14107589 -15743462 -13534481 -12804309 -13077777 -14120532 -13128506 -14374128 -13837704 -12281300
4252 -12281300 -12047268 -13435940 -12910961 -13466822 -13838935 -13205614 -11716128 -12675085 -12657169 -13354183
4242 -13354183 -12496076 -13320081 -12986475 -12135246 -13310596 -13255734 -14400624 -12445705 -11768602 -12857137
4232 -12857137 -11935541 -12806001 -14033366 -13282447 -11912188 -13925947 -13275786 -13378589 -14633732 -15489119
$$ packed form
4302a4000714J655764j987930N55958j257462K702281q29860j33785n6935J26346k46778
4292a3473115K52847n99416O91706M31023q96502j030933N38562O74218j05910P46355
4282a2771165j609182o16651r71469l635998N986971L53104j393921m4130J887184q86542
4272a3701799q94163R34975o37234o94905P21432M00201O83264Q79710k942804J191068
4262a4060255m7334j635873K208981P30172k73468j042755R92026j245622N36424J556404
4252a2281300K34032j388672N24979n55861l72113O33321J489486r58957J7916o97014
4242a3354183Q58107q24005L33606Q51229j175350N4862j144890J954919O77103j088535
4232a2857137R21596q70460j227365P50919J370259k013759O50161j02803j255143q55387
$$ plain form
4222 -15489119 -15760859 -13448341 -12870393 -13268716 -14171770 -14569352 -12571482 -13251301 -13889565 -13200890
4212 -13200890 -14058196 -13612670 -13939000 -13678736 -15839968 -13786046 -13858391 -14617336 -13899259 -14033748
4202 -14033748 -13647862 -13222043 -13135985 -14296556 -13745574 -13699967 -12365485 -13330632 -14806629 -13908378
4192 -13908378 -13226478 -13291132 -13119716 -13016365 -13108395 -12408029 -12785302 -13043886 -14034800 -13221364 -12527448
4181 -12527448 -14235802 -13062815 -13693527 -14198094 -12878338 -12826033 -13356010 -13488119 -13532686 -13798981
4171 -13798981 -15985923 -15257512 -12747845 -13629362 -13479856 -13139626 -15688277 -14604095 -13558943 -12604953
4161 -12604953 -12658726 -14521319 -14141909 -13771917 -13308057 -15194153 -15293480 -13254473 -15676070 -13617001
4151 -13617001 -12816569 -13637608 -12035032 -12707156 -11364620 -11773627 -13523932 -12441610 -14728236
$$ packed form
4222a5489119k71740K312518N77948l98323r03054l97582J997870o79819o38264O88675
4212a3200890q57306M45526l26330K60264k161232K053922p2345p58945P18077j34489
4202a4033748L85886M25819Q6058j160571N50982M5607J334482r65147j475997Q98251
4192a3908378O81900o4654J71416J03351r2030P00366l77273k58584r90914Q13436O93916
4181a2527448j708354J172987o30712n04567J319756N2305n29977j32109m4567k66295
4171a3798981k186942P28411K509667q81517J49506L40230k548651J084182J045152R53990
4161a2604953n3773j862593L79410L69992M63860j886096r9327K039007k421597K059069
4151a3617001Q00432q21039J602576o72124J342536m09007j750305J082322k286626
$$ plain form
4142 -14728236 -13607487 -13847742 -13219066 -11855314 -13945822 -13771117 -13444014 -13106263 -14108262 -11768928
4132 -11768928 -13101899 -13245890 -11764754 -12759738 -12945600 -13313777 -12664363 -12882411 -13536294 -16352231
4122 -16352231 -13929678 -13773363 -13420678 -13960990 -12949988 -12089385 -11831133 -12031218 -13754957 -15387543
4112 -15387543 -13972088 -13942769 -12594145 -13684082 -13313339 -12837978 -12889162 -13835107 -13286933 -13287027 -13597828
4101 -13597828 -12737562 -12072125 -10919560 -14934678 -13173584 -13389678 -13306639 -13121321 -12527588 -11519068
4091 -11519068 -12358858 -13974970 -11287224 -10795799 -13467365 -11797451 -12620100 -14908215 -12176174
4082 -12176174 -13772097 -13660489 -11090822 -10821937 -12711491 -12454510 -13776679 -13782313 -12931720 -11591346
4072 -11591346 -13569797 -13907156 -12998883 -12780352 -13347300 -13007787 -13533417 -11739381 -13515033 -12965577
$$ packed form
4142a4728236J120749k40255O28676J363752k090508J74705L27103L37751j001999K339334
4132a1768928j332971j43991J481136r94984j85862l68177O49414k18048o53883k815937
4122a6352231K422553J56315L52685n40312J011002Q60603K58252k00085j723739j632586
4112a5387543J415455K9319J348624j089937L70743M75361n1184r45945N48174r4l10801
4101a3597828Q60266O65437J152565m015118J761094k16094Q3039J85318N93733J008520
4091a1519068q39790j616112K687746M91425k671566J669914q22649k288115K732041
4082a2176174j595923J11608K569667K68885j889554K56981j322169n634Q50593J340374
4072a1591346j978451l37359R08273K18531n66948L39513n25630J794036j775652N49456
$$ plain form
4062 -12965577 -12296410 -10905427 -12548085 -14426802 -11537351 -13063928 -14217273 -14510992 -14627079
4053 -14627079 -11447281 -11932281 -13901635 -13053646 -12713867 -11337901 -11092353 -13021959 -13243033 -14156553
4043 -14156553 -13906396 -13719272 -12777236 -13059420 -11377519 -12473898 -11736767 -12470782 -11658703 -12082246
4033 -12082246 -11814791 -11217276 -13523740 -14214758 -14511653 -13164902 -13086240 -13595340 -13722069 -13940259
4023 -13940259 -13563532 -12467471 -13355817 -13285317 -11771543 -13359388 -13533085 -13375759 -13343528 -11920697
4013 -11920697 -12025363 -13075658 -13081406 -13594339 -13273056 -13023572 -15173502 -15571431 -12834580 -14257384
4003 -14257384 -13918975 -13843119 -14070273 -12994990 -12462418 -11989118 -16600142 -14540184 -16029873 -16755276
3993 -16755276 -16653598 -15855597 -14729346 -15769547 -14559565 -15173180 -14599582 -15247635 -14765808 -15154137
$$ packed form
4062a2965577O69167J390983j642658j878717K889451j526577j153345k93719j16087
4053a4627079L179798m85000j969354Q47989L39779J375966K45548j929606k21074r13520
4043a4156553K50157J87124R42036k82184J681901j096379P37131p34015Q12079m23543
4033a2082246K67455N97515k306464o91018k96895J346751P8662n09100j26729k18190
4023a3940259L76727J096061q88346P0500J513774j587845j73697J57326L2231J422831
4013a1920697j04666j050295n748n12933L21283K49484k149930l97929K736851j422804
4003a4257384L38409P5856k27154J075283N32572M73300m611024K059958j489689p25403
3993a6755276J01678P98001J126251j040201J209982o13615N73598o48053M81827l88329
$$ plain form
3983 -15154137 -13887316 -14317945 -14677743 -15174790 -16659307 -13969406 -13553166 -14734625 -15418943 -13778520
3973 -13778520 -13799290 -13852323 -13616145 -14638406 -15861226 -14431886 -12763635 -14370972 -14504738 -14890210
3963 -14890210 -13802784 -15511454 -13364651 -15496926 -15423855 -15205516 -13377375 -14114518 -14341167 -14243701
3953 -14243701 -13500221 -14662252 -14081150 -14249607 -14136808 -13812988 -15904281 -16218963 -13773489 -14166868
3943 -14166868 -14308724 -14556847 -13799201 -15106015 -14947737 -15314276 -17371583 -25595300 -10582920
3934 -10582920 -12528159 -12555301 -12551185 -11847609 -13066147 -12655051 -13910478 -13232911 -13821335 -11717750
3924 -11717750 -15034626 -12185143 -11810012 -14516331 -13554285 -14544805 -12882169 -13982741 -12749310
3915 -12749310 -12871005 -15168002 -14278998 -13850671 -12449183 -15371558 -12510123 -12228769 -13735584 -13504071
$$ packed form
3983a5154137J266821m30629l59798m97047j484517K689901M16240j181459o84318J640423
3973a3778520k0770n3033K36178j022261j222820J429340J668251j607337j33766l85472
3963a4890210J087426j708670K146803k132275P3071K18339J828141p37143k26649R7466
3953a4243701P43480j162031N81102j68457J12799L23820k091293l14682K445474l93379
3943a4166868j41856k48123P57646j306814J58278l66539k057307q223717J5012380
3934a0582920j945239k7142M116P03576j218538M11096j255427O77567n88424K103585
3924a1717750l316876K849483L75131k706319R62046r90520J662636j100572J233431
3915a2749310j21695k296997Q89004M28327J401488k922375K861435K81354j506815K31513
$$ plain form
3905 -13504071 -13817602 -14586227 -15022874 -14336486 -13529585 -14772121 -15982849 -14421806 -14612161 -13885245
3895 -13885245 -16630689 -13388685 -14362274 -14188237 -13255340 -15127183 -15139649 -13650429 -13299701 -13250384
3885 -13250384 -11426273 -17623507 -17498394 -17961716 -14289205 -15597809 -14535677 -15083542 -15581649 -15233288
3875 -15233288 -14949320 -14161887 -14190017 -14322117 -14122513 -15566068 -15357891 -13422794 -12254502 -12771675
3865 -12771675 -11910217 -13542832 -15377789 -15159464 -13656388 -15019356 -15143671 -15497229 -15277418 -14278899
3855 -14278899 -14589036 -13945588 -13615177 -13136950 -12673621 -14934333 -14004640 -15183394 -14771003 -14170918
$$ packed form
3905a3504071l13531p68625m36647O86388Q06901j242536j210728J561043j90355P26916
3895a3885245k745444L242004r73589J74037R32897j871843j2466J489220L50728M9317
3885a3250384J824111o197234J25113m63322L672511j308604J062132n47865m98107L48361
3875a5233288K83968P87433k8130j32100J99604j443555K08177J935097J168292n17173
3865a2771675Q61458j632615j834957K18325J503076j362968j24315l53558K19811R98519
3855a4278899l10137O43448L30411M78227M63329k260712R29693j178754M12391O00085
$$ [...]
-2730d41846  $$ checkpoint
##END NTUPLES=
##END=
