##TITLE= S#353042
##JCAMP-DX= 5.00 $$ JEOL NMR v1.10
##DATA TYPE= NMR SPECTRUM
##DATA CLASS= NTUPLES
##NUM DIM= 1
##ORIGIN= DELTA_NMR
##OWNER= organic
##SPECTROMETER/DATA SYSTEM= DELTA_NMR
##.OBSERVE FREQUENCY= 3.00529655924288E+02
##.OBSERVE NUCLEUS= ^1H
##.DELAY= (2.194E+02,2.194E+02)
##.ACQUISITION MODE= SIMULTANEOUS
##.FIELD= 7.0586013
##.FILTER WIDTH= 1.81675738660864
##.ACQUISITION TIME= 3.6339712
##.SPINNING RATE= 15
##.OBSERVE 90= 9.6
##NTUPLES= NMR SPECTRUM
##VAR NAME= FREQUENCY,    SPECTRUM/REAL, SPECTRUM/IMAG, PAGE NUMBER
##SYMBOL=   X,            R,             I,             N
##VAR TYPE= INDEPENDENT,  DEPENDENT,     DEPENDENT,     PAGE
##VAR FORM= AFFN,         ASDF,          ASDF,          AFFN
##VAR DIM=  16384, 16384, 16384, 2
##UNITS= PPM,     ARBITRARY UNITS, ARBITRARY UNITS, 
##FIRST=  1.2501033903057E+01, -2.44785856828058, -1.82488299898182, 1
##LAST=  -2.50011824950436, -2.09282600641404, -2.39339053255184, 2
##FACTOR=  9.1565355261926E-04, 3.16895977410906E-04, 3.16895977410906E-04, 1
##PAGE= N=1
##DATA TABLE=(X++(R..R)), XYDATA
$$ [...]
5491b0043565k122647j063181K707047q41328k535566O75133J32338k089380K146652
5482b3034497M04349q2458P76650j337054K252809j857628J636075j812097J162992p15909
5472b2606768R44492p02366j594726J373305j801718J244676P22588L078112j380327
5463b0722732j127763L163141j4453447O410635Q637941j590805o790088K715818J650165
5454b2107135j162824j122017J403764j108200P03214L067909k393138j723331r422
5445b4451180J267224K338270j186411l94523k810102J965574R88910J582054r20055
5436b1620239j304019m57762j049798J716490K21000o51507j73430M00560K10094J021596
5426b1687015j84802j353205J296248Q47283j853105J308739j261011N08929Q27582r56947
$$ y = [-20043565, -22166212, -23229393, -20522346, -21363674, -23899240, -23224107, -23091769, -25181149, -23034497, -22630148, -22712606, -21935956, -23273010, -21020201, -22877829, -21241754, -23053851, -21890859, -22606768, -21662276, -22364642, -23959368, -22586063, -24387781, -23143105, -22420517, -19342405, -20722732, -21850495, -18687354, -33140801, -26730166, -18092225, -19683030, -26473118, -23757300, -22107135, -23269959, -24391976, -22988212, -24096412, -23393198, -20325289, -22718427, -24441758, -24451180, -23183956, -20845686, -22032097, -22426620, -25236722, -23271148, -22282238, -20700184, -21620239, -22924258, -23382020, -24431818, -22715328, -22494328, -23145835, -23319265, -22918705, -22708611, -21687015, -21871817, -23225022, -21928774, -21081491, -22934596, -21625857, -22886868, -22377939, -21550357, -22507304]
5416b2507304J196752K4171k389830R70337j270666O13638J687276j622457L51372P50822
5406b2195889J011651p46634J053296j425901l89317J106265l10492Q50108j442416
5397b2489329j305586K455973J360900l56991k560412j638089K430488R1184j526039
5388b3537901J122767K655100l566941J589592j673371m09114J554238J27883j82660
5379b2320407J75695J048436j62548O03109O58095q76530j18077Q62666j811607K38604
5369b1702564L13943N46829j540625J027483L83658O21481r10182j111049j09940K271463
5359b0209503k162830j755142O41888k644348M39872J667410J222551J949269L0540p31898
5349b1552191j294117l53575R13408j203825m10320J996597o5928R88232J120829n012462
$$ y = [-22507304, -21310552, -21286381, -23676211, -22705874, -23976540, -23362902, -21675626, -23298083, -22946711, -22195889, -21184238, -21930872, -20877576, -22303477, -22692794, -21586529, -21897021, -21046913, -22489329, -23794915, -21338942, -19978042, -20335033, -22895445, -24533534, -22103046, -22011862, -23537901, -22415134, -19760034, -23326975, -21737383, -23410754, -23819868, -22265630, -22137747, -22320407, -22144712, -21096276, -21258824, -20655715, -19997620, -20874150, -20992227, -20129561, -21941168, -21702564, -21388621, -20841792, -22382417, -21354934, -20971276, -20349795, -21259977, -22371026, -22480966, -20209503, -22372333, -24127475, -23485587, -26129935, -25690063, -24022653, -22800102, -20850833, -20820293, -21552191, -22846308, -23199883, -22286475, -23490300, -23900620, -21904023, -21969951, -20981719, -19860890, -24873352]
5339b4873352J311717k22786Q96031K728249j766223J191503q88033Q02543o34997j147510
5329b2602858j461682M50352j266763K107939K142763j932920M67938j485164J438945
5320b2141450p74447J598953j264538J56643r1526J567165k937312Q20255O0250Q80873
5310b2125134j710266j54500l23790j603872N889688L03986o79316r03274O2222j531122
5300b2775378J020531M13339N15392l43328j242082j146866J876923j292312J265520
5291b1708261p66415J850601p95221l4180n859945N977256P43046j423604N25014j44208
5281b1635917k75743J038573J276135P30300p49071m21338J42505j297156O39296j32017
5271b0684433n6074R88263p02280k092935o11961K292933n57520N56796j387334R60271
$$ y = [-24873352, -23561635, -23784421, -22888390, -20160141, -21926364, -20734861, -21622894, -20820351, -21455348, -22602858, -24064540, -23614188, -24880951, -22773012, -20630249, -22563169, -22095231, -23580395, -22141450, -22915897, -21316944, -22581482, -22424839, -22516365, -20949200, -23886512, -23066257, -23006007, -22125134, -23835400, -23989900, -24313690, -25917562, -20027874, -19723888, -20403204, -21306478, -21244256, -22775378, -21754847, -21341508, -20826116, -21169444, -22411526, -23558392, -21681469, -22973781, -21708261, -22474676, -20624075, -21419296, -21453476, -27313421, -21336165, -20593119, -22016723, -21491709, -21635917, -21911660, -20873087, -19596952, -18866652, -19615723, -20037061, -19894556, -21191712, -20552416, -20684433, -20740507, -19752244, -20454524, -22547459, -23159420, -20866487, -21424007, -20867211, -22254545, -21294274]
5261b1294274R57387J918849j249625n79050O71292m53159J649771j557440J361278L21158
5251a8253813N27277J059965P11871K968583K554939M817228M758955l4514537k3634746
5242e9004278J5916163N815392L633888L006763J498324K090108P53149p75374L69540
5233b6696325k499289J355798o13503R4995J479217J10191R63445Q87657j034438K39375
5223b5712877n55902K267946j2038J281862R58220k670545L94767N93363n69346j475867
5213b5500417m02415J496072J367829j742120K68327J497671o90496q48912J22723Q40236
5203b3591502k81901P88J00710R0559k6172N5210j22015K722461m186720j8685J059690
5192b4197577J309290n70934j087714K050325j226621n58717J10877J182992l73732m30242
$$ y = [-21294274, -20336887, -18418038, -19667663, -20246713, -19575421, -20028580, -18378809, -19936249, -18574971, -18253813, -17726536, -16666571, -15954700, -12986117, -10431178, -5613950, -854995, -35369532, -59004278, -43088115, -37272723, -33638835, -30632072, -29133748, -27043640, -26290491, -27065865, -26696325, -29195614, -27839816, -28453319, -28358324, -26879107, -26768916, -25805471, -24917814, -25952252, -25712877, -26268779, -24000833, -24012871, -22731009, -21772789, -24443334, -24048567, -23455204, -24024550, -25500417, -25902832, -24406760, -23038931, -24781051, -24512724, -23015053, -23705549, -24554461, -24431738, -23591502, -23873403, -23872615, -23771905, -23681346, -23707518, -23652308, -23774323, -21051862, -25238582, -25257267, -24197577, -22888287, -23459221, -24546935, -22496610, -23723231, -24281948, -24171071, -22988079, -23361811, -23792053]
5182b3792053P87557p63518r57229J93613K116014p32636J508860n67074k993462j054110
5172b6254038L205399J493107J73333j484297j021421J216382j547822P98022N20365
5163b2900970k74553L76709J575394j711313O32000L62792j616797K799777k780017
5154b3536978J161752J566064j434389J64408N52468j125269j82302n13793o63031K077212
5144b1933858k858089J366453o94738K404441q22324j443377Q56288K079163j075143
5135b2121184k617867j308654M195142m89666q51265k09184J341918q8204j413116K090926
5125b1471154j409395r08770J839476n99296q00049J469850j300136K24531K41495j201683
5115b3915131o65926R42593J704467K73981q71788J9514k283794R27105J059274L24973
$$ y = [-23792053, -23004496, -23768014, -24725243, -24531630, -22415616, -23148252, -21639392, -22206466, -25199928, -26254038, -23048639, -21555532, -21382199, -22866496, -23887917, -22671535, -24219357, -23421335, -22900970, -23175523, -22798814, -21223420, -22934733, -22302733, -21939941, -23556738, -20756961, -23536978, -22375226, -20809162, -22243551, -22079143, -21526675, -22651944, -22834246, -23348039, -24011070, -21933858, -24791947, -23425494, -24120232, -21715791, -22538115, -23981492, -23125204, -21046041, -22121184, -24739051, -26047705, -21852563, -22342229, -23193494, -23402678, -22060760, -22148964, -23562080, -21471154, -22880549, -23789319, -21949843, -22549139, -23349188, -21879338, -23179474, -22954943, -22713448, -23915131, -24581057, -23638464, -21933997, -21660016, -22531804, -22512290, -24796084, -23868979, -22809705, -22484732]
5105b2484732j92006l52228j166102K526800K21843J43049p78612P48121L60651q10473
5095b1783689j203212j805349j70116j327708L069363J123227j170052l80018p02014
5086b4349568K523726J31394K8711n35943J24263N64130O7219o16219J66045j810614
5076b3706856k34813j244947R74962J005301k98242j84621r87350J902819K233854l715883
5066b4255776J041392j72467J18868J241747p14329L157369k125336L75573j632568l85659
5056b3351186R51867m34654p40022J294559j296292M24018k842891K300821o92101J747401
5046b2638480M92030j091909r82100J601006N33613j170865n36627J030620J274548
5037b1488164J931476j556022l223674m41360Q51489o76791r95864J118074J631087M25733
$$ y = [-22484732, -22676738, -23028966, -24195068, -21668268, -21446425, -21303376, -22081988, -21333867, -20973216, -21783689, -22986901, -24792250, -24962366, -26290074, -23220711, -22097484, -23267536, -23647554, -24349568, -21825842, -21694448, -21665737, -22201680, -22077417, -21513287, -21446068, -22062287, -21896242, -23706856, -23941669, -25186616, -24211654, -23206353, -23504595, -23689216, -24676566, -22773747, -20539893, -24255776, -23214384, -23386851, -23267983, -22026236, -22740565, -19583196, -21708532, -21332959, -22965527, -23351186, -22399319, -22833973, -23573995, -22279436, -23575728, -23151710, -25994601, -23693780, -24385881, -22638480, -22146450, -23238359, -24220459, -22619453, -22085840, -23256705, -23793332, -22762712, -21488164, -19556688, -21112710, -24336384, -24777744, -23926255, -24603046, -25598910, -24480836, -22849749, -22424016]
5027b2424016k080856N583832k663234k484567J608108p75115r02494J039410N63462
5018b2535470J369493k418723Q21142q5164n94695J112518j040258Q04513Q387J50773
5008b2407484o7068M70368j21774j680607J793443O47283k68387j264932j279461N60533
4998b3618086P72307m49823J46813k77588L5570k24432K21527o51618R73910P00523K70039
4987b2100858j295312J800968J87595J335144k813166j559511J76922K271718j916676
4978b3913176K071873o97883l07224p9738l096905K081149K83153j28864J189125O68817
4968b1929673q95481j024211m55180j862952r29401J72361N878429k829657j01287M52721
4958b3524331P2222k97333r78521j138684K304036j68456o44366L289860k338526J356922
$$ y = [-22424016, -24504872, -18921040, -21584274, -24068841, -22460733, -23235848, -24138342, -23098932, -22535470, -21165977, -23584700, -22763558, -22848722, -23443417, -22330899, -23371157, -22566644, -22558257, -22407484, -22474552, -22004184, -22125958, -23806565, -22013122, -21365839, -21634226, -22899158, -24178619, -23618086, -22845779, -23295602, -23148789, -23426377, -23390807, -23615239, -23393712, -24045330, -23071420, -22370897, -22100858, -23396170, -21595202, -21407607, -20072463, -22885629, -24445140, -24268218, -21996500, -23913176, -21841303, -22539186, -22846410, -22926148, -26023053, -23941904, -23658751, -23787615, -22598490, -21929673, -22825154, -23849365, -24304545, -26167497, -27096898, -26924537, -21046108, -23875765, -23977052, -23524331, -23452109, -23749442, -24727963, -25866647, -23562611, -23731067, -24375433, -21085573, -23424099, -22067177]
4948b2067177r0885O01996M03624j778205j52345n37478J197611r93980m39649J919536
4938b1936952Q71548j679201m5370j209272o73321Q28823N6214l05412k44645P49025
4928b3588563n77852N29798K36476Q30217j121656K28491k507626P87752L002514o79914
4918b2860363k478657J316117K24299j468830J594208q42939j617715Q85284J069059
4909b4179537K015806m67201j783913P85452J018638p39373J975156j429850K608265
4900b0196557j961507k229773J33234j041543K361094j99028j536441J034599L406988
4891b0228934k267172r39935k28511J340441j78609j732111m1361n31424j180375J65267
4881b5822724J644290K67981j706499Q10124p09880K008544m71985k85845m46792j07952
$$ y = [-22067177, -22158062, -21556066, -21152442, -22930647, -23082992, -23620470, -22422859, -23416839, -23856488, -21936952, -21065404, -22744605, -22789975, -23999247, -24672568, -23843745, -23787531, -24092943, -24337588, -23588563, -24166415, -23636617, -23400141, -22569924, -23691580, -23463089, -25970715, -25182963, -22180449, -22860363, -25339020, -24022903, -23798604, -25267434, -23673226, -24516165, -26133880, -25248596, -24179537, -22163731, -22630932, -24414845, -23629393, -22610755, -23350128, -21374972, -22804822, -20196557, -22158064, -24387837, -24254603, -25296146, -22935052, -23134080, -24670521, -23635922, -20228934, -22496106, -23436041, -23664552, -22324111, -22502720, -24234831, -24276192, -24807616, -25987991, -25822724, -24178434, -23910453, -25616952, -24806828, -25516708, -23508164, -23980149, -24265994, -24712786, -24820738]
4871b4820738K96868j51426m55677j389430K940370m01190R11915n53309Q66049j858421
4861b4614989M60067J663211M70534j381177L36052L86410p42755l81940j34731N18187
4851b3421131Q3742r30574R58953K5990k031980J957920r68221N94147J069829o35152
4841b3296477p75174j458489J165638r38047M84961L92621M7910j454237R68121N66923
4831b4296250J21222L51890n67640J845627k511319p10804J594900R09115j819372k21239
4821b5303870P25273J597732j975195l354189K018983j662855j218811J35658j056620
4812c0093894O79958j276824m501297j0480746o254259O4225505j5888255p539048m392272
4803a5521132j547194q32415k430140J083085j49769m15607k609269O04143j179742
$$ y = [-24820738, -24523870, -24675296, -25130973, -26520403, -23580033, -23981223, -23069308, -23622617, -22756568, -24614989, -24154922, -22491711, -22021177, -23402354, -23066302, -22679892, -23422647, -23804587, -23939318, -23421131, -23337389, -24267963, -23309010, -23283020, -25315000, -23357080, -24325301, -23731154, -22661325, -23296477, -24071651, -25530140, -24364502, -25302549, -24817588, -24424967, -24377057, -25831294, -24863173, -24296250, -24175028, -23823138, -24390778, -22545151, -25056470, -25767274, -24172374, -23263259, -25082631, -25303870, -24578597, -22980865, -24956060, -28310249, -26291266, -27954121, -29172932, -29037274, -30093894, -29413936, -30690760, -35192057, -45672803, -51927062, 12298443, -3589812, -11128860, -15521132, -17068326, -17900741, -20330881, -19247796, -19397565, -19813172, -22422441, -21818298, -22998040]
4794b2998040J581635j774695K934109R6984K9348j031144j357314M86002j23910j61397
4784b2318422j639145J416771p34847N33629p8386K138729k39799l42024j4577j618627
4774b2896698L460484l072265k60988K04639r39014K251340O3890j018316L84584K58849
4764b1563495q93031n73899J498440J92193j457284J62757r44552o77953K862319m00494
4754b1794999k72029j541315J252659L29545m00904N48951L67759r1371J421650k995182
4744b3175236J274714J32761j442267O57407L01687j193454M21101j39946O35367k1990
4734b2549856J203294j831137R88528l79429j083352J447643J002417p62777N66722O09060
4724b0788887n61373P49598j456506p56155J336072J362952q13135j334357P84125J84837
$$ y = [-22998040, -21416405, -23191100, -20256991, -20160007, -20130659, -21161803, -22519117, -22033115, -22157025, -22318422, -23957567, -22540796, -23275643, -22742014, -22820400, -20681671, -20921470, -21263494, -21278071, -22896698, -19436214, -22508479, -22769467, -22564828, -23503842, -21252502, -21188612, -22206928, -21822344, -21563495, -22456526, -23030425, -21531985, -21339792, -22797076, -22634319, -23578871, -24256824, -21394505, -21794999, -22067028, -23608343, -22355684, -22026139, -22427043, -21878092, -21510333, -21601704, -20180054, -23175236, -21900522, -21767761, -23210028, -22552621, -22250934, -23444388, -23023287, -23163233, -22527866, -22549856, -21346562, -23177699, -22189171, -22568600, -23651952, -22204309, -21201892, -21964669, -21397947, -20788887, -21350260, -20600662, -22057168, -22813323, -21477251, -20114299, -20927434, -22261791, -21477666, -21292829]
4714b1292829n90531L48867J02583l11758k57515L40740J002767J76908R09397Q49484
4704a8721887J37688m186445O00802K02769k11231R61987j414753J845423q26474n57472
4694b2169593j37224Q08197j001618O36321J76837m59461J4906R2457n5065J141900K77299
4683b0675044k331828K176532j115692j257685k324204J696648N52782J061722o51026
4674b2867795m37763n4717k57962m87213J996164j602943K153177J2811j269106J015493
4664b1799854j156939J95336j543970p31486L862446j311780j157367L35260r58152r28624
4654b5195130Q22985J852890Q99368j300381K570093l562502J957973j177100n62577
4645b3694381R68523j502275J349650J025884j380237J428903j222075j551273n00118
$$ y = [-21292829, -21883360, -21534493, -21431910, -21743668, -22001183, -21660443, -20657676, -20480768, -19571371, -18721887, -18584199, -22770644, -22169842, -21967073, -22178304, -21216317, -22631070, -20785647, -21612121, -22169593, -22306817, -21498620, -22500238, -21863917, -21687080, -22146541, -22131635, -22039178, -22094243, -20952343, -20675044, -23006872, -20830340, -21946032, -23203717, -25527921, -23831273, -23278491, -22216769, -22867795, -23305558, -23360275, -23618237, -24105450, -22109286, -23712229, -21559052, -21546241, -22815347, -21799854, -22956793, -22761457, -24305427, -25036913, -21174467, -22486247, -23643614, -23308354, -24266506, -25195130, -24372145, -22519255, -21619887, -22920268, -20350175, -23912677, -21954704, -23131804, -23694381, -22725858, -24228133, -22878483, -21852599, -23232836, -21803933, -23026008, -24577281, -25077399]
4636b5077399K495572q02340p75779J755506P41261j480156L57134L37613k644709J896300
4626b3196997J15895P38890j66403k194729N87615O67756J328618j383139j212556J442881
4616b3272169k034407J125669q62223Q00040q29217J874817q73848R55160n94121j159289
4606b4869588J245095m73841Q53577l85668j76267O23651K520681j59112n15403j530296
4596b2867171n78639O50934j176322j764588J975236O67742l768565M95537K503530k28571
4586b4090877N57785J169262J84087r72044q26121R89963M99910j482635m94030M08827
4576b4055873J525298p45108n49730j428291J478165R84234K23498J059393N92918j471674
4566b2387170k078109k4414J30955K048443j812035n95222q99445K619668L0685q7822
$$ y = [-25077399, -22581827, -23384167, -24159946, -22404440, -21663179, -23143335, -22786201, -22448588, -25093297, -23196997, -23081102, -22342212, -22508615, -24703344, -24115729, -23447973, -22119355, -23502494, -24715050, -23272169, -25306576, -24180907, -25043130, -24243090, -25072307, -23197490, -24071338, -23116178, -23710299, -24869588, -23624493, -24098334, -23244757, -23630425, -23806692, -23183041, -20662360, -20821472, -21336875, -22867171, -23445810, -22794876, -23971198, -25735786, -23760550, -23092808, -26861373, -26365836, -23862306, -24090877, -23533092, -22363830, -22179743, -23151787, -23977908, -22987945, -22488035, -23970670, -24464700, -24055873, -22530575, -23275683, -23825413, -25253704, -23775539, -22791305, -22567807, -21508414, -20915496, -22387170, -24465279, -24489693, -24358738, -22310295, -24122330, -24717552, -25616997, -22997329, -22966644, -23054466]
4556b3054466j013057L61715m12696p02899J415739P92922J36825j176911J386435K2478
4546b2243915l382677N67585J417001J577997J284654k137087l53900j18256L63741j58046
4536b3182903j41337j168484J443689o32028J67869l78063J072020J64797j46894j570948
4526b4372282n69139K136823K339988j951357l37394o06280R48090k270945P46307J454659
4516b2481530l49644p05485K71313N84130j316901j621796Q50554K625331k359191j199871
4506b5703090Q42574j699491L159758N45331L9304L01433j243746K90507k23269k63102
4496b3953791j428285J159274M4832o84165J818344k023865J532201J052089l93051
4487b2876417j016630O21828Q62869r53461M48188L39245o33847n11278L44266j262766
$$ y = [-23054466, -24067523, -23705808, -24118504, -24821403, -23405664, -22612742, -22475917, -23652828, -22266393, -22243915, -25626592, -25059007, -23642006, -22064009, -20779355, -22916442, -23270342, -23388598, -23024857, -23182903, -23324240, -24492724, -23049035, -23681063, -23513194, -23891257, -22819237, -22654440, -22801334, -24372282, -24941421, -22804598, -20464610, -22415967, -22753361, -23359641, -22411551, -24682496, -23936189, -22481530, -22831174, -23536659, -23265346, -22681216, -23998117, -25619913, -24769359, -22144028, -24503219, -25703090, -24860516, -26560007, -23400249, -22854918, -22815614, -22514181, -23757927, -23467420, -23690689, -23953791, -25382076, -24222802, -24177970, -24862135, -23043791, -25067656, -23535455, -22483366, -22876417, -23893047, -23271219, -22408350, -23361811, -22913623, -22574378, -23208225, -23719503, -23375237, -24638003]
4477b4638003N97173Q78091l85212P1619K316428l015540k207800J683393J465171K211861
4467b1022819j900723R82641K95970N35031j373261l7943j415417K344442r72633L05290
4457b2259422o08564J143652R2070q18750r46267k397614J414676J258135p7795J56090
4447b3043789j37484J222627J00247j745760K838920j330341j468208o26417J097070
4438b3093135M27383J27558k18541r20830M31723J454198K460551k226212Q61403n28453
4428b1224355J1499j232034n29040K972882j54542m641965J865956r62818P32387M83521
4418b2678509q99884Q88378o8354r41546j054807P06755M70229L87134L2759k43340
4408b3401185K284125k024401j488467M526597l85108n38027r9079K7675l224268K721075
$$ y = [-24638003, -24040830, -23162739, -23547951, -23476332, -21159904, -24175444, -26383244, -24699851, -23234680, -21022819, -22923542, -21940901, -21644931, -21109900, -22483161, -22521104, -23936521, -21592079, -22564712, -22259422, -22867986, -21724334, -21632264, -22451014, -23397281, -25794895, -24380219, -23122084, -23199879, -23043789, -23181273, -21958646, -21858399, -23604159, -20765239, -22095580, -23563788, -24190205, -23093135, -22665752, -22538194, -22756735, -23677565, -23245842, -21791644, -19331093, -21557305, -20695902, -21224355, -21212856, -22444890, -22973930, -20001048, -20155590, -24797555, -22931599, -23894417, -23162030, -22678509, -23578393, -22690015, -22758369, -23699915, -24754722, -24047967, -23577738, -23190604, -23157845, -23401185, -21117060, -23141461, -24629928, -20103331, -20488439, -21026466, -21125545, -21097870, -24322138, -21601063]
4398b1601063j361345O14408o12880l06523j508857J299471n71159J419741q23133k49820
4388b3701160N07954k50982Q6145j231097M76372K577295R73653n95469n44979j646187
4378b3348455j573071K801377K584119J90433J39825N480529K5985030m7741460M661845
4369c0819828K220243L94011Q12851M82589p1599J003838n89782J173996k06336l12374
4359b5912391k53057j63018J659356j365897K505393M83346k615952k075280K930979
4350b4806521j183641N5755J176905k330229K423397L85669K71633J292194j270606j9390
4340b4004834j008800o36489M92554l39894p45624m80142r06112L787657j769321O98815
4330b4912190M94223k723288J208077j021996K39929j29252K201997m20116n59102j475118
$$ y = [-21601063, -22962408, -22348000, -22960880, -23267403, -24776260, -23476789, -24047948, -22628207, -23451340, -23701160, -23193206, -23444188, -23358043, -24589140, -24112768, -21535473, -20561820, -21157289, -21702268, -23348455, -24921526, -22120149, -19536030, -19345597, -19205772, -13725243, 12259787, -35481673, -30819828, -28599585, -28205574, -27392723, -26910134, -26981733, -25977895, -26567677, -25393681, -25600017, -25912391, -26165448, -26328466, -24669110, -26035007, -23529614, -23046268, -25662220, -27737500, -24806521, -25990162, -25934407, -24757502, -27087731, -24664334, -24278665, -24007032, -22714838, -23985444, -24004834, -25013634, -25650123, -25157569, -25497463, -26243087, -26723229, -27629341, -23841684, -25611005, -24912190, -24417967, -27141255, -25933178, -26955174, -26715245, -26844497, -24642500, -25062616, -25621718, -27096836]
4320b7096836O45925N899122l643602j455583k30514K99561K175486j276121j83045m35678
4310b5301285o65415J716945j329839J854327k171345j131019O33882o34697O46802O09701
4300b5771943R09879R25880j448407j098436P9148J091336O42708Q00204p73131p06009
4290b5348771q3480k55192m19906O12449r97438Q72617K177484J000783l81470K21574
4280b2601350n80741M470620p264348l67149J920798J247178j508232P48329r80720
4271b4915615j273530O39350l33971Q54908o78362K149103k232614J040529l70018M087
4261b5116133j123974J539803J516014j829351k305684J044638J140640M4012J705543
4252b3384492R34485r9427m658276K668681Q51026o72813j899929J350995j81391O72521
$$ y = [-27096836, -26450911, -20551789, -24195391, -25650974, -25881488, -25581927, -23406441, -24682562, -24865607, -25301285, -25966700, -24249755, -25579594, -23725267, -25896612, -27027631, -26393749, -27028446, -26381644, -25771943, -24862064, -23936184, -25384591, -26483027, -26403879, -25312543, -24669835, -23869631, -24642762, -25348771, -25432251, -25687443, -26107349, -25494900, -26492338, -25619721, -23442237, -22441454, -22822924, -22601350, -23182091, -18711471, -25975819, -26342968, -24422170, -23174992, -24683224, -23934895, -24915615, -26189145, -25549795, -25883766, -25028858, -25707220, -23558117, -25790731, -24750202, -25120220, -25116133, -26240107, -24700304, -23184290, -25013641, -27319325, -26274687, -25134047, -25090035, -23384492, -22450007, -22549434, -27207710, -24539029, -23688003, -24360816, -26260745, -24909750, -25091141, -24418620]
4242b4418620J149362J46405p90408P64239j67917p06524q53620J237856R03516l852947
4232b6588658J621878N89765K130822k208825l1065l3256j326906J268204k95310R04416
4222b3968935M985067j220172r62693O66022N15468J94964p65226K378924k482116N56139
4212b0102558k76014j19793R22477k889180J730112j994735j82313M28035l19141P19792
4202b2083318P04185j002900K145940j023361l0705K7923l95688J375963M3082o03766
4192b0842645L12531R12345K373389n25943J184438j007200J273170l351715k784693
4183b2456323K70129J762431K92194j635531N68701R87909m90389k26706m6156L80297
4173b0593444J212136q91834J745447N74281r21441O45333J200916k066074L463093m67005
$$ y = [-24418620, -23269258, -23122853, -23913261, -23149022, -23316939, -24023463, -24877083, -23639227, -22735711, -26588658, -24966780, -24377015, -22246193, -24455018, -24486083, -24519339, -25846245, -24578041, -24873351, -23968935, -18983868, -20204040, -21166733, -20500711, -19985243, -19790279, -20555505, -18176581, -20658697, -20102558, -20378572, -20498365, -19575888, -22465068, -20734956, -22729691, -22912004, -22483969, -22803110, -22083318, -21379133, -22382033, -20236093, -21259454, -21290159, -21262236, -21657924, -20281961, -20238879, -20842645, -20530114, -19617769, -17244380, -17770323, -16585885, -17593085, -16319915, -19671630, -22456323, -22186194, -20423763, -20131569, -21767100, -21198399, -20210490, -20700879, -20927585, -20973741, -20593444, -19381308, -20273142, -18527695, -17953414, -18874855, -18229522, -17028606, -19094680, -15631587, -16098592]
4163a6098592J67788o37514P95223j74645j744377R34534j376987j89010K968423J547448
4153a3807709j062696p16408K7987j753149R4914L72956J712182j096947M8293N28292
4143a5652285j427142M229225j722217N56321o98736K74044J91136n18640N99931J708981
4133a2459382j862931l97732r49362L149600O86661J035761P3899L82150j310113J327631
4123a0323818l404299J264284K938554k980833K427276j8862j078183J907282k216415
4114a1485014J181735J70405M36088m56498J524088K035875J19708N02302k037145K886265
4104e122191j402707n49029M22029j421103L39038J412211Q02829p8289p1589K320J057447
4093d609034j72084j05671J80209J477525o55675J774251j09760J507112n41256K232601
$$ y = [-16098592, -15930804, -16568318, -15773095, -15947740, -17692117, -16757583, -18134570, -18323580, -15355157, -13807709, -14870405, -15586813, -15558826, -17311975, -17217061, -16844105, -15131923, -16228870, -16180577, -15652285, -17079427, -12850202, -14572419, -14016098, -14714834, -14440790, -14249654, -14768294, -14168363, -12459382, -14322313, -14720045, -15669407, -12519807, -11833146, -10797385, -10723486, -10341336, -11651449, -10323818, -13728117, -12463833, -9525279, -12506112, -10078836, -10097698, -11175881, -9268599, -11485014, -10303279, -10132874, -9696786, -10153284, -8629196, -6593321, -6473613, -5971311, -8008456, -5122191, -6524898, -7073927, -6651898, -8073001, -7733963, -6321752, -5518923, -5597212, -5668801, -5666481, -4609034, -4781118, -4886789, -4706580, -3229055, -3884730, -2110479, -2220239, -713127, -1254383, 978218]
4083I78218L0988K04062Q47120J063894J2661J132282p28632J303414N9980J823333L81559
4072G108879J25767J030313j680179j369001L23521J617490J88631k113998l93335k03333
4062D634755J374142M30540K397120N71743L242056J237991J322570M306577J836024
4053B1353518l639783K125593j27517P52933L062836j741228K058937K24227L393L410382
4043B7483291N333794K554884l212792m591760L7458K789315L312912q38619O81260
4034C3549743J063357O511149J959854L424590N89407k852764N501777K884688N326751
4025E7958552M080070M455402K090188K193943K237036M294624N971578M701974J657952
4016H9641319Q39500M236239O898047P852611P947193J914352M894468M504317K039433
$$ y = [978218, 1009206, 1213268, 2060388, 3124282, 3136943, 4269225, 3540593, 4844007, 4903987, 6727320, 7108879, 7234646, 8264959, 6584780, 5215779, 5539300, 7156790, 7345421, 5231423, 4838088, 4634755, 6008897, 6439437, 8836557, 9408300, 12650356, 13888347, 15210917, 19517494, 21353518, 17713735, 19839328, 19711811, 20464744, 23527580, 21786352, 23845289, 24069516, 24072909, 27483291, 32817085, 35371969, 32159177, 27567417, 27604875, 30394190, 33707102, 32868483, 33549743, 34613100, 41124249, 43084103, 46508693, 47098100, 44245336, 49747113, 52631801, 57958552, 62038622, 66494024, 68584212, 70778155, 73015191, 77309815, 83281393, 87983367, 89641319, 90480819, 94717058, 101615105, 109467716, 117414909, 119329261, 124223729, 128728046, 130767479]
4007A30767479M770418N918977J036203K092273L539780Q516289J5949829P947643Q02580
3998A81341471M514730N440140M811944O165356P651819P342938O377400N787165J1059115
3989B40492078J2609630J6469752J0701970O589017N033516J905665P845177J1302000
3981C12948805M963165L895404K022975J4239477Q898276J3498824J3248035J7320877
3973C91035838K0482513J6506597L1607027L5323664L0319689K0175018R364379M816759
3965E59631484J3651578K9017611M0531513M1471400K4157130J2276801L5333577K976207
3957G59047301m5108786o0344728o8747459p1396947o4268240k9933676o950312J7022881
3949D29320034K4803359K3831018O0173300P3483140N5852308K8450524J4559272M749092
$$ y = [130767479, 135537897, 141456874, 142493077, 144585350, 148125130, 156641419, 172591248, 180538891, 181341471, 185856201, 191296341, 196108285, 202273641, 209925460, 217268398, 223645798, 229432963, 240492078, 253101708, 269571460, 280273430, 286862447, 291895963, 293801628, 301646805, 312948805, 317911970, 321807374, 323830349, 338069826, 346968102, 360466926, 373714961, 391035838, 411518351, 428024948, 459631975, 494955639, 525275328, 545450346, 554814725, 559631484, 573283062, 602300673, 642832186, 684303586, 708460716, 720737517, 756071094, 759047301, 713938515, 653593787, 584846328, 513449381, 449181141, 419247465, 412297153, 429320034, 454123393, 477954411, 538127711, 611610851, 667463159, 695913683, 710472955, 715222047]
3941G15222047J0230360L1106534N6795465P6227073M7579616o60096P5062024M009862
3933A015572885j05239465j32157587j56795610j66514311j42582095q3463746m1802464
3926A87017607j9095464L332212Q381813L7433433N2019114L8974485J3297245Q004073
3918C29364518R377336P830383R880008J7175433L4376213K8124764K7890J2282415
3910D48438960J4919268m9245153p4442298q0635161q7938595p9150304m9875175k5235537
3902A6836005j9237675q772237r61878J1338464J4022149N498906j091434K433061O81684
3893B0747045N084001P46858n859931m334818k794085l259959n389451m285562n625175
3884d971077p648897K252749M196252j644007j327006J537662j598168M14568n35395
$$ y = [715222047, 725452407, 756558941, 813354406, 889581479, 937161095, 936500999, 1011563023, 1015572885, 910333420, 778175833, 621380223, 454865912, 312283817, 228820071, 187017607, 167922143, 171254355, 179636168, 217069601, 269088715, 308063200, 321360445, 329364518, 338741854, 346572237, 356452245, 373627678, 408003891, 436128655, 436156545, 448438960, 463358228, 414113075, 339670777, 259035616, 171097021, 91946717, 42071542, 16836005, -2401670, -11173907, -12135785, -797321, 13224828, 18723734, 17632300, 20065361, 20747045, 25831046, 26577904, 20717973, 16383155, 13589070, 10329111, 4939660, 654098, -4971077, -12619974, -10367225, -6170973, -7814980, -9141986, -7604324, -9202492, -8787924, -9323319]
3875i323319J056909M315124Q68008P57828j229435r37331K580115J133121l217532
3866c996512m004150n857017m848783k276335j069570j95646j475661M27000L365363
3857a9931311M098564j062212L06573j35514j0102K08604m638505l185692J56677N11364
3847b3681554j293453n6285K202145K808383J146153l295187k984744J143294j025775
3838b5037023j650908n101553l71610n71964K170172J776861K044035K787616K350304
3829b1604070j266671j909667m522538r334588l828046J171831p02553J044418M676463
3820c6275421K981314K762021K127536J705579K020313r8646j715541k407690j650270
3811c0550805J324757R12701j420582J126693K256813K493672m42689o54866k266731
$$ y = [-9323319, -8266410, -3951286, -3083278, -2325450, -3554885, -4492216, -1912101, -778980, -3996512, -8000662, -13857679, -18706462, -20982797, -22052367, -22248013, -23723674, -23296674, -19931311, -15832747, -16894959, -16588386, -16723900, -16734002, -16525398, -21163903, -24349595, -24192918, -23681554, -24975007, -25031292, -22829147, -20020764, -18874611, -22169798, -25154542, -24011248, -25037023, -26687931, -31789484, -32161094, -32733058, -30562886, -28786025, -26741990, -23954374, -21604070, -22870741, -24780408, -29302946, -38637534, -42465580, -41293749, -41996302, -40951884, -36275421, -33294107, -30532086, -28404550, -26698971, -24678658, -24777304, -26492845, -28900535, -30550805, -29226048, -28313347, -29733929, -28607236, -26350423, -23856751, -24299440, -24954306, -27221037]
3802b7221037m340309l230676p92351n00453J495362k199902O300262K366869K030569
3793b6091666J044323j166156L67738n18655j791128m64499L53697M78788j084906O39994
3783b8232470k49287L299148Q16036o658L80544L39055L0278j130108R75570l42820o36250
3772b4756962j848863Q36279M54587J858530k094090J64379K592330r61931n21006K50434
3762b4026313l62681m63486j368873Q68354J058570R29665j834897J39706J488610L7850
3752b3533495k772570J479717k700924K871819Q64265Q1997n30372n97731J903383R71368
3742b1962543j855419J392131J595114j729359J33701q57432J119501K483825m50188
3733b0130669Q04743j184437J050207j980821L345389k028623K81078j096192L21123
$$ y = [-27221037, -31561346, -34792022, -35584373, -36084826, -34589464, -36789366, -30489104, -28122235, -26091666, -25047343, -26213499, -25845761, -26364416, -28155544, -28620043, -28266346, -27787558, -28872464, -28232470, -28481757, -25182609, -24366573, -24373231, -23992687, -23653632, -23623354, -24753462, -23777892, -24120712, -24756962, -26605825, -25769546, -25314959, -23456429, -25550519, -25386140, -22793810, -23755741, -24276747, -24026313, -24388994, -24852480, -26221353, -25352999, -24294429, -23364764, -25199661, -25059955, -23571345, -23533495, -26306065, -24826348, -27527272, -24655453, -23791188, -23709191, -24239563, -24837294, -22933911, -21962543, -23817962, -22425831, -20830717, -22560076, -22426375, -23283807, -22164306, -19680481, -20130669, -19325926, -20510363, -19460156, -21440977, -18095588, -20124211, -19843133, -20939325, -20618202]
3724b0618202K65585K37213N56276r93787j80152O34571j436044L055607p5854o52060
3714a9206847k362510J303341K277194p28061J708664N8448q7474j325072J581302O32661
3704a6148354k39147J651236j293155O75242K486420j391299K83182j033315l43818
3695a5353008j759583J086105j037895j079449K23497J297366k24108L86070P80040r73472
3685a6654437R57689J278258k215652j204995K517091o12393m34371L324032R5092n05923
3675a3455609O84308j770281J22065j500963r58224j302103j716537j412528L021885
3666a8287987k830820K816181k29983O19486j040639J068779K81144j949587L05915L87696
3656a8859815j56829M03508K86013n52779J139008K843828k844279j295406j906395O64635
$$ y = [-20618202, -20352617, -20115404, -19559128, -20552915, -20733067, -20098496, -21534540, -18478933, -18554787, -19206847, -21569357, -20266016, -17988822, -18716883, -17008219, -16949771, -17037245, -18362317, -16781015, -16148354, -16387501, -14736265, -16029420, -15354178, -12867758, -14259057, -13975875, -15009190, -15353008, -17112591, -16026486, -17064381, -18143830, -17920333, -16622967, -16847075, -16461005, -15680965, -16654437, -15696748, -14418490, -16634142, -17839137, -15322046, -15934439, -16368810, -13044778, -12949686, -13455609, -12771301, -14541582, -14419517, -15920480, -16878704, -18180807, -19897344, -21309872, -18287987, -21118807, -18302626, -18532609, -17913123, -18953762, -17884983, -17603839, -19553426, -19247511, -18859815, -19016644, -18613136, -18327123, -18879902, -17740894, -14897066, -17741345, -19036751, -20943146, -20278511]
3646b0278511N57246L42991j196781L19631j053388J812702l71854k026574J214793K38029
3636b0441716p42025M9700O61478N7421J95174j320742m54792P487180m544256j241179
3626b0293757j174648J51207R14945J34543m73841k285657L14014q38793J38213J504164
3616b1909610q5917p6723N44302N75566l109848J288462Q79373M49810J689799j05622
3606a9860408j88971j511199j470795q24364L753803j088227J51632l29965J227320r81994
3596b1123168j52240J54576n13924R1749J06076r98653K67465P37068q53752M35569N82111
3585b1267123O27553Q97938k742921j79269l72956J9700J043069J568820k34816L5743
3575b0604262p50123m45770j176297o30324N05637N5925J131533p91007P28040K6686
$$ y = [-20278511, -19721265, -19378274, -20575055, -20255424, -21308812, -19496110, -19867964, -21894538, -20679745, -20441716, -21183741, -21134041, -20472563, -20415142, -20219968, -21540710, -21995502, -14508322, -19052578, -20293757, -21468405, -21317198, -20402253, -20267710, -20741551, -23027208, -22713194, -23551987, -23413774, -21909610, -21995527, -22072250, -21527948, -20952382, -24062230, -22773768, -21894395, -21444585, -19754786, -19860408, -20049379, -21560578, -23031373, -23855737, -20101934, -21190161, -21038529, -21368494, -20141174, -21123168, -21275408, -21120832, -21634756, -21543007, -21436931, -22435584, -22168119, -21431051, -22284803, -21849234, -21267123, -20639570, -19741632, -22484553, -22663822, -23036778, -23017078, -21974009, -20405189, -20640005, -20604262, -21354385, -21800155, -22976452, -23606776, -23101139, -23045214, -21913681, -22704688, -21976648, -21949962]
3565b1949962N39639m43101L76914k787070J316241K72160O16246k25345M87492M68904
3555b1327882L2793Q66132k14561K70077m2422o78930o52631j572480k4147J755534K37525
3544b1350992o85354n36862L004758j240072j150223J782109j079053j918208K57880
3535b2916017Q18785L64933k97693m90622J515432j686712j32139N10715k5414j166907
3525b3505639k81258J906038o38830j316688L49977Q94791P28004J606366k47558j048675
3515b1553472j416568L9546K007654k750047M33064N06062j887262k77366j521953M823650
3505b1596692j868791J48988J000681k995072K838960k234894Q918829k359379l137506
3496b1284876j98091j68785K66389q5791r54160j437401J082658K49710r99050L088336
$$ y = [-21949962, -21410323, -21853424, -21476510, -24263580, -22947339, -22675179, -22058933, -22284278, -21796786, -21327882, -21295089, -20428957, -20643518, -20373441, -20415863, -21094793, -21747424, -23319904, -23344051, -21588517, -21350992, -22036346, -22573208, -19568450, -20808522, -21958745, -20176636, -21255689, -23173897, -22916017, -22097232, -21732299, -22029992, -22520614, -21005182, -22691894, -22824033, -22313318, -22338732, -23505639, -23786897, -21880859, -22519689, -23836377, -23486400, -22591609, -21863605, -20257239, -20504797, -21553472, -22970040, -22930494, -20922840, -23672887, -23239823, -22733761, -24621023, -24898389, -26420342, -21596692, -23465483, -23316495, -22315814, -25310886, -22471926, -24706820, -15787991, -18147370, -21284876, -21482967, -21651752, -21385363, -21471154, -22425314, -23862715, -22780057, -22530347, -23529397, -20441061]
3486b0441061j139200O46775o171203K952683M64697k20300J895089j177394j41735J47092
3476b3184557n6809j93517J73732k31245J101251l31503K93897O71108Q53261j057671
3466b1962053k171717j299339J846762J031205K141240l805278J280193j503211O37167
3457b3805031k18698L49903o97008J407737j28379P5701P65051N12077j965047j35629
3447b3839323n3488R83907j056205l1660o0069J44684O04280K36628n35312j45193j266238
3436b5017989J376299K125862J38775k844014R88178k992j05685o94091n8663O6100L47784
3425b3680436r90775L125127L68120n41090k71516n55270n95853n16186o7264l30185
3415b4055328J220398l8433j718806J972917j211028l48808j60506N07952J379622j193424
$$ y = [-20441061, -21580261, -20933486, -27104689, -24152006, -23687309, -23907609, -22012520, -23189914, -23331649, -23184557, -23241366, -23434883, -23261151, -23492396, -22391145, -22722648, -22428751, -21757643, -20904382, -21962053, -24133770, -25433109, -23586347, -22555142, -20413902, -24219180, -22938987, -24442198, -23805031, -24023729, -23673826, -24370834, -22963097, -23091476, -23015775, -22250724, -21738647, -23703694, -23839323, -23892811, -22908904, -23965109, -23996769, -24056838, -23912154, -23307874, -23071246, -23606558, -23751751, -25017989, -23641690, -21515828, -21377053, -24221067, -23232889, -23235881, -23341566, -24035657, -24094320, -24028220, -23680436, -24671211, -21546084, -21177964, -21719054, -21990570, -22545840, -23141693, -23657879, -23725143, -24055328, -22834930, -22873363, -24592169, -22619252, -23830280, -24179088, -24339594, -23831642, -22452020, -23645444]
3405b3645444j62133q48638O36197N43188J10426o0056K358658k335785J57666M74164
3395b2771757L56150p02408J99104j58100k16693m40459k59204J19181Q3320J662269
3385b2128597j449419o62110Q5781J021672K1410j187333k50421K45678R15495m37977
3375b3825821j223420J704993J287110p11593K82328j591354L74574r34564J684898
3366b2952849j753724N63346r4772J29354K378749q91729l22028j431284m19610n8812
3356b4853359K176482k192627k04706J761710k734074J113710J763756j427281J51705
3347b4444684l31538o2146J930373j659446L98823Q60203R76211n74328j511077j859533
3337b6277142L371497k206440R29102J41803J6295L63031m66746k88871O15595J545155
$$ y = [-23645444, -23807577, -24656215, -24020018, -23476830, -23366404, -23426460, -21067802, -23403587, -23245921, -22771757, -22415607, -23118015, -22918911, -23077011, -23293704, -23734163, -23993367, -23874186, -23790866, -22128597, -23578016, -24240126, -24154345, -23132673, -23111263, -24298596, -24549017, -24303339, -23387844, -23825821, -25049241, -23344248, -22057138, -22768731, -22486403, -24077757, -23703183, -24637747, -22952849, -24706573, -24143227, -24237999, -24108645, -21729896, -22621625, -22943653, -24374937, -24794547, -24853359, -22676877, -24869504, -25074210, -23312500, -26046574, -24932864, -23169108, -24596389, -24444684, -24776222, -24838368, -22907995, -24567441, -24168618, -23308415, -22332204, -22906532, -24417609, -26277142, -22905645, -25112085, -24182983, -24041180, -24024885, -23661854, -24128600, -24417471, -23801876, -22256721]
3327b2256721j073180l99653K68520j76803R51661j290690n67421m79652O63640j72597
3317b4532896m17650M94650j7927q26051N31566n66736J302189l14299j521378P47243
3307b5121289L23436J08285M97093P41503j916657J425238K79940k262792l67077O45099
3297b5647221M08057P07285J466682r79389J505053J13937M76870k250294L327277m816150
3287b5687893J996353j656541R58003j87664n64389J320436l91715Q69192Q94964k838021
3277b5287275K032260j481363K06241P19424K281j98892k92101o39533R01482k73262
3267b4310738l05140m30619L16646n28489l75827L96245J06372J971899j075082N27157
3257b3707576j309011J949101P2510j040228R25653Q2282k51017k823927P10749R25110
$$ y = [-22256721, -23329901, -23729554, -23461034, -23637837, -22686176, -23976866, -24544287, -25023939, -24360299, -24532896, -24950546, -24455896, -24473823, -25299874, -24768308, -25335044, -24032855, -24347154, -25868532, -25121289, -24797853, -24689568, -24192475, -23450972, -25367629, -23942391, -23662451, -25925243, -26292320, -25647221, -25239164, -24531879, -23065197, -24044586, -22539533, -22425596, -21948726, -24199020, -20871743, -25687893, -23691540, -25348081, -24390078, -24577742, -25142131, -23821695, -24213410, -23344218, -22449254, -25287275, -23255015, -24736378, -24530137, -23810713, -23808432, -24007324, -24299425, -24938958, -24037476, -24310738, -24615878, -25046497, -24729851, -25258340, -25634167, -25237922, -25131550, -23159651, -24234733, -23707576, -25016587, -23067486, -22994976, -24035204, -23109551, -23027269, -23278286, -26102213, -25391464, -24466354]
3247b4466354l83981r1826J046036N45524o63232J213137r01924k23130k67313n60204
3237b4753267K568105K44053K417693o331432Q00000K96344j35301L51383j628246o35874
3227b6806542k126259O406018m68368K57631j122089P80863J96886j975411K167042
3218b2690229j758075J03675J559780n22159q32038O20377k5911M11173J898492l175155
3208b4410070N6768j426501K306903r54230j283862J776478m16795l51272N13790l3460
3198b4222251l9807J84605O86661K44628m75071p8631J966334j437690r20884m30659
3188b4522765q12835J26689O52853m00865j825918L154793P11131p90387N15819P39994
3178b2451491j150041O21536J094827j190139r00869R9330j205941l41864K16342J99852
$$ y = [-24466354, -24850335, -24942161, -23896125, -23350601, -24013833, -22800696, -23702620, -23925750, -24193063, -24753267, -22185162, -21941109, -19523416, -25854848, -25054848, -24758504, -24893805, -24542422, -26170668, -26806542, -28932801, -22526783, -22995151, -22737520, -23859609, -23078746, -22881860, -24857271, -22690229, -24448304, -24344629, -22784849, -23307008, -24139046, -23518669, -23544580, -23133407, -21234915, -24410070, -24353302, -25779803, -23472900, -24427130, -25710992, -23934514, -24351309, -24702581, -24188791, -24222251, -24262058, -24077453, -23390792, -23146164, -23621235, -23699866, -21733532, -23171222, -24092106, -24522765, -25335600, -25208911, -24556058, -24956923, -26782841, -23628048, -22916917, -23707304, -23191485, -22451491, -23601532, -22979996, -21885169, -23075308, -23976177, -23876847, -25082788, -25424652, -25208310, -25008458]
3168b5008458K067584j600107j746456L046436K91410m49952Q08756J014985l791242
3159b5367044L33758O27965r42762M20284N20647l60476J2005N47811o83658l02286M40526
3148b4753230m94701L82825J422372j381040m59317K74780n90353J429604M12993l42102
3138b4098169N48847k98294j94821l72239O77644p71045J148674L43286j026658j292059
3128b5334834J478935p74336l84316J470393L20520l72629j377173K39822j778340L082954
3118b3429004p43793K58974K939512k262189p0070Q65440m13498j491689j377542J001532
3108b4722327J192186k358020J052982J050046k18867j093006P634R43344j386520N84394
3098b4948154o42555l75138L763673j549580n99963j200953Q20211k98997k540232J645957
$$ y = [-25008458, -22940874, -24540981, -26287437, -23241001, -22949591, -23399543, -22590787, -21575802, -25367044, -25033286, -24405321, -25348083, -24927799, -24407152, -24767628, -24755623, -24207812, -24891470, -25193756, -24753230, -25247931, -24865106, -23442734, -24823774, -25283091, -25008311, -25598664, -24169060, -23756067, -24098169, -23549322, -23847616, -24042437, -24414676, -23737032, -24508077, -23359403, -23016117, -24042775, -25334834, -23855899, -24630235, -25014551, -23544158, -23223638, -23596267, -24973440, -24733618, -26511958, -23429004, -24172797, -23913823, -20974311, -23236500, -23306570, -22441130, -22854628, -24346317, -25723859, -24722327, -23530141, -25888161, -24835179, -23785133, -24004000, -25097006, -25089372, -24146028, -25532548, -24948154, -25590709, -25965847, -22202174, -23751754, -24351717, -25552670, -24732459, -25031456, -27571688, -25925731]
3088b5925731O95983P8848M48767N74962m51560j197512R82774K449270q79755j960009
3078b5183963j067023K45448J499289N77295M95062M15774o76408Q65609m36121k069094
3068b5334132Q37557J309210l194051j156768K66293K61908L705581k905859J291077
3059b4919184J604446k626807N50017n62956P19532J281893j847141M62666n00273L18590
3049b5519217N24602J032433M14501k756046N96494J663994M19706k456818J770942O71640
3039b3637769N57033j651288j017862J940907j040635K85186J347336j461536R61467
3030b3717161m51889J80260N0504j599089J054588R99226k521802k261955O87545J692888
3020b5886885n09728J761741L16357J2879L98455k778223O30354J994269j166411l043997
$$ y = [-25925731, -25229748, -25150900, -24702133, -24127171, -24578731, -25776243, -24793469, -22344199, -23223954, -25183963, -26250986, -26005538, -24506249, -23928954, -23433892, -23018118, -23694526, -22828917, -23265038, -25334132, -24496575, -23187365, -26381416, -27538184, -27271891, -27009983, -23304402, -26210261, -24919184, -23314738, -25941545, -25391528, -25954484, -25234952, -23953059, -25800200, -25337534, -25837807, -25519217, -24994615, -23962182, -23547681, -26303727, -25707233, -24043239, -23623533, -26080351, -24309409, -23637769, -23080736, -24732024, -25749886, -23808979, -24849614, -24564428, -23217092, -24678628, -23717161, -24169050, -23988790, -23938286, -25537375, -24482787, -23483561, -26005363, -28267318, -27579773, -25886885, -26396613, -24634872, -24318515, -24305636, -23907181, -26685404, -26055050, -24060781, -25227192, -28271189]
3010b8271189O30044K382057n71718O51460n57867J120280k19472L82868j128787J235754
3000b4346570j765620r2352J317923K49094J041815N684J5868j981325k72241J307788
2990b4519936J463566k744458J859035j255810O72793K71520k13299k34066K23106J142796
2980b3334753p74482m53221k022311L49642K459017J790633n29450j208108P8202j807562
2970b5452393l175606K812217k92697J957921r15463O3797j484296P75263L00434Q10842
2960b4599981q03665N07790j163493M310544l642167j410471K211673k120067J540720
2951b5169117o48229K252062m76479j196091O49089j072125K016564j527989k94931M22625
2941b5044621N3470P71236o07067j149385j619857Q93496J422518n21995K592891j990851
$$ y = [-28271189, -27641145, -25259088, -25830806, -25179346, -25737213, -24616933, -24836405, -24453537, -25582324, -24346570, -26112190, -26204542, -24886619, -24637525, -23595710, -23590026, -23574158, -25555483, -25827724, -24519936, -23056370, -25800828, -23941793, -25197603, -24524810, -24253290, -24466589, -24700655, -24477549, -23334753, -24109235, -24562456, -26584767, -26235125, -23776108, -21985475, -22514925, -23723033, -23644831, -25452393, -28627999, -25815782, -26108479, -24150558, -25066021, -25002224, -26486520, -25711257, -25410823, -24599981, -25403646, -24895856, -26059349, -21748805, -25390972, -26801443, -24589770, -26709837, -25169117, -25817346, -23565284, -24041763, -25237854, -24588765, -25660890, -23644326, -25172315, -25467246, -25044621, -24991151, -24219915, -24826982, -25976367, -27596224, -26702728, -25280210, -25802205, -23209314, -25200165]
2931b5200165n92416K19922J02827k27329L045041k633238k285764K715277j316903j78835
2921b6351583O88751L8856J002238j586930k674794l77363N544849j812680L37468p68219
2911b5959407L215085n84523k313829K119556N99657j364359J115312k177796J049744
2902b4300560j29374r3979J31036j785962k10815K67746K32666K10284p5265Q16088
2892b4938135j185447R10150j567057P89676J849046k9953J86655j667989q23287O15677
2882b5860664o85604j91801K59749J832937q08594j199296J212675K425438j150698
2873b4165858j261545j62970K372239k273392l49827l22115J187861j003806k69499q76485
2863b7125397K34893P65421R41703N48839L33268k10123N11668m10573M04672R7260L68249
$$ y = [-25200165, -25792581, -25572659, -25469832, -25697161, -22652120, -25285358, -27571122, -24855845, -26172748, -26351583, -25662832, -25623976, -24621738, -26208668, -28883462, -29260825, -23715976, -25528656, -25191188, -25959407, -22744322, -23328845, -25642674, -23523118, -22923461, -24287820, -23172508, -25350304, -24300560, -24429934, -24523913, -24392877, -26178839, -26389654, -26121908, -25889242, -25678958, -25754223, -24938135, -26123582, -25213432, -26780489, -25990813, -24141767, -24171720, -23985065, -25653054, -26476341, -25860664, -26546268, -26738069, -26478320, -24645383, -25453977, -26653273, -25440598, -23015160, -24165858, -25427403, -25590373, -23218134, -25491526, -25841353, -26163468, -24975607, -25979413, -26248912, -27125397, -26890504, -26125083, -25183380, -24634541, -24301273, -24511396, -23999728, -24410301, -24005629, -23908369, -23540120]
2852b3540120k471339J614422K60635q40779j008402j6278J954027Q98023m80508j220475
2842b4850794k3192q35445l624107K289965J514429n897j242180n90452K431582J24853
2832b4811238k39058k314202K210477p14142J019146J81998j338348j15398P84373J261912
2822b4074480n8959l0695k154065K26716R45022q79670m293137J581626L432987k56590
2812b5561245L030252j542963j533727K407978k331884j44135L99263O34656j461267
2803b6103072J054182L92254o62405o78185j291829l52121K639005j695204k08318k23354
2793b7129047J333736O03818m24985J759658k53657j580784r06510j23302m3591r57631
2783b7722295N55242j530923n44269J028480J392932r57039j918147N24712l04056N174117
$$ y = [-23540120, -26011459, -24397037, -24136402, -24977181, -25985583, -26001861, -24047834, -23149811, -23630319, -24850794, -24873986, -25709431, -29333538, -27043573, -25529144, -25535041, -26777221, -27367673, -24936091, -24811238, -25050296, -27364498, -25154021, -25868163, -24849017, -24667019, -26005367, -26120765, -25336392, -24074480, -24133439, -24164134, -26318199, -26091483, -25146461, -26026131, -30319268, -28737642, -25304655, -25561245, -22530993, -24073956, -25607683, -23199705, -25531589, -25675724, -25276461, -24641805, -26103072, -25048890, -24656636, -25319041, -25997226, -27289055, -27641176, -25002171, -26697375, -26905693, -27129047, -25795311, -25191493, -25616478, -23856820, -24110477, -25691261, -26597771, -26721073, -26764664, -27722295, -27167053, -28697976, -29242245, -28213765, -26820833, -27777872, -29696019, -29171307, -29475363, -24301246]
2773b4301246m46835r04220k39320j789011J01218J798597P59017j143730j87482J711505
2763b4641507j595648J935938p49784j692701R50678j638430J720247R56769m89410
2754b5243848j889744J304503j96619Q56074j161152J207218J28163j600186n71659P31628
2744b6435622O43864j535301j919063N99356J884102K943792k76143j049820q93188
2735b6038023J098655l37618j653290P0076J458285n27071j173544l92383r10622L559907
2725b4845628j131391Q17671J401766r15874N86074O1036k19653j257910j246924M65050
2715b6285783Q33875k119269R33092p47726N01112J18989J579477p67566J859195n02283
2705b4596887N17738j08258p07334O55807j194570K39391Q45739j917236p31709p35547
$$ y = [-24301246, -24748081, -25652301, -25891621, -27680632, -27579414, -25780817, -25021800, -26165530, -26353012, -24641507, -26237155, -24301217, -25051001, -26743702, -25793024, -27431454, -25711207, -24754438, -25243848, -27133592, -25829089, -26025708, -25169634, -26330786, -25123568, -24995405, -26595591, -27167250, -26435622, -25791758, -27327059, -29246122, -28646766, -26762664, -23818872, -24095015, -25144835, -26038023, -24939368, -25276986, -26930276, -26860200, -25401915, -25928986, -27102530, -27494913, -28405535, -24845628, -25977019, -25159348, -23757582, -24673456, -24087382, -24026346, -24245999, -25503909, -26750833, -26285783, -25451908, -27571177, -26638085, -27385811, -26884699, -26765710, -25186233, -25953799, -24094604, -24596887, -24079149, -24187407, -24894741, -24238934, -25433504, -25194113, -24348374, -26265610, -26997319, -27732866]
2695b7732866J907275J882968k326598M72570J81065M33745k332479J013152m00315k21691
2685b7123174L96943l85746L086908P22224j499547l177698l25691j70640P1636J46288
2675b8258497J404119p88483M6781N55255J97106Q77978P09226J367323j400648r57414
2665b6247254j311452K173793j118314O60852j002918N76288P20087j299385J616196
2656b5232107j008307p15152K84985j409873R79548J311209o56105J01147j187659p96296
2646b8328610K132701P05508m36450n56541l10879M28066M72264L85385j100977Q30233
2636b5779300j711106J316189L040988k103415j397475O83069K7178k347760J084397
2627b7187235L277643j650682J169026P15525k756434J316751j568292j541561J372366
$$ y = [-27732866, -25825591, -23942623, -26269221, -25796651, -25615586, -25181841, -27514320, -26501168, -26901483, -27123174, -26726231, -27111977, -24025069, -23302845, -24802392, -27980090, -28305781, -28476421, -28404785, -28258497, -26854378, -27642861, -27596080, -27040825, -26843719, -25965741, -25256515, -23889192, -25289840, -26247254, -27558706, -25384913, -26503227, -25842375, -26845293, -26269005, -25548918, -26848303, -25232107, -26240414, -26955566, -26670581, -28080454, -27100906, -25789697, -26445802, -26344655, -27532314, -28328610, -26195909, -25490401, -25926851, -26483392, -26794271, -26366205, -25893941, -25508556, -26609533, -25779300, -27490406, -26174217, -23133229, -25236644, -26634119, -25951050, -25923872, -28271632, -27187235, -23909592, -25560274, -24391248, -23675723, -26432157, -25115406, -26683698, -28225259, -26852893]
2618b6852893J583149j45690J098345j013307m00071l16502K586724j218052P75756o85211
2608b4587752l585486J277317J093770K65663k03193q45685j043172N05263K144550
2599b4978725j183014k72116Q52545j61276k26413R17660L14252M67930N08234j39438
2589b3900361r1626o52265J305442j163092J367627j423843J62040O20472R28131J395593
2579b1451882J184966j722918K768883j430145K69001j165841j5909l72661J51474j166101
2569b2951133L762k76607p779j159168n25455K67452l08274j919331L280845p0604j002016
2558b4668308K97894j53401N69970o60111Q01437j313547o28124J716084L35740L20659
2548b3381707K1753N04187k155712O8393N35818Q02714j140688N20449J095778J61706
$$ y = [-26852893, -25269744, -25415434, -24317089, -25330396, -25730467, -26046969, -23460245, -24678297, -23902541, -24587752, -28173238, -26895921, -25802151, -25536488, -25739681, -26585366, -27628538, -27123275, -24978725, -26161739, -26433855, -25581310, -25742586, -25968999, -25051339, -24737087, -24269157, -23760923, -23900361, -23991987, -24644252, -23338810, -24501902, -23134275, -24558118, -24396078, -23775606, -22847475, -21451882, -20266916, -21989834, -19220951, -20651096, -20382095, -21547936, -21563845, -21936506, -21785032, -22951133, -22947371, -23223978, -23231757, -24390925, -24916380, -24648928, -24957202, -26876533, -23595688, -23666292, -24668308, -24370414, -24523815, -23953845, -24613956, -23812519, -25126066, -25754190, -24038106, -23702366, -23381707, -23359954, -22855767, -25011479, -24943086, -24407268, -23604554, -24745242, -24224793, -23129015, -22967309]
2538b2967309l48445k62605K347119n74654l219081R15307M29828K893904Q39597j145243
2528b1091582P00852n51657M18146j458062n54622N96508n94437j9353J117745N75163
2518b0861299r01292O2176J372893J184749k843916L17429p08520O88675Q59956M92772
2508b0336377J95675n93320M72882j010802K05025j84891L73371j709002K482156L71201
2498a9734082J140145J439244j69178M13478l741484L31130O42597q84059P83599n39254
2488b0317864k01257J242754M66949Q01468l69215k028303M28464r22819J233103R16889
2478a8749831r39629R93844K446510k083649L95015N49924M52924J637051K130956K199226
2468a0967659R82163j997668N31486J382413o70964k06298N03183l173398k54474J816060
$$ y = [-22967309, -23315754, -23578359, -21231240, -21805894, -25024975, -24109668, -23679840, -20785936, -19946339, -21091582, -20390730, -20942387, -20524241, -21982303, -22536925, -21940417, -22534854, -22554207, -21436462, -20861299, -21762591, -21700415, -20327522, -19142773, -21986689, -21669260, -22377780, -21689105, -20829149, -20336377, -20140702, -20734022, -20261140, -21271942, -21066917, -21251808, -20878437, -22587439, -20105283, -19734082, -18593937, -17154693, -17323871, -16910393, -20651877, -20320747, -19678150, -20562209, -19778610, -20317864, -20519121, -19276367, -18809418, -18007950, -18377165, -20405468, -19977004, -20899823, -19666720, -18749831, -19689460, -18695616, -16249106, -18332755, -17937740, -17387816, -16934892, -15297841, -13166885, -10967659, -9985496, -11983164, -11451678, -10069265, -10740229, -10946527, -10443344, -13616742, -13871216, -12055156]
2458a2055156J209712K644599K686176M55835Q29937m634516k104756j534839j802518
2449a4305526q39163K338542j826009N84875K923312J571595j991487K505757P39916
2440h298188j932200L243982k0337J167433R46419K205206L162925n72622r64691n15788
2430a577861J866573P95378J740559L026506N607353j23158K964358n34224o43733K191308
2420A5313059R02144q86458J988005J760747L006426Q67684J300100R737353R43348
2411C4932408j805133q02788L262357K488016M81250K017788J118010L244445K223825
2402D7160178R264431Q882404K704460K799126K264334R08464l360458O783703O655718
2393H4062360K044530M504894N263645L486056K951663N799724J433754N45382L114025
$$ y = [-12055156, -10845444, -8200845, -5514669, -5058834, -4228897, -8863413, -10968169, -12503008, -14305526, -15144689, -12806147, -14632156, -14047281, -11123969, -9552374, -11543861, -9038104, -8298188, -10230388, -6986406, -7006743, -5839310, -4892891, -2687685, 475240, -97382, -1062073, -1577861, 288712, 1084090, 2824649, 5851155, 11458508, 11335350, 14299708, 13765484, 13121751, 15313059, 16215203, 15328745, 17316750, 19077497, 22083923, 22951607, 24251707, 33989060, 34932408, 33127275, 32324487, 35586844, 38074860, 38556110, 40573898, 41691908, 44936353, 47160178, 56424609, 65307013, 68011473, 70810599, 73074933, 73983397, 70622939, 77406642, 84062360, 86106890, 90611784, 95875429, 99361485, 102313148, 108112872, 109546626, 110092008, 113206033]
2384A13206033k934265m90791M625000L189282L272923O293762M046628M634705M682452
2375A40525729N459982j40731N867944O357484J628537R37587L31613L940353M711053
2366A69619551q94254N661277J1317479J4633704J3195020K6845843M1603619L1515882
2358C13498121L5942382J3877516m175176j5268205j1067748K4508921K4381955L8834611
2350D20532377Q5146413K7990840N5132016M7277520m9335892q4943552j22086921
2343C79712801j30522196j17296137q2641424m8368528k7897080r129770l574125Q975575
2335c0740884J0608784J4852902O557554K437976o79663N506522M705286r964197l884539
2326f00259N90757n213686k068434l154467q569362m431876N24093k905830k502300o26129
$$ y = [113206033, 110271768, 109780977, 114405977, 117595259, 120868182, 127161944, 131208572, 135843277, 140525729, 145985711, 145844980, 151712924, 158070408, 159698945, 160636532, 160968145, 164908498, 169619551, 168725297, 174386574, 185704053, 200337757, 213532777, 240378620, 281982239, 313498121, 349440503, 363318019, 359142843, 343874638, 332806890, 357315811, 381697766, 420532377, 505678790, 533669630, 588801646, 636079166, 586743274, 501799722, 379712801, 249190605, 131894468, 49253044, 884516, -27012564, -36142334, -39716459, -30740884, -20132100, -5279198, 1278356, 3716332, 3036669, 8543191, 13248477, 3284280, -600259, -9502, -5223188, -7291622, -10446089, -19015451, -23447327, -22923234, -25829064, -28331364, -28957493]
2316b8957493M50250K640541K460946K521968o00394K886224R13142k293912j08270
2307b0086998j131616J095453J623404J203141N70238m341111L624031K083896l32227
2298a5691789J36547k773576r78595K068049K238988P87876o482270K657080k068934
2289b0106624q96489k410883K182316M60008J999262J677282K42674k181349J988385
2280a7045418m05028j799115m645060n665420J249643k434347o13549J976620J662734
2271b7718940J420350j6472p91879j003571R50387J322261k69004J572609J520439k20658
2261b3234478J07784q31699o46147n73649K91057j240174q35365J811771n26673k630960
2251b8308533k74896j295313P21597j99140j849121K864417K196017L130089L322152
$$ y = [-28957493, -28507243, -25866702, -23405756, -20883788, -21484182, -18597958, -17684816, -19978728, -20086998, -21218614, -20123161, -18499757, -17296616, -16726378, -21067489, -17443458, -15359562, -15691789, -15555242, -18328818, -19307413, -17239364, -15000376, -14212500, -20694770, -18037690, -20106624, -21003113, -23413996, -21231680, -20771672, -18772410, -17095128, -16852454, -19033803, -17045418, -17450446, -19249561, -23894621, -29560041, -28310398, -30744745, -31358294, -29381674, -27718940, -26298590, -26315062, -27106941, -28110512, -27160125, -25837864, -26106868, -24534259, -23013820, -23234478, -23126694, -23958393, -24604540, -25178189, -24887132, -26127306, -26962671, -25150900, -25677573, -28308533, -28583429, -29878742, -29157145, -29356285, -31205406, -28340989, -26144972, -23014883, -19692731]
2242a9692731l97543k136576l506167o808394o025915N49802R87637J94035N88036O811415
2232b9436401L676728j172413K074148K810419j530770J752959K201719l869603q99799
2223b4393013n56328J294798m51162k27594K038681J123774l66600k825196K767606K34449
2213b1360585L83657l7547K45945j039794j686724M98514J941490J049544j823842o07319
2203b2436661J702031J184878k691826K084849k32855k22206k100816J137438K705215
2194a8869953l46728J191432J059183m652018L628524M705409k622280k03094O70143
2185a5439382q58388J493372J285979K423949r64340J752024J367700M05671J617955
2176f915460K898132l290689J41612j1826O53136M569518Q23169n07119Q04323j676365
$$ y = [-19692731, -20090274, -22226850, -25733017, -32541411, -38567326, -38017524, -37029887, -36835852, -36247816, -29436401, -25759673, -26932086, -24857938, -22047519, -23578289, -21825330, -19623611, -23493214, -24393013, -24949341, -23654543, -24105705, -24333299, -22294618, -21170844, -21537444, -24362640, -21595034, -21360585, -20976928, -21014475, -20768530, -21808324, -23495048, -22996534, -21055044, -20005500, -21829342, -22436661, -20734630, -19549752, -22241578, -20156729, -20389584, -20611790, -22712606, -21575168, -18869953, -19216681, -18025249, -16966066, -21618084, -17989560, -13284151, -15906431, -16109525, -15439382, -16297770, -14804398, -13518419, -11094470, -12058810, -10306786, -8939086, -8533415, -6915460, -4017328, -7308017, -7166405, -7178231, -6525095, -1955577, -1132408, -1639527, -835204, -2511569]
2166b511569K484181n50755K555415r06312K135408M077469n98114r35626R53304K846059
2156I549460J456450P77196l10651M673956Q46297L742040K610537P51304L092324n86047
2146B6602866J55978J991663K596772K153756r14107M441560r60034J659426J392265
2137C9120145m79245K330690K813336j64120M625392P09507Q12637K780680K839434
2128E5388456J906718J357328M020392K018582j51804J266422L2895L531189L524511
2119G2894689K242119K565432Q86715J825001K826876k30763J638076L123502N97425
2110H8369072O71759j56366P28363J307847K555983Q21498J840215K273123M222971R37169
2100A03571634L007860M273698K688460K854301L238479L840815J138448N56831K853131
$$ y = [-2511569, -27388, -578143, 1977272, 1070960, 3206368, 7283837, 6685723, 5750097, 6703401, 9549460, 11005910, 11783106, 11472455, 16146411, 16992708, 20734748, 23345285, 24096589, 27188913, 26602866, 26758844, 28750507, 31347279, 33501035, 32586928, 37028488, 36068454, 37727880, 39120145, 38640900, 40971590, 43784926, 43620806, 48246198, 48955705, 49768342, 52549022, 55388456, 57295174, 58652502, 62672894, 64691476, 64539672, 65806094, 65838989, 69370178, 72894689, 75136808, 77702240, 78588955, 80413956, 83240832, 83010069, 84648145, 87771647, 88369072, 89040831, 88884465, 89612828, 90920675, 93476658, 94298156, 96138371, 98411494, 102634465, 103571634, 106579494, 110853192, 113541652, 116395953, 119634432, 123475247, 124613695, 125170526, 128023657]
2091A28023657J644553K390205K038533K328638J679635L630927L754255N699298L074061
2082A54263762O283785L995089O034094O286406O091813M948142O399827K207064P84205
2073A97294187K70922k357867m674681m437145k835649l788279o448695l229801l041758
2064A66751234k204142q45463p52772Q00232j668876j193569r90995j390737q97102n07907
2054A57099903r11430k063277p78454Q03832j379726j618552J72857j356473l82416
2045A49586264j680363l491845P79684m21354l95403q46607Q50342P62952j55297J472957
2035A46461330m61692J064067k093434M92021p18748j948039P88182j508400q03934O44995
2025A41916348P60283K0394M61825J04119j88447k993698j120960l48404n43788j400852
$$ y = [128023657, 129668210, 132058415, 134096948, 136425586, 138105221, 141736148, 145490403, 151189701, 154263762, 160547547, 164542636, 170576730, 176863136, 182954949, 187903091, 194302918, 196509982, 197294187, 197565109, 195207242, 190532561, 186095416, 183259767, 179471488, 173022793, 169792992, 166751234, 164547092, 163701629, 162948857, 163749089, 162080213, 160886644, 159895649, 158504912, 157607810, 157099903, 156188473, 154125196, 153346742, 154150574, 152770848, 151152296, 151325153, 149968680, 149586264, 147905901, 144414056, 145193740, 144772386, 144376983, 143530376, 144380718, 145143670, 144988373, 146461330, 145999638, 147063705, 144970271, 145462292, 144743544, 142795505, 143583687, 142075287, 141271353, 141916348, 142676631, 142697025, 143158850, 143262969, 143074522, 140080824, 138959864, 138611460, 138067672, 136666820]
2015A36666820J600289l048347j332211N16309J24056k177414R18853R75715P46231N07386
2005A35497687j193907J617673J940244J61709j216625J21441k02502R58186J562333
1996A39246239K010982N308584j598784J170994J057953L111318J729250L799374J689035
1987A57524945M624165K248982M106248L144659L108842J997765O049606J341844J881747
1978A86028803K247091J376243L246774m99187K095168J809468J536479J018346j303770
1969A97555415l248664J154740N443445R418177M757233l359896o338640j1865286
1961A93516524j5776906j3959437j3346987j7185732j3697070j0064574r323898n896237
1953I4265683m939846o061542o554017n238176k342435l044263k177238m993077n569613
$$ y = [136666820, 138267109, 135218762, 133886551, 134402860, 134526916, 132349502, 133268355, 134244070, 134990301, 135497687, 134303780, 135921453, 137861697, 138023406, 136806781, 136928222, 136725720, 137683906, 139246239, 141257221, 146565805, 144967021, 146138015, 147195968, 150307286, 152036536, 155835910, 157524945, 162149110, 164398092, 168504340, 171648999, 174757841, 176755606, 182805212, 184147056, 186028803, 188275894, 189652137, 192898911, 192399724, 194494892, 196304360, 197840839, 198859185, 197555415, 194306751, 195461491, 200904936, 210323113, 215080346, 211720450, 205381810, 193516524, 177739618, 163780181, 150433194, 133247462, 119550392, 109485818, 100161920, 94265683, 89325837, 83264295, 76710278, 71472102, 69129667, 66085404, 63908166, 58915089, 53345476]
1944E3345476m886373j941980n262273m898720n079111l590915q73857m862694l715458
1935A8234095l523332n255057o024184l294662k551419k586021k649447m90327j873490
1926a0013844p86049m093342J470354j182183l84752j408183K33064R29014J632067n20493
1916a4124347Q83409j257524j553645J64595k58806j168632J536882j080621k416754
1907a9275443J281353J984939k75081O29279k194786N73705L37242o73535p23216J177972
1897a7157571m23946M61541k053704k62650k89171j09857j278729J298940J990028j380345
1887a9205464J630226l15942L17097o4224j18182J543338j970888J766628l80194q60200
1877a7657805j287046J059907J767631j466399j404601n15726K40952q61672Q00107l04974
$$ y = [53345476, 48459103, 46517123, 41254850, 36356130, 31277019, 27686104, 26812247, 21949553, 18234095, 14710763, 9455706, 3431522, 136860, -2414559, -5000580, -7650027, -8140354, -10013844, -10799893, -14893235, -13422881, -14605064, -14989816, -16397999, -16164935, -15235921, -13603854, -14124347, -13240938, -14498462, -16052107, -15887512, -16146318, -17314950, -15778068, -16858689, -19275443, -17994090, -16009151, -16284232, -15654953, -17849739, -17276034, -16938792, -17612327, -18335543, -17157571, -17581517, -17119976, -19173680, -19436330, -19725501, -19835358, -21114087, -19815147, -17825119, -19205464, -17575238, -17891180, -17574083, -17638307, -17756489, -16213151, -18184039, -16417411, -16797605, -17657805, -18944851, -17884944, -16117313, -17583712, -18988313, -19504039, -19263087, -20124759, -19324652, -19629626]
1867a9629626L69560m89230N94720q46364j97511k56084K444939j771624L35271M37441
1857a9008508M053299K420416j922116q04445K73376p99542K99487o76377R92035j674463
1847a6846838J197338L219941j830622J906677r61604J468375j446793J798909r8574
1838a1593191j548286K334142r97293O5536P63454Q39139P60616n4461O22028R46718
1828g861598L73595r61986J22289J025919R7043k52242K981304j002959r5639J755731
1818c818543k630424M166225J041281o91563R76017O13998L103962j619717j540600
1809c99364K280607j99788j445417L006122J627868K998663q04303O01644J974363o44134
1799H996261J484333J801193J497718K35713L217101n15632K032464J681131N00935L25062
$$ y = [-19629626, -19260066, -19749296, -19154576, -20000940, -20198451, -20454535, -18009596, -19781220, -19445949, -19008508, -14955209, -12534793, -14456909, -15261354, -14987978, -15787520, -15488033, -16164410, -15172375, -16846838, -15649500, -12429559, -14260181, -12353504, -13315108, -11846733, -13293526, -11494617, -11593191, -13141477, -10807335, -11804628, -11739092, -10975638, -10136499, -9375883, -9430344, -8808316, -7861598, -7488003, -8449989, -8327700, -7301781, -7204738, -7456980, -4475676, -5478635, -5574274, -3818543, -6448967, -2282742, -1241461, -1933024, -957007, -343009, 2760953, 1141236, -399364, 1881243, 1681455, 236038, 3242160, 4870028, 7868691, 7064388, 7666032, 9640395, 8996261, 10480594, 12281787, 13779505, 14015218, 17232319, 16716687, 18749151, 20430282, 20931217, 21256279]
1789B1256279P98509k038048N455313K031784J568433N246534k152884L95746L918529
1780C6480195L441363K766135K953152Q10513M240329K260836J217608J230698L018256
1771E8419085K896045K406707L524380L596511M153236J857159K518031M970161J792261
1762H6133576N594893O501097K863208M381566K726116N250484M401408N390860K894688
1753A26137896N491786M328519N458487L320245Q267817N037946O343616O102469M875416
1744A75364197O002885R345966O265074O736707O986139P159298R103269Q024671Q718429
1735B43706635N698132J0043810Q942837J0649639Q782868O818198Q366446N141676
1727C08150241N614363L289649P206916O382498N442546O296497R857559J0295250
$$ y = [21256279, 22054788, 20016740, 25472053, 27503837, 29072270, 34318804, 32165920, 32561666, 36480195, 39921558, 42687693, 45640845, 46451358, 50691687, 52952523, 54170131, 55400829, 58419085, 61315130, 63721837, 67246217, 70842728, 74995964, 76853123, 79371154, 84341315, 86133576, 91728469, 98229566, 101092774, 105474340, 108200456, 113450940, 117852348, 123243208, 126137896, 131629682, 135958201, 141416688, 144736933, 153004750, 158042696, 164386312, 170488781, 175364197, 181367082, 190713048, 196978122, 203714829, 210700968, 217860266, 226963535, 234988206, 243706635, 249404767, 259448577, 268391414, 279041053, 287823921, 294642119, 303008565, 308150241, 313764604, 317054253, 324261169, 330643667, 336086213, 342382710, 352240269, 362535519]
1719C62535519J1438369J1002833J1729267J4746567O453214J2397301J1273613J1014639
1711D52591322J3491463R306708J3865415R485849R614063P637675L060568K73222j655651
1702E17670634l848642m451112m567605j952027n080925r86725J963296K442128M079876
1693E05268898K222546P115711N474331P483027Q950132R463861Q832712P914942L828878
1684E66555038O204171N462966r48734k233018o103503r257007q897610j5977359j8749823
1675E16055121k0707813k0706668k1763854k0387654j4784611j2658607r343910m784710
1667C90917294m284749j963875q47640O37505K01520j597821N57915k854538l774217
1658C76991394k635113l035688n359382p773760j0989498j1972074j8273833k0922063
$$ y = [362535519, 373973888, 384976721, 396705988, 411452555, 417905769, 430303070, 441576683, 452591322, 466082785, 475389493, 489254908, 498740757, 508354820, 515992495, 519053063, 519326285, 517670634, 513821992, 509370880, 504803275, 502851248, 497770323, 496783598, 498746894, 501189022, 505268898, 507491444, 514607155, 520081486, 527564513, 536514645, 545978506, 554811218, 562726160, 566555038, 572759209, 578222175, 577273441, 575040423, 568936920, 559679913, 550782303, 534804944, 516055121, 495347308, 474640640, 452876786, 432489132, 417704521, 405045914, 395702004, 390917294, 386632545, 384668670, 383821030, 384458535, 384660055, 383062234, 383620149, 380765611, 376991394, 374356281, 371320593, 365961211, 358187451, 347197953, 335225879, 316952046, 296029983]
1650B96029983k1780794k5405219k4142064k1608467j6275032j3751923j0984859n486311
1642A56595314m644242l487792q76737j930834k762715l842915j014259l586935l463501
1633A30985384j320888k484034q87445l588202o376219o507213n553398j0121134r458088
1624H4688763j0809883q689037q139575o597394j376538j335660p49845k272482r853o3661
1614D4644835k85576n56415r42759J89282l207349o24928L60735l578658J451217r27507
1604C6522877n31838l60625n65j737153j256310P74362O06041r70530j346306K337257
1594C4037210L8176K683214k538731K825930P8094J148194k450743J03197P82738M045948
1584D0753227j241486j178402p84755K135303M85543j415150J527635j04722P35192o4352
$$ y = [296029983, 274249189, 248843970, 224701906, 203093439, 186818407, 173066484, 162081625, 156595314, 151951072, 148463280, 147586543, 145655709, 142892994, 139050079, 138035820, 134448885, 130985384, 129664496, 127180462, 126293017, 122704815, 116328596, 109821383, 104267985, 94146851, 84688763, 73878880, 65189843, 57050268, 50452874, 49076336, 47740676, 46990831, 44718349, 44708496, 44644835, 44359259, 43802844, 42860085, 43049367, 39842018, 39217090, 39577825, 35999167, 37450384, 36522877, 35991039, 35630414, 35629849, 33892696, 32636386, 33410748, 34016789, 33046259, 31699953, 34037210, 34075386, 36758600, 34219869, 37045799, 37123893, 38272087, 35821344, 35924541, 36707279, 40753227, 39511741, 38333339, 37548584, 39683887, 40169430, 38754280, 40281915, 40177193, 40912385, 40848033]
1574D0848033K268238j885546J980661J642277j305782K618188R46498J782671J254342
1565E0149580J510710J364478J190565J389935j34261L489426K375292j50348r34394
1556F0250983K135187P91520M151169L239648M17412L405148K136258J478150K358738
1547H0364213J834765J502000Q43669J847617M553695J196989K747692M571471J473972
1538A00936083K110791L081466M144390J128740O632643O159708J395065M267638L335039
1529A33191563N629404M564183M385999L721544L553258N496539M817451K584051N637722
1520A73581714N564044M593992N982999O367554O276761O195046Q092034P607959Q150680
1511B32412783N815205Q904665P394090Q898109N76987R183870R741175R083613P150933
$$ y = [40848033, 43116271, 41230725, 43211386, 44853663, 43547881, 46166069, 47112567, 48895238, 50149580, 51660290, 53024768, 54215333, 55605268, 55471007, 58960433, 61335725, 61185377, 60250983, 62386170, 63177690, 67328859, 70568507, 70985919, 74391067, 76527325, 78005475, 80364213, 82198978, 83700978, 84544647, 86392264, 90945959, 92142948, 94890640, 99462111, 100936083, 103046874, 106128340, 110272730, 111401470, 118034113, 124193821, 125588886, 129856524, 133191563, 138820967, 143385150, 147771149, 151492693, 155045951, 160542490, 165359941, 167943992, 173581714, 179145758, 183739750, 189722749, 196090303, 202367064, 208562110, 216654144, 224262103, 232412783, 238227988, 247132653, 254526743, 263424852, 264001839, 273185709, 282926884, 292010497, 299161430]
1502B99161430R434346R963594J1849965R080456J1074046J1213268J0339269J1707289
1494C83823663J1478153J0025696J0123822J4497936J0238786J3923401J2299562J6602990
1486D83014009J4726942J3081792J6953531J5091016J2370564J8585642J1420695J6375172
1478F01619363J5244023J9577796J8922905K0317999J7993347J8976413K2337614K3432871
1470G58422331K2814188K2835359J9674317K4734965K0154452K0420007J8740045J9616185
1462I27411849J4541633J8623027K1073572K1950021K2192498J8724556K0433935J9953166
1454A084904257J7568986K2477083K3637422K5920032K7248080K8349193K7354494
1447A257459547L0055563L0804805K6134266K7558299K5346540K3400496K0436733
$$ y = [299161430, 308595776, 318559370, 330409335, 339489791, 350563837, 361777105, 372116374, 383823663, 395301816, 405327512, 415451334, 429949270, 440188056, 454111457, 466411019, 483014009, 497740951, 510822743, 527776274, 542867290, 555237854, 573823496, 585244191, 601619363, 616863386, 636441182, 655364087, 675682086, 693675433, 712651846, 734989460, 758422331, 781236519, 804071878, 823746195, 848481160, 868635612, 889055619, 907795664, 927411849, 941953482, 960576509, 981650081, 1003600102, 1025792600, 1044517156, 1064951091, 1084904257, 1102473243, 1124950326, 1148587748, 1174507780, 1201755860, 1230105053, 1257459547, 1287515110, 1318319915, 1344454181, 1372012480, 1397359020, 1420759516, 1441196249]
1440A441196249K3992920K2622965K3039607K4033048K2828818K2417209K1146746
1433A601277562K0771783K1875397K2095370K3750873K5190415K3305259K0763839
1426A759030498K1824367J8945866K1554126J9367696J6669638J7899978J9398071
1419A894690240J9604570K2559794J9603332K3106209J6191455J6364562J3603761
1412B025723923J3857978Q310813J1601153J4942065K0099832J8990659J7358609J1584754
1404B142469786N013861o292232j7565846k8107206k8316291k9474099k7387831k0657653
1396A989682489j6661340j7335850j7120316j5910737k2147702k1196674k6049161
1389A853260709k6753715k5178960k7015564k3891846j9361496j7664205j4993746p043855
$$ y = [1441196249, 1465189169, 1487812134, 1510851741, 1534884789, 1557713607, 1580130816, 1601277562, 1622049345, 1643924742, 1666020112, 1689770985, 1714961400, 1738266659, 1759030498, 1780854865, 1799800731, 1821354857, 1840722553, 1857392191, 1875292169, 1894690240, 1914294810, 1936854604, 1956457936, 1979564145, 1995755600, 2012120162, 2025723923, 2039581901, 2047892714, 2059493867, 2074435932, 2094535764, 2113526423, 2130885032, 2142469786, 2147483647, 2141191415, 2123625569, 2095518363, 2067202072, 2037727973, 2010340142, 1989682489, 1973021149, 1955685299, 1938564983, 1922654246, 1900506544, 1879309870, 1853260709, 1826506994, 1801328034, 1774312470, 1750420624, 1731059128, 1713394923, 1698401177, 1691357322]
1381A691357322p687193j2347522j7708294k5966003l2066262l8222160m5921134n3126908
1373A458311846n6455108n9449181n9391133o0307007o0176424n9999657o2319669
1366A040213667n7282138n6333962m9761909m8428377l7297148l6599128l5488309
1359G19022696l8693022l5694991l4921933l3845678l8003655l6460388l5852470l5362179
1351D30188380l4743970l1309808l0372984k6388261k1250218j9294008j3983919j4402203
1343B38443009j5620190r993278r753703o129458j0703003q706489q824280o960667
1335A61751941r434869r872147q237725q734389p794351o248086m999597m875008o342179
1326I5213590n056581m463466m197077n435048l730323k763249k992534j910266m102505
$$ y = [1691357322, 1683670129, 1671322607, 1653614313, 1627648310, 1595582048, 1557359888, 1511438754, 1458311846, 1401856738, 1342407557, 1283016424, 1222709417, 1162532993, 1102533336, 1040213667, 982931529, 926597567, 876835658, 828407281, 791110133, 754511005, 719022696, 680329674, 644634683, 609712750, 575867072, 537863417, 501403029, 465550559, 430188380, 395444410, 364134602, 333761618, 307373357, 286123139, 266829131, 252845212, 238443009, 222822819, 212829541, 203075838, 196946380, 186243377, 177536888, 168712608, 161751941, 152317072, 142444925, 134207200, 125472811, 117678460, 111430374, 106430777, 101555769, 95213590, 90157009, 85693543, 81496466, 76061418, 72331095, 69567846, 66575312, 64665046, 60562541]
1317F0562541l202136j386955n930564k178396n642666j587081m589777k920316k371120
1308C0753530n000810m487605l012421l744393l238836k361083k055035m210454o24333
1299B018560j704537q65232k222337o043132o40094N87394l316934L37326j869178R00684
1289a2817480l400647Q79509J007019p93290l860339j944388J639081k341865J97389
1280b1435011n25108k431566r71206k778739m45131n68649L23759l944926m7713j03605
1270c2927895k09237N45749k49235j654896L58626J872463j123176N0124J71632N6940
1260c3108905M12422k58375K68758J774077J125109O38773l51928J086457q54387Q30890
1250b8437109J114419J141146r082j525236N00529J504651J697838L8448r43727J105536
$$ y = [60562541, 57360405, 55973450, 50042886, 47864490, 42221824, 40634743, 36044966, 33124650, 30753530, 25752720, 21265115, 18252694, 14508301, 11269465, 8908382, 6853347, 2642893, 2018560, 314023, -551209, -2773546, -8816678, -9456772, -8869378, -12186312, -11848986, -13718164, -12817480, -16218127, -15338618, -14331599, -15124889, -18985228, -20929616, -19290535, -21632400, -21435011, -21960119, -24391685, -25362891, -28141630, -28586761, -29155410, -28831651, -32776577, -32824290, -32927895, -33137132, -32591383, -32840618, -34495514, -34136888, -32264425, -33387601, -33337477, -33165845, -33108905, -32696483, -32954858, -32686100, -30912023, -29786914, -29148141, -29500069, -28413612, -29267999, -28437109, -27322690, -26181544, -26190626, -27715862, -27215333, -25710682, -24012844, -23974396, -24918123, -23812587]
1240b3812587l65830q3391N068701J358669k582200K92207J064862O35898o37824P64035
1230a8297460j650422K437108j92230K07279j859297K516287J722j666570R84820P98654
1220a6720109K783710n34789j530603J259401J966337n86855R42583j861019J649772
1211a2631572J42273P82245N85590K34339J045035J05218K341849o45996O39255K72156
1201g129608l12086N25601K802020R80699L87031j235892K94314K52991L417387J70827
1191A53284q69301l366366J118655K995560q17045N41792K363762L52043K027365j594713
1181B905036J823923J271132j807097R32775q12214J836067L1081J127570M54963O92127
1171H455363r1029J763486j256223j523133K508227l01099J092628K602484J100028
$$ y = [-23812587, -24178417, -24261808, -19193107, -17834438, -20416638, -20124431, -19059569, -18423671, -19061495, -18297460, -19947882, -17510774, -17703004, -17495725, -19355022, -16838735, -16837013, -18503583, -17518763, -16720109, -13936399, -14471188, -16001791, -14742390, -12776053, -13362908, -12420325, -14281344, -12631572, -12489299, -11707054, -11121464, -10887125, -9842090, -9736872, -7395023, -8041019, -7401764, -7129608, -7441694, -6916093, -4114073, -3133374, -2746343, -3982235, -3687921, -3434930, -17543, 153284, -716017, -4082383, -2963728, 31832, -785213, -243421, 2120341, 2472384, 4499749, 2905036, 4728959, 6000091, 4192994, 5125769, 4313555, 6149622, 6180703, 7308273, 7763236, 8455363, 8364334, 10127820, 8871597, 7348464, 9856691, 9555592, 10648220, 13250704, 14350732]
1162A4350732j707196J414098J857321l140214L00166k584656K386729p9236k98148
1153A2499596j222886O41999L94376K46643k413039K315617r54569J049115J888097j77363
1143A4267586j240946O05567L08563M13165l53126N83164Q43521O25018m94661k523859
1133A3033992K003939Q52811R80032R0816q60992N93143l630963J205206J167350k06943
1123A5228391J79672j260255k12633K537901j76662J0557m6624j778042K989142j229904
1113A6241543r51420J705161q16074O74933k009491l91697L890218j93290j327701P38851
1103A7561033L934557k752301J086774J153290p90364J88596m14164J86789j202280
1094A8951930J017719O17702N68446k230495o769J875684L358747m35668Q28917K903128
$$ y = [14350732, 12643536, 14057634, 15914955, 12774741, 13074907, 10490251, 12876980, 12797744, 12499596, 11276710, 11918709, 12313085, 12559728, 10146689, 12462306, 11507737, 12556852, 14444949, 14267586, 13026640, 13632207, 13940770, 14353935, 14000809, 14583973, 15427494, 16052512, 15557851, 13033992, 15037931, 15890742, 16870774, 16961590, 16100598, 16693741, 13062778, 14267984, 15435334, 15228391, 15408063, 14147808, 13935175, 16473076, 16296414, 16306971, 16260347, 14482305, 17471447, 16241543, 15290123, 16995284, 16179210, 16854143, 14844652, 14452955, 18343173, 18149883, 16822182, 17561033, 21495590, 18743289, 19830063, 20983353, 20192989, 20381585, 19967421, 20154210, 18951930, 19969649, 20587351, 21155797, 18925302, 18918533, 20794217, 24152964, 23717296, 24546213, 27449341]
1084B7449341J22932j363990L57940R80321J93013j346786J775839P06068P84221K409307
1074C2068206n59858J165435J961936r91018q69235K548781j610836N69124R97340K166141
1064C7446016J828876j007948l872709P301773K242276J472354L510893J379566P80568
1055E1081665L450423n50899J518863K37896J913680J022968J277996J210148J428908
1046F2591648L582649L274383K361884K704151j06157j988685K759545R48511k166782
1037G3961147M994425M271061L281205M454831K430270M626497L340101J361127M098961
1028A06819625M736872O861544N181517M132010O448592O668767M793898M083174L227048
1019A52953047N022546L967914Q025230Q569837N903516Q480812M829250J0685517M131040
$$ y = [27449341, 27572273, 26208283, 26566223, 27546544, 27739557, 26392771, 28168610, 28874678, 29658899, 32068206, 31508348, 32673783, 34635719, 33644701, 32775466, 35324247, 33713411, 34282535, 35279875, 37446016, 39274892, 38266944, 34394235, 41696008, 43938284, 45410638, 48921531, 50301097, 51081665, 54532088, 53981189, 55500052, 55737948, 57651628, 58674596, 59952592, 61162740, 62591648, 66174297, 69448680, 71810564, 74514715, 74408558, 72419873, 75179418, 76127929, 73961147, 78955572, 83226633, 86507838, 90962669, 93392939, 98019436, 101359537, 102720664, 106819625, 111556497, 118418041, 123599558, 127731568, 134180160, 140848927, 145642825, 149725999, 152953047, 157975593, 161943507, 169968737, 178538574, 184442090, 192922902, 197752152, 208437669, 212568709]
1010B12568709O542512R008281P360926P803118Q200827R893353P497313J1317372
1002B80192411J5313673R175410M515301Q406790Q414155R795148Q831700Q300620
994C52945208J2557353J1816214J2261356J6179448J5892307J3780015J3630344J1983769
986D61046014Q718697R608440J6430412J3613987R127519K5292269J1994188J7446204
978E73277730J6808060J7044335K0178979J8108286K2521935J9024515K1187144K1482520
970G29633504K1492265K1269125K5777736K3594682K7393545K7487406L0076800K7438507
962I34163570K5770231K3646757J3893752K949326m397813p700700j1484199r555368
954I67285556n162427j452151N004257Q004874J5358881K5408312K5212563K1352716
$$ y = [212568709, 219111221, 228119502, 235480428, 243283546, 251484373, 261377726, 268875039, 280192411, 295506084, 304681494, 309196795, 317603585, 326017740, 335812888, 344644588, 352945208, 365502561, 377318775, 389580131, 405759579, 421651886, 435431901, 449062245, 461046014, 469764711, 479373151, 495803563, 509417550, 518545069, 543837338, 555831526, 573277730, 590085790, 607130125, 627309104, 645417390, 667939325, 686963840, 708150984, 729633504, 751125769, 772394894, 798172630, 821767312, 849160857, 876648263, 906725063, 934163570, 959933801, 983580558, 997474310, 1000423636, 996025823, 988325123, 976840924, 967285556, 962123129, 960670978, 965675235, 973680109, 989038990, 1014447302, 1039659865, 1061012581]
946A061012581Q886555p472441j4956316j0371283J0321356J9848699L7932130N0952160
938A156153441K7663978K8538661J2325157m8770885r1519819j22200010j36202713
931H25987810j23852507r9321613o8900802m5485637k5002615j3938049j438030N194104
923D53242661O679032O474357N200857P44112N2715k330050l186013k700912Q22703q14294
913D64185168n16303r787823j7152797k8765327l3945444m7541262n2205699m9590796
905B24679717m2718789l4018679k5952908j7007821r905043n711273m494681m715234
897H0155289p515850q31454k467222k653174j917494l425186m140571n098276l084415
888D9021647n258653m884816k429784k515637l68996l307879j987139o482382k306198
$$ y = [1061012581, 1069899136, 1062426695, 1047470379, 1037099096, 1047420452, 1067269151, 1105201281, 1156153441, 1183817419, 1212356080, 1224681237, 1175910352, 1084390533, 962190523, 825987810, 702135303, 602813690, 533912888, 488427251, 463424636, 449486587, 448048557, 453242661, 459921693, 466396050, 471596907, 472341019, 472393734, 470063684, 466877671, 464176759, 464999462, 464185168, 463668865, 453881042, 436728245, 407962918, 374017474, 326476212, 274270513, 224679717, 181960928, 147942249, 121989341, 104981520, 95076477, 89365204, 84870523, 80155289, 72639439, 71807985, 69340763, 66687589, 64770095, 61344909, 57204338, 52106062, 49021647, 43762994, 38878178, 36448394, 33932757, 33563761, 30255882, 28268743, 21786361, 19480163]
879A9480163J555979k012151j44684k87119J639608R05066l99118k60105J027188L68126
869B1872953p261137m461309k123608m203812j800151k607715j625941P48120j515672
860b978272J222606M66512m41239j209729j18320j079104r18189j585671j456582p4366
850h172354m25355R11122l506721m70700j286666M813246m839947j916744j938162O88717
840a6143564l838105P69956k469560k080799j084298L042171K370385k52270K323054
831a7363030K420379k306725k856041m843695n357056k233007J366825j19325K509518
822b8782157J945473K066159K312288Q14805M91194J545922R05883J605838j817027O26681
812a8284941k298748K49564o10586J290693N44277Q75410P33281k559254P40595m92580
$$ y = [19480163, 21036142, 19023991, 18879307, 18592188, 20231796, 21136862, 20737744, 20477639, 21504827, 21872953, 14611816, 10150507, 8026899, 3823087, 2022936, -584779, -2210720, -1462600, -2978272, -1755666, -1289154, -1730393, -2940122, -3058442, -4137546, -5055735, -6641406, -8097988, -8172354, -8597709, -7686587, -11193308, -11664008, -12950674, -8137428, -12977375, -14894119, -16832281, -16143564, -19981669, -19211713, -21681273, -23762072, -24846370, -21804199, -19433814, -19686084, -17363030, -14942651, -17249376, -20105417, -24949112, -30306168, -32539175, -31172350, -31291675, -28782157, -26836684, -24770525, -22458237, -21643432, -21152238, -19606316, -18700433, -17094595, -18911622, -18284941, -20583689, -20334125, -20944711, -19654018, -19109741, -18234331, -17501050, -20060304, -19319709, -19812289]
802a9812289l471484j101535J282402Q93539j070102P56356N61250J057570K639028l80192
792a8645457J643460p23171r61828j185116K745150p02775o4826k12337q81322p1913
782a9060135O26744J211706K361447k651799r75524L67997J249083P97841J417280r73554
772a5628914j162151O89432K388420m5995j924189p1499o03138J579954j067719J613465
762a4232334k384067K106047J609128j237455j033832J220328j985081J061104Q97616
753a3978546P96578L55940j573126J967631K09910J463520L88871N38840L8521j14844
743i906705j076339j114830o94728J479238P75206K387852j43658L79681J93525j14651
733g835409M24319q70903j369000L309771j394225K36059n39879P1810K680024l54636
$$ y = [-19812289, -23283773, -24385308, -23102906, -22209367, -23279469, -22523113, -21961863, -20904293, -18265265, -18645457, -17001997, -17725168, -18686996, -19872112, -17126962, -17829737, -17894563, -18106900, -18988222, -19060135, -18433391, -17221685, -14860238, -17512037, -18487561, -18119564, -16870481, -16072640, -14655360, -15628914, -16791065, -16101633, -13713213, -13759208, -15683397, -15754896, -16358034, -14778080, -15845799, -14232334, -16616401, -14510354, -12901226, -14138681, -15172513, -13952185, -15937266, -14876162, -13978546, -13181968, -12826028, -14399154, -12431523, -12221613, -10758093, -10369222, -9830382, -9791861, -9906705, -10983044, -12097874, -12792602, -11313364, -10538158, -8150306, -8293964, -7914283, -7720758, -7835409, -7411090, -8281993, -9650993, -6341222, -7735447, -7499388, -8039267, -7967457, -5287433, -5642069]
723e642069l88542q06213J047352N04146j76363j495616j299370M27872K216984J113519
713d498300j39583j902576J579433Q12045J325820l78629j372108j483209J983699r74956
703e048364O85154k72947l354387J125157j30352N71802n52231R07049N77481j758784
693g250422q93568K57061j53473R39682n0228k91894k537089K868715J95426j486593
683h402383K35514J188048J436128j163251K19331j600227K252995j599473j951833p01006
673a0086157J365480l69226j425129Q96266P02278j740576J375442k75266r52595J206616
663i302867J37017l57095k59316J111470j673058k207800N52280M35915m41831J521769
653a0483516J565831j991812j111282k31259J737745o11046j419531J010546J08512r19083
$$ y = [-5642069, -6030611, -6836824, -5789472, -5285326, -5461689, -6957305, -8256675, -7828803, -5611819, -4498300, -4637883, -6540459, -4961026, -4148981, -2823161, -3201790, -4573898, -6057107, -4073408, -5048364, -4363210, -4636157, -7990544, -6865387, -6995739, -6423937, -6976168, -6069119, -5491638, -7250422, -8143990, -7886929, -8040402, -7100720, -7150948, -7442842, -9979931, -7111216, -6915790, -8402383, -8166869, -6978821, -5542693, -6705944, -6486613, -8086840, -5833845, -7433318, -9385151, -10086157, -8720677, -9089903, -10515032, -9618766, -8916488, -10657064, -9281622, -9556888, -10509483, -9302867, -9165850, -9522945, -9782261, -8670791, -10343849, -12551649, -11999369, -11563454, -12005285, -10483516, -8917685, -10909497, -12020779, -12252038, -10514293, -11125339, -12544870, -11534324, -11425812, -12344895]
643a2344895J525638j455457J578620j425348J945223m65592k51604j018439K19909k4401
633a1716346J968879j578937k47004j460473m60339J805774L6371k092174J146560n05627
623a3103316L93639r699k037590K517622n62785O69871J204221r45173l0145j93976q75938
612a2973269M29515J136809j144017m90675K234540j434098j131470J330176j04143
603a2146632J432430k998135J397103n93602l77169K07000j117789j450018J479524N95979
593a3571309p82626J745558j089400K609221k323822P86304J247507l359867N61105
584a4177329K158904P5210l149247R09481J708856l75270n17013J121253j308888J393710
574a2160333l75643n93753J705965o19558Q52024j055599J626421q35714j552147J473504
$$ y = [-12344895, -10819257, -12274714, -10696094, -12121442, -10176219, -10641811, -10893415, -11911854, -11691945, -11716346, -9747467, -11326404, -11573408, -13033881, -13494220, -11688446, -11652075, -13744249, -12597689, -13103316, -12709677, -12719376, -14756966, -12239344, -12802129, -12132258, -10928037, -11873210, -11903355, -12097331, -12973269, -12543754, -11406945, -12550962, -13041637, -10807097, -12241195, -13372665, -12042489, -12146632, -10714202, -13712337, -12315234, -12908836, -13286005, -13079005, -14196794, -15646812, -14167288, -13571309, -14353935, -12608377, -13697777, -11088556, -13412378, -12626074, -11378567, -14738434, -14177329, -12018425, -11943215, -15092462, -14182981, -12474125, -12849395, -13366408, -12245155, -13554043, -12160333, -12535976, -13129729, -11423764, -12043322, -11191298, -12246897, -10620476, -11456190, -13008337, -11534833]
564a1534833j008156m04224j068341K129815L14745l23629j061605M995444p512503m11204
554a5884491J555856l95663J511413r41773J911565j062070P41161k068647j68281K198680
544a2602250k047032j235827K324723O60364J76426j440802L66673Q20049O00362L95908
534a1981406Q67478j333050K02558j671111q08252K346109j869916L24446J548021n26642
524a2901765j643030J315012N01736k645643O93352K47224q32601M42566M07411L83883
514a4031855j454569l75707K886369j715849P39183k080664J367884K146633k53639m79745
504a3251959Q45257j310161k320165J544852q59716J034907n1530O65491j238401o38223
494a5579648Q0154J42486o31577J223329p96321o09307L01941j297999J124859M76078
$$ y = [-11534833, -12542989, -12947213, -14015554, -11885739, -11570994, -11894623, -12956228, -7960784, -15473287, -15884491, -14328635, -14724298, -13212885, -14154658, -12243093, -13305163, -12564002, -14632649, -14800930, -12602250, -14649282, -15885109, -13560386, -12900022, -12723596, -14164398, -13797725, -12977676, -12377314, -11981406, -11113928, -12446978, -12244420, -13915531, -14723783, -12377674, -14247590, -13923144, -12375123, -12901765, -14544795, -13229783, -12728047, -15373690, -14680338, -14433114, -15265715, -14823149, -14415738, -14031855, -15486424, -15862131, -12975762, -14691611, -13952428, -16033092, -14665208, -12518575, -12772214, -13251959, -12406702, -13716863, -16037028, -14492176, -15351892, -14316985, -14368515, -13703024, -14941425, -15579648, -15499494, -15357008, -15988585, -14765256, -15561577, -16170884, -15868943, -17166942, -16042083, -15566005]
484a5566005N79229p57047j70478J477461J099259p03660j475407J649370M57357j184558
474a4594479r96779l27360m398695N655882j267524Q6326o09470R53327k84461J394711
464a4388522r84463Q83593n41207j329895l84067N41609K061147j152257L92043j070399
454a5972418Q83653R5117p67077L77982L7749j088989q56484K075559L68911j225621
444a6071618k06896j255870J809669J589416j838830L12793l49670q47492j311734J536276
434a6633956J76778R45538J06625n61404N76100N18557j149921n28135K951423p37864
424a4336259n72250j348293o8106n72945Q29240r94781J180258Q21151J321369k7783
414a3768399k593079k111531j009443P232643k826402K36582Q2303k54708L71438j113047
$$ y = [-15566005, -14986776, -15743823, -15914301, -14436840, -13337581, -14041241, -15516648, -13867278, -13409921, -14594479, -15591258, -15918618, -20317313, -14661431, -15928955, -15842629, -16452099, -15498772, -15783233, -14388522, -15372985, -14489392, -15030599, -16360494, -16744561, -16202952, -14141805, -15294062, -14902019, -15972418, -15088765, -14993648, -15760725, -15382743, -15344994, -16433983, -17290467, -15214908, -14845997, -16071618, -16278514, -17534384, -15724715, -14135299, -15974129, -15661336, -16011006, -16858498, -18170232, -16633956, -16457178, -15511640, -15405015, -15966419, -15390319, -14871762, -16021683, -16549818, -13598395, -14336259, -14908509, -16256802, -16324908, -16897853, -16068613, -17063394, -15883136, -15061985, -13740616, -13768399, -16361478, -18473009, -19482452, -12249809, -15076211, -14839629, -14757326, -15012034, -14640596, -15753643]
404a5753643K26526p21324J122342M26483k67587J42043J190284j058512n78193N83118
394a4688463p50506j145778K653366j923751l16791J060628n61246J093835m79569q02137
384a5860412o26877Q791L01754o68548j478661L480141j313099j796046K064547O30984
374a5257426P31206j824987R12446j539872Q06697O79740o67569j535123K780610q73001
364a5787279k235894J445612k51171J678105j986989R26826n294j159397M01440J14550
354a6859491J026569j635095K060281J323292k320268O22161p43162l96053J289310J76124
344a5456332l56212M27416n75662P2731j662848J832756q37935q41040j034352K137506
334a6293972J319828J683542j025889k011896l75626j164328L301622k114857n76792
$$ y = [-15753643, -15527117, -16248441, -15126099, -14699616, -14967203, -14825160, -13634876, -14693388, -15271581, -14688463, -15438969, -16584747, -13931381, -15855132, -16171923, -15111295, -15672541, -14578706, -15058275, -15860412, -16487289, -16478498, -16176744, -16845292, -18323953, -14843812, -16156911, -17952957, -15888410, -15257426, -14526220, -16351207, -15438761, -16978633, -16171936, -15492196, -16159765, -17694888, -14914278, -15787279, -18023173, -16577561, -16828732, -15150627, -17137616, -16210790, -16216084, -17375481, -16974041, -16859491, -15832922, -17468017, -15407736, -14084444, -16404712, -15782551, -16525713, -16921766, -15632456, -15456332, -15812544, -15385128, -15960790, -15888059, -17550907, -15718151, -16556086, -17397126, -18431478, -16293972, -14974144, -13290602, -14316491, -16328387, -16704013, -17868341, -14566719, -16681576, -17258368]
325a7258368l07341k74292K532611j116320m54073l32395m34820k220136L496157r77695
315a7346672J035953J330489j859367M21160R94814j254821k388459J247735p34530
306a8553698J294876J166588Q08736j665288o46074J245051l03249K997614k308823
297a5964267j117442M96790p12747K586526k158589R746P63440l070943K588074N82664
287a5996748M18303q39295j264610O08678J133518l245346K494636P4664o19895M81010
277a6755085K770579P80059j132840k421168p70240Q92383k62780k00596J070366M35466
267a5593856k412934r344J752697j514235K210133j892590R58878K99466R20459j183674
257a6465000k26020l61151J967393k023097n38038q64724J347063R465J809238J19082
$$ y = [-17258368, -17565709, -17840001, -15307390, -16423710, -16877783, -17210178, -17644998, -19865134, -16368977, -17346672, -16310719, -14980230, -16839597, -16418437, -15423623, -16678444, -19066903, -17819168, -18553698, -17258822, -16092234, -15283498, -16948786, -17594860, -16349809, -16653058, -13655444, -15964267, -17081709, -16584919, -17297666, -14711140, -16869729, -16859983, -16096543, -19167486, -16579412, -15996748, -15578445, -16417740, -17682350, -17073672, -15940154, -19185500, -16690864, -16616200, -17236095, -16755085, -13984506, -13204447, -14337287, -16758455, -17528695, -16636312, -16899092, -17099688, -16029322, -15593856, -18006790, -18016134, -16263437, -17777672, -15567539, -17460129, -16501251, -16201785, -15281326, -16465000, -16691020, -17052171, -15084778, -17107875, -17645913, -18510637, -17163574, -17154109, -15344871, -15225789]
247a5225789n25042n09027L46583l169069K714671q14769M45338L85969m76953Q29213
237a5998875o74836J316012j422531l5665j322055L61995r21049R60463J751095n15175
227a6500621k625991L72120J838968p32407L77101j321887O76081P98984k102637N449025
217a3771264k031691K78680j454014J560365q80755j005571N57867k481702M855657m68810
207a4841238j010806k81608j411783M96813J239333k231530J711895k91957J38894o08873
197a7090860K33293k709399K026070L84634j257288J462671m936J789240q15911M89918
187a5492568j220235j028809p07258Q21509J91873J591780j226473L105204j331467r00704
177a6197148j059461M82237Q9566j573440j40657L011497Q17489k110218j085698K485993
$$ y = [-15225789, -15750831, -16259858, -15913275, -19082344, -16367673, -17182442, -16737104, -16351135, -16828088, -15998875, -16673711, -15357699, -16780230, -16815895, -18137950, -17775955, -18697004, -17736541, -15985446, -16500621, -19126612, -18754492, -16915524, -17647931, -17270830, -18592717, -17916636, -17117652, -19220289, -13771264, -15802955, -15524275, -16978289, -15417924, -16298679, -17304250, -16746383, -19228085, -14372428, -14841238, -15852044, -16133652, -17545435, -17048622, -15809289, -18040819, -16328924, -16620881, -16481987, -17090860, -16857567, -19566966, -17540896, -17156262, -18413550, -16950879, -16955815, -15166575, -15982486, -15492568, -16712803, -17741612, -18448870, -17627361, -17435488, -15843708, -17070181, -13964977, -15296444, -16197148, -17256609, -16774372, -16684806, -18258246, -18398903, -15387406, -14569917, -16680135, -17765833, -15279840]
167a5279840k12483k234590q8461J453926J323617k448294M95538P40117J140602m10237
157a5520105j39676j5959k0845j827668J413563N14888l27027j924426J091423L04224
147a6451608N0922J878020l022651J500745p07406j527835J743774j385410k77400j4360
137a8213209j397106K266535N99471J126742k180591N1493M73849l61671N060486l589687
127a6163688k45641j35162j62837n95526m501693M455854k484048R46870r38302K112548
117a7711625K518103r92395n86452j403004M83122o22422q79283J50026J784442k40959
107a7500447r34661J459164n89125o07464L96918O80528R59688Q49692j395893o86917
97a7368517M49440p31767j63738R29582p45894j92367M88531J209388j1880k656226
$$ y = [-15279840, -15492323, -17726913, -17815374, -16361448, -15037831, -17486125, -16990587, -16250470, -15109868, -15520105, -15659781, -15675740, -15696585, -17524253, -16110690, -15595802, -15922829, -17847255, -16755832, -16451608, -16400686, -14522666, -17545317, -16044572, -16751978, -18279813, -16536039, -17921449, -18198849, -18213209, -19610315, -17343780, -16744309, -15617567, -17798158, -17746665, -17272816, -17634487, -12574001, -16163688, -16409329, -16544491, -16707328, -17302854, -21804547, -17348693, -19832741, -18885871, -19824173, -17711625, -15193522, -16185917, -16772369, -18175373, -17692251, -18314673, -19193956, -19043930, -17259488, -17500447, -18435108, -16975944, -17565069, -18172533, -17775615, -17095087, -16135399, -15285707, -16681600, -17368517, -16919077, -17650844, -17814582, -16885000, -17630894, -17823261, -17334730, -16125342, -16137222, -18793448]
87a8793448J655391j008164J512565j492111Q0418M29358k24963q66223L74633k22137
77a8554681n03879J611752K409728L58465k577843L494322k992019j827418J567989
68a7013584J653790O80347k973556o43574L9461k59938J488029q47105o79849J501668
58a7054311P18728k96236j524716m40201L932809q59536n58798M122536j613436k046351
48a5619512m25031q61713K7932j141857Q37362m59206K911205q48943k28098L6563j972474
37a7743772J247589P29320r79722p39552r81842J840025r92086q76511J294860k84383
27a7486074L86301j550921J559299l16507J651823n60256k500083J195007j068085J307221
17a7382275O45191J5301q03616k88705m50855K290O40716k089600Q7597J052292K69596
$$ y = [-18793448, -17138057, -18146221, -16633656, -18125767, -18045349, -17615991, -17840954, -18707177, -18332544, -18554681, -19058560, -17446808, -15037080, -14678615, -17256458, -13762136, -16754155, -18581573, -17013584, -15359794, -14679447, -17653003, -18296577, -18257116, -18517054, -17029025, -17876130, -18555979, -17054311, -16335583, -16631819, -18156535, -18596736, -14663927, -15523463, -16082261, -11959725, -13573161, -15619512, -16044543, -16906256, -16878324, -18020181, -17182819, -17642025, -14730820, -15579763, -15807861, -15771298, -17743772, -16496183, -15766863, -16746585, -17486137, -18467979, -16627954, -17620040, -18496551, -17201691, -17486074, -17099773, -18650694, -17091395, -17407902, -15756079, -16316335, -18816418, -17621411, -18689496, -17382275, -16737084, -16721783, -17525399, -17814104, -18264959, -18262669, -17621953, -19711553, -19623956, -18571664, -18302068]
6a8302068o90912j754K6605P39552j485668N76203R03027l732706K687980q96857m88961
-5b0665559L142431j665874J477611j179922q74743J009464J88909J525945p91170j293945
-15a9126853J281464J89010o05450Q99465m12108j438267R79710n2199K064168k717578
-25a8938638K055746j142652k196015L96535J025753P39888J355827q99261m69674L08999
-35a7763492J096095j789069J684441j684774Q16765J478327j883480j124558O65046
-44a8504699j192637N60263m81594j11898J057486L13863J128709Q61077j950355M21095
-54a7898690N31525j289899k92321J083182m108L9637k79620m72864k052491J798056
-64a8837593J291265k129980J787815k182555K237338j340471J421698j366838O64684
$$ y = [-18302068, -18992980, -18994734, -18968129, -18228577, -19714245, -19138042, -18235015, -21967721, -19279741, -20176598, -20665559, -17523128, -19189002, -17711391, -18891313, -19766056, -18756592, -18567683, -17041738, -17832908, -19126853, -17845389, -17656379, -18261829, -17362364, -17774472, -19212739, -18233029, -18285228, -16221060, -18938638, -16882892, -18025544, -20221559, -19825024, -18799271, -18059383, -16703556, -17602817, -18072491, -17763492, -16667397, -18456466, -16772025, -18456799, -17640034, -16161707, -18045187, -19169745, -18504699, -19697336, -19137073, -19618667, -19730565, -18673079, -18359216, -17230507, -16369430, -18319785, -17898690, -17367165, -18657064, -18949385, -17866203, -17870311, -17830674, -18110294, -18583158, -20635649, -18837593, -17546328, -19676308, -17888493, -20071048, -17833710, -19174181, -17752483, -19119321, -18454637]
-73a8454637K65889m14862j414842J638009J861952j124222r21259N82366k04636n55422
-83a8741664J832182r69374j580018N04041J185093p02045J943228j402069J009400
-92a6921226k385121K140979o31653J444360o52453J343952k482887J014213k3067l562988
-102b0715891J827019J064453n47318j798474L153919j169592j174790j407521L91248
-111b0376947J656421J938131k161857l73691J531031l62038m85174J292445j612514
-120a8954193K397162k455944P44620r26966o3934J080033q17654j809360J603715L67073
-130a8835448R68723m33864O60366j208041J694039q54029Q55521j527305j213912j23175
-140b0017125n70303j162365K581919J049835M00497J026271j942527R67911L57232n21746
$$ y = [-18454637, -18188748, -18603610, -20018452, -18380443, -16518491, -17642713, -18563972, -17981606, -18186242, -18741664, -16909482, -17878856, -19458874, -18954833, -17769740, -18471785, -16528557, -17930626, -16921226, -19306347, -17165368, -17797021, -16352661, -17005114, -15661162, -18144049, -17129836, -17152903, -20715891, -18888872, -17824419, -18371737, -20170211, -17016292, -18185884, -19360674, -20768195, -20376947, -18720526, -16782395, -18944252, -19317943, -17786912, -18148950, -18634124, -17341679, -18954193, -16557031, -19012975, -18268355, -19195321, -19259255, -18179222, -18996876, -20806236, -19202521, -18835448, -17866725, -18300589, -17640223, -18848264, -17154225, -18008254, -17152733, -18680038, -19893950, -20017125, -20587428, -21749793, -19167874, -18118039, -17717542, -16691271, -18633798, -17665887, -17308655, -17830401]
-150a7830401r09466J791495J99619k724631l96175j075566R92068l72677J874465J690172
-160a6761097k306512Q72286R99973j403678R23808j521250j01473R62344O32067j272309
-170a8975841l23372j51999J387968m388214Q26994J802909p13447L306769j724353
-179a8952586j335609R58658N39973n44517j77309m522100Q371604j184971m25813m38231
-189a7710901l95457J59061N99783k212949J169710J129303m76540q06568j552462K792508
-199a7304512n00534p13909R14749j44314k22767k085631N5355J282723p88382j982228
-209b1489450L682133j986790K260464Q67519p33026j269107m0316N10395N13290j499017
-219a9183905J721125r99811r64741M09530J771385j132295J284799O88827j65971j425596
$$ y = [-17830401, -18739867, -16948372, -16748753, -19473384, -19869559, -20945125, -19953057, -20325734, -18451269, -16761097, -19067609, -18195323, -17195350, -18599028, -17675220, -19196470, -19297943, -18335599, -17703532, -18975841, -19299213, -19451212, -18063244, -22451458, -21624464, -19821555, -20535002, -17228233, -18952586, -20288195, -19329537, -18789564, -19334081, -19511390, -24033490, -15661886, -16846857, -17272670, -17710901, -18106358, -17947297, -17347514, -19560463, -18390753, -17261450, -17737990, -18544558, -20097020, -17304512, -17805046, -18518955, -17604206, -17748520, -17971287, -20056918, -20001563, -18718840, -19507222, -21489450, -17807317, -19794107, -17533643, -16666124, -17399150, -18668257, -18708573, -18198178, -17684888, -19183905, -17462780, -18462591, -19427332, -19017802, -17246417, -18378712, -17093913, -16405086, -16571057, -17996653]
-229a7996653j286048P71643J911014O63584k211760n58677k187946J549791J449639
-238a7895413N45454j580065J735632L59310R22050m69856j769286m59461l970961K389015
-248b0193581J404423P62025k036651O91490J076421J047803n82906p48865r44868Q17392
-258a8707317k93511l38712L16815m63374J69485L97810j047500L69280J226889p94737
-268a9164872J241166k60226j306533P93160L21063n81918l06954j57639Q76916j223834
-278a9769671P79911J750404r85021k590669J640487J00057L13991Q06881p96421J365374
-288a7384677P49894k38018k675439K901120k184806o80134n69992J100636k7024K609759
-298a6398681j052092r67071M47565j272172L99091O46621P54104q86752j628561R93713
$$ y = [-17996653, -19282701, -18511058, -16600044, -15936460, -18148220, -18706897, -20894843, -19345052, -17895413, -17349959, -18930024, -17194392, -16835082, -15913032, -16382888, -18152174, -18611635, -22582596, -20193581, -18789158, -18027133, -20063784, -19372294, -18295873, -17248070, -17830976, -18579841, -19524709, -18707317, -19000828, -19339540, -19022725, -19486099, -19316614, -18918804, -19966304, -19597024, -18370135, -19164872, -17923706, -18183932, -19490465, -18697305, -18376242, -18958160, -19265114, -19422753, -18545837, -19769671, -18989760, -17239356, -18224377, -20815046, -19174559, -19074502, -18760511, -17953630, -18750051, -17384677, -16634783, -16872801, -19548240, -16647120, -18831926, -19512060, -20082052, -18981416, -19008440, -16398681, -17450773, -18417844, -17970279, -19242451, -18843360, -18196739, -17442635, -18329387, -19957948, -18964235]
-308a8964235j452700J305665j22074P72186m52226Q1738J56499q95267k94611J047546
-318a8817479O84624J47654J92381q14745n20967p57059M59805r01614K044502J059080
-328a7223818j234885L035002J403726m448951j590187l0325J494245r22550j253995
-337b0771738J152622l26350N92324j843191J748313N83877q22911J272165n96198P45608
-347a8265479J38775J491791L88587o94185j943497n35665j145588n91575J51434J272909
-357a9732493K961861j454920l45255j036760l5105O45810j27702R9541j296595J486822
-367a8834796j38844M2428J377757P32279k156105q54011P40046p71318k006631J941149
-377a9928046m58327K990508n44090j427386K670735l959991K249889k81938o9298l58360
$$ y = [-18964235, -20416935, -19111270, -19233344, -18461158, -18913384, -18831646, -18675147, -19570414, -19865025, -18817479, -18132855, -17985201, -17792820, -18607565, -19128532, -19885591, -19425786, -20327400, -18282898, -17223818, -18458703, -15423701, -14019975, -18468926, -20059113, -20089438, -18595193, -19517743, -20771738, -19619116, -19945466, -19353142, -21196333, -19448020, -18864143, -19687054, -18414889, -19011087, -18265479, -18126704, -16634913, -16246326, -16940511, -18884008, -19419673, -20565261, -21156836, -21005402, -19732493, -16770632, -18225552, -18570807, -19607567, -19642672, -18996862, -19124564, -19025023, -20321618, -18834796, -18973640, -18931212, -17553455, -16821176, -18977281, -19831292, -19091246, -19862564, -21869195, -19928046, -20386373, -17395865, -17939955, -19367341, -16696606, -20656597, -18406708, -18688646, -18757944, -19116304]
-387a9116304m30012j67045J193835K07690j933567L83925k463036N99912R97869J302631
-397a9424102J338226k84697K58714k98733j997503J864856L19761j245481J006398n25227
-407a8987788k23226r08107R51244O79402j162021M43092R39404j727178J571816J59696
-417a8263666K41411O52962k779538J808795m64870M12132l367624J889544R55399p52015
-427a9667470J161295J580404k96150k718823J811280l13997k471894P77730J297358
-436a8840267J54924j324439N17992j48908J267298J05740M2291n42858l3943Q77133
-446a7925037j858832K88013j098494l09958J130847l80090o01043J260090J552061
-455a7942443k721415K518124r48413k87483N79033M78534k147456Q80297l49962P65810
$$ y = [-19116304, -19546316, -19713361, -18519526, -18311836, -20245403, -19861478, -22324514, -21724602, -20726733, -19424102, -18085876, -18370573, -18111859, -18410592, -20408095, -18543239, -18223478, -19468959, -18462561, -18987788, -19211014, -20119121, -19167877, -18488475, -19650496, -19207404, -18268000, -19995178, -18423362, -18263666, -18022255, -17369293, -20148831, -18340036, -18804906, -18392774, -21760398, -19870854, -18915455, -19667470, -18506175, -16925771, -17221921, -19940744, -18129464, -18443461, -20915355, -20137625, -18840267, -18685343, -20009782, -19491790, -19640698, -18373400, -18267660, -18225369, -18768227, -18802170, -17925037, -19783869, -19495856, -20594350, -20904308, -19773461, -20153551, -20754594, -19494504, -17942443, -20663858, -18145734, -19094147, -19381630, -18802597, -18324063, -20471519, -19591222, -19941184, -19175374]
-465a9175374j266997K089887q26621j38615j96992O69866M04582j558939j70102O91316
-475a9477989J471886m12673J38486m54756q41315Q05228k70295j95814L83957J015539
-485a7837746k639639L59472J3454M78336k066931J425513L2031n0367k33839J898646
-495a8621070J718496l444135L89295J205910o31372k63595j864962J122997J23924O98732
-505a9565780N40281r09813m67248Q393J001652p96073j45609L91100J950476P6101o76196
-516a8592716J554376p13039n73830O56276r36400p92716O48364j491457l57080K333663
-526a8264559j078656R5329J258449J933912k513444j825281q39492J659665j678000
-535b1252077P13844J009569L80381O11132j099349L96152o44206m49727k13389o13568
$$ y = [-19175374, -20442371, -18352484, -19179105, -19317720, -19514712, -18844846, -18440264, -19999203, -20169305, -19477989, -18006103, -18418776, -18280290, -18735046, -19576361, -18771133, -19041428, -19237242, -18853285, -17837746, -20477385, -20117913, -20104459, -19626123, -21693054, -20267541, -20235510, -20285877, -20519716, -18621070, -16902574, -20346709, -19957414, -18751504, -19382876, -19646471, -21511433, -20388436, -20264512, -19565780, -19025499, -19935312, -20402560, -20394167, -19392515, -20188588, -20334197, -19943097, -17992621, -17916520, -18592716, -17038340, -17751379, -18325209, -17668933, -18605333, -19398049, -18749685, -20241142, -20598222, -18264559, -19343215, -19247886, -17989437, -16055525, -18568969, -20394250, -21233742, -19574077, -21252077, -20538233, -19528664, -19148283, -18537151, -19636500, -19240348, -19884554, -20334281, -20547670, -21161238]
-545b1161238r40527K224054o04892J929817N54703k302618Q29739K376640j522612j18693
-555a8735627M86579k80049j162175j674973K788764q70027p94884R73224J789013k026571
-565a9506726N98342N96203o05770j251427K87375L105328k528708Q57283p70276M7071
-575a9171305L30944J248466m74071j243071J711874j050462J115480k440532j134120
-584b1106797J585268n91684l80289j403685O72057j40108q40782L821010k242549j17658
-594b0745217L1164M091330L86145j416530M30833k359969o16620m28985m91422J666801
-604a9452470j594186J966049J151480O60690j735107J942161l057217k31453J32120
-613b0217933l08470l370030L616175l86271J226316r68362J491462j313362k315056
$$ y = [-21161238, -22101765, -19877711, -20482603, -18552786, -17998083, -20300701, -19470962, -17094322, -18616934, -18735627, -18249048, -18529097, -19691272, -21366245, -18577481, -19447508, -20242392, -19269168, -17480155, -19506726, -18908384, -18312181, -18917951, -20169378, -19882003, -16776675, -19305383, -18448100, -19218376, -19171305, -18840361, -17591895, -18065966, -19309037, -17597163, -18647625, -17532145, -19972677, -21106797, -19521529, -20113213, -20493502, -21897187, -21225130, -21365238, -22206020, -18385010, -20627559, -20745217, -20714053, -16622723, -16236578, -17653108, -17222275, -19582244, -20198864, -20627849, -21119271, -19452470, -21046656, -19080607, -17929127, -17268437, -19003544, -17061383, -20118600, -20350053, -20217933, -20526403, -23896433, -20280258, -20666529, -19440213, -20408575, -18917113, -20230475, -22545531]
-622b2545531Q60061Q46603J344886p33452L62737O79741j149389m33650O78975j224192
-632b1313211N60867J771856J52845j96293L19069k551661K536940J78571q73195o87010
-642b0101222n47009K355278j867354K46384J82563j470730R14637l36650K03389R64097
-652a9456617J308565O3434n02614K72079k789860K84411m24913l82774J975900n13744
-662b0166133j364563K226083j637259J213395J021540O39491r23054o66081J23254N66377
-672a8966950q34075j87483J873594q43037j086112M06004P25894l65100j482443J247603
-682a9512105O59655j403047J069378j023309q66663K04044N46669P96236k57355n51856
-692b0338353r6070l55077m3326P36504J194821j325887K61388j228457K54047q859486
$$ y = [-22545531, -21685470, -20838867, -19493981, -20227433, -19864696, -19184955, -20334344, -20767994, -20089019, -21313211, -20752344, -18980488, -18827643, -19023936, -18704867, -21256528, -18719588, -18541017, -19414212, -20101222, -20648231, -18292953, -20160307, -19913923, -19731360, -21202090, -20287453, -20624103, -20420714, -19456617, -18148052, -18084618, -18587232, -18315153, -21105013, -20820602, -21245515, -21628289, -19652389, -20166133, -21530696, -19304613, -20941872, -19728477, -18706937, -18067446, -18990500, -19656581, -19533327, -18966950, -19801025, -19988508, -18114914, -18957951, -20044063, -19638059, -18912165, -19277265, -20759708, -19512105, -18852450, -20255497, -19186119, -20209428, -21076091, -20872047, -20325378, -19529142, -19786497, -20338353, -20434423, -20789500, -20832826, -20096322, -18901501, -20227388, -19966000, -21194457, -20940410, -29799896]
-702b9799896R302763j162910J953725J192571Q73588j066801m99654j132394j86722
-711b0525730J363901j547827K88517K53346O18950j15556O90260j255213J166100J131151
-721a7932101j915228J077463m44835M45053p35103p05574k704097O03831M45792L140388
-731a8724411m1858L27630k759926O78790q76515K250256R82821k365164o01113R93138
-741b0136352n79197K013598J96041J042164k616884q9311K36855m89184n69146J414939
-751a9576477J929781q70811k048893K360007k163171L42799J13707J952086l419722
-760b1380694J435646p0933N06876J538253L76746k845445O9193q94399Q87374p6604
-770b0453987K019347q1597j219309J342825k83013N37102n38007r10036J90595j54213
$$ y = [-29799896, -20497133, -21660043, -19706318, -18513747, -17640159, -18706960, -19206614, -20339008, -20525730, -19161829, -20709656, -20421139, -20167793, -19548843, -19664399, -18974139, -20229352, -19063252, -17932101, -19847329, -18769866, -19214701, -18769648, -19504751, -20210325, -22914422, -22310591, -21864799, -18724411, -18766269, -18438639, -21198565, -20519775, -21396290, -19146034, -18163213, -20528377, -21129490, -20136352, -20715549, -18701951, -18505910, -17463746, -20080630, -20169941, -19933086, -20422270, -20991416, -19576477, -17646696, -18517507, -20566400, -18206393, -20369564, -20026765, -19913058, -17960972, -21380694, -19945048, -20015981, -19509105, -17970852, -17594106, -20439551, -20370358, -21264757, -20377383, -20453987, -18434640, -18516237, -19735546, -18392721, -18675734, -18138632, -18676639, -19586675, -19396080, -19550293]
-780a9550293j581519J035336j12320O55447N05942q81637J76566n89791P05804j435413
-790b1071878K266791l89430j133318J051383j015368j847947K629418J265322j201467
-799a9446494O08528p37874j627864K178072k68153k66498L68209J498042k483367J547624
-809a8629775j630893j114947n84958p69094K921992p1175K66526l73332M10603Q60365
-819a8714688j505403q4847j704775J20512K421468o12698K98136P87159k028483L34749
-829b0688870j584622K429995p44024q92435J471421Q59935j044971k29979j663020
-838b2086570J654955J310841j345974J107927K02292L02717l32481j134022J956249
-847a8364066k716920J190267K658306k282192j136500j823512J97437K507607j005148
$$ y = [-19550293, -21131812, -20096476, -20208796, -19553349, -19047407, -19929044, -19752478, -20342269, -19636465, -21071878, -18805087, -19194517, -20327835, -19276452, -20291820, -22139767, -19510349, -18245027, -19446494, -18837966, -19575840, -21203704, -19025632, -19293785, -19560283, -19192074, -17694032, -20177399, -18629775, -20260668, -21375615, -21960573, -22729667, -19807675, -19878850, -19612324, -19985656, -19575053, -18714688, -20220091, -20304938, -22009713, -21889201, -19467733, -20080431, -19782295, -18995136, -21023619, -20688870, -22273492, -19843497, -20587521, -21479956, -20008535, -19148600, -20193571, -20423550, -22086570, -20431615, -19120774, -20466748, -19358821, -19156529, -18853812, -19186293, -20320315, -18364066, -21080986, -19890719, -17232413, -19514605, -20651105, -22474617, -22277180, -19769573, -20774721]
-856b0774721k56944l08492O52140K98805k13958J044066p11505o82722j150628J65999
-866b1937960o07547J13151M009571j570832n25050M68833j268337O34746K46280j940
-876b0439085R99385n18008M89279o13439q13583k096465K922756Q91015j032072J717252
-886a8492965k595019L73406m56641J824552J649702k354678j228448K528356p2451j67003
-896a8991189J239951j001242j207198R20239k963522R95109j4631J723589K152343
-905a7146551j463911j454990j728922J55353J129470K473576l14001l255N34988k839587
-915b0657830J61667M6466m21523j74065J537675k68798K30124q4986J441146j476575
-925a9666699j75451p61807J182273j05572Q9492k66596n4571j0620O32715o29764k385689
$$ y = [-20774721, -21031665, -21340157, -20688017, -20389212, -20603170, -19559104, -20270609, -20953331, -22103959, -21937960, -22545507, -22432356, -18422785, -19993617, -20518667, -20049834, -21318171, -20683425, -20437145, -20439085, -19439700, -19957708, -19468429, -20081868, -20895451, -22991916, -20069160, -19178145, -20210217, -18492965, -21087984, -20714578, -21171219, -19346667, -17696965, -20051643, -21280091, -18751735, -18824186, -18991189, -17751238, -18752480, -19959678, -19039439, -22002961, -21007852, -21022483, -19298894, -17146551, -18610462, -20065452, -21794374, -21639021, -20509551, -18035975, -18349976, -18353231, -17818243, -20657830, -20496163, -20449697, -20871220, -21045285, -19507610, -19776408, -19546284, -19631270, -18190124, -19666699, -19842150, -20603957, -19421684, -19527256, -19437764, -19704360, -19758931, -19769551, -19136836, -19766600, -22152289]
-936b2152289q6962J445770n16432N62327j887591K567838Q02459j492502k9787J706026
-946a9081143M90822q59943l55120q27321J512476j018652J040557j562614r7770k08600
-956b0967308q6873p08631m12712J193042J790829k361151O02465j44373Q73424j368161
-966b1589449O59776N37454j622635p38720K214045K370291L5838Q22638P72763k529289
-976a9067288j069139o26658r153J85823K63272M62527M80752j32071o07724o17801K49229
-987b0488231m97553P20060m47223j143236J544045J15103P09859r14790k99535J329552
-997a9371949j206081P42773N32984o03837j632738K642771K7078l19687j080937J95073
-1007b0074550Q71683l552824M499506l9771k23456K117130l211270j124950k11850
$$ y = [-22152289, -22239251, -20793481, -21309913, -20747586, -22635177, -20067339, -19264880, -20757382, -20787169, -19081143, -18590321, -19450264, -19805384, -20632705, -19120229, -20138881, -19098324, -20660938, -20758708, -20967308, -21054181, -21762812, -22175524, -20982482, -19191653, -21552804, -20950339, -21094712, -20221288, -21589449, -20929673, -20392219, -22014854, -22753574, -20539529, -18169238, -18133400, -17310762, -16537999, -19067288, -20136427, -20763085, -20772238, -20586415, -20323143, -19860616, -19379864, -19511935, -20119659, -20737460, -20488231, -20985784, -20265724, -20712947, -21856183, -20312138, -20197035, -19487176, -20401966, -20701501, -19371949, -20578030, -19835257, -19302273, -19906110, -21538848, -18896077, -18868999, -19188686, -20269623, -20074550, -19202867, -22755691, -18256185, -18295956, -18519412, -16402282, -19613552, -20738502, -20950352]
-1016b0950352J002841J980691l660041O14916J231222q75033J864038j437582Q08686
-1025a9420614J161917n4225q04880k666097P78579J30535j29558Q6780L25092J299503
-1035a9292968k458263r34217P14743J550196j61665k601673K420387L41614M07522
-1044b0014324j508155K430398j999290o12551O82013j221190J159924j18861K300377
-1053a8901659j602194j66065J530544n24551J705902l539560j357995L631810j052123
-1062b0275891r57136K778952k108517o51604J026336k49109J473241n92839M84393
-1071a9072174j152437J50596j495495L018399m79588j515686J81447M62609N98918l16212
-1081a9619623O70514L08782j203463j217797r90348K96372J042382J215446j985152
$$ y = [-20950352, -19947511, -17966820, -21626861, -21011945, -19780723, -20655756, -18791718, -20229300, -19420614, -18258697, -18312922, -19117802, -21783899, -21005320, -20874785, -21004343, -20917563, -20592471, -19292968, -21751231, -22685448, -21970705, -20420509, -20582174, -23183847, -20763460, -20421846, -20014324, -21522479, -19092081, -21091371, -21703922, -21021909, -22243099, -21083175, -21202036, -18901659, -20503853, -20669918, -19139374, -19663925, -17958023, -21497583, -22855578, -19223768, -20275891, -21233027, -18454075, -20562592, -21214196, -20187860, -20436969, -18963728, -19556567, -19072174, -20224611, -20074015, -21569510, -18551111, -19030699, -20546385, -20364938, -19902329, -19303411, -19619623, -18949109, -18640327, -19843790, -21061587, -22051935, -21755563, -20713181, -19497735, -21482887]
-1090b1482887J751223O27898R27327o57636n92464m90607j74085j685268k792099J431129
-1100b3137469J042078P91924J065299k11871j94642j001864K693485p80019N43041
-1109a9190038J155013k779604K61408j730105r34406K817866j41345M87387L95133
-1118a9658691K237703j014707j288478j800188R24673J88425L94880q88131r13792J68085
-1128b1650221n6148P31752k6537J303705j320820N58299l58817L88895J777580j689744
-1138b0342056j857175J414663L05470k110634L19124J564826K29217l19758J385344
-1147a9410979l96297j915328M32492Q62244K195670j857663J88562m79372k330503N05755
-1157b2205419J863525j393062M14801r15489L756041l46438j782628M49271n89977P86440
$$ y = [-21482887, -19731664, -19103766, -18176439, -18834075, -19426539, -19917146, -20091231, -21776499, -24568598, -23137469, -22095391, -21303467, -20238168, -20450039, -20644681, -21646545, -18953060, -19733079, -19190038, -18035025, -20814629, -20553221, -22283326, -23217732, -20399866, -20541211, -20053824, -19658691, -17420988, -18435695, -19724173, -21524361, -20599688, -20411263, -20016383, -20904514, -21818306, -21650221, -21706369, -20974617, -21001154, -19697449, -21018269, -20459970, -20818787, -20429892, -18652312, -20342056, -22199231, -20784568, -20479098, -22589732, -22270608, -20705782, -20476565, -20796323, -19410979, -19807276, -21722604, -21290112, -20427868, -18232198, -20089861, -19901299, -20380671, -22711174, -22205419, -20341894, -21734956, -21320155, -22235644, -18479603, -18826041, -20608669, -20159398, -20749375, -19962935]
-1167a9962935l19914q36173K453620j685890J976476k560005k50381N24744R4553j13671
-1177b0679576k335710L218266j491545O03819N62526J159525J405004q195j190867r52354
-1187a9709107j301982R67783r56825k40422O54253R3331J285456j751593j034768J928129
-1197b0065745j274115J459960o90299k487800Q65552N58749R69356J99808R82396K05428
-1207a9276710p94692j824067K108828j816477M24841l51069Q97411j326514J782502
-1216b0175947n34808J115889k755314M67503Q57281J193319k183947K587797j644139
-1225b1072366K375946j880362J310359J520513j555275L09195j761593j120134P74593
-1234b1099124M56466J670266l47793q25385p91010l280222M824411p05926J647763
$$ y = [-19962935, -20282849, -21119022, -18665402, -20351292, -18374816, -20934821, -21185202, -20660458, -20565905, -20679576, -23015286, -19797020, -21288565, -20684746, -20122220, -18962695, -17557691, -17565886, -18756753, -19709107, -21011089, -20043306, -21000131, -21240553, -20586300, -20492969, -19207513, -20959106, -21993874, -20065745, -21339860, -19879900, -20570199, -23057999, -22192447, -21633698, -20664342, -20464534, -19482138, -19276710, -20071402, -21895469, -19786641, -21603118, -21178277, -21529346, -20631935, -21958449, -20175947, -20710755, -19594866, -22350180, -21882677, -21025396, -19832077, -22016024, -19428227, -21072366, -18696420, -20576782, -19266423, -17745910, -19301185, -18991990, -20753583, -21873717, -21099124, -20642658, -18972392, -19320185, -20145570, -20936580, -24216802, -19392391, -20098317, -18450554]
-1243a8450554j877421j450608J920364p69185M05304o55093J083017k80619J225185
-1252a8849610n74990j844817J346506j862766J484525j445064M883759j603496p23643
-1261a9189596k9276j604653k01769q11132M3694J756263j216307L600403l278422p49929
-1271b1680724J089220Q09673j024287J458859K19597m98511j537717J599707j011926
-1280b0576109J27631Q65505j519577J726209n70109j32550L16655j275630R41587j271608
-1290b1367996Q72752J370175K03092n17465j029455K80040M40837j291727Q34767M06468
-1300a9798512J139717k216097M2282J02653p13597O4171K922018l201975p03606K179676
-1310b0183270j218073K037738j023743j261790J990707J189991j951439m86623J250126
$$ y = [-18450554, -20327975, -21778583, -19858219, -20627404, -20222100, -20877193, -19794176, -20074795, -18849610, -19424600, -21269417, -19922911, -21785677, -20301152, -21746216, -16862457, -18465953, -19189596, -19218872, -20823525, -21025294, -21836426, -21792732, -20036469, -21252776, -17652373, -20930795, -21680724, -20591504, -19781831, -20806118, -19347259, -19127662, -19626173, -21163890, -19564183, -20576109, -20448478, -19582973, -21102550, -19376341, -19946450, -20079000, -19762345, -21037975, -20096388, -21367996, -20495244, -19125069, -18921977, -19439442, -20468897, -20188857, -19748020, -21039747, -20204980, -19798512, -18658795, -20874892, -20832610, -20729957, -21443554, -21379383, -18457365, -21659340, -22362946, -20183270, -21401343, -19363605, -20387348, -21649138, -19658431, -18468440, -20419879, -20906502, -19656376]
-1319a9656376j419416q36423N39341R19786k472871J497896K405649k28353J89820
-1328a9060947j125426M7660L33250m50981N68198q79803j185580J620918j069508O20673
-1338b0581546R29560j803073j572675N38028j02022K585141K07053k90221r77899m0871
-1348b1108525J078775j042496M30707j977000J490664r2840J099256j181981j26067
-1357b1429507r28974K266866J77621j78785k03075J413636K89059j007561R16914j425079
-1367b0108885Q9828j132164J724184k309607J39626J379935M32017p78713J159001
-1376a9404778j696946o81921L23381P71942R0549P46623j139065P16473J4249J70926
-1386b0088567N31527j673270N79896K57656J88041j09566j85842J853219k626645R94438
$$ y = [-19656376, -21075792, -21912215, -21372874, -20453088, -22925959, -21428063, -19022414, -19250767, -19060947, -20186373, -20138713, -19805463, -20256444, -19688246, -20568049, -21753629, -20132711, -21202219, -20581546, -19651986, -21455059, -23027734, -22489706, -22591728, -20006587, -19799534, -20089755, -21067654, -21108525, -20029750, -21072246, -20641539, -22618539, -21127875, -21220715, -20121459, -21303440, -21429507, -22358481, -20091615, -19913994, -20092779, -20295854, -18882218, -18593159, -19600720, -18683806, -20108885, -20019057, -21151221, -19427037, -21736644, -21597018, -20217083, -19785066, -20563779, -19404778, -21101724, -21783645, -21460264, -20688322, -20597773, -19851150, -20990215, -20273742, -20259493, -20088567, -19557040, -21230310, -20650414, -20392758, -20204717, -20314283, -20500125, -18646906, -21273551, -20279113]
-1396b0279113J028758r88929P90958q32054k95362p35062L57366P43329k850679K595548
-1406b0465240J74398k036252j834776j6461K712687R22966l23764Q02919J620578K39137
-1416a8203808j337632n29666j554931R24630O64418p3694j886288J840955r95099q81058
-1426b2032173Q12668M6895L48302N12485r47023j82584J1751o41184j269646R086824
-1436a4253685m908099j911943K115667P24961q15539q67006j357768J063886N18545
-1445a9690981l165074J762599K620995k777060o70518J4772K939494q6579k246879
-1454b1299231M185320k532760O1518j596607N39772l41138Q98805o6973j065943J771089
-1464a9446148p49358J18954m39519l1559p48714j256252j728542O992244n44656k180452
$$ y = [-20279113, -19250355, -20239284, -19448326, -20280380, -20575742, -21310804, -20953438, -20210109, -23060788, -20465240, -20290842, -22327094, -24161870, -24178331, -21465644, -20542678, -20866442, -20063523, -18442945, -18203808, -19541440, -20071106, -21626037, -20701407, -20036989, -20110683, -21996971, -20156016, -21151115, -22032173, -21219505, -21172610, -20824308, -20311823, -21258846, -21441430, -21429679, -22070863, -23340509, -14253685, -19161784, -21073727, -18958060, -18233099, -19048638, -19915644, -21273412, -20209526, -19690981, -22856055, -21093456, -18472461, -21249521, -21920039, -21905267, -18965773, -19052352, -21299231, -17113911, -19646671, -19585153, -21181760, -20641988, -20983126, -20084321, -20151294, -21217237, -19446148, -20195506, -20076552, -20516071, -20547630, -21296344, -22552596, -24281138, -17288894, -17833550, -20014002]
-1474b0014002o72855P80173k02096j037783p26107J837568o78149J205492q13678J689241
-1484a8632196k022625k838368J776873R43552J199379j497857m78028J283420J284762
-1493a8981088r39626j835480M65732P31643Q52391l40419k049814J168554r3087J309423
-1503a9711771L11797l386171l52609K9855K570842j35314M78506K35946J47172j248245
-1513b1059992j108893J197318q9358O49731l51434q67358J839018p00116K86658j300
-1523b0205726r68952o78359K034030m23166q17299K244755r54043n28860L341772k908391
-1533a9864239q84245L43695L021602m331194J122070N27064k314569j231390K879346
-1542b0731860J025431j033091L11080N7767n68471K584868O37066j461792j8256r42520
$$ y = [-20014002, -20686857, -19906684, -20108780, -21146563, -21872670, -20035102, -20713251, -19507759, -20321437, -18632196, -20654821, -23493189, -21716316, -20772764, -19573385, -21071242, -21549270, -20265850, -18981088, -19920714, -21756194, -21290462, -20558819, -19706428, -20046847, -22096661, -20928107, -21021194, -19711771, -19399974, -22786145, -23138754, -23108899, -20538057, -20673371, -20194865, -19958919, -19811747, -21059992, -22168885, -20971567, -21060925, -20411194, -20762628, -21629986, -19790968, -20491084, -20204426, -20205726, -21174678, -21853037, -19819007, -20242173, -21059472, -18814717, -19768760, -20297620, -16955848, -19864239, -20748484, -20404789, -17383187, -21714381, -20592311, -20065247, -22379816, -23611206, -20731860, -19706429, -20739520, -20428440, -20370673, -20939144, -18354276, -17717210, -19179002, -19197258, -20139778]
-1552b0139778l50021K103081n847381K699333n41982J185101r66985O58275J07501
-1561b1092856J164050r94755J89797j474619N89017j1201J006249K06899N45316j178015
-1571b1050118K7198J242468J259213J02025p27070j77979k375257J169253l55370L41443
-1581b0544194M54340n51875J67864m04716k052757K616747j18822J763148n49895k001412
-1591b1221572K7524R07127p27661K815970k031077j253402j291192N44479O23261j16099
-1601b1722642J151314j557349K130205k567572K013990m09489k648549O261797n525572
-1610b2873867K554832n19605k18673k40L98652O59570j732149j582801J266754M03900
-1620b1643627J348553k83510m20436J450215R48624o30332k236808J157438R1487j010228
$$ y = [-20139778, -20489799, -18386718, -24234099, -21534766, -22076748, -20891647, -21858632, -21200357, -21092856, -19928806, -20923561, -20733764, -22208383, -21619366, -21630567, -20624318, -20417419, -19872103, -21050118, -21022920, -19780452, -18521239, -18419214, -19146284, -19324263, -21699520, -20530267, -20885637, -20544194, -20089854, -20641729, -20473865, -20878581, -22931338, -20314591, -20433413, -18670265, -19220160, -21221572, -21194048, -20286921, -21014582, -18198612, -20229689, -21483091, -22774283, -22229804, -21606543, -21722642, -20571328, -22128677, -19998472, -22566044, -20552054, -20961543, -23610092, -17348295, -22873867, -20319035, -20838640, -21057313, -21057553, -20658901, -19999331, -21731480, -23314281, -22047527, -21643627, -20295074, -20578584, -20999020, -19548805, -18600181, -19230513, -21467321, -20309883, -20218396, -21228624]
-1630b1228624o75796N95130p8258j105024J36623J422951O79245n15776o48254J471507
-1640a9946276M30363j267962k680639N67631j173049j30816R31218K81794m03820L579659
-1650a9811897J156317Q65103l076871K434131p96192Q9157r49955P04414j075174R23606
-1660a9537361l86729K99575p25278j275428Q48938Q12582J61528j4937j298348K085469
-1670a9029989k133161L38408r84524K030866L35347K46799P58707j835568R1939J307476
-1680a8873700L84582j621515n81606j63317N44823j112482L247215j25071k340681
-1689b0641752J243227m112441K158195R61292N1965l85521m02531p00477K384674K69410
-1699a9173959j145680q17244R48194p07608p00144J689326n55271j909180K211803q43927
$$ y = [-21228624, -21904420, -21309290, -21387548, -22492572, -22355949, -20932998, -20253753, -20769529, -21417783, -19946276, -19515913, -20783875, -23464514, -22896883, -24069932, -24200748, -23269530, -22987736, -23391556, -19811897, -18655580, -17790477, -20867348, -18433217, -19229409, -19140252, -20090207, -19385793, -20460967, -19537361, -19924090, -19624515, -20349793, -21625221, -20776283, -19963701, -19802173, -19817110, -21115458, -19029989, -21163150, -20824742, -21809266, -19778400, -19443053, -19196254, -18437547, -20273115, -20181176, -18873700, -18489118, -20110633, -20692239, -20855556, -20310733, -21423215, -18176000, -18301071, -20641752, -19398525, -23510966, -21352771, -20391479, -20339514, -20725035, -21127566, -21828043, -19443369, -19173959, -20319639, -21136883, -20188689, -20896297, -21596441, -19907115, -20462386, -22371566, -20159763, -21003690]
-1709b1003690j36626n16739R84620j99413J004127N53074J981675j647948j614279
-1718b0595199j087337M78940N85390J36182J515740j979282Q14576J24702j3322j77271
-1728b0196881j39918o47920N9767k236762J808742J075471K3533q49481M88131M85696
-1738b0129622o37174K261315j013654M76075j177256Q37499J312571j452425p92261
-1747b0314932j189390J027705p40680k68322O16530L97374r23761L53257K62505J207580
-1757a9572134p85396L59711q55424K166984k219598J121155L023567j439405k284357
-1766b0484897P82272l57161M46955N30300p34373l79930j718374M89151O21682O19743
-1776b0184632o07685N42507j458361O83660j449645K065032L188177k269000L70097
$$ y = [-21003690, -21140316, -21657055, -20672435, -20871848, -19867721, -19314647, -17332972, -18980920, -20595199, -21682536, -21203596, -20618206, -20482024, -18966284, -20945566, -20130990, -20006288, -20019610, -20196881, -20336799, -20984719, -20924952, -23161714, -21352972, -20277501, -20253968, -21103449, -20615318, -20129622, -20766796, -18505481, -19519135, -19043060, -20220316, -19382817, -18070246, -19522671, -20314932, -21504322, -20476617, -21217297, -21485619, -20869089, -20471715, -21395476, -21042219, -20779714, -19572134, -20357530, -19997819, -20853243, -18686259, -20905857, -19784702, -16761135, -18200540, -20484897, -19702625, -20059786, -19612831, -19082531, -19816904, -20196834, -21915208, -21426057, -20804375, -20184632, -20792317, -20249810, -21708171, -21024511, -22474156, -20409124, -17220947, -19489947, -19119850]
-1785a9119850k171709j751831N91183J927465q51114K24932l96094Q66711o74893J181633
-1795b0173567o65827p28790J689941r67733J539186p20046Q25791k350796J504077q69908
-1805b0917672n3413J072331k41863J393093k564527r56436Q40142o40047J375240j671513
-1815b2364665r80132K765299J079750k119336K143102p99923n88729J628407k609951
-1824b1846178J505677J240475k356584k04948L59094Q65676n35108R6018J495833L42587
-1834a9037458r22693L47738j701273P23228q11872O87016P11376o80561R83866p24368
-1844b0425001q86125K111776j705872J985959r80483J30609j66344j407537n54007p93072
-1854b2690097L191232j21920n58532p17551J035961J13132p83039J036083j362580m13762
$$ y = [-19119850, -21291559, -23043390, -22452207, -20524742, -21375856, -21150924, -21547018, -20680307, -21355200, -20173567, -20839394, -21568184, -19878243, -20845976, -19306790, -20026836, -19201045, -21551841, -20047764, -20917672, -20971085, -19898754, -20140617, -18747524, -21312051, -22268487, -21428345, -22068392, -20693152, -22364665, -23344797, -20579498, -19499748, -21619084, -19475982, -20275905, -20864634, -19236227, -21846178, -20340501, -19100026, -21456610, -21661558, -21302464, -20436788, -20971896, -20875878, -19380045, -19037458, -19960151, -19612413, -21313686, -20590458, -21402330, -20715314, -20003938, -20684499, -19700633, -20425001, -21311126, -19199350, -20905222, -18919263, -19899746, -19769137, -19935481, -21343018, -21897025, -22690097, -19498865, -19620785, -20179317, -20896868, -19860907, -19747775, -20530814, -19494731, -20857311, -21271073]
-1864b1271073J310720k55607r30577K7200j047069m67093L709690k99410j264966N10833
-1874a9977352K93441l94079j762826K91894J813071p81097Q00225n34940l440480K339620
-1884b1352523J161179m70159O19585q64062j752261J224358P01R75845J79004Q17196
-1894a9461137j953520P62427J187000L1393J438585j619315k057388m39564K82334n24977
-1904b2354162j118293J418965j872745o79936O997898j062811l237897J51551K461776
-1913a9295654j728812K138526l86629k6787n32171j363484N86398K55968j477524M74663
-1923b1355506m797859N262142J727527o08483p97235j578667J092648K179093l93702
-1932a9270042n71495r32357K39708J750626k254539J140345O51707r20036j527348
$$ y = [-21271073, -19960353, -20215960, -21146537, -21119337, -22166406, -22633499, -18923809, -19223219, -20488185, -19977352, -19683911, -20077990, -21840816, -21548922, -19735851, -20516948, -19716723, -20251663, -23692143, -21352523, -20191344, -20661503, -20041918, -20905980, -22658241, -21433883, -21433182, -20457337, -20278333, -19461137, -21414657, -20652230, -19465230, -19433837, -17995252, -19614567, -21671955, -22111519, -21829185, -22354162, -23472455, -22053490, -23926235, -24606171, -17608273, -18671084, -21908981, -21757430, -19295654, -21024466, -18885940, -19272569, -19299356, -19831527, -21195011, -20608613, -20352645, -21830169, -21355506, -26153365, -20891223, -19163696, -19772179, -20569414, -22148081, -21055433, -18876340, -19270042, -19841537, -20773894, -20534186, -18783560, -21038099, -19897754, -19246047, -20166083, -21693431]
-1941b1693431J263886N65904N99707n36853J193644o62971j691631N6421j747236J715552
-1951b0937008J032711j28321j30878j237505J559901K65074J33422n90736P66769j299611
-1961b0566182R61275J248514p77591p72386j91834l96880n52148K252628p62612k177547
-1971b1734763M613516k075657j232181K532150j156400l79533J33535j056L56093J753111
-1981a7191185j759226N3327J064636k35720j435155J72399q56731N28271k984914J753587
-1991b0890711N13186o12611J42961m89457J506641j176112M83606K234212l01670k480747
-2001b1070702J033180J297439j215354N40493k022338J204438m33598k93228Q16718
-2010b0142952j39468J418487j121806J193346K097420m267689N9655j25934N2898J519222
$$ y = [-21693431, -20429545, -19863641, -19263934, -19800787, -18607143, -19270114, -20961745, -20905324, -22652560, -20937008, -19904297, -20032618, -20163496, -21401001, -19841100, -19576026, -19442604, -20033340, -19266571, -20566182, -19604907, -18356393, -19133984, -19906370, -20098204, -20495084, -21047232, -18794604, -19557216, -21734763, -17121247, -19196904, -20429085, -17896935, -19053335, -19432868, -19299333, -19300389, -18944296, -17191185, -18950411, -18897084, -17832448, -18068168, -19503323, -19330924, -20187655, -19659384, -22644298, -20890711, -20377525, -20990136, -20847175, -21336632, -19829991, -21006103, -20522497, -18288285, -18589955, -21070702, -20037522, -18740083, -19955437, -19414944, -21437282, -20232844, -20666442, -20959670, -20142952, -20282420, -18863933, -19985739, -18792393, -16694973, -20962662, -20903007, -21028941, -20976043, -19456821]
-2020a9456821k33620l72968j22149q12586N63050l04378K88280j14650k701955L439104
-2030a9828693P12180j003036l90568l23274J329361l35901j202462K160896k617327j0246
-2040b1509070K457519k327559Q50467P75018Q47605J028652k020692Q05327L56533q15086
-2050a9551286J36020k098084K52038L057696k16593n2419k797982k55108K32322p47826
-2060b2041222L019278m58846j71691k295201J451298N89409J68865j289892J101607
-2069a9926395j241942N62170m077483L083318J55995K60496j5760o27720J532172n82161
-2079b0877310J36613K78258p60702J733221p70338n12150L04017Q58925j251513o79140
-2089b1540119J444024J158529l02672j188772k25565N44348O32526j687076O59973j89766
$$ y = [-19456821, -19690441, -20063409, -20185558, -20998144, -20435094, -20739472, -20451192, -20565842, -23267797, -19828693, -19116513, -20119549, -20510117, -20833391, -19504030, -19839931, -21042393, -18881497, -21498824, -21509070, -19051551, -21379110, -20528643, -19753625, -18906020, -17877368, -19898060, -19092733, -18736200, -19551286, -19415266, -21513350, -21261312, -18203616, -18420209, -18472628, -21270610, -21525718, -21293396, -22041222, -19021944, -19480790, -19652481, -21947682, -20496384, -19906975, -19738110, -21028002, -19926395, -21168337, -20606167, -24683650, -21600332, -21444337, -21183841, -21199601, -21827321, -20295149, -20877310, -20740697, -20462439, -21223141, -19489920, -20260258, -20772408, -20468391, -19609466, -20860979, -21540119, -20096095, -18937566, -19240238, -20429010, -20654575, -20110227, -19477701, -21164777, -20504804, -20694570]
-2099b0694570J32955K23277O43424k1018J72391O28111p20213o77792Q32214J044901
-2109a8436320j840819j89674m3529k23412O10019p22562J58750l84245M68901J378946
-2119a9223945j665883J019468M3565l72983O97565K27551r55260j044812j649312J134847
-2129b1789199K530339r23925q67369N56391l24934J693590j36046k056432N44087O07980
-2139b0165518J286377j276609L05782J75658n26349k18244l24720p88268J150813m72347
-2149b0853425j0443K16362l88963J073645j048193O82416j606826Q37475p58677K461633
-2159a9394996J18071J020164j32641k941072o38941J033271m76043l50388J247126K10360
-2169b0305089J13463L60468k62203l4935l83322K29020m78123J021814K11422j322738
$$ y = [-20694570, -20561615, -20338338, -19694914, -19715932, -19543541, -18915430, -19635643, -20313435, -19481221, -18436320, -20277139, -20466813, -20510342, -20733754, -20123735, -20846297, -20687547, -21071792, -20602891, -19223945, -20889828, -19870360, -19826795, -20199778, -19502213, -19274662, -20229922, -21274734, -22924046, -21789199, -19258860, -20182785, -21050154, -20493763, -20818697, -19125107, -19261153, -21317585, -20773498, -20165518, -18879141, -20155750, -19849968, -19674310, -20200659, -20418903, -20743623, -21531891, -20381078, -20853425, -20863868, -20647506, -21036469, -19962824, -21011017, -20328601, -21935427, -21097952, -21856629, -19394996, -19276925, -18256761, -18389402, -21330474, -21969415, -20936144, -21412187, -21762575, -20515449, -20305089, -20191626, -19831158, -20093361, -20128296, -20511618, -20282598, -20760721, -19738907, -19527485, -20850223]
-2179b0850223N84993j201211j264807Q0664J544302q52795K624250R38846K96229r22693
-2189a9022445j144223j451382L233819m040063M98143o79146J114281L16358J800782
-2198a9373876M05955J266269j862862m031917J948985J23455j386j32505J31321l36520
-2208b1863081J703213K26318n29661k70123o28762O77204Q24659k094788K11510M40857
-2218b1302654J983465m73146L99697j384492J22794n88840J075441r46550k04439J956568
-2228a9362156j441668l62248r06620Q22716P98749l99234k1764Q54739q55692j819801
-2238b2692979Q18145O95226L39487M57362j619332o4347J204402O81606N19671j646340
-2248b1307099j44354k3051J774551k113164J113385j418349M79185R04995R55592p56696
$$ y = [-20850223, -20265230, -21466441, -22731248, -22650584, -21106282, -21959077, -19334827, -18395981, -18099752, -19022445, -20166668, -21618050, -18384231, -22424294, -21926151, -22605297, -21491016, -21174658, -19373876, -18967921, -17701652, -19564514, -23596431, -21647446, -21523991, -21525377, -21657882, -21526561, -21863081, -20159868, -19933550, -20463211, -20733334, -21362096, -20684892, -19860233, -21955021, -21743511, -21302654, -19319189, -19792335, -19392638, -20777130, -20654336, -21243176, -20167735, -21114285, -21318724, -19362156, -20803824, -21166072, -22072692, -21249976, -20451227, -20850461, -20872225, -20017486, -20873178, -22692979, -21874834, -21179608, -20840121, -20382759, -22002091, -22066438, -20862036, -20180430, -19660759, -21307099, -21451453, -21474504, -19699953, -21813117, -20699732, -22118081, -21638896, -20733901, -19778309, -20535005]
-2258b0535005p55446n74749R51241P62079P93569j573447p56753J685104R20249M84666
-2268a8598492j603425j256304J268558Q93951j380995m57080K10642J808496L61247
-2277a8753402p00143j47853l29666l75505r90528K91563m80945j856092J350272K917833
-2287a9074466r242o90884p11563j081999K378J962561j15444j93474n67844P83818
-2297a9696159j315839m316338K382151J348906K9844J090705k89084r85409R42806L19191
-2307b0489226M61553J35572J220012k135717K146695p22164k16275Q16928j364737l06208
-2317b0453567j909871K834390k14060k4764j566370K49287j253184N22787q69862J883927
-2327b0801287q7986J80541M79001j73935k45l32776J825525j213488M0631J80123l13997
$$ y = [-20535005, -21290451, -21865200, -20913959, -20151880, -19358311, -20931758, -21688511, -20003407, -19083158, -18598492, -20201917, -21458221, -20189663, -19295712, -20676707, -21133787, -20923145, -19114649, -18753402, -19453545, -19601398, -19931064, -20306569, -21297097, -21005534, -21486479, -23342571, -21992299, -19074466, -19083708, -19774592, -20486155, -21568154, -21565776, -19603215, -19718659, -19912133, -20479977, -19696159, -21011998, -25328336, -22946185, -21597279, -21567435, -20476730, -20765814, -21751223, -20808417, -20489226, -20027673, -19892101, -18672089, -20807806, -18661111, -19383275, -19599550, -18782622, -20147359, -20453567, -22363438, -19529048, -19743108, -19767872, -21334242, -21084955, -22338139, -21815352, -22685214, -20801287, -20889273, -20708732, -20229731, -20403666, -20403911, -20736687, -18911162, -20124650, -20084019, -19903896, -20217893]
-2338b0217893N16900O28683k285021R5055k08208K081118j204270J555990o14745j656311
-2348b1308702q41397K540403K75120J187579k046836j419097O06994K63008J98341
-2357b0544587j429941J056186M16200r72621O21899N3868l20489P42139J050202l62303
-2367a9689447k03804M04536j104355k260401j016466K632984J911611j006504m43575
-2376b0775421o50911l33740J646567J084376m542490N77380K320696J436507J594357
-2385a7642679k236503l23338j392253q63958K461191j689451k49375J5938J029504l91722
-2395b1282646o09614K473375n49295l40883J099892k777173J858098k331393R70O56540
-2405b1802129j35652N38589L09995J241492j885889J727198k227187J772858P51536r9787
$$ y = [-20217893, -19700993, -19072310, -21357331, -21262276, -21470484, -19389366, -20593636, -19037646, -19652391, -21308702, -22150099, -19609696, -19334576, -18146997, -20193833, -21612930, -21005936, -20742928, -20544587, -21974528, -20918342, -20502142, -21474763, -20852864, -20798996, -21119485, -20377346, -19327144, -19689447, -19893251, -19488715, -20593070, -22853471, -23869937, -21236953, -19325342, -20331846, -20775421, -21426332, -21760072, -20113505, -19029129, -23571619, -22994239, -20673543, -19237036, -17642679, -19879182, -20202520, -21594773, -22458731, -19997540, -21686991, -21936366, -21920428, -20890924, -21282646, -21892260, -19418885, -19968180, -20309063, -19209171, -21986344, -20128246, -22459639, -22458669, -21802129, -21937781, -21399192, -21089197, -19847705, -21733594, -20006396, -22233583, -20460725, -19709189, -19808976]
-2415a9808976j41800J646108K8180j256305k222023r9037J262589M77691k65328p49047
-2425b1127948J571495j306992l11544N78263J186078K70994k636377m21043R2667j191259
-2435b3295666P00700r5954J019000L17006Q88524j479511J871224q01885L072764k929933
-2445b0733731K059458J7757q16547J51875q70508j56568J075310k184503j517464L439178
-2455a9535743j328726R98880J075775k341977j560075J022969L92548K289139l33485
-2464a9320695l78632K43730p50186k93311L32548K9655L91489k459975J473109K51593
-2474b0480675N96187J1814n25154j089148j37311Q71310n65727K27031j357745K918307
-2484a9531111l83351m57003N39359q21531K132706l076061L745302O32861j622883O2409
$$ y = [-19808976, -19950776, -18304668, -18276488, -19532793, -21754816, -21853853, -20591264, -20113573, -20378901, -21127948, -19556453, -20863445, -21174989, -20596726, -19410648, -19139654, -21776031, -22197074, -22104407, -23295666, -22594966, -22690920, -21671920, -21354914, -20466390, -21945901, -20074677, -20876562, -17803798, -20733731, -18674273, -18656516, -19473063, -19321188, -20191696, -20348264, -19272954, -21457457, -22974921, -19535743, -20864469, -19865589, -18789814, -21131791, -22691866, -21668897, -21276349, -18987210, -19320695, -19699327, -19455597, -20205783, -20499094, -20166546, -20136891, -19745402, -22205377, -20732268, -20480675, -19884488, -19872674, -20397828, -21486976, -21624287, -20752977, -21318704, -21091673, -22449418, -19531111, -19914462, -20371465, -19832106, -20653637, -18520931, -21596992, -17851690, -17218829, -18841712, -18779303]
-2494a8779303l65885j503399n56059J91141J67307J633396m08899j483438L78508j200476
-2504b1927107J158877n89276k65588J023984J764448L9153k042220j160535Q67728N84277
-2514b0546259Q0546j164147R25956J618650j196095m69961K3534M52225n32936p05150
-2524b1513637k054k74428J012083K2209J831604r35850q95606K66265p0482o26179
-2534b1186075J228812K06500q78072J601182J066794j809588l84833j567584J36110
-2543b1586754l558884K446402J666125K102439j212089n04987q65330m45184J552468
-2552b0405794k24760k056313L050417j716332p53644K055310n28562K265728k943628
-2561b1257578k387281M057436j717420J282985r69828k438929J642919j33939J57413
$$ y = [-18779303, -19145188, -20648587, -21204646, -21013505, -20846198, -19212802, -19621701, -21105139, -20726631, -21927107, -20768230, -21357506, -21623094, -20599110, -18834662, -18795509, -20837729, -21998264, -21130536, -20546259, -20465713, -21629860, -20703904, -19085254, -20281349, -20751310, -20727776, -20275551, -20808487, -21513637, -21515691, -21790119, -20778036, -20755827, -18924223, -19860073, -20755679, -20489414, -20559896, -21186075, -19957263, -19750763, -20628835, -19027653, -17960859, -19770447, -20155280, -21722864, -21586754, -25145638, -22699236, -21033111, -18930672, -20142761, -20647748, -21513078, -21958262, -20405794, -20630554, -22686867, -19636450, -21352782, -22106426, -20051116, -20579678, -18313950, -21257578, -23644859, -19587423, -21304843, -20021858, -20991686, -23430615, -21787696, -21921635, -21764222]
-2570b1764222P2067p95565K252154P76227m25102j427524L31431q73741K832246j447573
-2580b0469602k98661j397807L86322K556083j452657J344275j576960R85563J52529
-2589a9770915n08240Q25775R02267j557391L90081j134463L305800j283389j606690O6388
-2599b0370777R66594q5898j57463k99286Q54274n25171j726505J263403P9114l33270
-2609b0334985M57368n65764j245778J088332J4516R7215N01138r19043j740801K436837
-2619b0210965q2013O12812r16368k049395L453334O8372k3341j285577j247336J629846
-2629b0050631L5830P62123j66114p62154j781232K403264j344607P68124O63118L56274
-2639a9116005L14975m04448j493764k73353j07707J360772N17771j757709N23733L87779
$$ y = [-21764222, -21692155, -22487720, -20235566, -19459339, -19884441, -21311965, -20980534, -21854275, -19022029, -20469602, -20768263, -22166070, -21779748, -19223665, -20676322, -19332047, -20909007, -19923444, -19770915, -20279155, -19453380, -18551113, -20108504, -19718423, -20852886, -17547086, -18830475, -20437165, -20370777, -19404183, -19490081, -19647544, -19946830, -19092556, -19617727, -21344232, -20080829, -20001715, -20334985, -19877617, -20443381, -21689159, -20600827, -20586311, -20489096, -19987958, -20907001, -22647802, -20210965, -20292978, -19680166, -20596534, -22645929, -19192595, -19124223, -19147564, -20433141, -21680477, -20050631, -20014801, -19252678, -19418792, -20180946, -21962178, -19558914, -20903521, -20135397, -19472279, -19116005, -18801030, -19205478, -20699242, -20972595, -21080302, -19719530, -19201759, -20959468, -20435735, -20047956]
-2649b0047956M66458R33458L38839l832557J4397K897223k113992J019034j055399
-2658b1380495j200763K293133k93338L45671N81926j020842K817184L25670L73352
-2667a7158502k494541k296112Q81070l0757J264649k711063j986011K501210J99903
-2676b1830154J522497j05298r84989J524793j412000p39314j577387L464576j15474
-2685b0252750l13501q30804O93158N8618j821539J986011l82330m935R7211O88186J15209
-2696a9967466O25197R1068l37292j989897k3860Q72120l94850j97610k207462K356601
-2706b1173451j111678M65220Q0610Q93427k60231R94862J77585j22427q97116K346635
-2716a8606564o772o09901j208222J35594j291720n58115O44379K058940k095299l35875
$$ y = [-20047956, -19581498, -18648040, -18309201, -22141758, -22127361, -19230138, -21344130, -20325096, -21380495, -22581258, -20288125, -20581463, -20235792, -19653866, -20674708, -17857524, -17531854, -17158502, -19653043, -21949155, -21068085, -21098842, -19834193, -22545256, -24531267, -22030057, -21830154, -20307657, -20412955, -21397944, -19873151, -21285151, -22024465, -23601852, -20137276, -20252750, -20566251, -21397055, -20703897, -20645279, -22466818, -20480807, -20863137, -20868072, -20770861, -20082675, -19967466, -19342269, -19251201, -19588493, -21578390, -21602250, -20730130, -21124980, -21322590, -23530052, -21173451, -22285129, -21819909, -21739299, -20845872, -21106103, -20111241, -19933656, -20056083, -20953199, -18606564, -18613336, -19223237, -20431459, -20295865, -21587585, -22145700, -21501321, -19442381, -21537680, -21873555]
-2726b1873555J34980J730781N40664j372964
$$ y = [-21873555, -21738575, -20007794, -19467130, -20840094]
-2730b0840094  $$ checkpoint
##PAGE= N=2
$$ [...]
-2730b3833077  $$ checkpoint
##END NTUPLES=
##END=
