##TITLE= S#340318
##JCAMP-DX= 5.00 $$ JEOL NMR v1.10
##DATA TYPE= NMR SPECTRUM
##DATA CLASS= NTUPLES
##NUM DIM= 1
##ORIGIN= DELTA_NMR
##OWNER= organic
##SPECTROMETER/DATA SYSTEM= DELTA_NMR
##.OBSERVE FREQUENCY= 3.00529655924288E+02
##.OBSERVE NUCLEUS= ^1H
##.DELAY= (2.194E+02,2.194E+02)
##.ACQUISITION MODE= SIMULTANEOUS
##.FIELD= 7.0586013
##.FILTER WIDTH= 1.81675738660864
##.ACQUISITION TIME= 3.6339712
##.SPINNING RATE= 16
##.OBSERVE 90= 9.6
##NTUPLES= NMR SPECTRUM
##VAR NAME= FREQUENCY,    SPECTRUM/REAL, SPECTRUM/IMAG, PAGE NUMBER
##SYMBOL=   X,            R,             I,             N
##VAR TYPE= INDEPENDENT,  DEPENDENT,     DEPENDENT,     PAGE
##VAR FORM= AFFN,         ASDF,          ASDF,          AFFN
##VAR DIM=  16384, 16384, 16384, 2
##UNITS= PPM,     ARBITRARY UNITS, ARBITRARY UNITS, 
##FIRST=  1.2501033903057E+01, -3.43057053731813, -2.43577638522497, 1
##LAST=  -2.50011824950436, -2.76643348962763, -3.09121016608773, 2
##FACTOR=  9.1565355261926E-04, 3.62292048053182E-04, 3.62292048053182E-04, 1
##PAGE= N=1
##DATA TABLE=(X++(R..R)), XYDATA
$$ [...]
5517b0562073j363005P68275L35202n29960j085206p45893Q8511K328083j297739o62418
5507b2726223K05644J274761n16604r270J404992p89075j548423P36554J782814J61586
5497b0023244j864353j29997J563354J39138q15920k255366J234875Q14723M64303q32509
5487b1704996n50038J281145j620295K80682M17170M34742j399790O43102j08677Q2330
5477b2244625Q50071J673686j065694J476431j091087r73000J166141j057406K908475
5468a8357008l7735J774827n142893N687075l097969J1504832J3013783l2539709K129703
5459b5065094J34532K829922J16728K293495k545970N46849k708551L785649j724224
5450b2336664j277548J154069n21996M93943J99741j755174O17372J13519P97979Q47413
$$ plain form
5517 -20562073 -21925078 -21156803 -20821601 -21351561 -22436767 -23182660 -23094149 -20766066 -22063805 -22726223
5507 -22726223 -22520579 -21245818 -21762422 -21771692 -20366700 -21155775 -22704198 -21967644 -20184830 -20023244
5497 -20023244 -21887597 -22017594 -20454240 -20315102 -21131022 -23386388 -22151513 -21336790 -20872487 -21704996
5487 -21704996 -22255034 -20973889 -22594184 -22313502 -21896332 -21461590 -22861380 -22218278 -22326955 -22244625
5477 -22244625 -21394554 -19720868 -20786562 -19310131 -20401218 -21374218 -20208077 -21265483 -18357008
5468 -18357008 -18394743 -16619916 -21762809 -16075734 -19173703 -7668871 5344912 -27194797 -25065094
5459 -25065094 -24930562 -22100640 -21983912 -19690417 -22236387 -21689538 -24398089 -20612440 -22336664
5450 -22336664 -23614212 -22460143 -22982139 -22488196 -22288455 -24043629 -23426257 -23312738 -22514759 -21667346
5440b1667346j964846J608055j07102j728624J344319l03771J518946P78290q36707
5431b1358786j413810j676094L59297J542130L05433o5471p55897Q28642j42505l396
5421b2380457q36214O452L76949J161395k4141n86844j73298r69402J923573R25950p21978
5410b1298015k39939l12652k435654K827148o54183J324829o83151K25306j19113j666847
5400b3032271n76234L17361J237126O93234q08473l23669P99852o17704m49246q57021
5390b3617045J463603m66947k04897j305519K874840k748058N41354k91936J645367o74037
5380b2783275l11078q27062K127191j742077J015065o0857P39500k55483j784019J225461
5370b2656634J132429j489935M26008R39110k285592K315229j767578j907305L278909
$$ plain form
5440 -21667346 -23632192 -22024137 -22131239 -23859863 -22515544 -22819315 -21300369 -20522079 -21358786
5431 -21358786 -22772596 -24448690 -24089393 -22547263 -22241830 -22307301 -23063198 -22234556 -22377061 -22380457
5421 -22380457 -23216671 -23210219 -22833270 -21671875 -21696016 -22282860 -22456158 -23425560 -21501987 -20576037 -21298015
5410 -21298015 -21537954 -21850606 -24286260 -21459112 -22113295 -20788466 -21471617 -21246311 -21365424 -23032271
5400 -23032271 -23608505 -23291144 -22054018 -21360784 -22169257 -22492926 -21693074 -22310778 -22760024 -23617045
5390 -23617045 -22153442 -22620389 -22825286 -24130805 -21255965 -24004023 -23462669 -23754605 -22109238 -22783275
5380 -22783275 -23094353 -23921415 -21794224 -23536301 -22521236 -22582093 -21842593 -22098076 -23882095 -22656634
5370 -22656634 -21524205 -23014140 -22588132 -21649022 -23934614 -21619385 -23386963 -25294268 -22015359
5361b2015359j949996K949360O24317q21665J17498j369642p25658J194071N26299l43167
5351b1813942j85484J834049j172423L38758M30708P02010n08650k81161q97778k61263
5341b1815176O86890q59177J40178j556156j073457J936616J313726j562304L97369k5813
5331b2417304l08495J477120j915093K332592k204825J232505p01126N62791p3987q21206
5321b2837028Q96453r34207R96183K01754k39292r55784O48492k218629K63886O58215
5311b3519957R34778j081072N32333J90241k579265M697571K47032o76514k161948N31729
5301b2885072j612925J49877J758029J56025N52481j821275M68057Q92763P71098j392213
5291b2963155J255089k036734n69667K65661L405183P86586k741673L071931l74956
$$ plain form
5361 -22015359 -23965355 -21015995 -20391678 -21213343 -21095845 -22465487 -23191145 -21997074 -21470775 -21813942
5351 -21813942 -21999426 -20165377 -21337800 -20999042 -20568334 -19866324 -20374974 -20656135 -21553913 -21815176
5341 -21815176 -21128286 -21987463 -21847285 -23403441 -24476898 -22540282 -21226556 -22788860 -22391491 -22417304
5331 -22417304 -22725799 -21248679 -23163772 -20831180 -23036005 -21803500 -22504626 -21941835 -22015822 -22837028
5321 -22837028 -21940575 -22874782 -21878599 -21676845 -21916137 -22871921 -22223429 -24442058 -24178172 -23519957
5311 -23519957 -22585179 -23666251 -23133918 -22943677 -25522942 -20825371 -20578339 -21254853 -23416801 -22885072
5301 -22885072 -24497997 -24348120 -22590091 -22434066 -21881585 -23702860 -23234803 -22342040 -21570942 -22963155
5291 -22963155 -21708066 -23744800 -24314467 -24048806 -20643623 -19857037 -22598710 -19526779 -19901735
5282a9901735j775897k36997o71748K40666j091002J177402J935831q12961j507532
5273b2643973J166387J19501r30875k20274j540756j710630K909605P16022J850j254738
5263b3387881J538818L88830j116241K74038J564622q02859j717127L78684M57037r11145
5253b3333224J30276J43141Q8976O57659r17457J15402O15418L000351L833101M8239902
5243C2573545m9290292l611293j972563L19203M70345j019185l77945N44423j322597
5234b3686359J29556K210756n64218j772920n70684K121077K065722k290345J119541L0853
5224b1207021p62648J732906k043451p7270k7561j632196K383404O62917K60361j680072
5214b2390631j109871N37082N57057p65256K229488j004727p76431J123370l91194O33477
$$ plain form
5282 -19901735 -21677632 -21914629 -22586377 -22345711 -23436713 -22259311 -20323480 -21136441 -22643973
5273 -22643973 -21477586 -21358085 -22288960 -22509234 -24049990 -25760620 -22851015 -22134993 -22133143 -23387881
5263 -23387881 -21849063 -21460233 -22576474 -22302436 -20737814 -21540673 -23257800 -22879116 -22422079 -23333224
5253 -23333224 -23202948 -23059807 -22970831 -22313172 -23230629 -23115227 -22499809 -19499458 -15666357 32573545
5243 32573545 -16716747 -20328040 -22300603 -21981400 -21511055 -22530240 -22908185 -22363762 -23686359
5234 -23686359 -23556803 -21346047 -21910265 -23683185 -24253869 -22132792 -20067070 -22357415 -21237874 -21207021
5224 -21207021 -21969669 -20236763 -22280214 -22357484 -22385045 -24017241 -21633837 -20970920 -20710559 -22390631
5214 -22390631 -23500502 -22963420 -22406363 -23171619 -20942131 -21946858 -22723289 -21599919 -21991113 -21357636
5204b1357636r950p31022O46059q27067n6857J61324J402360j422988o7807N5107P89848
5193b1418629p91836k458421k23130J044544j57208M68038k31942Q61041K14978J820258
5183b0872307m01576r86561L35918j896875O28517J202500O95973j264023m61482J976107
5173b1043809N26465j235109P05465j761693o94842R16932m81962J715992m278144K555456
5163b3075249p91640R3722O52229Q90777J138224j59664j245310P7923N05353m42112
5153b2355747R33293j268452J634452J590290k113918j177751J518993j25530n05298
5144b1869668L80823N89237m440065L364115M74596j353570J070247r15511R75544M88748
5134b1235504L20545m30549j766488Q99980j40828r46925o99571J453684J083704o84535
$$ plain form
5204 -21357636 -21367586 -22098608 -21452549 -22279616 -22336473 -22175149 -20772789 -22195777 -22263584 -22208477 -21418629
5193 -21418629 -22210465 -24668886 -24892016 -23847472 -24004680 -23536642 -23768584 -22907543 -22692565 -20872307
5183 -20872307 -21273883 -22260444 -21924526 -23821401 -23192884 -21990384 -21294411 -22558434 -23019916 -21043809
5173 -21043809 -20517344 -21752453 -21046988 -22808681 -23503523 -22586591 -23068553 -21352561 -25630705 -23075249
5163 -23075249 -23866889 -23773167 -23120938 -22230161 -21091937 -21251601 -22496911 -22418988 -21913635 -22355747
5153 -22355747 -21422454 -22690906 -21056454 -19466164 -21580082 -22757833 -21238840 -21364370 -21869668
5144 -21869668 -21488845 -20899608 -25339673 -21975558 -21500962 -22854532 -21784285 -22699796 -21724252 -21235504
5134 -21235504 -20914959 -21345508 -23111996 -22212016 -22352844 -23299769 -23999340 -22545656 -21461952 -22146487
5124b2146487j605411J07468j555237J533749L21993K246172m35569l208792R63552O22449
5114b3156113L56512J89135m3699n42681P54781r0382l509885M222181o3204r13552K18170
5103b2578737n90245J15807J639509N26819j548680O2898k62525L49379L12780K52634
5093b1720361k607706K849859r063j169839j097455O66975J810835o73996J189431j090023
5083b1851343O50748k687739k78642K214331j116141R02990m29877r49873J197966j281721
5073b3629301O8279K08538L49740J164422R9913J84397j338331J415655J212587j855112
5063b2119213k85122Q88145j02872j594570J133719J097690K14168k548418J964588
5054b1351885j103682K32309r19372K39582q37091N78834r6829j356041K730491l14035
$$ plain form
5124 -22146487 -23751898 -23644430 -25199667 -23665918 -23343925 -21097753 -21533322 -24742114 -23778562 -23156113
5114 -23156113 -22799601 -22610466 -22654165 -23196846 -22442065 -22532447 -26042332 -21820151 -21883355 -22796907 -22578737
5103 -22578737 -23168982 -23053175 -21413666 -20886847 -22435527 -22372629 -22635154 -22285775 -21972995 -21720361
5093 -21720361 -24328067 -21478208 -21487271 -22657110 -23754565 -23087590 -21276755 -21950751 -20761320 -21851343
5083 -21851343 -21200595 -23888334 -24166976 -21952645 -23068786 -22165796 -22595673 -23545546 -22347580 -23629301
5073 -23629301 -23561022 -23352484 -23002744 -21838322 -21738409 -21554012 -22892343 -21476688 -20264101 -22119213
5063 -22119213 -22404335 -21516190 -21619062 -23213632 -22079913 -20982223 -20768055 -23316473 -21351885
5054 -21351885 -22455567 -22223258 -23142630 -22903048 -23740139 -23161305 -23258134 -24614175 -21883684 -22197719
5044b2197719r88561J128737j184402O54929O469J282365j692497r3279J8787M236l33234
5033b3394169k93856q03577K107667r99357O3504P25241J69800j423632J110584J272446
5023b1465349j8394o5789j961150l33037J138423J698286o99781j467991O99254p82955
5013b3258483J24122Q42991J043418m71502n44313J036140j590936m94583j078805R43875
5003b3448076N51237K035971j263073M39889p62891L46003j499036q49538P54316P52281
4993b2942917m7822m34911J178119j639865m1949N28601R61778o67924J277093K367834
4983a9461963k914189l00627j577889K477072j156398m04118p48694J266216q96091
4974b3716681K159040r43385k029023J93942J55574J639234k21556Q42464m87353j367394
$$ plain form
5044 -22197719 -23186280 -22057543 -23241945 -22587016 -22580547 -21298182 -22990679 -23083958 -23065171 -23060935 -23394169
5033 -23394169 -23688025 -24491602 -22383935 -23383292 -23319788 -22594547 -22424747 -23848379 -22737795 -21465349
5023 -21465349 -21483743 -21549532 -23510682 -23843719 -22705296 -21007010 -21706791 -23174782 -22475528 -23258483
5013 -23258483 -23134361 -22291370 -21247952 -21719454 -22263767 -21227627 -22818563 -23313146 -24391951 -23448076
5003 -23448076 -22896839 -20860868 -22123941 -21684052 -22446943 -22100940 -23599976 -24449514 -23695198 -22942917
4993 -22942917 -22990739 -23425650 -22247531 -23887396 -23929345 -23400744 -22438966 -23106890 -21829797 -19461963
4983 -19461963 -22376152 -22676779 -24254668 -21777596 -22933994 -23338112 -24086806 -22820590 -23716681
4974 -23716681 -21557641 -22501026 -24530049 -24336107 -24180533 -22541299 -22762855 -21920391 -22407744 -23775138
4964b3775138J338636l025443N944263j606552M28849J360432k459716l06255o44425
4955b2745349L66315m93976L44423k283556L588155j124715m77555P96845q03927k64136
4945b3097476O9915N74805L43043j73324k68617J97247J191676Q53043n943361J708066
4935b4544983l83468J299751M95885q509K240083k059876L801406l736529p72674K020370
4925b1648544K19394p34431l95400M46535M98547J033171p20693j326494q21921M4417
4915b3405419J571912n36296o76984J621210P41988k981474m89495J46981J858566P01403
4905b1447608k600545J24241M53610M71760L86434q14783k14068j36365O10311J057845
4895b2109168j828884J182831r32269j733349R94400L48840J211190J364426j346296
$$ plain form
4964 -23775138 -22436502 -25461945 -19517682 -21124234 -20695385 -19334953 -21794669 -22100924 -22745349
4955 -22745349 -22379034 -22873010 -22528587 -24812143 -21223988 -22348703 -22826258 -22029413 -22833340 -23097476
4945 -23097476 -23027561 -22452756 -22109713 -22283037 -22551654 -22354407 -21162731 -20309688 -26253049 -24544983
4935 -24544983 -24928451 -23628700 -23132815 -23141324 -20901241 -22961117 -19159711 -22896240 -23668914 -21648544
4925 -21648544 -21429150 -22163581 -22558981 -22112446 -21613899 -20580728 -21301421 -22627915 -23449836 -23405419
4915 -23405419 -21833507 -22369803 -23046787 -21425577 -20683589 -23665063 -24154558 -24007577 -22149011 -21447608
4905 -21447608 -24048153 -23923912 -23470302 -22998542 -22612108 -23426891 -23640959 -23777324 -23167013 -22109168
4895 -22109168 -23938052 -22755221 -23687490 -25420839 -24426439 -24077599 -22866409 -21501983 -22848279
4886b2848279o99345P26839k70526r16477K68963O51119j553823R90587J052104p98764
4876b3397602j145540K498242R44259k226561O62335j148217N69048K46892j604050
4867b4601194K643057K75559j581874j696063j25177J063526r90759n02354L433052n82414
4857b2664641k58990n58690p7648J75532k74661J74140k69286O98867l80858m89661K6425
4846b3899471J244104j417143K95654J185482N72777j286777R52036L96350J71818k03628
4836b1988798j146197j075372K30768J24588o20220P0861n99838o93739J650300O80547
4826b3367100l57665l11165J141229n75527K091193m98979k843680K41261J025703N89558
4816b2865172l461344j776j7710o35432l891355N25419j820086k111382L7679693j943782
$$ plain form
4886 -22848279 -23547624 -22820785 -23091311 -24007788 -23738825 -23087706 -24641529 -23650942 -22598838 -23397602
4876 -23397602 -24543142 -22044900 -21100641 -23327202 -22664867 -23813084 -23244036 -22997144 -24601194
4867 -24601194 -21958137 -21682578 -23264452 -24960515 -25085692 -24022166 -25012925 -25515279 -22082227 -22664641
4857 -22664641 -22923631 -23482321 -23559969 -23384437 -23659098 -23484958 -23754244 -23055377 -23436235 -23925896 -23899471
4846 -23899471 -22655367 -24072510 -23776856 -22591374 -22018597 -23305374 -22353338 -21956988 -21785170 -21988798
4836 -21988798 -23134995 -24210367 -23979599 -23855011 -24475231 -24404370 -25004208 -25697947 -24047647 -23367100
4826 -23367100 -23724765 -24035930 -22894701 -23470228 -21379035 -21878014 -24721694 -24480433 -23454730 -22865172
4816 -22865172 -26326516 -26328292 -26346002 -26981434 -30872789 -30347370 -32167456 -34278838 3400855 1457073
4806A457073j1938106m109377l621342p87910j533735J0135O76566O49663l76430j982618
4796b1556081O57840m79560P25312N08751p33841K16536j918035J45718j23242J991296
4786b0565306j423907N03010p75288J95108l94378O61493J4500j06203j064397Q80984
4776b2074384N19218Q3625J509832k387651J33536J71935n14207N63607j079437K45419
4766b2828507P04324j025180O84771O54372J542388j097357j282456m43157m67641K501092
4756b1057351m1976n69237j564231J766039Q75774j993142R21854o92273K21643j201137
4746b3334037N40445J733892r76800j878434J045385k73201N59254K288909j111123
4737b1405710j237249M52953J541045M50351j753411j72575o01617l90998j77563J486927
$$ plain form
4806 1457073 -10481033 -14590410 -18211752 -18999662 -20533397 -20523262 -19846696 -19197033 -19573463 -21556081
4796 -21556081 -20898241 -21377801 -20652489 -20143738 -20877579 -20661043 -22579078 -22433360 -22556602 -20565306
4786 -20565306 -21989213 -21486203 -22261491 -22066383 -22460761 -21799268 -21784768 -21890971 -22955368 -22074384
4776 -22074384 -21555166 -21471541 -19961709 -22349360 -22215824 -22043889 -22558096 -21994489 -23073926 -22828507
4766 -22828507 -22124183 -23149363 -22464592 -21810220 -20267832 -21365189 -22647645 -23090802 -23558443 -21057351
4756 -21057351 -21099327 -21668564 -23232795 -21466756 -20590982 -22584124 -21662270 -22354543 -22132900 -23334037
4746 -23334037 -22793592 -21059700 -22036500 -23914934 -22869549 -23142750 -22583496 -20294587 -21405710
4737 -21405710 -22642959 -22190006 -20648961 -20198610 -21952021 -22124596 -22726213 -23117211 -23294774 -21807847
4727b1807847J20583o46102J37917J441471j28516j435378r04536J310550J470186k943768
4717b3385440J536189j476556m8506k70685J732585j216889K043348J98596r46650l35369
4707b2169377N2023j21710M561312l304655j601819L93402K66400l79075n77068J395761
4697b1484806q6523l05456M62582q61014K481740j160412q78708J70767l86830R52595
4687b1096065M1461J10225j123118N19103J645209o34494m51490l27755m05313M08039
4677b1314198j734919J361616J237813j894441N17444l4116L86638j931015N89438J250578
4667b1565162k14122j149051K124300M68222k306853K003768k015197l59871m4752J557664
4657b1501054P17269n56088l67443q02947J058908P2388l576554k364786L290612j143923
$$ plain form
4727 -21807847 -21687264 -22333366 -22195449 -20753978 -20882494 -22317872 -23222408 -21911858 -20441672 -23385440
4717 -23385440 -21849251 -23325807 -23374313 -23644998 -21912413 -23129302 -21085954 -20887358 -21834008 -22169377
4707 -22169377 -22117354 -22239064 -17677752 -20982407 -22584226 -22190824 -21924424 -22303499 -22880567 -21484806
4697 -21484806 -21571329 -21876785 -21414203 -22275217 -19793477 -20953889 -21832597 -21661830 -22048660 -21096065
4687 -21096065 -21054604 -20944379 -22067497 -21548394 -19903185 -20537679 -20989169 -21316924 -21722237 -21314198
4677 -21314198 -23049117 -21687501 -20449688 -22344129 -21826685 -21860801 -21474163 -23405178 -22815740 -21565162
4667 -21565162 -21779284 -22928335 -20804035 -20335813 -22642666 -20638898 -22654095 -23013966 -23058718 -21501054
4657 -21501054 -20783785 -21339873 -21707316 -22510263 -21451355 -21378967 -24955521 -27320307 -24029695 -25173618
4647b5173618P8413n89088J256620k82408M54282J101009j76948m7081O54643j68238
4637b2892414J55000j314138P69356m52980Q81429n66974N74656J105047P39736l37271
4627b1338553r77873j047094k72314O38505N18749r78519q31044K077365N29841p71137
4617b2452074q11868N22575m06751J5123J306275j086157m08643j87119O19774p87812
4607b3676677k6654J85174p12504J268255P17060j856764K532154L28585P10117k832809
4597b3364063J890559k033470J882769k45288k698353J246618J12072R95030k491882
4588b4706008K329645j965835K131392l68279p27022o25727n86934J090431R49810P65545
4578b1712982N14J842945j962534K07288k377917J178651L62965j456831P34494j33051
$$ plain form
4647 -25173618 -25095205 -25684293 -24427673 -24710081 -24255799 -23154790 -23331738 -23378819 -22724176 -22892414
4637 -22892414 -22737414 -24051552 -23282196 -23735176 -22853747 -23420721 -22846065 -21741018 -21001282 -21338553
4627 -21338553 -22316426 -23363520 -23635834 -22997329 -22478580 -23457099 -24288143 -22210778 -21680937 -22452074
4617 -22452074 -23263942 -22741367 -23148118 -23132995 -21826720 -22912877 -23321520 -23508639 -22888865 -23676677
4607 -23676677 -23703331 -23518157 -24230661 -22962406 -22245346 -24102110 -21569956 -21241371 -20531254 -23364063
4597 -23364063 -21473504 -23506974 -21624205 -21869493 -24567846 -23321228 -23209156 -22214126 -24706008
4588 -24706008 -22376363 -24342198 -22210806 -22579085 -23306107 -23931834 -24518768 -23428337 -22478527 -21712982
4578 -21712982 -21712468 -19869523 -21832057 -21624769 -24002686 -22824035 -22461070 -23917901 -23183407 -23316458
4568b3316458J18839j467724p8332K068961M06515m65701j70406j529478J070160R1021
4558b3272603J70243N93352J343453p74520j088380J110633j700269J77477J77256J082046
4548b2181312r74322P57430N09225j356503J679939k146010j93862J295602k030323M72640
4538b4167496J388770n62288l20213L29380j658056J520974m9658j563671O83808J22083
4528b4276367L6534m09308M61401j521566O84964j457659K465682k27483J119528K285748
4518b0838526l44042m7932j689886j824969K754934j236792j54840J112592q14654J930721
4508b1153394j728746L16841R80587r83508j972769l48934J492891Q4273R88530j377820
4498b3702049M03445O28751m29401j124980m36512q88355R86104m51277k0009M40720
$$ plain form
4568 -23316458 -23197619 -24665343 -24743675 -22674714 -22268199 -22733900 -22904306 -24433784 -23363624 -23272603
4558 -23272603 -23102360 -22509008 -21165555 -21940075 -23028455 -21917822 -23618091 -23440614 -23263358 -22181312
4548 -22181312 -23155634 -22398204 -21888979 -23245482 -21565543 -23711553 -23905415 -22609813 -24640136 -24167496
4538 -24167496 -22778726 -23341014 -23661227 -23331847 -24989903 -23468929 -23518587 -25082258 -24398450 -24276367
4528 -24276367 -24239833 -24649141 -24187740 -25709306 -25024342 -26482001 -24016319 -24243802 -23124274 -20838526
4518 -20838526 -21182568 -21230500 -22920386 -24745355 -21990421 -23227213 -23382053 -22269461 -23084115 -21153394
4508 -21153394 -22882140 -22565299 -21584712 -22568220 -24540989 -24889923 -23397032 -23312759 -22324229 -23702049
4498 -23702049 -23298604 -22669853 -23099254 -24224234 -24660746 -25549101 -24562997 -25014274 -25034283 -24593563
4488b4593563K550988j050482k75025J539888j720451l30258R20193m89236j199014R86762
4478b3660198r31311J856723j130859Q75738R41784Q79320j670916M34079j366539J180860
4468b2591319O34459j230553P61312p2133L26266j584629J051940J248265O20403j911982
4458b2747971J247831j978160J271184k21723J48194n49114N22722j721708J502418
4449b2526327j708101Q8271K311281m97314R71682m40885k095249R06268q8443k82512
4439b3361329q6721p59509K84791J791218j560587J707157p66952j858547J386595J544702
4429b1679182j368540K85727O85900l17264m0413K85650l22822j093191l173Q95541O26244
4418b2045523m2497j564367M43892K71945m8912m03503P87374K50380N40590k37021n72387
$$ plain form
4488 -24593563 -22042575 -23093057 -23368082 -21828194 -23548645 -23878903 -22958710 -23447946 -24646960 -23660198
4478 -23660198 -24591509 -22734786 -23865645 -22989907 -22048123 -21168803 -22839719 -22405640 -23772179 -22591319
4468 -22591319 -21956860 -23187413 -22426101 -22498234 -22171968 -23756597 -22704657 -21456392 -20835989 -22747971
4458 -22747971 -21500140 -23478300 -22207116 -22428839 -22280645 -22829759 -22307037 -24028745 -22526327
4449 -22526327 -24234428 -24146157 -21834876 -22332190 -21360508 -21801393 -23896642 -22990374 -23078817 -23361329
4439 -23361329 -23448050 -24207559 -23922768 -22131550 -23692137 -21984980 -22751932 -24610479 -23223884 -21679182
4429 -21679182 -23047722 -22761995 -22076095 -22393359 -22433772 -22148122 -22470944 -23564135 -23567308 -22671767 -22045523
4418 -22045523 -22088020 -23652387 -23208495 -22936550 -22985462 -23388965 -22601591 -22351211 -21810621 -22047642 -22620029
4407b2620029j283470J062333j206465J270876j272618J2319K083198O2232r16335j362479
4397b4170438L35654J517634J22066K01822M09447k69447O86367k558182L54088R96143
4387b2374846j048529K42727m17571q58558m12690J791105j967812j10774n78165K240496
4377b3494617j067542o05216k249269k562126l405459k99256K9119426p881117m394805
4368a6839981j201517k450988J997079m7608m98295q06395Q19751j79200k04635j8486
4358a9430275k033491O10023j72638j643621n8459P59750L770R77270m7216p84681k003625
4347b3823193L852560j889769K615081n23011j381771m06587j45047k22148n3890J733735
4337b0244040K210138k102499M59236P4842k551947m19959K048111K73157j465136J560647
$$ plain form
4407 -22620029 -23903499 -22841166 -24047631 -22776755 -24049373 -24037054 -21953856 -21891624 -22807959 -24170438
4397 -24170438 -23834784 -22317150 -22195084 -21993262 -21583815 -21853262 -21166895 -23725077 -23370989 -22374846
4387 -22374846 -23423375 -23180648 -23598219 -24456777 -24869467 -23078362 -25046174 -25156948 -25735113 -23494617
4377 -23494617 -24562159 -25167375 -27416644 -29978770 -33384229 -33683485 -4564059 -12445176 -16839981
4368 -16839981 -18041498 -20492486 -18495407 -18543015 -19041310 -19847705 -19027954 -19207154 -19411789 -19430275
4358 -19430275 -21463766 -20853743 -21026381 -22670002 -22728461 -21968711 -21964941 -20987671 -21034887 -21819568 -23823193
4347 -23823193 -19970633 -21860402 -19245321 -19768332 -21150103 -21556690 -21701737 -21923885 -21977775 -20244040
4337 -20244040 -18033902 -20136401 -19677165 -19602323 -22154270 -22574229 -20526118 -20252961 -21718097 -20157450
4327b0157450n23774j350471J059549n14562Q33501k92372O31900n35454l20761j241625
4317b2411519k70551q90081J820557j747614M85426K600590k556135k39181L70755J167336
4307b1670417k99015J332627j326999k62194P44346J094009j15416p51551L16358M05822
4297b0532430j67025o17520p5425j433817J940606k91239m3396O5185l77308k132009
4287b3664378K199314J91469n39504r69705J584808j124576j179268Q74662K907675
4278a9719503K132933k378794l058694l80999K045150M89208J069795q27529J398258
4269a9230175m18167p72628P90143p75640k54870j035044Q74329j20824J575173j75045
4259a9542748L74842k024537N32593K878829r68932k284625J528129j508990n4489m92474
$$ plain form
4327 -20157450 -20681224 -22031695 -20972146 -21486708 -20653207 -20945579 -20313679 -20849133 -21169894 -22411519
4317 -22411519 -22682070 -23572151 -21751594 -23499208 -23013782 -20413192 -22969327 -23208508 -22837753 -21670417
4307 -21670417 -21969432 -20636805 -21963804 -22225998 -21481652 -20387643 -20503059 -21254610 -20938252 -20532430
4297 -20532430 -20699455 -21316975 -21392400 -22826217 -20885611 -21176850 -21220246 -21155061 -21532369 -23664378
4287 -23664378 -21465064 -21273595 -21813099 -22782804 -21197996 -22322572 -23501840 -22627178 -19719503
4278 -19719503 -17586570 -19965364 -23024058 -23405057 -21359907 -20870699 -19800904 -20628433 -19230175
4269 -19230175 -19648342 -20420970 -19630827 -20406467 -20661337 -21696381 -20822052 -20942876 -19367703 -19542748
4259 -19542748 -19167906 -21192443 -20659850 -17781021 -18749953 -21034578 -19506449 -21015439 -21069928 -21562402
4249b1562402J947138k3733j927434O82648N84708K314724r09353n07700O05820Q00445
4239a7995139j400898J889719o47508m69835M55700j62557k400811L131799o98834P8033
4229a8220331O08747j895670J538991k64106k09079P82362J192175k564411M621133
4220a4410189k574611K23931P81895M59154j969524L77628O18164N32256R84263Q64911
4210a4112122J140423M89634j166297K24868J115337J09310R7894k38891j537744q36695
4200a4714283k45603N09440R22347j339921N89957j7965J097374N42471M46860k628747
4190a4838070L52276J325725r21611J159283K824085o59950j260979J812724j877828
4181a2084345o27971K65846j12059r62913J078009q53622j85514j229054R21976j283362
$$ plain form
4249 -21562402 -19615264 -19638997 -21566431 -20883783 -20299075 -17984351 -18893704 -19401404 -18795584 -17995139
4239 -17995139 -19396037 -17506318 -18153826 -18623661 -18167961 -18330518 -20731329 -17599530 -18298364 -18220331
4229 -18220331 -17611584 -19507254 -17968263 -18232369 -18441448 -17659086 -16466911 -19031322 -14410189
4220 -14410189 -16984800 -16760869 -15978974 -15519820 -17489344 -17111716 -16493552 -15961296 -14977033 -14112122
4210 -14112122 -12971699 -12482065 -13648362 -13423494 -12308157 -12198847 -12100953 -12339844 -13877588 -14714283
4200 -14714283 -14959886 -14450446 -13528099 -14868020 -14278063 -14296028 -13198654 -12656183 -12209323 -14838070
4190 -14838070 -14485794 -13160069 -14081680 -12922397 -10098312 -10758262 -12019241 -10206517 -12084345
4181 -12084345 -12712316 -12446470 -12558529 -13521442 -12443433 -13297055 -13482569 -14711623 -13789647 -15073009
4171a5073009N85311k57447j353783K043461N50813q70899K405700j964739r62715j178588
4161a6075895j779838J992880J681565M42829n11877o74127K86804J085372j246213l4243
4151a4832743K87136j689254J624008n6346M43524p8403M84703m44759P980O64544j286000
4140a4875610J196360q21826L482899l429666P13687K34835R01391Q57912o17857O33745
4130a1724130J75401j136982n92075k649243J7633J349856J364850l233672L401208
4121a3027154j451590J070619R74035M4348r17258j075596R20093R22454J935128O48212
4111i956709P58698j271087J669405q57877j56946Q1565K156922n35899j194586j56865
4101i463379j147826M54936n73322j82425j889462L876761j153807n40569J802511K479894
$$ plain form
4171 -15073009 -14487698 -14745145 -16098928 -14055467 -13504654 -14375553 -11969853 -13934592 -14897307 -16075895
4161 -16075895 -17855733 -15862853 -14181288 -13738459 -14250336 -14924463 -14637659 -13552287 -14798500 -14832743
4151 -14832743 -14545607 -16234861 -14610853 -14667199 -14223675 -14302078 -13817375 -14262134 -14254154 -13589610 -14875610
4140 -14875610 -13679250 -14501076 -11018177 -14447843 -13734156 -13499321 -12597930 -11740018 -12357875 -11724130
4130 -11724130 -11548729 -12685711 -13277786 -15927029 -15909396 -14559540 -13194690 -16428362 -13027154
4121 -13027154 -14478744 -13408125 -12434090 -12389742 -13307000 -14382596 -13462503 -12540049 -10604921 -9956709
4111 -9956709 -9198011 -10469098 -8799693 -9657570 -9814516 -9732951 -7576029 -8111928 -9306514 -9463379
4101 -9463379 -10611205 -10156269 -10729591 -10912016 -12801478 -8924717 -10078524 -10619093 -8816582 -6336688
4091f336688q66937r71241p57270K896884j899628J917325k021441j671919P64065J946583
4081g000267J87628O67873o39440J903082J537643J443519q92638K432435K71426J269757
4071A181018q87719J886688K045963J261340n110230m496103J603891k613074L50611
4062d777615l115650L86833m693344l397922q52376L048729M885738L556889J267795
4053c690923j126631N289967K926825J569283J39329J210963M85753L144318N300166
4044A5249050K92623o180263p074869j565106r61338R58979J368194m149248j0146625
4035a2208603q781550l239360M899768M733701R231950M937163M554146L927706J003894
4026I058815N442508K024002M22534L871774P475093Q276819O428870M070460K490596
$$ plain form
4091 -6336688 -7203625 -8174866 -8932136 -6035252 -7934880 -6017555 -8038996 -9710915 -8946850 -7000267
4081 -7000267 -6812639 -6144766 -6784206 -4881124 -3343481 -1899962 -2792600 -360165 -88739 1181018
4071 1181018 293299 2179987 4225950 5487290 377060 -4119043 -2515152 -5128226 -4777615
4062 -4777615 -7893265 -7506432 -12199776 -15597698 -16450074 -13401345 -8515607 -4958718 -3690923
4053 -3690923 -4817554 472413 3399238 4968521 5107850 6318813 6804566 9948884 15249050
4044 15249050 15541673 9361410 2286541 721435 -239903 719076 2087270 -2061978 -12208603
4035 -12208603 -20990153 -24229513 -19329745 -14596044 -5364094 -426931 4127215 8054921 9058815
4026 9058815 14501323 16525325 16947859 20819633 28294726 36571545 43000415 47070875 49561471
4017D9561471r04122j049480L742030N696296J294448n573473n146987l156935J654606
4008D6117854N690839Q905905R197698Q613400N278717P907916J1279069O126613K589839
3999A11707850K401732J1682968J3781058J3448997J7170129J3254391L591695M335226
3991A91374046K449105O523677P383307M299879M8895K871320M345256Q324687J1376760
3982B38996932J0017817J0103231P436420K799755O853962J1044676P796911M350565
3974B99400269N459240Q392364J3449582J7872932J8018876R180515Q879884J0110831
3966C90764493J1862829K2909658K5704042K7442947K2294372M2731660P0285424P0430079
3958F84425504N0112379K4546442K4797919K0753352J5072083L3240771J3813304k5962153
$$ plain form
4017 49561471 48657349 47607869 51349899 57046195 58340643 52767170 47620183 44463248 46117854
4008 46117854 51808693 60714598 69912296 78525696 83804413 91712329 102991398 109118011 111707850
3999 111707850 114109582 125792550 139573608 153022605 170192734 183447125 187038820 191374046
3991 191374046 193823151 200346828 207730135 212030014 212078909 214950229 219295485 227620172 238996932
3982 238996932 249014749 259117980 266554400 269354155 276208117 287252793 295049704 299400269
3974 299400269 304859509 313251873 326701455 344574387 362593263 371773778 380653662 390764493
3966 390764493 402627322 425536980 451241022 478683969 500978341 543710001 613995425 684425504
3958 684425504 734537883 759084325 783882244 804635596 819707679 852948450 866761754 840799601
3950H40799601p3270629q4315306n7725545n8587980m4027011k9635733q578930O301134
3942D90959601N781031K4844119L8594238M6423692L1785865M9391858J08597364
3935G96377768J20126660Q3871425M2679742N0333376N0430387L0558949N5836977
3928A230215284J8297884n6599510j38230833j76699302j32414854j34535685j16654896
3921D93378088q1363043m3584199j7960691j6262823l820555K4407375J9212993J118899
3913C75126044j2595769K2624606M1362887M2356229K2841140K0087575L4194810K2105586
3905E68103108K0813082K3394842k5938725o1579548r3342110o8229971o0227551o5076091
3897B37917036m9826563l2239229j7830760j0174392j0900493K119605J457424q079899
$$ plain form
3950 840799601 767528972 683213666 625488121 566900141 522873130 493237397 484658467 490959601
3942 490959601 496740632 521584751 560178989 606602681 638388546 687780404 796377768
3935 796377768 916504428 1000375853 1043055595 1093388971 1143819358 1174378307 1230215284
3928 1230215284 1248513168 1191913658 1053682825 876983523 744568669 610032984 493378088
3921 493378088 412015045 368430846 350470155 334207332 330386777 354794152 374007145 375126044
3913 375126044 362530275 385154881 426517768 468873997 491715137 511802712 545997522 568103108
3905 568103108 588916190 612311032 586372307 524792759 431450649 363220678 302993127 237917036
3897 237917036 188090473 155851244 138020484 127846092 116945599 119065204 120522628 112442729
3889A12442729j9348557j9678934j2551836j1843297n756546j902404O227814J247446
3881D8836415k428930r4920J093454l309519l33523N421497R226361M172254k49511
3872F2333578m262820p47340R1799n93313L872261J863984J979082j818449l165004
3863E9553778n486104j302794l370847J619947j248397k149047l475482m249552l358757
3854C6532745M56438K006229J358558J861608P09684J177614n044737m462378J734128
3845C6329889J271808J022551k121807l393430k282498j919067l849971l014380K916764
3836B4959859J769117L19066k116584l00705j05431k99036l111991J365710k02709r67799
3826B1309497k433068j256604m354520m034960j279412j677628j018438n994507n912890
$$ plain form
3889 112442729 93094172 73415238 60863402 49020105 43263559 41361155 47588969 48836415
3881 48836415 46407485 46312565 47406019 44096500 43762977 49184474 58410835 62583089 62333578
3872 62333578 58070758 57323418 57415217 56821904 60694165 62558149 64537231 62718782 59553778
3863 59553778 54067674 52764880 49394033 51013980 49765583 47616536 44141054 39891502 36532745
3854 36532745 36989183 38995412 40353970 42215578 42925262 44102876 39058139 34595761 36329889
3845 36329889 37601697 38624248 36502441 33109011 30826513 28907446 25057475 22043095 24959859
3836 24959859 26728976 27048042 24931458 24630753 24525322 24226286 21114295 22480005 22277296 21309497
3826 21309497 18876429 17619825 13265305 9230345 7950933 6273305 5254867 -739640 -6652530
3817f652530l035419k014585l935070k455107j348562J841679M19432K716671K579184
3808a1884307k05479j59384K53938M82195J608693j566920j27548j003538J204997J698439
3798i698914N43329j324042p05542l779571j785659k435654j945237j887568k135074
3789b5153932k225687Q83481j15227J66360O36088k261281J138386J883980P18733J090485
3779b3238614o08002K424717k88379P0414j69091K305561m08223L45245l33338K08099
3769a9691611R77088O22392k509342p18757J323465j797350K857247l07780k341956
3760b1586604j436755q96400J123751J949636J647074r31117J599978o97842L6288j821661
3750b1013652o30403l94258K227950q64794J880849k74640p56797k43475r57632k804926
$$ plain form
3817 -6652530 -9687949 -11702534 -15637604 -18092711 -19441273 -17599594 -17180162 -14463491 -11884307
3808 -11884307 -12089786 -12249170 -11995232 -11513037 -9904344 -11471264 -11598812 -12602350 -11397353 -9698914
3798 -9698914 -9155585 -10479627 -11185169 -14964740 -16750399 -19186053 -21131290 -23018858 -25153932
3789 -25153932 -27379619 -26496138 -26611365 -26445005 -25808917 -28070198 -26931812 -25047832 -24329099 -23238614
3779 -23238614 -23846616 -21421899 -21710278 -21639864 -21808955 -19503394 -19911617 -19566372 -19899710 -19691611
3769 -19691611 -18714523 -18092131 -20601473 -21320230 -19996765 -21794115 -18936868 -19244648 -21586604
3760 -21586604 -23023359 -23919759 -22796008 -20846372 -19199298 -20130415 -18530437 -19228279 -19191991 -21013652
3750 -21013652 -21644055 -22038313 -19810363 -20675157 -18794308 -19068948 -19825745 -20069220 -21026852 -23831778
3740b3831778R43031L935045P76219J72139K57281k342034N95819K20236J012866J21969
3730a8139207K7746m478328J795131r3875L32380J57679k018911J400370J399620N91155
3720a9026240j149132m08148j587288Q55804o74352Q86771J443042J605142J292334
3711a6762067j635713P02660j475680K010739n74561j32229M64925n31946j103740r25500
3701a9963112l75871Q77520K942888r17062P83153j092549p44008M27431N76296k166525
3691a9651839k507777O64270J118055J071286O7746k91038k33047L11646L99252k86454
3681a9337900p95038M97636J174585L16748M40475J212878j610681j449996P11621J250355
3671a7589317l36772j255836O71021j59772j037014j217554Q33191j899007M68780K01800
$$ plain form
3740 -23831778 -22888747 -18953702 -18177483 -18005344 -17748063 -20090097 -19494278 -19274042 -18261176 -18139207
3730 -18139207 -18111461 -22589789 -20794658 -20888533 -20556153 -20398474 -22417385 -21017015 -19617395 -19026240
3720 -19026240 -20175372 -20583520 -22170808 -21315004 -21989356 -21102585 -19659543 -18054401 -16762067
3711 -16762067 -18397780 -17695120 -19170800 -17160061 -17734622 -17866851 -17401926 -17933872 -19037612 -19963112
3701 -19963112 -20338983 -19461463 -16518575 -17435637 -16652484 -17745033 -18489041 -18061610 -17485314 -19651839
3691 -19651839 -22159616 -21495346 -20377291 -19306005 -19238259 -19529297 -19762344 -19450698 -19051446 -19337900
3681 -19337900 -20132938 -19635302 -18460717 -18143969 -17703494 -16490616 -18101297 -19551293 -18839672 -17589317
3671 -17589317 -17926089 -19181925 -18510904 -18670676 -19707690 -20925244 -20092053 -21991060 -21522280 -21320480
3661b1320480P62082k841934M51192l0295Q89820N80564o78214q38990K374834j260448
3651b1911869k659985J651001L280086k457051K175458R7400r25882j230143k8520J9814
3641b1989691q16815J076679O94312m44484q7860k47376k230029J602660N72057j150508
3631b3021055j337571k578615N039567R10767O28454k080529j269978Q77811m05083j39560
3621b3375792o57553L59122J689752q97151L83466n42030Q87678Q34619m11030l24406
3611b2053325o71800k558890k64886J413603j065265j39652K211662k83608n304734
3602b8716895N306424L62434q10300J941372p89765n5848k102013L167630q41615k63025
3592b2801601J251512j542871l268R82676n93577q09957J526354j70886N77120l23921
$$ plain form
3661 -21320480 -20558398 -23400332 -22949140 -22979435 -22089615 -21509051 -22187265 -23026255 -20651421 -21911869
3651 -21911869 -24571854 -22920853 -19640767 -22097818 -19922360 -19824960 -20750842 -21980985 -22009505 -21989691
3641 -21989691 -22806506 -21729827 -21035515 -21479999 -21567859 -21815235 -24045264 -22442604 -21870547 -23021055
3631 -23021055 -24358626 -26937241 -21897674 -20986907 -20358453 -22438982 -23708960 -22831149 -23236232 -23375792
3621 -23375792 -24033345 -23674223 -21984471 -22881622 -22498156 -23040186 -22152508 -21317889 -21728919 -22053325
3611 -22053325 -22725125 -25284015 -25548901 -24135298 -25200563 -25340215 -23128553 -23412161 -28716895
3602 -28716895 -23410471 -23048037 -23858337 -21916965 -22706730 -22762578 -24864591 -21696961 -22538576 -22801601
3592 -22801601 -21550089 -23092960 -23096228 -22113552 -22707129 -23517086 -21990732 -22161618 -21584498 -21908419
3582b1908419r58447K54906o25561j797203J133150K68537N77268J304786l32429j210466
3572b3293878J342268N43556p64150r43847J2735j511594K025534r66586J661063n05494
3562b2400393J352438k192633M38688J607265j914075l51507J619707o85676J18973k77547
3552b2684760K75585O79130j310305O00363M54262n75882j467456J269460j6852r3468
3542b2869923Q62148k89517O27764K12271k003580J15397r01848J244111o2411L80481
3532b2685107J378220k294815l29993J424432n46803m74159j116J37238N85798l75803
3522b3182108J951086j15719k564264j593998Q34628O19218p14877o64514R61047K141019
3512b2328482m37973m40728R94520l37057q85506M03937k09269n52562l95532k103849
$$ plain form
3582 -21908419 -22866866 -22611960 -23237521 -25034724 -23901574 -23633037 -23055769 -21750983 -22083412 -23293878
3572 -23293878 -21951610 -21408054 -22172204 -23116051 -23103316 -24614910 -22589376 -23555962 -21894899 -22400393
3562 -22400393 -21047955 -23240588 -22801900 -21194635 -23108710 -23460217 -21840510 -22526186 -22407213 -22684760
3552 -22684760 -22409175 -21730045 -23040350 -22439987 -21985725 -22561607 -24029063 -22759603 -22776455 -22869923
3542 -22869923 -22007775 -22297292 -21669528 -21457257 -23460837 -23345440 -24247288 -23003177 -23065588 -22685107
3532 -22685107 -21306887 -23601702 -23931695 -22507263 -23054066 -23528225 -23529341 -23392103 -22806305 -23182108
3522 -23182108 -21231022 -21346741 -23911005 -25505003 -24670375 -24051157 -24766034 -25430548 -24469501 -22328482
3512 -22328482 -22766455 -23207183 -22212663 -22549720 -23435226 -23031289 -23240558 -23793120 -24188652 -26292501
3502b6292501K277012N20221l619626N097605j146371r5079l2324J292203j422536J367197
3492b2054199j919709q28174M43017j293427M95487J056400J77926k485879K361607
3483b4046951K993801J04721o00719k441801J619799j222105K599040j473484L26838
3474b2140861r74617j44300P49326r41648j078104p1704j38103K913481m15646m28464
3464b2670640N37626n37101j147437j502589K809941j226136J89945k09434M78531M51981
3454b2825313J05931j52099J463546j404287r77561r33905M26025O75255J149903j054625
3444b3527130L103973k916039O94005J436675p64949r13048L60756n4016p89524Q85353
3434b2483944j864534k05592J043781R80256r62309J223670l40311j85228j046756q86238
$$ plain form
3502 -26292501 -24015489 -23495268 -27114894 -22017289 -23163660 -23258739 -23291063 -21998860 -23421396 -22054199
3492 -22054199 -23973908 -24802082 -24359065 -25652492 -25157005 -24100605 -23922679 -26408558 -24046951
3483 -24046951 -21053150 -20948429 -21549148 -23990949 -22371150 -23593255 -20994215 -22467699 -22140861
3474 -22140861 -23115478 -23259778 -22510452 -23452100 -24530204 -24601908 -24740011 -21826530 -22242176 -22670640
3464 -22670640 -22133014 -22670115 -23817552 -25320141 -22510200 -23736336 -23546391 -23755825 -23277294 -22825313
3454 -22825313 -22719382 -22871481 -21407935 -22812222 -23789783 -24723688 -24297663 -23622408 -22472505 -23527130
3444 -23527130 -20423157 -23339196 -22645191 -21208516 -21973465 -22886513 -22525757 -22579773 -23369297 -22483944
3434 -22483944 -24348478 -24554070 -23510289 -22530033 -23492342 -22268672 -22608983 -22794211 -23840967 -24727205
3424b4727205L698680j618716J469270j544796j541866K133968m38674l74978R29905
3415b2014412J13113k96916k13624j103650Q06430J12527j795369L58017Q64565r11813
3405b4081132J211610J042952J152201k169891L94453Q87675j518152l19705O10874M60690
3395b2328425n53136k94059J071495J074082k137904o48663P29398N9757R13299r5758
3385b2209914Q3630l79299L80761j85137q59588M90808k37193p71403N28688J230295
3375b1928352j121351n70229J349049P47609j218900K579083k904823Q54323J47220M45547
3365b1620824j104135j68846j055222J069108l76894n12309J893575N17839j380729o12272
3355b3350709M50187R0657R25732n05525O31577j814055j374572K140547M88582J44283
$$ plain form
3424 -24727205 -21028525 -22647241 -21177971 -22722767 -24264633 -22130665 -22569339 -22944317 -22014412
3415 -22014412 -21901299 -22198215 -22411839 -23515489 -22709059 -22596532 -24391901 -24033884 -23169319 -24081132
3405 -24081132 -22869522 -21826570 -20674369 -22844260 -22449807 -21562132 -23080284 -23399989 -22789115 -22328425
3395 -22328425 -22881561 -23175620 -22104125 -21030043 -23167947 -23816610 -23087212 -23027455 -22114156 -22209914
3385 -22209914 -22126284 -22505583 -22124822 -22309959 -23169547 -22678739 -22915932 -23687335 -23158647 -21928352
3375 -21928352 -23049703 -23619932 -22270883 -21523274 -22742174 -20163091 -23067914 -22213591 -22066371 -21620824
3365 -21620824 -22724959 -22893805 -23949027 -22879919 -23256813 -23769122 -21875547 -21357708 -22738437 -23350709
3355 -23350709 -22900522 -22809865 -21884133 -22389658 -21758081 -23572136 -24946708 -22806161 -22317579 -22173296
3345b2173296k70944l7782L50337j769597o5722J980914l33114k858173J677054M63583
3335b3036740j884163J094168R67574j83467j380278m70664K898209n56902o52155J54023
3325b3050395m386K273169j171537o42116L68783p70665J644554n39861l37761j72600
3315b2402815l59492j078333m66251J280479k75960k60839n80059J086210j167181R57622
3305b3266619l21243O86990J224915j214328l03552K17907M90816m03579J430959j627915
3295b3085649j258505P57408l5929l47160R00968R92282m58707j467860L28952J224396
3285b2449804R99340k93571J78477j444615O86178j42454l19531j108729O6776K63827
3275b3564106K100152r63385L09091J565123j545101P74269j39608j577383r51496L81112
$$ plain form
3345 -22173296 -22444240 -22482022 -22131685 -23901282 -23967004 -21986090 -22319204 -25177377 -23500323 -23036740
3335 -23036740 -24920903 -23826735 -22859161 -23042628 -24422906 -24893570 -21995361 -22552263 -23204418 -23050395
3325 -23050395 -23054781 -20781612 -21953149 -22595265 -22226482 -22997147 -21352593 -21892454 -22230215 -22402815
3315 -22402815 -22762307 -23840640 -24306891 -23026412 -23302372 -23563211 -24143270 -23057060 -24224241 -23266619
3305 -23266619 -23587862 -22900872 -21675957 -22890285 -23193837 -22975930 -22485114 -22888693 -21457734 -23085649
3295 -23085649 -24344154 -23586746 -23622675 -23969835 -23068867 -22076585 -22535292 -24003152 -23674200 -22449804
3285 -22449804 -21450464 -21744035 -21565558 -23010173 -22323995 -22466449 -22785980 -23894709 -23827933 -23564106
3275 -23564106 -21463954 -22427339 -22118248 -20553125 -22098226 -21323957 -21463565 -23040948 -23992444 -23611332
3265b3611332q0020J167050o65014l58175r7019K33484N16633l26978m90255J363369P6658
3254b2271599q68609l0805L13004N62767R8203n87806l50879j263158J629791K32452
3244b2536639j695716J265136N875k7948J21514q53346K137950P5658k9394J711696
3234a9825214l708140j792554J992927o42713P4574k97278n41491j930815K581567K255586
3224b1833551j534975K325393r37239Q87749j166952J675783k882210K024123l166289
3215b4608168L628909l202630J48186o39050J448090M92001l85858Q92021k538186J310808
3205b3453877Q93271K87435P69863j862274O68931J653787j368787M38603L05808j751294
3195b3418534n02764j079169K740877K377109J57071l200223p33869j885332L602193
$$ plain form
3265 -23611332 -23691352 -22524302 -23189316 -23547491 -23644510 -23411026 -22894393 -23221371 -23711626 -22348257 -22271599
3254 -22271599 -23140208 -23171013 -22858009 -22295242 -22197039 -22784845 -23135724 -24398882 -22769091 -22536639
3244 -22536639 -24232355 -22967219 -22961344 -22989292 -22867778 -23721124 -21583174 -21507516 -21536910 -19825214
3234 -19825214 -23533354 -25325908 -23332981 -23975694 -23901120 -24198398 -24739889 -26670704 -24089137 -21833551
3224 -21833551 -23368526 -21043133 -21980372 -21092623 -22259575 -20583792 -23466002 -21441879 -24608168
3215 -24608168 -20979259 -24181889 -24033703 -24672753 -23224663 -22732662 -23118520 -22226499 -24764685 -23453877
3205 -23453877 -22560606 -22273171 -21503308 -23365582 -22696651 -21042864 -22411651 -21973048 -21667240 -23418534
3195 -23418534 -23921298 -25000467 -22259590 -19882481 -19725410 -22925633 -23659502 -25544834 -21942641
3186b1942641j03356K38922j21925k256794J821817Q41846j16662k03781L39864l85037
3176b1887747r17197J034270j185859J73897P33250J377007r36986l34840J39013N38277
3166b1266915j795118j425307q9291O95592N89571K25861j742120J218162J222931Q59962
3156b1506672m74150R291o30850j109180o3525J290224k371175P28038J971771j48502
3146b2304730j650853J859003j521255J276915k54073p26501r61181Q04366j70270N66690
3136b3081889m46120j266461P63948J28853P76585j55586l76236R57038L30641J380184
3126b0989043p1798k493925N00522N97903K33399N60833j970588K95611N2795q442P08388
3115b2584345j930107O52419l70727L31641K84557k5535N87395J488057j071738j373407
$$ plain form
3186 -21942641 -22045997 -21807075 -21929000 -24185794 -22363977 -21522131 -21638793 -21842574 -21502710 -21887747
3176 -21887747 -22804944 -21770674 -22956533 -22782636 -22049386 -20672379 -21609365 -21944205 -21805192 -21266915
3166 -21266915 -23062033 -24487340 -24576631 -23881039 -23291468 -23065607 -24807727 -23589565 -22366634 -21506672
3156 -21506672 -21980822 -21971531 -22602381 -23711561 -23775086 -22484862 -24856037 -24127999 -22156228 -22304730
3146 -22304730 -23955583 -22096580 -23617835 -22340920 -22594993 -23321494 -24282675 -23478309 -23648579 -23081889
3136 -23081889 -23528009 -24794470 -24030522 -23901669 -23125084 -23280670 -23656906 -22699868 -22369227 -20989043
3126 -20989043 -21060841 -23554766 -23054244 -22456341 -22222942 -21662109 -23632697 -23337086 -23284291 -23292733 -22584345
3115 -22584345 -24514452 -23862033 -24232760 -23901119 -23616562 -23642097 -23054702 -21566645 -22638383 -24011790
3105b4011790n66981N16710N15484J15776J360505j310596K80524O12121k81395k598980
3095b5368622K254228j717136J459441m20549J386288J065610n323651J370837J847642
3086b3445912J125436j176900J040455j795590J157765k50389o71955P17143k507766
3077b5807713J925711q58861J213764R83361r54094J50092M09057L079795l658702n40718
3067b4058308j062904q1432J162605l934598O399558m04917j406j384665K42117J411044
3057b1712906o93555n35201p90800J834304l4570j56066m26014r13554R52194j51124
3047b2627292P99262k09556m7982k939486O47708K096500j293867j907270M395635l622026
3037b4708374J286200k2950N19820J042376L94122k093819K03563j334273K478031R9309
$$ plain form
3105 -24011790 -24578771 -24062061 -23546577 -23430801 -22070296 -23380892 -23100368 -22488247 -22769642 -25368622
3095 -25368622 -23114394 -24831530 -23372089 -23792638 -22406350 -21340740 -26664391 -25293554 -23445912
3086 -23445912 -22320476 -23497376 -22456921 -24252511 -23094746 -23345135 -24017090 -23299947 -25807713
3077 -25807713 -23882002 -24740863 -23527099 -22543738 -23497832 -23347740 -22938683 -19858888 -23517590 -24058308
3067 -24058308 -25121212 -25202644 -24040039 -27974637 -21575079 -21979996 -21981402 -23366067 -23123950 -21712906
3057 -21712906 -22406461 -22941662 -23732462 -21898158 -21932728 -22088794 -22514808 -23428362 -22476168 -22627292
3047 -22627292 -21828030 -22037586 -22085568 -25025054 -24377346 -22280846 -23574713 -25481983 -21086348 -24708374
3037 -24708374 -23422174 -23445124 -22925304 -21882928 -21488806 -23582625 -23379062 -24713335 -22235304 -22135995
3027b2135995m41785J13849L624952l019686k723899L53438m9078l45504R22966k50575
3017b3951317K227046k119788L40352L1275J625127o9175k777088p11688J957467p51454
3007b4199243J780994K3929k501981J437607k045144M45043M20189J520493J57649R56850
2997b2003614j863503j086061K404845J038526k415599K42506L98050j603046M0941K6003
2987b4820952M08476L06909p87634Q27109J13602R16827j168263n94763o20345J086104
2977b4332930j714689R75171R34827J507169j948682O2410j554454K857237l88198o94772
2967b4296911J412919l27935o66069P81742j195224N2048Q52847Q92671r44418P62182
2957b2676148j128583O29316J137192L65853j837189M8667r23058Q03598L42683j274696
$$ plain form
3027 -22135995 -22577780 -22463931 -18838979 -21858665 -24582564 -24229126 -24278204 -24623708 -23700742 -23951317
3017 -23951317 -21724271 -23844059 -23503707 -23472432 -21847305 -21916480 -24693568 -25405256 -23447789 -24199243
3007 -24199243 -22418249 -22394320 -24896301 -23458694 -25503838 -25058795 -24638606 -23118113 -22960464 -22003614
2997 -22003614 -23867117 -24953178 -22548333 -21509807 -23925406 -23682900 -23284850 -24887896 -24846955 -24820952
2987 -24820952 -24412476 -24105567 -24893201 -24066092 -23952490 -23035663 -24203926 -24798689 -25419034 -24332930
2977 -24332930 -26047619 -25072448 -24137621 -22630452 -24579134 -24516724 -26071178 -23213941 -23602139 -24296911
2967 -24296911 -22883992 -23211927 -23877996 -23096254 -24291478 -24239430 -23386583 -22493912 -23438330 -22676148
2957 -22676148 -23804731 -23175415 -22038223 -21672370 -23509559 -23460892 -24383950 -23580352 -23237669 -24512365
2947b4512365m45655P32755o11230J579368N51848k059552J691302j255640K12426N71010
2937b3545733j179245m19543J105954m3879k6443j115479J674582q3490r4626l03285
2927b4031187R19869j089146J32501J069512N29947j093641k515365J724789n86955
2918b4939676j406059J901080l62894J579625M461J15869j183532M11215O34420j91668
2908b3437159o99765k89864J833033j598580K08019l89433Q2194j127592J806424p01356
2898b4314079L97796j66307l9764J69297l80691o65700L12125O80490J463J09464P7269
2887b3818637P16422j522735O86034J012356J22995j035114r76194P1146O66098O18554
2877b3459075L68170r25260j264893L51663Q63624J672675j446339j30486l60361J484615
$$ plain form
2947 -24512365 -24958020 -24225265 -24836495 -23257127 -22705279 -24764831 -23073529 -24329169 -24116743 -23545733
2937 -23545733 -24724978 -25144521 -24038567 -24082446 -24108889 -25224368 -23549786 -23633276 -23727902 -24031187
2927 -24031187 -23111318 -24200464 -24067963 -22998451 -22468504 -23562145 -26077510 -24352721 -24939676
2918 -24939676 -26345735 -24444655 -24807549 -23227924 -23223463 -23107594 -24291126 -23879911 -23245491 -23437159
2908 -23437159 -24136924 -24426788 -22593755 -24192335 -23984316 -24373749 -24291555 -25419147 -23612723 -24314079
2898 -24314079 -23916283 -24082590 -24122354 -23953057 -24333748 -24999448 -24687323 -24006833 -24005370 -23895906 -23818637
2887 -23818637 -23102215 -24624950 -23938916 -22926560 -22803565 -23838679 -24814873 -24743727 -24077629 -23459075
2877 -23459075 -23090905 -24016165 -25281058 -24929395 -24065771 -22393096 -23839435 -23969921 -24330282 -22845667
2867b2845667j186113J081598M73876j348485P49290L723718p042609J57071J075066
2858b5162255l94859J358023n42439J832902j178844k480263K401300L30117j98092n44621
2848b4579031l23625p3669J147175m609258L031206m27853K591936M87574j106611j81427
2838b4043583J142657o64783j339009l52964m36007K19517O01562K22746K60805J55070
2828b4233989K18249l88057k04942q3134P41970j308372J117126N70832p33422L69848
2818b3933891j870935q9297O30338K959698q14432k415926J281118K245276r88203k605179
2808b5601433L135260j424617J49350l48607r7300j59605r26095J97348Q04767R64552
2798b3306380O74383j117500l64801l32611P68620M6366j217762q89679J175176k610298
$$ plain form
2867 -22845667 -24031780 -22950182 -22476306 -23824791 -23075501 -19351783 -26394392 -26237321 -25162255
2858 -25162255 -25557114 -24199091 -24741530 -22908628 -24087472 -26567735 -24166435 -23836318 -24034410 -24579031
2848 -24579031 -24902656 -24976325 -23829150 -28438408 -25407202 -25835055 -23243119 -22755545 -23862156 -24043583
2838 -24043583 -22900926 -23565709 -24904718 -25257682 -25693689 -25474172 -24872610 -24649864 -24389059 -24233989
2828 -24233989 -24015740 -24403797 -24608739 -24691873 -23949903 -25258275 -24141149 -23570317 -24303739 -23933891
2818 -23933891 -25804826 -25894123 -25263785 -22304087 -23118519 -25534445 -24253327 -22008051 -22996254 -25601433
2808 -25601433 -22466173 -23890790 -23741440 -24090047 -24187347 -24346952 -25273047 -25075699 -24270932 -23306380
2798 -23306380 -22631997 -23749497 -24114298 -24446909 -23678289 -23631923 -24849685 -25739364 -24564188 -27174486
2788b7174486M755721j51867j183054P56070L30561j240208L86974O09461q10421m51718
2778b4172967j330959J405418M10827j423571l34067P15491O70114L21259K611136k876987
2768b4004306k91914O41285o22316J590831j091047j969395J150680p02884J196359k4773
2758b4127480J56492j300740J947657j87085j166130n19029J010892Q77154m74717J5821
2748b3767165j732211m90882J353052J49094l27831P65083q09521m56005k214512K106249
2738b5424649J143017l01985J70028J91686N59715O69202l34615Q0579j743955J50074
2728b4840903o12117K06688l336849K950738K52165J216138r02587R11992j908925k49163
2718b6312823J642888L72117r27736J994406k166010J16482J361193Q2164j897308R49019
$$ plain form
2788 -27174486 -22418765 -22570632 -23753686 -22997616 -22667055 -23907263 -23520289 -22910828 -23721249 -24172967
2778 -24172967 -25503926 -24098508 -23687681 -25111252 -25445319 -24729828 -24059714 -23738455 -21127319 -24004306
2768 -24004306 -24296220 -23654935 -24277251 -22686420 -23777467 -25746862 -24596182 -25299066 -24102707 -24127480
2758 -24127480 -23970988 -25271728 -23324071 -23511156 -24677286 -25196315 -24185423 -23308269 -23782986 -23767165
2748 -23767165 -25499376 -25990258 -24637206 -24488112 -24815943 -24050860 -24860381 -25316386 -27530898 -25424649
2738 -25424649 -24281632 -24583617 -24413589 -24221903 -23662188 -22992986 -23327601 -23247022 -24990977 -24840903
2728 -24840903 -25453020 -25246332 -28583181 -25632443 -25380278 -24164140 -25066727 -24154735 -26063660 -26312823
2718 -26312823 -24669935 -24297818 -25225554 -23231148 -25397158 -25280676 -23919483 -23837319 -25734627 -24785608
2708b4785608K46087J85838j020694J086677P53992J41039l50989J375452j954808j22612
2698b4445626M01641J13427K4077r863r50275J790572p98511L54781q95560j495972R53382
2687b4957927O01308p2232m66185Q45225o19259L26121k23297O01939r21486o65738
2677b5551531J322872r71918m25304J493172r27882j92062J346556j97597J69455J50711
2667b3783528l840118K08009K122413j157402K714120j201193K148257q21010p73430
2658b4383882m79105o62874Q91401o62592L4053M632P145p11678J643930O983j705411
2647b6017398P39830J191540n80551o11997q3566J561807l781k56826j397009J055038
2637b4402913l63879q76509R23509j041910R22123j486066m74422L89935k242614k384925
$$ plain form
2708 -24785608 -24539521 -24353683 -25374377 -24287700 -23533708 -23392669 -23743658 -22368206 -24323014 -24445626
2698 -24445626 -24043985 -23930558 -23906481 -23916344 -24866619 -23076047 -23874558 -23519777 -24415337 -25911309 -24957927
2687 -24957927 -24356619 -24428851 -24895036 -24049811 -24669070 -24342949 -24566246 -23964307 -24885793 -25551531
2677 -25551531 -24228659 -25200577 -25625881 -24132709 -25060591 -25252653 -23906097 -24103694 -23934239 -23783528
2667 -23783528 -27623646 -27415637 -25293224 -26450626 -23736506 -24937699 -22789442 -23610452 -24383882
2658 -24383882 -24862987 -25525861 -24634460 -25297052 -25262999 -25258367 -25251222 -25962900 -24318970 -24311987 -26017398
2647 -26017398 -25277568 -24086028 -24666579 -25278576 -25362142 -23800335 -23804116 -24060942 -25457951 -24402913
2637 -24402913 -24766792 -25643301 -24719792 -25761702 -24839579 -26325645 -26800067 -26410132 -28652746 -31037671
2627c1037671J0815654j541221o44224k242744L325158k485586m42155J859482k10301
2618b2603608J4224o21375j114499J310341o45264K82104k32537J639254O30118n983733
2608b7324975K992682q375Q49668l62041o27487Q39393l71794j39425N74736Q83874
2598b2693744j718242M42427r81654J107431j278211J161184r92679r77262R70122M35098
2588b4525530O23353k324894K759081j288593Q71537J877216k535842P77504j892254
2579b5658422J949517k02118k74623k44143l806294L909012q03034J03121P12761k62993
2569b4577216o5348k01429L9460m85538N27177M15933r7433k448649K378533J65083o40779
2558b4990206k48770R80546J16789M26194j141164j215403J142890L71977l51728j690733
$$ plain form
2627 -31037671 -20222017 -21763238 -22407462 -24650206 -21325048 -23810634 -24252789 -22393307 -22603608
2618 -22603608 -22589384 -23210759 -24325258 -23014917 -23660181 -23378077 -23610614 -21971360 -21341242 -27324975
2608 -27324975 -24332293 -24340668 -23491000 -23853041 -24480528 -23641135 -24012929 -24152354 -23577618 -22693744
2598 -22693744 -24411986 -23969559 -24951213 -23843782 -25121993 -23960809 -24953488 -25930750 -24960628 -24525530
2588 -24525530 -23902177 -26227071 -23467990 -24756583 -23885046 -22007830 -24543672 -23766168 -25658422
2579 -25658422 -23708905 -23911023 -24185646 -24429789 -28236083 -24327071 -25130105 -25026984 -24314223 -24577216
2569 -24577216 -24642564 -24843993 -24804533 -25290071 -24762894 -24346961 -24444394 -26893043 -24514510 -24349427 -24990206
2558 -24990206 -25238976 -24258430 -24141641 -23715447 -24856611 -26072014 -24929124 -24557147 -24908875 -26599608
2548b6599608P06903Q56499J9698J614822j447503J493047k47557J74390q45691m43113
2538b4718113r14833K42297J53996L718057j649315j907029K54041K86571k624123J900746
2528b5257705R43481j899239J391149k296910L331426k172425N53059J08406L10322n97054
2518b5585490l7191O27398J433340L0542J002140k600229R89060n33512K04735J010973
2508b3458234j771255K86532Q0538K60809n32667k01646R83325r2737L82652J077718
2498b2984965j082165j881546J923804J86863p91470q73778J029311O56906j328123
2489b5145163K131891j45629j715562o57714O74689j73966k15694J09692r18965J880061
2479b4176360j310938L82198k45127J073448K52261l177922K702028L20705N95140K02959
$$ plain form
2548 -26599608 -25892705 -25036206 -25016508 -23401686 -24849189 -23356142 -23603699 -23429309 -24275000 -24718113
2538 -24718113 -25632946 -25390649 -25236653 -21518596 -23167911 -25074940 -24820899 -24534328 -27158451 -25257705
2528 -25257705 -24314224 -26213463 -24822314 -27119224 -23787798 -25960223 -25407164 -25298758 -24988436 -25585490
2518 -25585490 -25622681 -24995283 -23561943 -23531401 -22529261 -25129490 -24140430 -24673942 -24469207 -23458234
2508 -23458234 -25229489 -24942957 -24862419 -24601610 -25134277 -25335923 -24352598 -24445335 -24062683 -22984965
2498 -22984965 -24067130 -25948676 -24024872 -23838009 -24629479 -25503257 -24473946 -23817040 -25145163
2489 -25145163 -23013272 -23158901 -24874463 -25532177 -24857488 -25031454 -25247148 -25137456 -26056421 -24176360
2479 -24176360 -25487298 -25105100 -25350227 -24276779 -24024518 -27202440 -24500412 -24179707 -23584567 -23381608
2469b3381608l83961k46442k81282o03951M42371K0812K788635j481732n57083K40323
2459b3443918j74599P93199o36326p36584k016607Q81327k1833K28742P16088N87678
2449b3822833j81729n10585Q08663q87990R30516k80449o51369J428185j327052K62157
2439b4232486J537528k330328l96573L94880n57601O83692O92111M05095j865177n69326
2429b6238185J754631j63753j00263O85311j961523M134744j002796k72135n64194L29244
2419b3398919k122035K566879r37876m90663J51354O72447L01597o13275J647880n7437
2409b2280048k766433l36433J714658M87526n36706l82833j716559K130612j409789M14889
2399b4681116o60080m24889K697533M32545j773805O36185N85206k00490j132519M127665
$$ plain form
2469 -23381608 -23765569 -24012011 -24293293 -24897244 -24454873 -24434061 -21645426 -23127158 -23684241 -23443918
2459 -23443918 -23618517 -22825318 -23461644 -24198228 -26214835 -25333508 -25355341 -25126599 -24410511 -23822833
2449 -23822833 -24004562 -24515147 -23706484 -24594474 -23663958 -23944407 -24595776 -23167591 -24494643 -24232486
2439 -24232486 -22694958 -25025286 -25421859 -25026979 -25584580 -24900888 -24208777 -23803682 -25668859 -26238185
2429 -26238185 -24483554 -24647307 -24747570 -24062259 -26023782 -21889038 -22891834 -23163969 -23728163 -23398919
2419 -23398919 -25520954 -22954075 -23891951 -24382614 -24231260 -23558813 -23257216 -23870491 -22222611 -22280048
2409 -22280048 -25046481 -25382914 -23668256 -23180730 -23717436 -24100269 -25816828 -23686216 -25096005 -24681116
2399 -24681116 -25341196 -25766085 -23068552 -22636007 -24409812 -23773627 -23188421 -23388911 -24521430 -20393765
2389b0393765k048894j055947J316148p62511p27156R82230j395415J437764Q05131k78882
2379b2121297j5534q27778p20550J599424p86546K710474k545341m52241j315345L304987
2369b1169747M20085J218169J591342j919364M0861R93706N52772j254051m6415J560955
2359a8011687N72167L6113M7040j081523j89177N42471J976693l555277P43903K712934
2349a6206343J66240J603851j671699J106518k29324P59077m79293m87547O07844J891072
2339a2939604J505233j99239l60483q24573J353321K52801m13862K33267n13676K407106
2329i499709j380223J00662R73810K95489L87603k09654N38858L432377r85956k838339
2319i185082k060042K90274L702283l14911n17926J954256J311553j312972J108208J22147
$$ plain form
2389 -20393765 -22442659 -23498606 -22182458 -22944969 -23672125 -22689895 -24085310 -22647546 -21842415 -22121297
2379 -22121297 -22136831 -22964609 -23685159 -22085735 -22872281 -20161807 -22707148 -23159389 -24474734 -21169747
2369 -21169747 -20749662 -19531493 -17940151 -19859515 -19818654 -18824948 -18272176 -19526227 -19572642 -18011687
2359 -18011687 -17439520 -17403407 -17356367 -18437890 -18627067 -18084596 -16107903 -19663180 -18919277 -16206343
2349 -16206343 -16040103 -14436252 -16107951 -15001433 -15230757 -14471680 -14950973 -15438520 -14830676 -12939604
2339 -12939604 -11434371 -11633610 -11994093 -12818666 -11465345 -11212544 -11626406 -11393139 -11906815 -9499709
2329 -9499709 -10879932 -10779270 -9805460 -9509971 -9122368 -9332022 -8793164 -5360787 -6346743 -9185082
2319 -9185082 -11245124 -10954850 -7252567 -7567478 -8085404 -6131148 -4819595 -6132567 -5024359 -4902212
2309d902212q32269J922291k36013r8639O39905p60602Q03885k16765P28279J534801
2299a417339j668929l24867J170591p67639j374604L431247n54416j395217J230425
2290a670748J021969p87312J549779j001846m03780j203560J327654J242875O46072
2281G21103J349418j685955K491629Q04662M10915L22080j40636J266064j714535o6617
2271C758128J853564m14281J8678k87737J687744Q44006q36009K230122R7993q71294
2261H080914P45120j277078N30805n90774o47871R68898O49097P59295O31085J313860
2251A1163351l1535r77272Q34627j39512J004380j343869Q02504P02040J635787q41637
2241A2808864N3270j087924J310319P32752q55794J741197n28129M47007J916318P24952
$$ plain form
2309 -4902212 -5734481 -3812190 -4048203 -4146842 -3506937 -4267539 -3463654 -3680419 -2952140 -1417339
2299 -1417339 -3086268 -3411135 -2240544 -3008183 -4382787 -951540 -1505956 -2901173 -1670748
2290 -1670748 -648779 -1436091 113688 -888158 -1291938 -2495498 -1167844 75031 721103
2281 721103 2070521 384566 2876195 3680857 4091772 4413852 4273216 5539280 3824745 3758128
2271 3758128 5611692 5197411 5216089 4928352 6616096 7460102 6624093 8854215 8952208 8080914
2261 8080914 8826034 7548956 8079761 7488987 6841116 7810014 8459111 9218406 9849491 11163351
2251 11163351 11131816 10154544 10989171 10849659 11854039 10510170 11312674 12014714 13650501 12808864
2241 12808864 12862134 11774210 13084529 13817281 12961487 14702684 14174555 14621562 16537880 17262832
2231A7262832Q38200p05473J801215j895193J03583k92304K342135K36794K32578J076502
2221B1000869J322292j133524j76678J882591K506087N43287K47733M25995l41168K217420
2211B8494904M79516K939164m41494k68942j435983J577602N26668R34308J003383J476380
2201C5285506K013459o32893Q95049K483995L79722j041304k73681J048307J605328
2192D1763488j453341M510399K495901P50360r38036J938953J74549m45361K416780n2468
2182E1161224k19953r37806p69775k0909J459603j090152O235218k812179L89886N46660
2172E3941817j8182J336677K845338J004604k050770O26600K535224K274848k591017
2163E9905139J535547Q48694K288890L110347J263867L155145J789149K234718K874119
$$ plain form
2231 17262832 18101032 17395559 19196774 17301581 17405164 17112860 19454995 19691789 19924367 21000869
2221 21000869 22323161 21189637 21012959 22895550 25401637 25944924 26192657 26618652 26277484 28494904
2211 28494904 28974420 31913584 31472090 31203148 29767165 31344767 31871435 32805743 33809126 35285506
2201 35285506 37298965 36666072 37561121 40045116 40424838 39383534 39109853 40158160 41763488
2192 41763488 40310147 44820546 47316447 48066807 47128771 49067724 49242273 48796912 51213692 51161224
2182 51161224 50941271 50003465 49233690 49212781 50672384 49582232 55817450 53005271 53395157 53941817
2172 53941817 53923635 55260312 58105650 59110254 57059484 57686084 60221308 62496156 59905139
2163 59905139 61440686 62289380 64578270 67688617 68952484 72107629 73896778 76131496 79005615
2154G9005615K642389M017971K293100L647425M817484L540786J916089K154557M020429
2145A08055845L25998P6823J008623P54681J636471p72875k29049o59617O1422n9660
2135A10198662j834616J957642K27820o55781j165176K705018K93451Q79766l46283
2126A12260503K425151L25484L586947K149450J881947L51055j373038l89642R85669
2117A22203526j779132J430111j85953J550710K380179P65291P71594K860401J956919
2108A31953646J053838R70776M460405P06543K995229K736851J97549K437442L547900
2099A51060179J430628J735380R16881R13868L415055L827094M178764L844261M270524
2090A75592634N119383K04160K269535L843772N62863L863049M062589M360477J0983405
$$ plain form
2154 79005615 81648004 85665975 87959075 91606500 96423984 99964770 101880859 104035416 108055845
2145 108055845 108381843 108458666 109467289 110221970 111858441 111085566 110856517 110196900 110258322 110198662
2135 110198662 108364046 110321688 110549508 109893727 108728551 111433569 111727020 112606786 112260503
2126 112260503 114685654 115011138 118598085 120747535 122629482 122980537 121607499 121217857 122203526
2117 122203526 120424394 121854505 121668552 123219262 125599441 126364732 127136326 129996727 131953646
2108 131953646 133007484 133978260 138438665 139145208 142140437 144877288 145074837 147512279 151060179
2099 151060179 152490807 154226187 155143068 156056936 159471991 163299085 167477849 171322110 175592634
2090 175592634 180712017 180916177 183185712 187029484 187592347 191455396 195517985 199878462 210861867
2081B10861867J3789820J4799846J9226217L1307567L5554345L6038414K4403238K2111153
2073D08092467J7560566M704234k181488j1218138j2567943j1746598j0923218j2838744
2065C68881138j2676771j0409725r101991m205091n546284k891412J275212L392354
2057C28717430M712472L610694l083763r664840k2312304k9480625l4371041l4913552
2049B03214471l4247894l3406881k4404223j8473015j6062026j0049805q352428n882116
2041E2336083m897741o563932q485466o221719p551878o494355k241636k292951l246750
2032D339655j398142Q25361p07563l3181P04616j684246R14269k56501k009339J61408
2022H56337j279633J660999j709489k789834K89705J727857J46844L25286R92741l9662
$$ plain form
2081 210861867 224651687 239451533 258677750 289985317 325539662 361578076 385981314 408092467
2073 408092467 425653033 430357267 428175779 416957641 404389698 392643100 381719882 368881138
2065 368881138 356204367 345794642 336692651 332487560 326941276 324049864 325325076 328717430
2057 328717430 333429902 337040596 333956833 324291993 301979689 272499064 238128023 203214471
2049 203214471 168966577 135559696 111155473 92682458 76620432 66570627 58218199 52336083
2041 52336083 47438342 40874410 32388944 26167225 18615347 12120992 9879356 7586405 4339655
2032 4339655 2941513 3766874 3059311 3026130 3730746 2046500 2960769 2704268 694929 856337
2022 856337 -423296 1237703 -471786 -3261620 -2971915 -1244058 -1097214 -771928 220813 181151
2012A81151L03349k445655L128926j354887j31093N47287J419736M4431M26667k01024
2002A918888L275794j468330J129100k23315j8409o58609k670778q8962j28111J619505
1992B686773L25907p05457J979469j06970Q7773N80062o25367r35565m71236J0326j381351
1981A444364k505554j001345p55009p04883j153435J899165k229684J705640k412006r6761
1971e809508J421501n91027O72275n43470o82757r59342k550130o83652j112782J73644
1961a0665248L97939j73653L15434m9301K03200n37745p9877j163965j04049j680086
1951a3537351j684139L42998N20009l17549j650726L3534n56698j000080k311800N75057
1941a9586745k32716O62566q5573J198525j792992n68661q37476J173191L86445r38418
$$ plain form
2012 181151 484500 -1961155 1167771 -187116 -318209 229078 1648814 1693245 2119912 1918888
2002 1918888 5194682 3726352 4855452 4632137 4613728 3955119 1284341 1195379 1067268 2686773
1992 2686773 3012680 2307223 4286692 4179722 4267495 4847557 4222190 3286625 2815389 2825715 1444364
1981 1444364 -1061190 -2062535 -2817544 -3522427 -4675862 -2776697 -5006381 -3300741 -5712747 -5809508
1971 -5809508 -4388007 -4979034 -4306759 -4850229 -5532986 -6492328 -9042458 -9726110 -10838892 -10665248
1961 -10665248 -10267309 -10440962 -10125528 -10174829 -9971629 -10509374 -10589251 -11753216 -11857265 -13537351
1951 -13537351 -15221490 -14878492 -14358483 -14676032 -16326758 -16293224 -16849922 -17850002 -20161802 -19586745
1941 -19586745 -19819461 -19156895 -19242468 -18043943 -19836935 -20405596 -21243072 -20069881 -19683436 -20621854
1931b0621854J46415Q37648L37167Q07034P85832K85076l50931o4572N70670K09341O24907
1920a6433267j116016J573384J73303J800888j008362l35547r52334K92982J314062
1911a4690907J367048j121172k019569L110201k648017J766323M62019K81966J35542o7370
1901a3423936J160279Q09958k528349K703427o10298L53432o26389j150684R91797j627683
1891a3948446O20899N00154K44345p20273j400851M1812J675078K64356o82074k00441
1881a3605441K73525J388054O11544k011663K092926L38686j807960j817322K283244
1872a2254407j085992j668638M93657N32099J269729j541037J234337j077702P86626O9585
1862a3241743R24424K67994o457M73322o71204L154346l843780K007081O00906N72998
$$ plain form
1931 -20621854 -20475439 -19637791 -19300624 -18493590 -17707758 -17422682 -17773613 -17838185 -17267515 -17058174 -16433267
1920 -16433267 -17549283 -15975899 -15802596 -14001708 -15010070 -15345617 -16297951 -16004969 -14690907
1911 -14690907 -13323859 -14445031 -16464600 -13354399 -16002416 -14236093 -13774074 -13492108 -13356566 -13423936
1901 -13423936 -12263657 -11453699 -13982048 -11278621 -11888919 -11535487 -12161876 -13312560 -12320763 -13948446
1891 -13948446 -13327547 -12827393 -12583048 -13303321 -14704172 -14662360 -12987282 -12722926 -13405000 -13605441
1881 -13605441 -13331916 -11943862 -11332318 -13343981 -11251055 -10912369 -12720329 -14537651 -12254407
1872 -12254407 -13340399 -15009037 -14515380 -13983281 -12713552 -14254589 -13020252 -14097954 -13311328 -13241743
1862 -13241743 -12317319 -12049325 -12055782 -11582460 -12253664 -9099318 -12943098 -10936017 -10335111 -9762113
1852i762113O30891o79914N76880m1730J671440L49308o89268J019596j060112J15261
1842g869761j018009j173961K648953J299266p78198l9059l68655J176318M8700k76860
1832f351266O32207j180715O7046k6247k46287R29394q19534j027606K71581J01417
1822g650010K791591r56131j064663K85097l78964k969671K897489L02275J517170p62864
1812e988681J361070n38483M70846Q66404j277586k535722n48756O67259l41128J104081
1802f760696n68366L62916J192877J826222Q98919J762982m66448J896801J468929O10453
1792B224589J795176K13313p96706m07272J316240J839036K73193J526983J388531j447847
1782G925236R58393p27131P08494J655043N1769J842456J569288L229076J880321M006189
$$ plain form
1852 -9762113 -9131222 -9811136 -9234256 -9275986 -7604546 -7255238 -7944506 -6924910 -7985022 -7869761
1842 -7869761 -8887770 -10061731 -7412778 -6113512 -6891710 -6930769 -7299424 -6123106 -6074406 -6351266
1832 -6351266 -5719059 -6899774 -6832728 -6858975 -7105262 -6175868 -6995402 -8023008 -7751427 -7650010
1822 -7650010 -4858419 -5814550 -6879213 -6594116 -6973080 -9942751 -7045262 -6742987 -5225817 -5988681
1812 -5988681 -4627611 -5166094 -4695248 -3828844 -5106430 -7642152 -8190908 -7523649 -7864777 -6760696
1802 -6760696 -7329062 -6966146 -5773269 -3947047 -3048128 -1285146 -1751594 145207 1614136 2224589
1792 2224589 4019765 4233078 3436372 3029100 4345340 6184376 6457569 7984552 9373083 7925236
1782 7925236 8883629 8156498 8864992 10520035 10571804 12414260 13983548 17212624 19092945 23099134
1772B3099134K481427K462316L093289L598211L141996M156870N578919J136284L408123
1763E2156569M508028L731312K158864K072937L338418K432802J820349J258187N070046
1754G8547512M050812L478479K993906M147946N237158L048250Q236612O999331N873561
1745A22613567N142159P419846N839091O567428P754014P192130P212424Q157309Q315826
1736A86213794Q223853O794728Q887809Q902072Q181363J0467587R497779J1515990
1728B58684975R453818Q351473R849698J1484256R290035N628951Q911262P302889N638557
1719C34595914N493264N389599P784057J085636J2966029R926737J0341551J0907333
1711C98490120J6795095J4704916J3922586J7398436J9499127J8054489J6433729K0957316
$$ plain form
1772 23099134 25580561 28042877 31136166 34734377 37876373 42033243 47612162 48748446 52156569
1763 52156569 56664597 60395909 62554773 64627710 67966128 70398930 72219279 73477466 78547512
1754 78547512 82598324 86076803 89070709 93218655 98455813 101504063 109740675 116740006 122613567
1745 122613567 127755726 135175572 141014663 147582091 155336105 162528235 169740659 177897968 186213794
1736 186213794 194437647 201232375 210120184 219022256 227203619 237671206 247168985 258684975
1728 258684975 268138793 276490266 286339964 297824220 307114255 312743206 321654468 328957357 334595914
1719 334595914 340089178 345478777 353262834 354348470 367314499 377241236 387582787 398490120
1711 398490120 415285215 429990131 443912717 461311153 480810280 498864769 515298498 536255814
1703E36255814J5490000J7215053J3610304J2585113O857263K357467q46630n463197
1695E98061187p816153o556221m564889n579641j749944k448685K11362J339721L154971
1686E74051708P153655P955424J0846892J2414718J8017706J8017236J8741932J7338142
1678F84537413J7223504J6491509J2907248O828289J224317p049845j5052230j7030493
1670G00079712k1196618k1114400k2287833k5135302k5627509k6040799k1995080k1499977
1662E15182194j4536848j0902113n971168j842017j355350L313073P447298Q426923
1654D99761992R557707J0833789Q477043P257035J581727m695495o437559r696035
1646E16640204j4195407k0355584k6746769l0380839l3530672l4688134l0185446k7442126
$$ plain form
1703 536255814 551745814 568960867 582571171 595156284 602013547 604371014 603524384 598061187
1695 598061187 590245034 583688813 579123924 573544283 571794339 569345654 569557016 570896737 574051708
1686 574051708 581205363 589160787 600007679 612422397 630440103 648457339 667199271 684537413
1678 684537413 701760917 718252426 731159674 737987963 739212280 732162435 717110205 700079712
1670 700079712 678883094 657768694 635480861 610345559 584718050 558677251 536682171 515182194
1662 515182194 500645346 489743233 483772065 481930048 480574698 483887771 491335069 499761992
1654 499761992 509319699 520153488 528630531 535887566 537469293 532773798 526336239 516640204
1646 516640204 502444797 482089213 455342444 424961605 391430933 356742799 326557353 299115227
1638B99115227k2483508j6848914j2190727r931623o072396o012966j388400k395203
1630B21791490k105991j485316j095180L37629n59742J077806P74080l532421m708280
1621B10494075n518857r178863j2627595j3743078j2162414j4637418r590320p665316
1613A25370214n000814m466459l023345l341752m532133q19212q58695p088656k129813
1604I4109335j121788k705438j911185j92236o56295j384089O28284k317080p34291
1595H3715217j258725q80046J71233k77155K209383m72254k522516j217236j198809
1586G8269092j442401L775632k602824j039508j99799j782418j273722k072825l65517
1577G1265710j301421p39918r61202j015890M28838j808003l47475q57529j936978J544985
$$ plain form
1638 299115227 276631719 259782805 247592078 237660455 231588059 225575093 224186693 221791490
1630 221791490 219685499 218200183 217105003 217442632 216882890 217960696 218734776 215202355 210494075
1621 210494075 204975218 195796355 183168760 169425682 157263268 142625850 133035530 125370214
1613 125370214 120369400 115902941 112879596 109537844 105005711 104186499 103327804 96239148 94109335
1604 94109335 92987547 90282109 88370924 88178688 87522393 86138304 86766588 84449508 83715217
1595 83715217 82456492 81576446 81747679 81470524 83679907 83207653 80685137 79467901 78269092
1586 78269092 76826691 80602323 77999499 76959991 76760192 74977774 73704052 71631227 71265710
1577 71265710 69964289 69224371 68263169 67247279 67676117 65868114 65520639 64663110 62726132 64271117
1567F4271117j250195N68653r43779p69952j359242R72528j02823j123299P4218O84489
1557F1021715J376551j197977q8930j44827R42288J299863L025399K009105J110922R96460
1547G0350569J918398K0127J236329K769059K520439L063891J456784J73988K583286
1538H6092870L498194J634356L104209N81203L760581L354017K128106K583246K696488
1529A09433270J980856K951212M375199L588205K140742M811887M532637K152752O085405
1520A42052165K941309O574477M480899O628246M580508M375330N679967P183304N182171
1511A89678376M453911N503105P098385J0592715J362153M189905P846873R198803Q769852
1502B48694078Q714922R857482J2871277J3039957J2305960J4094870J0821781J2117898
$$ plain form
1567 64271117 63020922 63589575 62645796 61875844 60516602 61489130 61386307 60263008 60337226 61021715
1557 61021715 62398266 61200289 61111359 60966532 61908820 63208683 66234082 68243187 69354109 70350569
1547 70350569 72268967 72289094 73525423 76294482 78814921 81878812 83335596 83509584 86092870
1538 86092870 89591064 91225420 94329629 94910832 98671413 102025430 104153536 106736782 109433270
1529 109433270 111414126 114365338 118740537 122328742 124469484 129281371 133814008 135966760 142052165
1520 142052165 144993474 151567951 156048850 162677096 167257604 171632934 177312901 184496205 189678376
1511 189678376 194132287 199635392 206733777 217326492 218688645 222878550 230725423 239924226 248694078
1502 248694078 257409000 267266482 280137759 293177716 305483676 319578546 330400327 342518225
1494C42518225J2747257J3171733J2396306J1527563R570365R318644Q258821R417396
1486D28926310R485694J2147576J4047079J5822737J8016107K1154606J7070604J8143100
1478E54813813K1181444K2582150K2274547K5537609K5118382K7629429K7051850K7497939
1470G53687163K4006380K5131800K0094704K0871771J6589964J4295976J4273025J4039073
1462I02989856R423054J5309996J4001734J6927372K0281778K1730050K1718462K5470697
1454A047852999K5386414K6479471K4793047K5116771K6198086K7489841K6777553
1447A230094182K6224439K2035403J5204733J2005079J2685073J2994317J3030339
1440A344273565J7409395J3562398J5686742K1153194K2269264K2215441K0507370
$$ plain form
1494 342518225 355265482 368437215 380833521 392361084 401931449 411250093 419508914 428926310
1486 428926310 438412004 450559580 464606659 480429396 498445503 519600109 536670713 554813813
1478 554813813 575995257 598577407 620851954 646389563 671507945 699137374 726189224 753687163
1470 753687163 777693543 802825343 822920047 843791818 860381782 874677758 888950783 902989856
1462 902989856 912412910 927722906 941724640 958652012 978933790 1000663840 1022382302 1047852999
1454 1047852999 1073239413 1099718884 1124511931 1149628702 1175826788 1203316629 1230094182
1447 1230094182 1256318621 1278354024 1293558757 1305563836 1318248909 1331243226 1344273565
1440 1344273565 1361682960 1375245358 1390932100 1412085294 1434354558 1456569999 1477077369
1433A477077369J8391672J5906821J2482029J4325710J4261179J6542891J5588076
1426A584575747J6890549J7216619J4376221J6166034J7068839J8686156J9090087
1419A704070252K1375664K5776650K4486255K3325060K2626051K2627667K3982527
1412A868270126K3660951K4390513K0953377J9549384K3239180K2821037K8159806
1405B031044374K9158049K7886299K0901955J6866156J2510604N231295L884915j280627
1397B146203020p365212k4446943l8975766n4390660p2779076q9705561r6095927r2509008
1389A669934867q8687501q1799647p4515515p2247918o8599249o4415461o0167000
1382A159502576o0935619n5693043n0676467m2445388m1109422l1911688k8562396
$$ plain form
1433 1477077369 1495469041 1511375862 1523857891 1538183601 1552444780 1568987671 1584575747
1426 1584575747 1601466296 1618682915 1633059136 1649225170 1666294009 1684980165 1704070252
1419 1704070252 1725445916 1751222566 1775708821 1799033881 1821659932 1844287599 1868270126
1412 1868270126 1891931077 1916321590 1937274967 1956824351 1980063531 2002884568 2031044374
1405 2031044374 2060202423 2088088722 2108990677 2125856833 2138367437 2143598732 2147483647 2146203020
1397 2146203020 2138837808 2114390865 2075415099 2021024439 1948245363 1858539802 1762443875 1669934867
1389 1669934867 1581247366 1499447719 1424932204 1352684286 1284085037 1219669576 1159502576
1382 1159502576 1098566957 1042873914 992197447 949752059 908642637 876730949 848168553
1375H48168553k5554239k6093710k5875472k8116651k6471330k9684911k5204489k4385748
1367F36782003k1186438k2282016k1923093j8908723j6952219k8889113j8998266j5815936
1359D71826199j1857085j6161404j4045198j3541005j6770119j5858646j5957192j6999412
1351C50636138j4226587j4691306j0761012q619369n084550m048748j397663m680039
1343B87126864o134119m240858m663522n657145o131139n184138o597754k183569n808198
1334B40526422l868055o032925l453915o219798o354164m840531o045267m519181n509317
1325A93683269q260039p047547p560388q186829n269184m202795m640636n200123m084178
1316A39231550m322577l036778m339521k786110k737978k413784k385910k006846k308908
$$ plain form
1375 848168553 822614314 796520604 770645132 742528481 716057151 686372240 661167751 636782003
1367 636782003 615595565 593313549 571390456 552481733 535529514 506640401 487642135 471826199
1359 471826199 459969114 443807710 429762512 416221507 399451388 383592742 367635550 350636138
1351 350636138 336409551 321718245 310957233 302337864 297253314 293204566 291806903 287126864
1343 287126864 280992745 276751887 272088365 266431220 260300081 255115943 248518189 246334620 240526422
1334 240526422 236658367 230625442 227171527 220951729 214597565 209757034 203711767 199192586 193683269
1325 193683269 185423230 178375683 170815295 162628466 157359282 153156487 148515851 143315728 139231550
1316 139231550 134908973 131872195 127532674 124746564 122008586 119594802 117208892 115202046 112893138
1307A12893138j737287m595058j981729n734832j291399k721006l445026k816821k913440
1298H5656540j398318l400449m916120l285629l423929k652843l831872l772599m013817
1289E4960964l815951m528548k127343n512532m113228m635957m066852l606213k982594
1280A9571746j152317j718911m64644j375510j978977O0219k298013j75756j735699
1271H732138l180095J289517j306196n45795j68053o72537r42235j656250k598898J022788
1261b5616j519190q84493m42755L37552j733654o75246J335674K888607q91785j218785
1251b829691p07318r80495j194156Q61215J713483q78318n2743J613259r6322J110937
1241a440149q01844J159109K472933N34141K48336j123597K122519M13965k347534N38241
$$ plain form
1307 112893138 111155851 106560793 104579064 98844232 97552833 94831827 91386801 88569980 85656540
1298 85656540 84258222 80857773 75941653 72656024 69232095 66579252 62747380 58974781 54960964
1289 54960964 51145013 46616465 44489122 38976590 34863362 30227405 26160553 22554340 19571746
1280 19571746 18419429 16700518 16235874 14860364 12881387 12941606 10643593 10467837 8732138
1271 8732138 5552043 6841560 5535364 4989569 4821516 4148979 3206744 1550494 -1048404 -25616
1261 -25616 -1544806 -2429299 -2872054 -2534502 -4268156 -4943402 -3607728 -719121 -1610906 -2829691
1251 -2829691 -3537009 -4517504 -5711660 -4850445 -3136962 -4015280 -4068023 -2454764 -2551086 -1440149
1241 -1440149 -2241993 -1082884 1390049 1924190 2172526 1048929 3171448 3585413 1237879 1776120
1231A776120J636053j400209q59889M82238K408036j706592J699681r54644K14424m18974
1221B876244K755554k805947j436105K24774l93849l73969M38657R91594L73848j526475
1211A124326O5939M06943R69550r7489J64315l23002J7676P60739o85094j073422j24503
1200A205978J135819j513421m35677j74622P50923J371828K21275J557618j15699j66017
1190C838005J982711m13555j70341O68835L95559J827543L57233m5964r41975m78561
1180G019490o18598J24638q54940J500571n72454J5703j203272M25070p0392k051629
1170C714187k34076M90219o60861l03403O19866j651444K28305k201006o05528j007083
1160a610824p08297K115715j403815k674140J3082K130910P42267j188206K44900r72649
$$ plain form
1231 1776120 3412173 2011964 1152075 1634313 4042349 2335757 4035438 3080794 3295218 2876244
1221 2876244 5631798 2825851 1389746 1614520 1220671 846702 1285359 2276953 2650801 1124326
1211 1124326 1190265 1597208 2566758 2469269 2633584 2310582 2328258 3088997 2403903 1330481 1205978
1200 1205978 2341797 828376 392699 218077 969000 2340828 2562103 4119721 4004022 3838005
1190 3838005 5820716 5407161 5236820 5905655 6301214 8128757 8485990 8440026 7498051 7019490
1180 7019490 6400892 6525530 5670590 7171161 6598707 6614410 5411138 5836208 5765816 3714187
1170 3714187 3480111 3970330 3309469 3006066 3625932 1974488 2202793 1787 -603741 -1610824
1160 -1610824 -2319121 -203406 -1607221 -4281361 -4268279 -2137369 -1395102 -2583308 -2338408 -3311057
1150c311057O55745o71802K68936k98298L96541J537334k49830o9452j804117J334175
1140b211825j369895K13322J5828j795137j163183l52472N90436P06468l02863j357749
1130g027070j45159j47485Q78449N459421p50823r05871o67070r86682J955163q21253
1120c158380j9455J44154j052447J424747j604653J396765p79135J054835n59255J227392
1110a925432O37044n01795J7754J803594J52276r49667J605635M0707Q05762K96598n03977
1099A478499K284341K42221m50690m02294k79909N98004K154995M72497J431288P292
1089G536244J926807J255303R46747M43835p86419J504609p06559P44152K034864k799196
1079A2100387N35530k379031k89792k453601K39716j832270j82398j04192o64205M02865
$$ plain form
1150 -3311057 -2655312 -3327114 -3058178 -3356476 -2959935 -1422601 -1672431 -1741883 -3546000 -2211825
1140 -2211825 -3581720 -3368398 -3352570 -5147707 -6310890 -6663362 -6072926 -5366458 -5669321 -7027070
1130 -7027070 -7172229 -7319714 -6441265 -981844 -1732667 -2638538 -3305608 -4292290 -2337127 -3158380
1120 -3158380 -3177835 -3033681 -4086128 -2661381 -4266034 -2869269 -3648404 -2593569 -3152824 -1925432
1110 -1925432 -1288388 -1790183 -1772429 31165 183441 -766226 839409 880116 1685878 1982476 1478499
1099 1478499 3762840 4005061 3554371 3152077 2872168 3470172 5625167 6097664 7528952 7536244
1089 7536244 9463051 10718354 11665101 12108936 11322517 12827126 12120567 12864719 14899583 12100387
1079 12100387 12635917 10256886 9967094 7513493 7753209 5920939 5738541 5634349 4970144 5373009
1069E373009P22477K848047j271738K292228J244236K286167N403179k919852n38566
1060A5439187K177527N99487J13660j063881k088722k804957M29731q81160J306713r54477
1050A2273108k786065m971252k745605R3385L835717O073482O698266L975021L065883
1041B5511940L014930N634496L409605M435406O262601M726903O655713O763387N875849
1032G2290830M870540L704325L028599N262685N389677P691064N741470J78250M228356
1023A12385796M262644N114645O622264Q676411J2428182J0416971J1142709J1559092
1015A82608714J1034571J0786932P477391J3401237J2034677J3832040J5676997J5795658
1007B82648217J3975705Q707143R885265R011378J2543713J1964571J0769484R294928
$$ plain form
1069 5373009 6095486 8943533 7671795 9964023 11208259 13494426 18897605 15977753 15439187
1060 15439187 17616714 18216201 18329861 17265980 15177258 12372301 12802032 11920872 13227585 12273108
1050 12273108 9487043 4515791 1770186 1863571 5699288 11772770 18471036 22446057 25511940
1041 25511940 28526870 34161366 37570971 42006377 48268978 52995881 59651594 66414981 72290830
1032 72290830 77161370 80865695 83894294 89156979 94546656 102237720 107979190 108157440 112385796
1023 112385796 116648440 121763085 128385349 137061760 149489942 159906913 171049622 182608714
1015 182608714 193643285 204430217 211907608 225308845 237343522 251175562 266852559 282648217
1007 282648217 296623922 305331065 315216330 324227708 336771421 348735992 359505476 368800404
999C68800404J0667984Q285399J1246550J2806524J1013018J5556096J3163839J4090842
991D65630656J4222025J2059450J3427884J2646675J6140244J4493560J7119357J8550663
983E84290514J7988764J0869388K6982785K0124003K4317494K6204709K8703307K7150767
975G66631731L2427974L5698572L9520305L5861354L1190497K8402647K5501206K5909098
967A021143384K6102323K1732708J2644813J963423n037781q807776q853455r211258
959A051676381p172148M829069O833187J561167M467622J6933772L4744251K8246362
951A142119663M0579725M5536655O2501606O3019538M3120915L5807708J5776224K3431088
943A471893122K2188150J2379571k1923835p7636646j16236578j20645776j18165582
$$ plain form
999 368800404 379468388 387753787 399000337 411806861 422819879 438375975 451539814 465630656
991 465630656 479852681 491912131 505340015 517986690 534126934 548620494 565739851 584290514
983 584290514 602279278 613148666 640131451 660255454 684572948 710777657 739480964 766631731
975 766631731 799059705 834758277 874278582 910139936 941330433 969733080 995234286 1021143384
967 1021143384 1047245707 1068978415 1081623228 1083586651 1078548870 1069741094 1060887639 1051676381
959 1051676381 1044504233 1049333302 1056166489 1057727656 1062195278 1079129050 1113873301 1142119663
951 1142119663 1182699388 1228236043 1290737649 1353757187 1396878102 1432685810 1448462034 1471893122
943 1471893122 1494081272 1506460843 1484537008 1406900362 1290663784 1170018008 1051852426
936A051852426j14030141r5393898o6880152m3834482l1785569k5763298j2970096p502887
928F53691903q045459j6403999j5802048j0919150j525072P268394J3592755J5188690
920F37046014R564059k574177l368472j0140305k6419469l6810922m4686429m7664397
912D74945902m7499468n0976693m4882567l5841876k9076741j9303537j4285887j4998918
904B18080215q999734j3312697j2235927j3462827j2034224j4212848q558662n536442
896A29726854l542208m047041k996022k804757o26988j086856J253518J634063p05227
887A16805336M72474k14827j802537j923608o32377J702489m39317j669738L45243O63361
877A13306499l914228m813902l306951k141375j189307J14663m291021J091102j1627962
$$ plain form
936 1051852426 937822285 842428387 775548235 731713753 699928184 674164886 661194790 653691903
928 653691903 645646444 629242445 613440397 602521247 600996175 608264569 621857324 637046014
920 637046014 646610073 644035896 640667424 630527119 604107650 567296728 522610299 474945902
912 474945902 427446434 376469741 331587174 295745298 266668557 247365020 233079133 218080215
904 218080215 209080481 195767784 183531857 170069030 158034806 143821958 135263296 129726854
896 129726854 126184646 122137605 119141583 116336826 115709838 114622982 115876500 117510563 116805336
887 116805336 117277810 117062983 115260446 113336838 112704461 114406950 113967633 112297895 112643138 113306499
877 113306499 109392271 104578369 101271418 99130043 97940736 98055399 93764378 94855480 83227518
868H3227518J556739k769054M15167K8079l003415M1123j904100j693836l699334q27644
858G1371243m58351o43377l031452k032062k194692j008722k233935j438872J550142
849E9879922j420678k031321m76805j333106m150834K827097l598592l859136l689848
840D2146699k744232k174938k620854k914585j07444j934531n368132m130987n283276
831A4867720m066194l040807m106518j15358k661550j327307n16884p16146l787L77897
821a308934Q59254P13319j240263J489784j415193K090810k058821K08641l03776l093195
811d058374m13870q99925l60124l360602k319285l55477q15890j253978m70631k781689
801a7089845j059163J455029O52734k269874J074640M5704J437386J885472o95432L08346
$$ plain form
868 83227518 84784257 82015203 82430370 82458449 79455034 79496157 77592057 75898221 72198887 71371243
858 71371243 70912892 70269515 67238063 65206001 63011309 62002587 59768652 58329780 59879922
849 59879922 58459244 56427923 55951118 54618012 50467178 53294275 49695683 45836547 42146699
840 42146699 39402467 37227529 34606675 31692090 31584646 29650115 24281983 20150996 14867720
831 14867720 10801526 7760719 3654201 3538843 877293 -450014 -966898 -1683044 -1686831 -1308934
821 -1308934 -449680 263639 -976624 513160 -902033 1188777 -870044 -661403 -965179 -4058374
811 -4058374 -4472244 -5372169 -5732293 -9092895 -11412180 -11767657 -12583547 -13837525 -14308156 -17089845
801 -17089845 -18149008 -16693979 -16041245 -18311119 -17236479 -17190775 -15753389 -13867917 -14563349 -14255003
791a4255003K029426J162892J439525j317638K92507j66452K074816M13371k076424Q64490
781i538490l45871N48194K97386j129310r6330J36555L51144J98629j794759l7315J578414
770i831753R38719J28711q18821j138343l10188m07741O20943p15137k04471M7391n43981
759a2234671n332826P303789j23160q10948N3114J9626J291894L58890J24428K02159
749i147705l53586j57086O74933R82305j53226q03262J802345L92388j424413P23498
739g463809k032932J388927J158681p02906P9541J389421j496243M49925n78370o4946
729g872711R70047r11474j194691k18207J543251J316453j046985M60080K83972J302544
719e367721o1578N6898k179963r6765J00010K1341Q13383j309890l29508j336732o28926
$$ plain form
791 -14255003 -12225577 -11062685 -9623160 -10940798 -10648291 -10814743 -8739927 -8326556 -10402980 -9538490
781 -9538490 -9884361 -9336167 -9038781 -10168091 -10264421 -10127866 -9776722 -9578093 -11372852 -11410167 -9831753
770 -9831753 -8893034 -8764323 -9583144 -10721487 -11031675 -11439416 -10818473 -11533610 -11738081 -11690690 -12234671
759 -12234671 -17567497 -10263708 -10386868 -11197816 -11144702 -11125076 -9833182 -9474292 -9349864 -9147705
749 -9147705 -9501291 -9658377 -8983444 -8001139 -8154365 -8957627 -7155282 -6762894 -8187307 -7463809
739 -7463809 -9496741 -8107814 -6949133 -7652039 -7572498 -6183077 -7679320 -7229395 -7807765 -7872711
729 -7872711 -6902664 -7814138 -9008829 -9227036 -7683785 -6367332 -7414317 -6954237 -6670265 -5367721
719 -5367721 -5429299 -5372401 -7552364 -7649129 -7549119 -7527778 -6714395 -8024285 -8353793 -9690525 -10319451
708a0319451q96337o11743j848845q81887J040138J103135l372098J016199K26738J359511
698a3184640k840620J730405j7774M06297J795962j799002j194200j126039K097178
689a4132433j643495P184j291162J121774J009210j062408j00435j870777J346258j011812
679a7628096k65963M22591J19682J030394j851211j152413O24667l40914J672289m05665
669a7774639r02089J894570r10997J74004q00758P97340J46718K20361J153173o86524
659a6688841k64549J49603P61000J03872j212198J251805j24203m28914k35208n8339
649a6745972J36909L87064J345963m0957j241528m66836l64192J969503j559617K286892
639a4292771j264718O21708j464054K83120m9207L63114k93556k00744L50514J437919
$$ plain form
708 -10319451 -11215788 -11827531 -13676376 -14558263 -13518125 -12414990 -15787088 -14770889 -14544151 -13184640
698 -13184640 -16025260 -14294855 -14312629 -13906332 -12110370 -13909372 -15103572 -16229611 -14132433
689 -14132433 -15775928 -15768744 -17059906 -15938132 -14928922 -15991330 -16091765 -17962542 -16616284 -17628096
679 -17628096 -17894059 -17471468 -17351786 -16321392 -18172603 -19325016 -18700349 -19041263 -17368974 -17774639
669 -17774639 -18676728 -16782158 -17693155 -17519151 -18319909 -17522569 -17375851 -17155490 -16002317 -16688841
659 -16688841 -16953390 -16803787 -16042787 -15938915 -17151113 -15899308 -16023511 -16452425 -16687633 -16745972
649 -16745972 -16609063 -16221999 -14876036 -14916993 -16158521 -16625357 -16989549 -15020046 -16579663 -14292771
639 -14292771 -15557489 -14935781 -16399835 -16116715 -16165922 -15802808 -16096364 -16297108 -15946594 -14508675
629a4508675j388332j602358N16317O44160j395590l78035M31266O79601P56907q87632
619a7132371n98769j548078K325869n92567O37909J218344j536932j135570J869129
610a6493036J342166k172909j032794J485675j233535J161337j02091n25935K98262O62704
600a6610156j55265k63503O72437K03263m41159r53059O21866J59232m30650J14589m78369
589a7560774L44017q39689J11710Q69794Q09876k344232M48051J864377j10746K96552
579a6111064j177895K43766M92605J87672q22752R65657r79685j7132J70829P75173
569a6272826J518557j151621n03430Q57551j860682K032958j730795O02136q02506J249476
559a6061182o25720n76566k139412q08550K435059J339809r10007n11165j706462J010724
$$ plain form
629 -14508675 -15897007 -17499365 -16983048 -16338888 -17734478 -18112513 -17681247 -17001646 -16244739 -17132371
619 -17132371 -17731140 -19279218 -16953349 -17545916 -16908007 -15689663 -17226595 -18362165 -16493036
610 -16493036 -15150870 -17323779 -18356573 -16870898 -18104433 -16943096 -17045187 -17571122 -17272860 -16610156
600 -16610156 -16765421 -17028924 -16356487 -16153224 -16594383 -17547442 -16925576 -16766344 -17196994 -17082405 -17560774
589 -17560774 -17216757 -18056446 -17944736 -17074942 -16265066 -18609298 -18161247 -16296870 -16407616 -16111064
579 -16111064 -17288959 -17045193 -16552588 -16364916 -17187668 -16222011 -17201696 -17218828 -17047999 -16272826
569 -16272826 -14754269 -15905890 -16409320 -15551769 -17412451 -15379493 -17110288 -16508152 -17310658 -16061182
559 -16061182 -16686902 -17263468 -19402880 -20211430 -17776371 -16436562 -17346569 -17857734 -19564196 -18553472
549a8553472N58898J387390l152176Q36366M821238k364924j602945n44518N23614m22909
539a8513438P49392K67877K59171j397932J616241l68966J046545l272460j62233P14843
529a9060960J013039j249531J979367l74984n47053P95180o54355k487051J292365j35329
519a9429312J77048n14578o77839J736141J186122j859832M91283j433044J194153J236677
509a7893181o44592q77765m01766K338638k036145n65606M6304J490630J449304j364503
499a8458682q4940o6124l29718p63431J376481Q4045m83502J46518r19662M26848K7500
488a9044667N94757o33873J167911j305468K051869l44839p30290k004009J496969P82171
478a7969469M34139p58514P12560m37189N6032J103041N93883j985976L16125P05781
$$ plain form
549 -18553472 -17994574 -16607184 -19759360 -18922994 -14101756 -16466680 -18069625 -18614143 -18090529 -18513438
539 -18513438 -17764046 -17496169 -17236998 -18634930 -17018689 -17387655 -16341110 -19613570 -19775803 -19060960
529 -19060960 -18047921 -19297452 -17318085 -17693069 -18240122 -17444942 -18099297 -20586348 -19293983 -19429312
519 -19429312 -19252264 -19766842 -20444681 -18708540 -17522418 -19382250 -18890967 -20324011 -19129858 -17893181
509 -17893181 -18537773 -19415538 -19817304 -17478666 -19514811 -20080417 -20034113 -18543483 -17094179 -18458682
499 -18458682 -18543622 -18609746 -18939464 -19702895 -18326414 -18242369 -18725871 -18579353 -19499015 -19072167 -19044667
488 -19044667 -18449910 -19083783 -17915872 -19221340 -17169471 -17514310 -18244600 -20248609 -18751640 -17969469
478 -17969469 -17535330 -18293844 -17581284 -18018473 -17962441 -16859400 -16265517 -18251493 -17935368 -17229587
468a7229587K35278j029674j320470J151810Q90762o67772J147288R24127j481497k261011
458a9640746K612743l80022p51111J542420j907372q04073K71633J111067J422511j055909
448a7578859p46996j41774p18555Q59041n59970p00463R49487m48981J347599r30302
438a8669773O83882n92444m88599K188990j026206O6740k84575r96895J772650R76972
428a6369258j862150k797647L669068q2224Q90803K06024o43941R10561j900139N47947
418a7430956L04985J22658P66451J343279r10315L19935n03999l407314L04227J90701
408a8900348J063049P11457j30817k7540r39356J61592L25666j206192j01704J641167
398a7403026r21882J84365M92761n56581o24647J257115P78479l80071o02904m90990
$$ plain form
468 -17229587 -16994309 -18023983 -19344453 -18192643 -17301881 -17969653 -16822365 -15898238 -17379735 -19640746
458 -19640746 -17028003 -17408025 -18159136 -16616716 -18524088 -19328161 -19056528 -17945461 -16522950 -17578859
448 -17578859 -18325855 -18467629 -19186184 -18327143 -18887113 -19587576 -18638089 -19087070 -17739471 -18669773
438 -18669773 -17985891 -18578335 -19066934 -16877944 -17904150 -17837410 -18121985 -19118880 -17346230 -16369258
428 -16369258 -18231408 -21029055 -17359987 -17442211 -16551408 -16345384 -16989325 -16078764 -17978903 -17430956
418 -17430956 -17125971 -17003313 -16236862 -14893583 -15803898 -15483963 -15987962 -19395276 -19091049 -18900348
408 -18900348 -17837299 -17125842 -17256659 -17284199 -18223555 -18061963 -17736297 -18942489 -19044193 -17403026
398 -17403026 -18324908 -18140543 -17647782 -18204363 -18829010 -17571895 -16793416 -17173487 -17776391 -18267381
388a8267381J410892P93944j855248R68000N99767j999917n25722N17250K92441m32461
378a8498435k10207m21351R92418J11025J24239O42334k152217Q27734J579538j097864
368a8102786O61611j51423j556327J421759k83308P56694k79407l89509O63813k646143
358a9905026K128061q85891J412366j519343q76167R05727r7399P12003K258925k323914
348a8190658j596359K392949k35852p87102Q0021p46145Q41718m73940M36406J45954
338a8133008r16326R43563K35277j500458m03082P94795k14072J13677K127416k44955
328a7197173j599887K49993o81259K462630p96120K207341k937922j261307J167714
319a8385990k301248l341702M579666N94052K82247j656976K61674J481673R05592j773122
$$ plain form
388 -18267381 -16856489 -16062545 -17917793 -16949793 -16350026 -18349943 -18875665 -18358415 -18065974 -18498435
378 -18498435 -18708642 -19129993 -18137575 -18026550 -17902311 -17259977 -19412194 -18584460 -17004922 -18102786
368 -18102786 -17441175 -17592598 -19148925 -17727166 -18010474 -17253780 -17533187 -17922696 -17258883 -19905026
358 -19905026 -17776965 -18662856 -17250490 -18769833 -19646000 -18740273 -18837672 -18125669 -15866744 -18190658
348 -18190658 -19787017 -17394068 -17629920 -18417022 -18337001 -19083146 -18241428 -18715368 -18278962 -18133008
338 -18133008 -19049334 -18105771 -17870494 -19370952 -19774034 -18979239 -19193311 -19079634 -16952218 -17197173
328 -17197173 -18797060 -18547067 -19228326 -16765696 -17561816 -15354475 -18292397 -19553704 -18385990
319 -18385990 -20687238 -24028940 -19449274 -18855222 -18572975 -20229951 -19968277 -18486604 -17581012 -19354134
309a9354134J760085j280280M89440j037509q28245K224647M49168j312781J213929
300a7675680k417317K607512p67126p37467R193k086938L549947p66195m98303N39686
290a8242688N85538J079404m32040j710345J059260j642959N84684M59358K902505k643123
280a8000406k40719l25917O35489n08450l52731J706686k854784K250580J44704j598581
270a9144129J115614R46437J363279k106271J98042J237597m107880J320058J123096
261a8054157J241100p30406o82623j055011L14270J173409R49143j827979J712631q4507
251a7044130P95119o35427j824330n56785k81093l8400Q83500p39000J171771j159684
241a9428459j78081P49351j021079n73007J297494j96158K666808k989620J305519k97609
$$ plain form
309 -19354134 -17594049 -18874329 -18384889 -19422398 -20250643 -18025996 -17576828 -18889609 -17675680
300 -17675680 -20092997 -17485485 -18252611 -18990078 -18980885 -21067823 -17517876 -18284071 -18782374 -18242688
290 -18242688 -17657150 -16577746 -17009786 -18720131 -17660871 -19303830 -18719146 -18259788 -15357283 -18000406
280 -18000406 -18241125 -18567042 -17931553 -18440003 -18792734 -17086048 -19940832 -17690252 -17545548 -19144129
270 -19144129 -18028515 -17082078 -15718799 -17825070 -17627028 -16389431 -20497311 -19177253 -18054157
261 -18054157 -16813057 -17543463 -18226086 -19281097 -18966827 -17793418 -16844275 -18672254 -16959623 -17044130
251 -17044130 -16249011 -16884438 -18708768 -19265553 -19546646 -19585046 -18701546 -19440546 -18268775 -19428459
241 -19428459 -19606540 -18857189 -19878268 -20451275 -19153781 -19349939 -16683131 -19672751 -18367232 -18664841
231a8664841N58708M60487j90663q58510j091521n07240J864323Q5696k20198o58661
221a9222420M53104n0840J997897j293966N15287J40018q26893j05035P63396k023174
211a9652626J332214N38632j654562J323973p50264j122833Q27638J675049j637855p01007
201a9821641K10648k797204M527413j345599J143985k40261m91995J241814j752736O98799
191a8626777j384364O53848R68105o92419O18917m21387J985833r55108J41129k035086
181a9747309J165901n36828q06275N07110j4049p27803R51810j368572k057530L594300
171a9039245P503j867616J652940J279243k453264J626282J332086k253421N60871J569546
161a7585075j735229O5614O15827J86436j147033K100251j235414j607408K754855j007852
$$ plain form
231 -18664841 -18106133 -17645646 -17836309 -18694819 -19786340 -20293580 -18429257 -18343561 -18563759 -19222420
221 -19222420 -18769316 -18820156 -16822259 -18116225 -17600938 -17460920 -18287813 -18392848 -17629452 -19652626
211 -19652626 -18320412 -17781780 -19436342 -18112369 -18862633 -19985466 -19157828 -17482779 -19120634 -19821641
201 -19821641 -19610993 -22408197 -17880784 -19226383 -18082398 -18322659 -18814654 -17572840 -19325576 -18626777
191 -18626777 -20011141 -19357293 -18389188 -19081607 -18462690 -18884077 -16898244 -17853352 -17712223 -19747309
181 -19747309 -18581408 -19118236 -19924511 -19417401 -19431450 -20159253 -19207443 -20576015 -22633545 -19039245
171 -19039245 -19031742 -20899358 -19246418 -17967175 -20420439 -18794157 -17462071 -19715492 -19154621 -17585075
161 -17585075 -19320304 -19254690 -18638863 -18452427 -19599460 -17499209 -18734623 -20342031 -17587176 -18595028
151a8595028K075936k569674N74351N53898j424945J616456O69644J60820p17178j239441
141a8895161J524332J032357l453847J020448j610540J609833K87451J021407K76183
132a7187537r15694N18881j894982j296471M547021k139800p95008R49155J819330j456355
122a7851460j310528p34782K43522J056890M63868j11320J8426j165404j172762O69727
112a9893823O58075m26503J758280k401980K008843M62367l83450p49224J663448p23673
102a8027640j933745J200491J085541q93949o96410j113804J834463l37769N935J39090
92a8737797J324283j325860R90598r33672J57571o95053n12578k07436L50741L29038
82a9260165l42160J449343O61430m09237k667442j127985K269537p90350j94618K96133
$$ plain form
151 -18595028 -16519092 -19088766 -18514415 -17960517 -19385462 -17769006 -17099362 -16938542 -17655720 -18895161
141 -18895161 -17370829 -16338472 -19792319 -18771871 -20382411 -18772578 -18485127 -17463720 -17187537
132 -17187537 -18103231 -17584350 -19479332 -20775803 -16228782 -18368582 -19163590 -18214435 -16395105 -17851460
122 -17851460 -19161988 -19896770 -19653248 -18596358 -18132490 -18243810 -18225384 -19390788 -20563550 -19893823
112 -19893823 -19235748 -19662251 -17903971 -20305951 -18297108 -17834741 -18218191 -18967415 -17303967 -18027640
102 -18027640 -19961385 -18760894 -17675353 -18569302 -19265712 -20379516 -18545053 -18882822 -18876887 -18737797
92 -18737797 -17413514 -18739374 -17748776 -18682448 -18524877 -19219930 -19732508 -19939944 -19589203 -19260165
82 -19260165 -19602325 -18152982 -17491552 -17900789 -20568231 -21696216 -19426679 -20217029 -20411647 -20115514
72b0115514J269269m57634O54276K9979o60245o8897M49705l470929L087068n59086k3736
61a9865744p2647K66356j560337r3961l88093J261031j447121L264280p74734L08082
51a9102888J096412k833245K351076r49888K65963j64914J782312j980447j27664k406648
41b2069931J284035J63433r8268J288999K82161k88325l53950n61372K018867m52046
31a8786397j880066J093483n88823n75324J455383j748800J604821O49008k156967K925929
21a8007753k128119O32074j004650P9741N52830J301887J22919j55237n82731J17475
11a9071564k18490k826853K147301Q06239n21656k61088O41717r22283K231803q66803
1a8861677R9044k56592j515626m90688P4632J23764O89622O53761m75977p2108j54506
$$ plain form
72 -20115514 -18846245 -19303879 -18649603 -18619624 -19279869 -19348766 -18899061 -22369990 -19282922 -19842008 -19865744
61 -19865744 -19938391 -19672035 -21232372 -21326333 -21714426 -20453395 -21900516 -18636236 -19410970 -19102888
51 -19102888 -18006476 -20839721 -18488645 -19438533 -19172570 -19337484 -17555172 -19535619 -19663283 -22069931
41 -22069931 -20785896 -20622463 -20720731 -19431732 -19149571 -19437896 -19791846 -20353218 -18334351 -18786397
31 -18786397 -20666463 -19572980 -20161803 -20737127 -19281744 -21030544 -19425723 -18776715 -20933682 -18007753
21 -18007753 -20135872 -19503798 -20508448 -20428707 -19875877 -18573990 -18451071 -18606308 -19189039 -19071564
11 -19071564 -19290054 -22116907 -19969606 -19163367 -19685023 -19946111 -19304394 -20226677 -17994874 -18861677
1 -18861677 -18762633 -19019225 -20534851 -21025539 -20950907 -20827143 -20137521 -19483760 -19959737 -20031845 -20186351
-10b0186351L07841J693857j551130N76123J81045r57992p02513J172406K96757j72753
-20a9342710r90598j0716K03380Q24626o08062O50799P64769q24238K20466j176184j74215
-31b0462683O29614J093315j278106P63236P11625K09749k662840J147173M30319q81427
-41b0300025L69299Q35132o34132n02949K42359K29896q8304n85330n90063K072320r83260
-52a9935057m59942K081695m74684Q99365j680657o28695n88438O67011P90435j280752
-62b0609719J368161k5194k102085j041628P25546K048813J39433m85087n89436L71198
-72b0199998o56054J52951K52624J129128j83176j477607J145072N69409M54891N6464
-82a8756296k146364O57622o62610L83437j71153P25797j7658k93915j60789J504061
$$ plain form
-10 -20186351 -19878510 -18184653 -19735783 -19159660 -18978615 -19936607 -20639120 -19466714 -19169957 -19342710
-20 -19342710 -20333308 -20344024 -20140644 -19316018 -19924080 -19273281 -18508512 -19332750 -19112284 -20288468 -20462683
-31 -20462683 -19833069 -18739754 -20017860 -19254624 -18542999 -18333250 -20996090 -19848917 -19418598 -20300025
-41 -20300025 -19930726 -19095594 -19729726 -20232675 -19990316 -19760420 -19848724 -20434054 -21024117 -18951797 -19935057
-52 -19935057 -20394999 -18313304 -18787988 -17888623 -19569280 -20197975 -20786413 -20119402 -19328967 -20609719
-62 -20609719 -19241558 -19266752 -21368837 -22410465 -21684919 -19636106 -19496673 -19981760 -20571196 -20199998
-72 -20199998 -20856052 -20703101 -20450477 -19321349 -19504525 -20982132 -19837060 -19267651 -18812760 -18756296
-82 -18756296 -20902660 -20245038 -20907648 -20524211 -20695364 -19969567 -19987225 -20281140 -20441929 -18937868
-92a8937868j559594K95840L79068n68454K04826r91479p86341J565295k405179M007602
-102a8796284q39880N80339P73875j518818j18263m06413L45944K139648j078179J01750
-112a8816281j429562Q65899o007j454471o60838j098690J191233J248149L62950j185985
-122b0983603j54668l03971k44947L998Q19895O085315l874730j959206L64701j66737
-132b0413953J057333m0908R08077p30924L09221m55111k45749j006344q90138L865127
-142a7643369j068785k859146Q13987Q90415K568343l242181N06227M72046O68303o821
-152a8900981q95375j111511K508552l52691M31893r81672J948768k484959N95246p509
-162a9250239q52629j745359J969897l92793n50872J404686m98989L27462m20684q50722
$$ plain form
-92 -18937868 -20497462 -20201622 -19822554 -20391008 -20186182 -21177661 -21964002 -20398707 -22803886 -18796284
-102 -18796284 -19636164 -19055825 -18281950 -19800768 -19919031 -20325444 -19979500 -17839852 -18918031 -18816281
-112 -18816281 -20245843 -19379944 -19385951 -20840422 -21501260 -22599950 -21408717 -20160568 -19797618 -20983603
-122 -20983603 -21138271 -21442242 -21687189 -21683191 -20863296 -14777981 -18652711 -20611917 -20247216 -20413953
-132 -20413953 -19356620 -19397528 -18489451 -19220375 -18911154 -19366265 -19612014 -20618358 -21508496 -17643369
-142 -17643369 -18712154 -21571300 -20757313 -19866898 -17298555 -20540736 -20034509 -19562463 -18894160 -18900981
-152 -18900981 -19796356 -20907867 -18399315 -18752006 -18320113 -19301785 -17353017 -19837976 -19242730 -19250239
-162 -19250239 -20102868 -21848227 -19878330 -20271123 -20821995 -19417309 -19916298 -19588836 -20009520 -20860242
-172b0860242J504683K99801j46293k130195K049104k001267K75628j6532k4565j216535
-182b2266413J44686M31839n115457Q196299K064232j947473O51421l148430J234541
-191a9754755N34350o29454j692674K344890r3851J285819k226076k79967k59711L6569
-201b0734860J092933r53071J592556j338087O68711m91097N70451j218500J122038P75432
-211a8913494Q2433q15687m9958P42248j302850M44554m23329M20334J155296q12354
-221a9472807k93062K015594j522911P20615o16941J764832l851605L43929j18449j020613
-231b2051418q121L078325k49347n76696j211644J157619J617871l340949L71347J110731
-241b0102282k8441O07380j341750N94065k686139L495729o86771O03581K095447k769394
$$ plain form
-172 -20860242 -19355559 -19055758 -19202051 -21332246 -19283142 -21284409 -21008781 -21025313 -21049878 -22266413
-182 -22266413 -22121727 -21689888 -26805345 -18609046 -16544814 -18492287 -17840866 -20989296 -19754755
-191 -19754755 -19220405 -19849859 -21542533 -19197643 -19291494 -18005675 -20231751 -20511718 -20771429 -20734860
-201 -20734860 -19641927 -20594998 -19002442 -20340529 -19671818 -20162915 -19592464 -20810964 -19688926 -18913494
-211 -18913494 -18831061 -19646748 -19696706 -18954458 -20257308 -19812754 -20236083 -19815749 -18660453 -19472807
-221 -19472807 -19765869 -17750275 -19273186 -18552571 -19169512 -17404680 -21256285 -20912356 -21030805 -22051418
-231 -22051418 -22059539 -18981214 -19230561 -19807257 -21018901 -19861282 -18243411 -21584360 -21213013 -20102282
-241 -20102282 -20130723 -19523343 -20865093 -20271028 -22957167 -19461438 -20148209 -19544628 -17449181 -20218575
-251b0218575J138853j565088j84360N7461n56442R16356p69988Q36025K5796J762096
-261a8557866k447325R62982R31428l1015n76706o90883L87938M40746j269497p74665
-271b1624863K497002k168384l56263l41439j0066K031693J161246q04248r67598o4908
-281b0647828L58597j213787R31930J77736q30811J357762j209692j029715J121535k92002
-291b1276275N90083m08384J877865k02160N99058k477344k81501J231540k508675M31637
-301b2424156k32440K334836n28912J206886q6429N17478m6503n93591m41683M38959
-311a9855555q76182j227338q10453J502759P96800J281318o20205m03727j3729R03654
-321a9322658J86139k36251j13924J295374k37152j283474L84911Q33459J475836m349294
$$ plain form
-251 -20218575 -19079722 -20644810 -20829170 -20771709 -21328151 -20411795 -21181783 -20345758 -20319962 -18557866
-261 -18557866 -21005191 -20042209 -19110781 -19141796 -19718502 -20409385 -20021447 -19580701 -20850198 -21624863
-271 -21624863 -19127861 -21296245 -21652508 -21993947 -22004013 -19972320 -18811074 -19615322 -20582920 -20647828
-281 -20647828 -20289231 -21503018 -20571088 -20393352 -21224163 -19866401 -21076093 -22105808 -20984273 -21276275
-291 -21276275 -20686192 -21094576 -19216711 -19418871 -18819813 -21297157 -21578658 -20347118 -22855793 -22424156
-301 -22424156 -22656596 -20321760 -20850672 -19643786 -19730215 -19212737 -19259240 -19852831 -20294514 -19855555
-311 -19855555 -20731737 -21959075 -22769528 -21266769 -20469969 -19188651 -19808856 -20212583 -20226312 -19322658
-321 -19322658 -19136519 -19372770 -19486694 -18191320 -18428472 -19711946 -19327035 -18493576 -17017740 -21367034
-331b1367034N64883M29920R1706K77236J315252P0697q66059j785290R72530J440120
-341a8856039l674813j874790J523669R44660O92288j75793l63063J106050L55828L18534
-351b0003469r55578J334707N60925j805066J334059P0786j148925k106596r1778J739573
-361b1071362m05024K149297n42500k5065j366965M90673n54037J678689q63060P50709
-371a9758645K02204M7209r19799J940713p99568J61968j410504J991526N6911R84991
-381a7502994q05498j987360J75311J648152j134830k09934n34125m30493O59885L21297
-391a9800589J068956p47882L06808p2347k628876Q68875P64566q55652M82049l36272
-401b0950364J462565j904838J345097j103645J378088j113385j839893K684082K70834
$$ plain form
-331 -21367034 -20802151 -20372231 -20280525 -20003289 -18688037 -18617340 -19483399 -21268689 -20296159 -18856039
-341 -18856039 -22530852 -24405642 -22881973 -21937313 -21245025 -21420818 -21783881 -20677831 -20322003 -20003469
-351 -20003469 -20959047 -19624340 -19063415 -20868481 -19534422 -19463636 -20612561 -22719157 -22810935 -21071362
-361 -21071362 -21476386 -19327089 -19869589 -19894654 -21261619 -20770946 -21324983 -19646294 -20509354 -19758645
-371 -19758645 -19556441 -19509232 -20429031 -18488318 -19287886 -19125918 -20536422 -18544896 -18487985 -17502994
-381 -17502994 -18308492 -20295852 -20120541 -18472389 -19607219 -19817153 -20351278 -20781771 -20121886 -19800589
-391 -19800589 -18731633 -19479515 -19172707 -19245054 -21873930 -21005055 -20240489 -21096141 -20614092 -20950364
-401 -20950364 -19487799 -21392637 -20047540 -21151185 -19773097 -20886482 -22726375 -20042293 -19771459
-410a9771459j858283Q53211M28769o94849p87911O42262r14553j471492J946057J377491
-420b0250757N24940J07234j448442j032139J294036j010080O24583m12810O49132k69054
-430b1223357M29373M15946J275982k024989J076227j03709o62580J067894j682378n1547
-440b1483138J823338o85597J518476j265027n28166J625816j010105k50427l55799
-449b0610629j616379P83154K79170r09724p36245K443217j65712O72899r24076l5899
-459b0820224J306205R63989j119665P90468o91664L63423n19069j579916O36543J041290
-469a9628620J161971j332920j956702Q63019L97823j225302p1547N39415O12934M01556
-479b0238373o49833J134708o84393p15956O30644K311143k262811m67281j14636n36966
$$ plain form
-410 -19771459 -21629742 -20776531 -20347762 -21042611 -21830522 -21188260 -22102813 -23574305 -21628248 -20250757
-420 -20250757 -19725817 -19618583 -21067025 -22099164 -20805128 -21815208 -21190625 -21603435 -20954303 -21223357
-430 -21223357 -20793984 -20378038 -19102056 -21127045 -20050818 -20154527 -20817107 -19749213 -21431591 -21483138
-440 -21483138 -19659800 -20345397 -18826921 -20091948 -20620114 -18994298 -20004403 -20254830 -20610629
-449 -20610629 -22227008 -21443854 -21164684 -22074408 -22810653 -20367436 -20533148 -19860249 -20784325 -20820224
-459 -20820224 -19514019 -18550030 -19669695 -18879227 -19570891 -19207468 -19726537 -21306453 -20669910 -19628620
-469 -19628620 -18466649 -19799569 -21756271 -20893252 -20495429 -21720731 -21792278 -21252863 -20639929 -20238373
-479 -20238373 -20888206 -19753498 -20437891 -21153847 -20523203 -18212060 -20474871 -20942152 -21056788 -21593754
-489b1593754Q37606J570409j423848Q58284j301570L53795p08076O7861l8087J083014
-499b0294366r54450J70546k70372J875833j363305o81769L26309L46363k15154p25239
-509b1785604r89621L132694k780588j053146K067112J315482K88394M86430m4016j338673
-519b0701536Q21533j186895K71202O38991J79836J28661k111273j78906K74942R72429
-529b0891016o56455P32816P24703L36954j642741j064285L14274N24278j53824m31030
-539b2206326J96389J427655Q12868j065100O41000o57511j873547J870177k64508N41096
-549b0577807p3782J322013M75748j406376M2010P81400M85363o96489q00810K7320n80381
-560b1001791j60286P44896j088119R65404j281670K201993l00109j349382K074730
$$ plain form
-489 -21593754 -20756148 -19185739 -20609587 -19751303 -21052873 -20699078 -21407154 -21339293 -21377380 -20294366
-499 -20294366 -21248816 -21078270 -21348642 -19472809 -20836114 -21517883 -21191574 -20845211 -21060365 -21785604
-509 -21785604 -22775225 -19642531 -22423119 -23476265 -21409153 -20093671 -19805277 -19318847 -19362863 -20701536
-519 -20701536 -19880003 -21066898 -20795696 -20156705 -19976869 -19848208 -21959481 -22138387 -21863445 -20891016
-529 -20891016 -21547471 -20814655 -20089952 -19752998 -21395739 -22460024 -22145750 -21621472 -21775296 -22206326
-539 -22206326 -22009937 -20582282 -19769414 -20834514 -20193514 -20851025 -22724572 -20854395 -21118903 -20577807
-549 -20577807 -20651589 -19329576 -18853828 -20260204 -20218194 -19436794 -18951431 -19647920 -20448730 -20421410 -21001791
-560 -21001791 -21162077 -20417181 -21505300 -20539896 -21821566 -19619573 -19919682 -21269064 -19194334
-569a9194334k621826J752608o28552N2987J093866q95160j504278O89236M01531J093251
-579a9760671K82308k122498O20531R47254M45861j868730p53542N1208K39762J908160
-589b0010357O24959J21388k624775Q68504r53091M03386O485469m603272r58364L29993
-599b0316160J374606L42915k77209j522994J393729r82812M24005l34443P45420j299695
-609b0452638j661126N9276O98402j635151J842633L57650J543253m53153J21534r56063
-619b0535383j113206L6576j104049M664567O83115j716852Q37516l579526l2591J21024
-629b1738809J553982R68490N54168k085703p38447J046670J362447j466653j217267
-638b1761122J643055l90947j322447L51975P48500j33493P01062n80880J995460p56155
$$ plain form
-569 -19194334 -21816160 -20063552 -20692104 -20639117 -19545251 -20440411 -21944689 -21255453 -20853922 -19760671
-579 -19760671 -19478363 -21600861 -20980330 -20033076 -19587215 -21455945 -22209487 -22158279 -21918517 -20010357
-589 -20010357 -19385398 -19264010 -21888785 -21020281 -21973372 -21569986 -15084517 -19687789 -20646153 -20316160
-599 -20316160 -18941554 -18598639 -18875848 -20398842 -19005113 -19987925 -19563920 -19898363 -19152943 -20452638
-609 -20452638 -22113764 -22054488 -21356086 -22991237 -21148604 -20790954 -19247701 -19700854 -19579320 -20535383
-619 -20535383 -21648589 -21612013 -22716062 -18051495 -17368380 -19085232 -18247716 -21827242 -21859833 -21738809
-629 -21738809 -20184827 -19216337 -18662169 -20747872 -21486319 -20439649 -19077202 -20543855 -21761122
-638 -21761122 -20118067 -20509014 -21831461 -21479486 -20730986 -20864479 -20163417 -20744297 -18748837 -19504992
-648a9504992q02706J251668j695471J306287k27786M82701j633984M95501j050800Q51358
-658b0528224l54372j090803J037351J090534j110292j549472R60198R77266j963781
-667b2531595J184107Q09269J994880j14983m38117O0022j115210q22243N17036l380376
-677b3837210J475901R10920q85059N49834n21502J010835J332k33913P65313j434502
-687b2198051J321923O97243R97767j757909j191685K514306j691529n8018J297744M10077
-697a9658132j379385M23987k51478J24778J381341m29041J83018J217177j304889j307935
-707b1000559J171534l24004j081751O30224k40718J265939j709830r1238j024750K324403
-717b0080750o60369j259328Q72116J042339j050101N47641n21030J58252j39336k44024
$$ plain form
-648 -19504992 -20307698 -19056030 -20751501 -19445214 -19673000 -19190299 -20824283 -20328782 -21379582 -20528224
-658 -20528224 -20882596 -21973399 -20936048 -19845514 -20955806 -22505278 -21545080 -20567814 -22531595
-667 -22531595 -21347488 -20538219 -18543339 -18658322 -19096439 -19036417 -20151627 -20973870 -20456834 -23837210
-677 -23837210 -22361309 -21450389 -22335448 -21785614 -22307116 -21296281 -21294949 -21528862 -20763549 -22198051
-687 -22198051 -20876128 -20178885 -19181118 -20939027 -22130712 -19616406 -21307935 -21365953 -20068209 -19658132
-697 -19658132 -21037517 -20613530 -20865008 -20740230 -19358889 -19787930 -19604912 -18387735 -19692624 -21000559
-707 -21000559 -19829025 -20153029 -21234780 -20604556 -20845274 -19579335 -21289165 -21380403 -22405153 -20080750
-717 -20080750 -20741119 -22000447 -21128331 -20085992 -21136093 -20588452 -21109482 -20951230 -21090566 -21334590
-727b1334590j337972K97212K063688O69717J063644k311368J142179L20610l92244K97689
-737a9521435k92890J48006P27866k183167n14798m33948J141414J215502j269809K476505
-747a8506754k476709j38719J696711j276173Q19395o5048q91604K171782k05208k110984
-757b0983311N84405J42890K218186r33878m68695M1962L610354n214068M49568p19530
-767b1272117P81390P66240O47398q87401J038730P6483N1129k363106J030492L50651
-777a9780111k56005j031475m96078r02069J345296K502620j523625k97500N46574p67015
-787b0659388q32552K235882l113714L568391j729735o6502j91903j035379N93907j171324
-797b2402317R05617j17667J121757o73596Q4889p38525K69147j037782J021127J278812
$$ plain form
-727 -21334590 -22672562 -22375350 -20311662 -19641945 -18578301 -20889669 -19747490 -19426880 -19819124 -19521435
-737 -19521435 -19814325 -19666319 -18938453 -21121620 -21636418 -22070366 -20928952 -19713450 -20983259 -18506754
-747 -18506754 -20983463 -21122182 -19425471 -20701644 -19882249 -19947297 -20838901 -18667119 -18872327 -20983311
-757 -20983311 -20398906 -20256016 -18037830 -18971708 -19440403 -19398441 -15788087 -21002155 -20552587 -21272117
-767 -21272117 -20490727 -19724487 -19077089 -19964490 -18925760 -18849277 -18798148 -21161254 -20130762 -19780111
-777 -19780111 -20036116 -21067591 -21563669 -22465738 -21120442 -18617822 -20141447 -20438947 -19892373 -20659388
-787 -20659388 -21491940 -19256058 -22369772 -18801381 -20531116 -20597618 -20789521 -21824900 -21230993 -22402317
-797 -22402317 -21496700 -21614367 -20492610 -21166206 -21081317 -21819842 -21550695 -22588477 -21567350 -20288538
-807b0288538q3203o01539m64197L3652j533413J006560J611977n36026j240358J432067
-817b0663018J208250n43100j217171J639876j460235P86923r11358N06021K90562j292201
-827b1655451Q37352Q28411j488700J770223q10792L73422k06329K448514J054791j840761
-837a8689320j399177j499573K08987n36688M82692J280050j455109p59679K091257
-846b0276560j090177J568960Q45125j213974P23816P19191l07678l92857J44966k575358
-856b1854546K524708j914078l00103l17363r5500m22917O97005O88738j296045J863863
-866b0426238q2608l43848K020707k364832O59893j816608J835617K66081J027350k681754
-876b1906240K740551j219145j019877J745364r76606J350996k099820L54204N48419
$$ plain form
-807 -20288538 -20371741 -20973280 -21437477 -21403825 -22937238 -21930678 -20318701 -20854727 -22095085 -20663018
-817 -20663018 -19454768 -19997868 -21215039 -19575163 -21035398 -20248475 -21159833 -20653812 -20363250 -21655451
-827 -21655451 -20818099 -19989688 -21478388 -19708165 -20518957 -20145535 -20351864 -17903350 -16848559 -18689320
-837 -18689320 -20088497 -21588070 -21379083 -21915771 -21433079 -20153029 -21608138 -22367817 -20276560
-846 -20276560 -21366737 -19797777 -18952652 -20166626 -19442810 -18723619 -19031297 -19424154 -19279188 -21854546
-856 -21854546 -19329838 -21243916 -21544019 -21861382 -21956882 -22379799 -21682794 -20994056 -22290101 -20426238
-866 -20426238 -20508846 -20852694 -18831987 -21196819 -20536926 -22353534 -20517917 -20251836 -19224486 -21906240
-876 -21906240 -19165689 -20384834 -21404711 -19659347 -20635953 -19284957 -21384777 -21030573 -20482154
-885b0482154n97995n4609Q3681j173005L06551j54785j69654j04224P590K35310L542859
-896a8560435j162110O91281j151958J194675n434784M251520n45850O91310n7049m60905
-906b0544305M25322j606854o9573J364569Q78637m62668m25190o3124j840124Q4667
-916b2258643m57439l41572J475538k69762J13716k14755k07755n5443M80432R2626P85471
-927b0857586R29683M64692q85972J106686j705777J059734j0048r54512N94721k11073
-937b0469452j236980J204832j028897R9504J786836r37076l39294J019337o86739o78414
-947b1266343n29180J009993K65285k408194J035751J541567L15831l68936n2077N91202
-957a9865101k63567j215501N66772k007518J679567J652633k458172J620064P91596
$$ plain form
-885 -20482154 -21080149 -21134758 -21051077 -22224082 -21917531 -22072316 -22241970 -22346194 -22338604 -22103294 -18560435
-896 -18560435 -19722545 -19031264 -20183222 -18988547 -24423331 -20171811 -20717661 -20026351 -20083400 -20544305
-906 -20544305 -20118983 -21725837 -21795410 -20430841 -19552204 -20014872 -20440062 -20503186 -22343310 -22258643
-916 -22258643 -22716082 -23057654 -21582116 -21851878 -21738162 -21952917 -22160672 -22216115 -21735683 -21643057 -20857586
-927 -20857586 -19927903 -19463211 -20349183 -19242497 -20948274 -19888540 -19898588 -20853100 -20258379 -20469452
-937 -20469452 -21706432 -20501600 -21530497 -21430993 -19644157 -20581233 -20920527 -19901190 -20587929 -21266343
-947 -21266343 -21795523 -20785530 -20520245 -22928439 -21892688 -20351121 -20035290 -20404226 -20456303 -19865101
-957 -19865101 -20128668 -21344169 -20777397 -22784915 -21105348 -19452715 -21910887 -20290823 -19499227
-966a9499227j360449J508862m49393R25369j208001q08519O40558j641883J145081M66343
-976b0281259o99390m18782k58125J900454J055316q43552J027550j791902L95335j85261
-986b0099616K232303j966958K98254J27639J195785o063124J603297k00057N03113
-995b2369364K029931l19424j040784J318728K082659p71250j757653j10034o71054l8715
-1005b1646960Q06886K16366O91683p43497o87201j698851K099874J85346j145203q43597
-1015b2765154Q40435p29238J513830Q64510o87469n8242J682830j634072k31611N55505
-1025b0648676k13243n98373l68445J916859j919133n99325J813215L52655j400899
-1034b1665365j540367L167121J17035O52029l366602J601573n6711o55027L60893J143437
$$ plain form
-966 -19499227 -20859676 -19350814 -19800207 -18874838 -20082839 -20891358 -20250800 -21892683 -20747602 -20281259
-976 -20281259 -20980649 -21399431 -21657556 -19757102 -18701786 -19545338 -18517788 -20309690 -19914355 -20099616
-986 -20099616 -17867313 -19834271 -19536017 -19408378 -18212593 -24275717 -22672420 -22872477 -22369364
-995 -22369364 -20339433 -20658857 -21699641 -20380913 -18298254 -19069504 -20827157 -20937191 -21608245 -21646960
-1005 -21646960 -20840074 -20623708 -19932025 -20675522 -21362723 -23061574 -20961700 -20776354 -21921557 -22765154
-1015 -22765154 -21924719 -22653957 -21140127 -20275617 -20963086 -21021328 -19338498 -20972570 -21204181 -20648676
-1025 -20648676 -20861919 -21460292 -21828737 -19911878 -21831011 -22430336 -20617121 -20264466 -21665365
-1034 -21665365 -23205732 -20038611 -19921576 -19269547 -22636149 -21034576 -21091287 -21746314 -21385421 -20241984
-1044b0241984L1462j404267M77571j23988o8225o37666l70266l01539Q18093R02863
-1054b0917946L10836r13014J539423m76659j867253m227640M676962k75490O13134M47903
-1064b1089744P54357p83704J32128O77317k011517O15943k50226Q57388n68281j96712
-1074b1863051J076544l03912k25252j00100m04595M50251J999382k108838j094131l22297
-1084b2895999M89896K73532J076467J201644l23888j856669J495670J014896n3421
-1093a9577872k372207K67367J345304j3848j059274j773108r1720K727378L29226j46206
-1103b0364960j01239n47783k379644J965302l14934J863572K255454k835668m96738
-1112b0956638j060774K406458n44651J94780P93806l74264j890366j272253K902362
$$ plain form
-1044 -20241984 -20210522 -21614789 -21137218 -21261206 -21329431 -21967097 -22337363 -22638902 -21820809 -20917946
-1054 -20917946 -20607110 -21520124 -19980701 -20457360 -22324613 -26552253 -21875291 -22150781 -21537647 -21089744
-1064 -21089744 -20335387 -21119091 -20986963 -20309646 -22321163 -21705220 -21955446 -21098058 -21666339 -21863051
-1074 -21863051 -20786507 -21090419 -21315671 -21415771 -21820366 -21370115 -19370733 -21479571 -22573702 -22895999
-1084 -22895999 -22406103 -22132571 -21056104 -19854460 -20178348 -22035017 -20539347 -19524451 -19577872
-1093 -19577872 -21950079 -21682712 -20337408 -20351256 -21410530 -23183638 -23275358 -20547980 -20218754 -20364960
-1103 -20364960 -20466199 -21013982 -23393626 -21428324 -21743258 -19879686 -17624232 -20459900 -20956638
-1112 -20956638 -22017412 -19610954 -20155605 -19960825 -19167019 -19541283 -21431649 -22703902 -19801540
-1121a9801540L14998p21043o38807J969038k36819o89679r32145o25417M83998q11137
-1131b1688553K091310k41949j174306K45774J416714l96601j326083O17325j066374
-1140b1522743o51947j19597L57520J714194k54594j310740J324815n70560Q52472j550869
-1150b1732049J862539j480850o22649Q53710j622691J546705P05010P51079j967816
-1159b1707012P89912k315359K530593j312983L51538N8625j275335O23762K692180
-1168a9564079j455946k064770m60285o39026K000054J145810N31398j718182K694698
-1177a9530328j005564q71989j5002K9433J922495j912013L118600k433381j574133R34183
-1187b1337699n82184k36717L89151j438210J225248L18594J641659m48203L57966j45461
$$ plain form
-1121 -19801540 -19486542 -20207585 -20846392 -18877354 -19114173 -19803852 -20735997 -21361414 -20877416 -21688553
-1131 -21688553 -19597243 -19839192 -21013498 -20767724 -19351010 -19747611 -21073694 -20456369 -21522743
-1140 -21522743 -22174690 -22294287 -21936767 -20222573 -20477167 -21787907 -20463092 -21033652 -20181180 -21732049
-1150 -21732049 -19869510 -21350360 -21973009 -21119299 -22741990 -21195285 -20490275 -19739196 -21707012
-1159 -21707012 -20917100 -23232459 -20701866 -22014849 -21663311 -21604686 -22880021 -22256259 -19564079
-1168 -19564079 -21020025 -23084795 -23545080 -24184106 -22184052 -21038242 -20506844 -22225026 -19530328
-1177 -19530328 -20535892 -21407881 -21422883 -21393450 -19470955 -21382968 -18264368 -20697749 -22271882 -21337699
-1187 -21337699 -21919883 -22156600 -21767449 -23205659 -21980411 -21661817 -20020158 -20468361 -20110395 -20255856
-1197b0255856j674420P11710j526484L451474J130746k059348k83530l21773j98397
-1206b1025878J68512j252360J37570l26766N65055j221234N81622J827173J300412n93918
-1216a9839812m90226j877275J364144m33660J079389j161934K68882J11696R48429
-1225b0030367k763968Q56417k36877N14733j993090K280404N88594J432819n52937p84382
-1235b0688654R83428J52081m60736N10993j992266J364471r31960r22316J00887j02176
-1245b1986248K133436q38330p22863K276143j48602m19019L3623J413326l036183Q74695
-1255b0420022O1673K22407o37179k43544Q29154j492040L93454p95404O44900J561176
-1265a9875425J5308m86351p9239j946259J733082j460521O93677R71771N88278q88606
$$ plain form
-1197 -20255856 -21930276 -21218566 -22745050 -19293576 -18162830 -20222178 -20505708 -20827481 -21025878
-1206 -21025878 -20857366 -22109726 -21972156 -22298922 -21733867 -22955101 -22373479 -20546306 -19245894 -19839812
-1216 -19839812 -20330038 -22207313 -20843169 -21276829 -20197440 -21359374 -21090492 -20978796 -20030367
-1225 -20030367 -22794335 -21937918 -22174795 -21660062 -23653152 -21372748 -20784154 -19351335 -19904272 -20688654
-1235 -20688654 -19705226 -19553145 -20013881 -19502888 -21495154 -20130683 -21062643 -21984959 -21884072 -21986248
-1245 -21986248 -19852812 -20691142 -21414005 -19137862 -19286464 -19705483 -19671860 -18258534 -21294717 -20420022
-1255 -20420022 -20358349 -20135942 -20773121 -21016665 -20187511 -21679551 -21286097 -22081501 -21436601 -19875425
-1265 -19875425 -19860117 -20346468 -20425707 -22371966 -20638884 -22099405 -21405728 -20433957 -19845679 -20734285
-1275b0734285L06092j369750J585548M7007j357261J4980j9724J756765j928959J972073
-1285a9727514k01202k508922K521316o19990j844211J360108j087996K92645K09980
-1294b1605786j93108O61114N66209j118329P98189n44860j14096J327767k951499L043590
-1304b0130809K74734j897324k87122J230158P39508m72838J248038p72126J233467
-1313a8834314k346892j32959n26520R49884L928364k150987j410453m42161J69402P25638
-1323b0070998p13422R57740j009991k366326p48064K803900j819391J051861K46614
-1332b1668077r22306J152530K63355K04941L38990P57640m99509k40419J41813J56673
-1342b0314369j580493O61890K426257j57297o02343k551355J674366q27418o14705
$$ plain form
-1275 -20734285 -20428193 -21797943 -20212395 -20165388 -21522649 -21507669 -21527393 -19770628 -21699587 -19727514
-1285 -19727514 -19928716 -22437638 -19916322 -20536312 -22380523 -21020415 -22108411 -21815766 -21605786
-1294 -21605786 -21798894 -21137780 -20571571 -21689900 -20891711 -21436571 -21550667 -20222900 -23174399 -20130809
-1304 -20130809 -19856075 -21753399 -22040521 -20810363 -20070855 -20543693 -19295655 -20067781 -18834314
-1313 -18834314 -21181206 -21314165 -21840685 -20890801 -16962437 -19113424 -20523877 -20966038 -20796636 -20070998
-1323 -20070998 -20784420 -19826680 -20836671 -23202997 -23951061 -21147161 -22966552 -21914691 -21668077
-1332 -21668077 -22590383 -21437853 -21174498 -20969557 -20630567 -19872927 -20372436 -20612855 -20471042 -20314369
-1342 -20314369 -21894862 -21232972 -18806715 -18964012 -19566355 -22117710 -20443344 -21270762 -21885467
-1351b1885467J276791K059206j279046j272513R03692j186930J033646n02238m35721
-1360b1288580o88779j9384p80063L449958L70897J187558k010144R13219j929066J192517
-1370a9601867m26603o41487L38643R59420m15222j499753J960313J885043k977805
-1379b0419318K253470k50212k444625q95103L41265L23704n84113J156284R02252r91861
-1389b0608257J032063j889029m18018J263991j080946J79890P15383m5684j7398J84949
-1399b0683056P11512j104593O95917r67846J235999M77743p31425q74669m46723n55103
-1409b2242244k36755k42205J159494K10127K233398n84686j351744k653959P37269
-1418b2971305J928769Q2533J72405k394551J045951N51915L66917j36960j507477R65361
$$ plain form
-1351 -21885467 -20608676 -18549470 -19828516 -21101029 -20197337 -21384267 -20350621 -20852859 -21288580
-1360 -21288580 -21977359 -21996743 -22776806 -19326848 -18955951 -17768393 -19778537 -18865318 -20794384 -19601867
-1370 -19601867 -20028470 -20669957 -20331314 -19371894 -19787116 -21286869 -19326556 -17441513 -20419318
-1379 -20419318 -18165848 -18416060 -20860685 -21755788 -21414523 -21090819 -21674932 -20518648 -19616396 -20608257
-1389 -20608257 -19576194 -21465223 -21883241 -20619250 -21700196 -21520306 -20804923 -20850607 -20868005 -20683056
-1399 -20683056 -19971544 -21076137 -20380220 -21348066 -20112067 -19634324 -20365749 -21240418 -21687141 -22242244
-1409 -22242244 -22478999 -22721204 -21561710 -21351583 -19118185 -19702871 -21054615 -23708574 -22971305
-1418 -22971305 -21042536 -20960003 -20787598 -23182149 -22136198 -21584283 -21217366 -21354326 -22861803 -21896442
-1428b1896442J165220J322221M80708P71879k642778l88815O63917L673313l642876
-1437b0493653j009755O24276k073098K726299j364423L32723K58119O75874K43221Q8272
-1447a9992145Q868j183033O39892O18667j055387N17801N08897J146309l629036J287735
-1457b1131432r16698O70894j1830j66150j281041K832514j210989N27879j907698J843088
-1467b0751463P68133j192775P36812J960229m963193Q30961p80217Q44924j14121Q56452
-1477b1804258j68176o52321Q43474q84339L274780q11751K1890l909016j408999L230043
-1487b2268673J132748n67549K57072Q93939j514552r00254M32398L9004o38098J028155
-1497b2105810k98969P97527q57351M14884n6188o88331j711425O60850K866728J81443
$$ plain form
-1428 -21896442 -20731222 -19409001 -18928293 -18156414 -20799192 -21188007 -20524090 -16850777 -20493653
-1437 -20493653 -21503408 -20879132 -22952230 -20225931 -21590354 -21257631 -20999512 -20323638 -20080417 -19992145
-1447 -19992145 -19983277 -21166310 -20526418 -19907751 -20963138 -20445337 -19936440 -18790131 -22419167 -21131432
-1457 -21131432 -22048130 -21377236 -21389066 -21555216 -22836257 -20003743 -21214732 -20686853 -22594551 -20751463
-1467 -20751463 -19983330 -21176105 -20439293 -18479064 -23442257 -22611296 -23391513 -22546589 -22660710 -21804258
-1477 -21804258 -21972434 -22624755 -21781281 -22665620 -19390840 -20202591 -20180701 -24089717 -25498716 -22268673
-1487 -22268673 -21135925 -21703474 -21446402 -20552463 -22067015 -22967269 -22534871 -22495867 -23133965 -22105810
-1497 -22105810 -22404779 -21607252 -22464603 -22049719 -22105907 -22794238 -24505663 -23844813 -20978085 -20796642
-1507b0796642J001181j505070q90350K4879J558713l37611J172573n68126K47947k50736
-1517b0343242L40742p91118l60742m20265N03983p9645Q72444M18794O74556j061657
-1527b0246150J506985k366236P40342l23348k364689P36709k21818j555419L971021
-1536b0122603k066223k06185J966925k899176J199442M22842n04502K60895L46879
-1545b1601706J079584r4167j779176J196448R24633j91823j758522o13646J127677
-1554b1710698L588454j138453r98131j478861L65924p1471m02927J380292M74120P78357
-1564a9213394j384658Q38028j70228m66843K18331J77707m81332p65465p87625k5926
-1574b2061405K69777r46642N40186L89803J578988j759632L73674P41680o12072n2447
$$ plain form
-1507 -20796642 -19795461 -21300531 -22190881 -22166002 -20607289 -20944900 -19772327 -20340453 -20092506 -20343242
-1517 -20343242 -20002500 -20793618 -21154360 -21574625 -21070642 -21150287 -20277843 -19859049 -19184493 -20246150
-1527 -20246150 -18739165 -21105401 -20365059 -20688407 -23053096 -22316387 -22538205 -24093624 -20122603
-1536 -20122603 -22188826 -22395011 -20428086 -23327262 -22127820 -21704978 -22209480 -21948585 -21601706
-1545 -21601706 -20522122 -20616289 -22395465 -21199017 -20274384 -20466207 -22224729 -22838375 -21710698
-1554 -21710698 -18122244 -19260697 -20258828 -21737689 -21371765 -21443236 -21846163 -20465871 -19991751 -19213394
-1564 -19213394 -20598052 -19760024 -19930252 -20397095 -20178764 -20001057 -20482389 -21247854 -22035479 -22061405
-1574 -22061405 -21791628 -22738270 -22198084 -21808281 -20229293 -21988925 -21615251 -20873571 -21485643 -21538090
-1584b1538090q07308J774050M96931j090638K70970r43998N14966j33869n24139J187579
-1594b0793546j020766L22361k85366o3139Q47538L67064j29573l3451N77465R02106
-1604a9309307j279704q81774J257184L46390o309814M112530q77411j138039M92025
-1613b3587920N86764K883549r88495j376291K262077l68964j398235J91959J373339
-1622b0422217K44013q62903J161330n07712k110813p04020J380923M88484J141075
-1631b0191840l214250J862922N58359q91361J231366l86673r91384j229901J14346O0050
-1641b3078366K266742n83963L522714l221889m85020L88938p15463O19249M43560k325225
-1651b3168723R70040M27009K329199j78908k448942J243145J700680L11071l058958
$$ plain form
-1584 -21538090 -22345398 -20571348 -20074417 -21165055 -20894085 -21838083 -21323117 -21456986 -21981125 -20793546
-1594 -20793546 -21814312 -21491951 -21777317 -21840456 -20992918 -20625854 -20755427 -20788878 -20211413 -19309307
-1604 -19309307 -20589011 -21470785 -20213601 -19867211 -26177025 -22064495 -22941906 -24079945 -23587920
-1613 -23587920 -23001156 -20117607 -21106102 -22482393 -20220316 -20589280 -21987515 -21795556 -20422217
-1622 -20422217 -20178204 -21041107 -19879777 -20387489 -22498302 -23202322 -21821399 -21332915 -20191840
-1631 -20191840 -23406090 -21543168 -20984809 -21876170 -20644804 -21031477 -22022861 -23252762 -23138416 -23078366
-1641 -23078366 -20811624 -21395587 -17872873 -21094762 -21579782 -21190844 -21906307 -21287058 -20843498 -23168723
-1651 -23168723 -22198683 -21771674 -19442475 -19621383 -22070325 -20827180 -19126500 -18815429 -21874387
-1660b1874387J002965p76339k37135K431586l08372j295138k548527K472948J989833
-1669a9142566j921443J082313l560256J313508P39765n71814j126679L140556j576857
-1678b1623473Q59227Q83772j092041j178850R42955N23492k71589j040031J077642K01420
-1688b0717476Q84786O08352k596920j79076J642720o07306j291500O63296K409078
-1697a9184046j665496j073337o54436K802822j186836R21726j7108k019283K793536
-1706a9282458k08577r37556r17947K92332m30101J418541j167520l82796J986062k082593
-1716b1712613L62872K47992J539767j374745O53689p58359n32643J307210k02237J34108
-1726b0334959k50305j83940O6284o8341P5606J84874j062389Q34542j768407J009261
$$ plain form
-1660 -21874387 -20871422 -21647761 -21884896 -19453310 -19761682 -21056820 -23605347 -21132399 -19142566
-1669 -19142566 -21064009 -19981696 -23541952 -22228444 -21488679 -22060493 -23187172 -20046616 -21623473
-1678 -21623473 -20764246 -19880474 -20972515 -22151365 -21208410 -20684918 -20956507 -21996538 -20918896 -20717476
-1688 -20717476 -19832690 -19224338 -21821258 -22000334 -20357614 -20964920 -22256420 -21593124 -19184046
-1697 -19184046 -20849542 -21922879 -22577315 -19774493 -20961329 -20039603 -20056711 -22075994 -19282458
-1706 -19282458 -19491035 -20428591 -21346538 -21054206 -21484307 -20065766 -21233286 -21616082 -19630020 -21712613
-1716 -21712613 -21349741 -21101749 -19561982 -20936727 -20283038 -21041397 -21574040 -20266830 -20469067 -20334959
-1726 -20334959 -20585264 -20769204 -20702920 -20771261 -20695655 -20510781 -21573170 -20738628 -22507035 -21497774
-1736b1497774J46908n92004J115601R68406j278270m19689J613376p28480N50300j172512
-1746b1294138O44940N39030j846031K7201J628262o71605l45437J108187n35528q68477
-1756b1613596N42667n14806P37071j504983J988784J070089M83617j731666k90133p95259
-1766b1628215k58213q21580O74714J020417n78043K4583J9056J332186J477424j672055
-1776b0409726L04044r96699j23112J111182q86313p50464K867044j582981j236016
-1785b1703041J110860q39503K51757O79351j109222R48436m09741J327118j036630L13172
-1795b0467443j548672J096706l020M37987N23676j427531k29829N5541j36476q06120
-1805b2505181J085001L14310N55745O35596j070148o604m78394k5350n2044j005298
$$ plain form
-1736 -21497774 -21350866 -21942870 -20827269 -19858863 -21137133 -21556822 -19943446 -20671926 -20121626 -21294138
-1746 -21294138 -20649198 -20110168 -21956199 -21928998 -20300736 -20972341 -21317778 -20209591 -20745119 -21613596
-1756 -21613596 -21070929 -21585735 -20848664 -22353647 -20364863 -19294774 -18811157 -20542823 -20832956 -21628215
-1766 -21628215 -21886428 -22708008 -22033294 -21012877 -21590920 -21566337 -21547281 -20215095 -18737671 -20409726
-1776 -20409726 -20105682 -21102381 -21225493 -20114311 -21000624 -21751088 -18884044 -20467025 -21703041
-1785 -21703041 -20592181 -21431684 -21179927 -20500576 -21609798 -20661362 -21071103 -19743985 -20780615 -20467443
-1795 -20467443 -22016115 -20919409 -20922429 -20484442 -19960766 -21388297 -21618126 -21562585 -21699061 -22505181
-1805 -22505181 -21420180 -21105870 -20550125 -19914529 -20984677 -20991281 -21469675 -21495025 -21547069 -22552367
-1815b2552367J023810K02571J113150l49184O21657j734104P92324J91477j09879m89054
-1825b1289599J004054J815904k715421J602837k323293M63213m18390J343747j252483
-1834b1769431j502941J134611J651948R97381j717580j64659K81930L98342Q42474
-1843a9847925j680413L82384J78030j83605Q31984J540831j625801p01916J109302
-1852a9997129j080147K390660n100138J271367J230838o28533O36378q36605Q44666
-1861b1268643R12469J920352j115328k32757m5213j082566p78784R8372Q824J650787
-1871a9932487j242355J445616R23208j208871m96408k485562K560179l58072K91302
-1880b0503450j514217r77333R49382j05464J718681K68665o30198N37139j060688o44193
$$ plain form
-1815 -22552367 -21528557 -21325986 -20212836 -20562020 -19940363 -21674467 -20882143 -20690666 -20800545 -21289599
-1825 -21289599 -20285545 -18469641 -21185062 -19582225 -21905518 -21442305 -21860695 -20516948 -21769431
-1834 -21769431 -23272372 -22137761 -20485813 -19488432 -21206012 -21370671 -21088741 -20690399 -19847925
-1843 -19847925 -21528338 -21145954 -20967924 -21151529 -20319545 -18778714 -20404515 -21106431 -19997129
-1852 -19997129 -21077276 -18686616 -23786754 -22515387 -21284549 -21913082 -21276704 -22113309 -21268643
-1861 -21268643 -20356174 -18435822 -19551150 -19783907 -19829120 -20911686 -21690470 -21592098 -21583274 -19932487
-1871 -19932487 -21174842 -19729226 -18806018 -20014889 -20511297 -22996859 -20436680 -20794752 -20503450
-1880 -20503450 -22017667 -22995000 -22045618 -22151082 -20432401 -20163736 -20793934 -20256795 -21317483 -21961676
-1890b1961676n89598J796910J492854n66713r41827j045517J519015j822695J076611
-1899b1042636K098196j974050j58058j229830k0696j358263K659785j50315j043294p5685
-1909b2294846k06835O7232J775826n89868J488533L38701q48185j044365L6810J89212
-1919b1087785n38639J58009P60453r14444k761815m64398M333736j002843K79438L22859
-1929b0915429L77539K066063k224387n19189M09185l0151P89269n68461N29726n10752
-1939b0596587J699747n260j291031j055779o67648N96099K69159j164588R51597J294732
-1949a9969559R43183j698432j22872P40214j466385J036706j004073O78502j06256k48856
-1959b1217828L1439Q34172O081q97997n13802J648664J73195p04116k05863q02654M59253
$$ plain form
-1890 -21961676 -22551274 -20754364 -19261510 -19828223 -20770050 -21815567 -20296552 -22119247 -21042636
-1899 -21042636 -18944440 -20918490 -21076548 -22306378 -22327074 -23685337 -21025552 -21175867 -22219161 -22294846
-1909 -22294846 -22501681 -22434449 -20658623 -21248491 -19759958 -19421257 -20269442 -21313807 -21276997 -21087785
-1919 -21087785 -21626424 -21468415 -20707962 -21622406 -24384221 -24848619 -20514883 -21517726 -21238288 -20915429
-1929 -20915429 -20537890 -18471827 -20696214 -21215403 -20806218 -20836369 -20047100 -20615561 -20085835 -20596587
-1939 -20596587 -18896840 -18902100 -20193131 -21248910 -21916558 -21320459 -21051300 -22215888 -21264291 -19969559
-1949 -19969559 -19026376 -20724808 -20847680 -20107466 -21573851 -20537145 -21541218 -20862716 -20968972 -21217828
-1959 -21217828 -21186389 -20352217 -20346136 -21244133 -21757935 -20109271 -19936076 -20640192 -20846055 -21648709 -21189456
-1970b1189456J951996l803958r98269K164115j5039K31108L70188P97714k02429q44237
-1980b1538267K07232j39928o0389j914502K043845R31826p99601J261991j036590j195158
-1990b2239541O97192P07311J006966k141652q95802J617399l11951J14378J325999
-1999b0119701k467147n5009M31954j206918L08863M77851R99828K85448L34082P42779
-2009b0267970n10787J982353q21938j810931L47129n92181N17978O10558q47084N67430
-2019b0825443J265279j199682l5037j369182J264381o19035j917975K79099J150822
-2028b2006773M74414J216335j158300J706538k447338n01081J311484M9126M30373
-2037b0925222J486848k042943Q48072M71204j757309q55085J38698q56610K431035O40612
$$ plain form
-1970 -21189456 -19237460 -23041418 -24039687 -21875572 -21890611 -21659503 -21289315 -20491601 -20694030 -21538267
-1980 -21538267 -21331035 -21470963 -21531352 -23445854 -21402009 -20470183 -21269784 -20007793 -21044383 -22239541
-1990 -22239541 -21542349 -20835038 -19828072 -21969724 -22865526 -21248127 -21560078 -21445700 -20119701
-1999 -20119701 -22586848 -22641857 -22209903 -23416821 -23107958 -22630107 -21630279 -21344831 -21010749 -20267970
-2009 -20267970 -20778757 -18796404 -19618342 -21429273 -21082144 -21674325 -21156347 -20545789 -21392873 -20825443
-2019 -20825443 -19560164 -20759846 -20794883 -22164065 -20899684 -21518719 -23436694 -23157595 -22006773
-2028 -22006773 -21532359 -20316024 -21474324 -19767786 -22215124 -22716205 -21404721 -21355595 -20925222
-2037 -20925222 -19438374 -21481317 -20633245 -20162041 -21919350 -22774435 -22635737 -23492347 -21061312 -20420700
-2047b0420700O97362k214997J01322R00860O81165l92925n48301O99655j693221l32808
-2057b2522588n42890J880956j533990J099460R32900l56242j027885M0907O59397J777462
-2067a9592513j182261N34218j950465L06943n69344K109415n60919k97739l60160M32946
-2077b1129879J822710k202889n55030P07525L84001K40774J544082r76505p82036l64940
-2087b1312187R16213n82434j980696P66354p02050J157248Q74948L55312o29028r4078
-2097b1230398j196669K662890j669558j14174J99023k30147j58556K228030j093860
-2106b0603419J177510o82724L4368j557221R95312j089390j69009n71544R82115J321559
-2116b0162443j334171k71610R18466q58741Q55457m64581L39862O03834J772995k067257
$$ plain form
-2047 -20420700 -19723338 -21938335 -21837013 -20936153 -20254988 -20647913 -21196214 -20496559 -22189780 -22522588
-2057 -22522588 -23065478 -21184522 -22718512 -21619052 -20686152 -21042394 -22070279 -22029372 -21369975 -19592513
-2067 -19592513 -20774774 -20240556 -22191021 -21884078 -22453422 -20344007 -20904926 -21202665 -21562825 -21129879
-2077 -21129879 -19307169 -21510058 -22065088 -21357563 -20973562 -20732788 -19188706 -20165211 -20947247 -21312187
-2087 -21312187 -20395974 -20978408 -22959104 -22192750 -22894800 -21737552 -20862604 -20507292 -21136320 -21230398
-2097 -21230398 -22427067 -19764177 -21433735 -21547909 -21348886 -21579033 -21737589 -19509559 -20603419
-2106 -20603419 -19425909 -20108633 -20074265 -21631486 -20636174 -21725564 -21894573 -22466117 -21484002 -20162443
-2116 -20162443 -21496614 -21768224 -20849758 -21708499 -20853042 -21317623 -20977761 -20373927 -18600932 -20668189
-2126b0668189k464066J30840J991915j830963J492058m06255k99866J430965j561433
-2135b2184994K083544j34496K0738O08183m87197j232423J77581n72575L02221N05238
-2145b0914180k24604O348O68552j152218P99047P28881j926709K960510j525956n65783
-2155b1146112n42420j587721K499905j566121J89020R87196L41272L5294J434007j625368
-2165b0981048K30748J123689k125935K42964R58493q15957p2499L70594o49678N39882
-2175b1178747r6737O62609J01682l77109J843200q17516m61525j468819J001439n18006
-2185b1309529J79430J011159R08136q58182k410267K74168J211076j67691l54570j500734
-2195b3017004J088351J173887J65094j383323J201105j520943R84005Q42374k198470
$$ plain form
-2126 -20668189 -23132255 -23001415 -21009500 -22840463 -21348405 -21754660 -22054526 -20623561 -22184994
-2135 -22184994 -20101450 -20235946 -20215208 -19607025 -20094222 -21326645 -21149064 -21721639 -21419418 -20914180
-2145 -20914180 -21138784 -21132436 -20463884 -21616102 -20817055 -20088174 -22014883 -19054373 -20580329 -21146112
-2155 -21146112 -21688532 -23276253 -20776348 -22342469 -22153449 -21166253 -20824981 -20789687 -19355680 -20981048
-2165 -20981048 -20750300 -19626611 -21752546 -21509582 -20551089 -21367046 -21439545 -21068951 -21718629 -21178747
-2175 -21178747 -21275484 -20612875 -20511193 -20888302 -19045102 -19862618 -20324143 -21792962 -20791523 -21309529
-2185 -21309529 -21130099 -20118940 -19210804 -20068986 -22479253 -22205085 -20994009 -21161700 -21516270 -23017004
-2195 -23017004 -21928653 -20754766 -20589672 -21972995 -20771890 -22292833 -21308828 -20466454 -22664924
-2204b2664924K197922o75180M66423o89156M22058j243195J834100J072534l045180
-2213b2324598m27225l52245K111167k22181L79588O61743p71200l13082k576778J316496
-2223b2518315q53910N16982L634582k087755j595367J4391K89293K701876p79309J58650
-2233b0518882j157475m2399K385061j321658o63188J823183j299998r48021q93844
-2242b2637221J223446O64201p1603j62740l37333j552520m73887J532263L09277L38871
-2252b1167246k91556L71039k67867J244878j58702j974876m71234J610258k6429J028863
-2262b0102872j697782l42288J155125J98062j592221J687103R8180J47466J000029q78698
-2272b0327896n08652m76751J269403o48655J865786j152514J74631j283671N15697
$$ plain form
-2204 -22664924 -20467002 -21142182 -20675759 -21364915 -20942857 -22186052 -20351952 -19279418 -22324598
-2213 -22324598 -22751823 -23104068 -20992901 -21215082 -20835494 -20173751 -20944951 -21258033 -23834811 -22518315
-2223 -22518315 -23372225 -22855243 -19220661 -21308416 -22903783 -22889392 -22600099 -19898223 -20677532 -20518882
-2233 -20518882 -21676357 -21718756 -19333695 -20655353 -21318541 -19495358 -20795356 -21743377 -22637221
-2242 -22637221 -21413775 -20749574 -20821177 -20983917 -21321250 -22873770 -23347657 -21815394 -21506117 -21167246
-2252 -21167246 -21458802 -21087763 -21355630 -20110752 -20269454 -22244330 -22715564 -21105306 -21131735 -20102872
-2262 -20102872 -21800654 -22142942 -20987817 -20789755 -22381976 -20694873 -20596693 -20449227 -19449198 -20327896
-2272 -20327896 -20836548 -21313299 -20043896 -20692551 -18826765 -19979279 -19804648 -21088319 -20572622
-2281b0572622j878901J320393k06413J94203Q27557k219794O99109N88290J401979
-2290a9846199j211724J20564K01568K84244j849962N69351p51672j67819Q08132j226102
-2300b3069619J983369p9960k12534o71130K000028j083802J719653l18857k061069
-2309b1793921J924773r95395j24235J036967p99458o78478j324023J117021k730425
-2318b4367174M640651j056374K50594j448512q78069J405703J142106k972802J574830
-2327b1709047N84626O24771n11729j672632K812307j727415J347748q24124j749972
-2336b2825467J268299O99827n60590J80663J54279K97987k3071Q27685Q66603j191450
-2346b0305235P84499p13238j268665P40649o94937J532541J93777j053372p09996J21816
$$ plain form
-2281 -20572622 -22451523 -21131130 -21337543 -21143340 -20315783 -22535577 -21836468 -21248178 -19846199
-2290 -19846199 -21057923 -20937359 -20735791 -20451547 -22301509 -21732158 -22483830 -22651649 -21843517 -23069619
-2300 -23069619 -21086250 -21166210 -21378744 -22049874 -20049846 -21133648 -19413995 -19732852 -21793921
-2309 -21793921 -19869148 -20864543 -20988778 -19951811 -20751269 -21429747 -22753770 -21636749 -24367174
-2318 -24367174 -19726523 -20782897 -20532303 -21980815 -22858884 -21453181 -20311075 -23283877 -21709047
-2327 -21709047 -21124421 -20499650 -21011379 -22684011 -19871704 -21599119 -20251371 -21075495 -22825467
-2336 -22825467 -21557168 -20857341 -21417931 -21237268 -21082989 -20785002 -20808073 -19980388 -19113785 -20305235
-2346 -20305235 -19520736 -20233974 -21502639 -20761990 -21456927 -19924386 -19730609 -20783981 -21493977 -21372161
-2356b1372161p51689o52929J499291m05760r8109O40031o45295O94256o0216m22829
-2366b1575410k084060J99675J586414n83620Q52031K674896j760761p51590k95289K34503
-2376b1503211O33925L88831m27604n65152R73472J93234k933297J022596J796127L70792
-2386b0050287L84163j977329Q74904p28171O25953o7507J154865j383666j646043j41975
-2396b2955093K417859l00298J054054j867652Q53193p84895P59615J448161l72422
-2405a9747478j703560M49998j032681p21095J769494K472927k795850P31011j477567
-2414b2054801J217434J87196J09672O90400l37480j377019J503607J196175j187836
-2423b0052652l97553M07922j899611P87375m0636k09335q26617j41721n44256J452790
$$ plain form
-2356 -21372161 -22123850 -22776779 -21277488 -21683248 -21781357 -21141326 -21786621 -21092365 -21152581 -21575410
-2366 -21575410 -23659470 -23459795 -21873381 -22457001 -21604970 -18930074 -20690835 -21442425 -21737714 -21503211
-2376 -21503211 -20869286 -20480455 -20908059 -21473211 -20499739 -20306505 -23239802 -22217206 -20421079 -20050287
-2386 -20050287 -19666124 -21643453 -20768549 -21496720 -20870767 -20938274 -19783409 -21167075 -22813118 -22955093
-2396 -22955093 -20537234 -20837532 -19783478 -21651130 -20797937 -21582832 -20823217 -19375056 -19747478
-2405 -19747478 -21451038 -21001040 -22033721 -22754816 -20985322 -18512395 -21308245 -20577234 -22054801
-2414 -22054801 -20837367 -20650171 -20540499 -19850099 -20187579 -21564598 -20060991 -18864816 -20052652
-2423 -20052652 -20450205 -20042283 -21941894 -21154519 -21195155 -21404490 -22231107 -22372828 -22917084 -21464294
-2433b1464294j557438J552158R2664L914713m548834K95009o17192K923847j4449q89908
-2443b0313724k879636J234546P25958M36528j102821M88605O28725r21228o7732o35655
-2453b2406434J926756k286630N51827Q84308l78465O8720O62807j07482j114453k010729
-2463b4209775N563465k182141n47624K33010M98172N9481L25450K184503l599576o76223
-2473b2351258N47680J698827p27804p55333p87053j053455J11454J696978M91381k083311
-2483b3211894K654922Q16673j551494j240926Q72012n62989N7400K073160l63j340465
-2493b1433964K235253j427502K831969j189476j565804m55243R03257k92172n17152
-2502b0910834J122188j532390J050628m92517n22843N63896Q62283J239479j272734
$$ plain form
-2433 -21464294 -23021732 -21469574 -21376910 -17462197 -22011031 -21716022 -22333214 -19409367 -19423816 -20313724
-2443 -20313724 -23193360 -21958814 -21232856 -20796328 -21899149 -21410544 -20781819 -21703047 -21770779 -22406434
-2453 -22406434 -20479678 -22766308 -22214481 -21330173 -21708638 -21639918 -20977111 -21084593 -22199046 -24209775
-2463 -24209775 -18646310 -20828451 -21376075 -21143065 -20644893 -20585412 -20259962 -18075459 -21675035 -22351258
-2473 -22351258 -21803578 -20104751 -20832555 -21587888 -22374941 -23428396 -23316942 -21619964 -21128583 -23211894
-2483 -23211894 -20556972 -19740299 -21291793 -22532719 -21660707 -22223696 -22166296 -20093136 -20093499 -21433964
-2493 -21433964 -19198711 -20626213 -17794244 -18983720 -20549524 -21004767 -20101510 -20393682 -20910834
-2502 -20910834 -19788646 -21321036 -20270408 -20762925 -21285768 -20721872 -19859589 -18620110 -19892844
-2511a9892844m49406j361249L1828l8273K46165N87823j378895K226698M75389J8676
-2521a9534088j804975k03746m21397K087338M83384k038215o04171o20383J803401m28110
-2531b1280962j006991P29400J90257Q3596K20416N99372j121215q24027m9278m10451
-2541b2869883J211159m60733k65620K442615k168555M00813J700970q39467L66956
-2550b0481745j173982Q82111j456527J556512j295886J018408l53785M01006l20734
-2559b1224622m47789L58146l23785J734012q19305L3979P1212o39479l95819N44757
-2569b1108693j93615j01407J183790j695105j092594J717479k258799L133729l82778
-2578b0797993M85012j588272J194384j68341J364337j235559p80988j31911j74608P59925
$$ plain form
-2511 -19892844 -20342250 -21703499 -21671671 -21709944 -21463779 -20875956 -22254851 -20028153 -19552764 -19534088
-2521 -19534088 -21339063 -21542809 -21964206 -19876868 -19393484 -21431699 -22035870 -22656253 -20852852 -21280962
-2531 -21280962 -22287953 -21558553 -21368296 -21284700 -21064284 -20464912 -21586127 -22410154 -22459432 -22869883
-2541 -22869883 -21658724 -22119457 -22385077 -19942462 -22111017 -21710204 -20009234 -20848701 -20481745
-2550 -20481745 -21655727 -20773616 -22230143 -20673631 -21969517 -20951109 -21304894 -20903888 -21224622
-2559 -21224622 -21672411 -21314265 -21638050 -19904038 -20723343 -20689364 -20618152 -21257631 -21653450 -21108693
-2569 -21108693 -21302308 -21403715 -20219925 -21915030 -23007624 -21290145 -23548944 -20415215 -20797993
-2578 -20797993 -20312981 -21901253 -20706869 -20875210 -19510873 -20746432 -21527420 -21659331 -21833939 -21074014
-2588b1074014j694166Q93335L160635k05253j247055k249292M86191L572785j756099
-2597b0112933P18787j022644j86397p14218N28728j56116n35542j21435L73353J098676
-2607b0129741P84050j403304q15704R73703K45588q14774k640742K060543J145531
-2616b0594850J816103k36235o32142o02003J963391j745481j051162o44568J487884
-2625b0239063j298950O27272J064665l102078J288332L16004R57902j229862j17749
-2634b1733527Q72957N7183n65646o94177m4636n88884K192728j28238n33678o57919
-2644b1823837K65311N16589j431814o09716m51830J013082Q7268r53639o77727K140243
-2654b1926070O50042k262269Q10394J353731R43575K46217N05243r52357j640887J109630
$$ plain form
-2588 -21074014 -22768180 -21874845 -18714210 -18919463 -20166518 -22415810 -21929619 -18356834 -20112933
-2597 -20112933 -19394146 -20416790 -20603187 -21317405 -20788677 -20944793 -21480335 -21601770 -21228417 -20129741
-2607 -20129741 -19345691 -20748995 -21564699 -20590996 -20345408 -21160182 -23800924 -21740381 -20594850
-2616 -20594850 -18778747 -19014982 -19647124 -20249127 -18285736 -20031217 -21082379 -21726947 -20239063
-2625 -20239063 -21538013 -20910741 -19846076 -22948154 -21659822 -21343818 -20385916 -21615778 -21733527
-2634 -21733527 -20860570 -20803387 -21369033 -22063210 -22107846 -22696730 -20504002 -20632240 -21165918 -21823837
-2644 -21823837 -21558526 -21041937 -22473751 -23083467 -23535297 -22522215 -22434947 -23388586 -24066313 -21926070
-2654 -21926070 -21276028 -23538297 -22727903 -21374172 -20430597 -20184380 -19679137 -20631494 -22272381 -21162751
-2664b1162751J190305J33950l26865k443286M283786l264170J097796k650420K148201
-2673b0993454q67145J193382J48888r87121K05810J075934j3055j81333J58054j357157
-2683b1617197l44775L52515J150777L97201k95650r36712m09285K116547r01753Q53400
-2693a9634932j071362k00473L50169P35721m24085k475950N81162K02457J175446O82762
-2703b0079085k472584M18420n28967J537397J006395j69255J8880N2754J649236j500854
-2713b0067663q45469j066209K102609j393693m224181N600009q90121p99180K134400
-2722a9449498p53509q61690J840610k746967j577454J890597p9873O61083
$$ plain form
-2664 -21162751 -19972446 -19838496 -20165361 -22608647 -18324861 -21589031 -20491235 -23141655 -20993454
-2673 -20993454 -21860599 -20667217 -20518329 -21505450 -21299640 -20223706 -20236761 -20418094 -20260040 -21617197
-2683 -21617197 -21961972 -21609457 -20458680 -20061479 -20357129 -21293841 -21703126 -19586579 -20488332 -19634932
-2693 -19634932 -20706294 -20906767 -20556598 -19820877 -20244962 -22720912 -22139750 -21937293 -20761847 -20079085
-2703 -20079085 -22551669 -22133249 -22662216 -21124819 -20118424 -20287679 -20268799 -20216045 -18566809 -20067663
-2713 -20067663 -20913132 -21979341 -19876732 -21270425 -25494606 -19894597 -20784718 -21583898 -19449498
-2722 -19449498 -20203007 -21064697 -19224087 -21971054 -23548508 -21657911 -21737784 -21076701
-2730b1076701  $$ checkpoint
##PAGE= N=2
##DATA TABLE=(X++(I..I)), XYDATA
13653a8557515P45705o06973P84406J77159Q06281N35980j78486l48408j086606j97404
13643a7925861o99698j387737l113558M961974J425298l66482L52097r40504n92530
$$ plain form
13653 -18557515 -17811810 -18418783 -17634377 -17457218 -16650937 -16114957 -16293443 -16641851 -17728457 -17925861
13643 -17925861 -18625559 -20013296 -23126854 -18164880 -16739582 -17106064 -16753967 -17694471 -18287001
$$ [...]
-2730b3551086  $$ checkpoint
##END NTUPLES=
##END=
