##TITLE= S#342235
##JCAMP-DX= 5.00 $$ JEOL NMR v1.10
##DATA TYPE= NMR SPECTRUM
##DATA CLASS= NTUPLES
##NUM DIM= 1
##ORIGIN= DELTA_NMR
##OWNER= organic
##SPECTROMETER/DATA SYSTEM= DELTA_NMR
##.OBSERVE FREQUENCY= 3.00529655924288E+02
##.OBSERVE NUCLEUS= ^1H
##.DELAY= (2.194E+02,2.194E+02)
##.ACQUISITION MODE= SIMULTANEOUS
##.FIELD= 7.0586013
##.FILTER WIDTH= 1.81675738660864
##.ACQUISITION TIME= 3.6339712
##.SPINNING RATE= 16
##.OBSERVE 90= 9.6
##NTUPLES= NMR SPECTRUM
##VAR NAME= FREQUENCY,    SPECTRUM/REAL, SPECTRUM/IMAG, PAGE NUMBER
##SYMBOL=   X,            R,             I,             N
##VAR TYPE= INDEPENDENT,  DEPENDENT,     DEPENDENT,     PAGE
##VAR FORM= AFFN,         ASDF,          ASDF,          AFFN
##VAR DIM=  16384, 16384, 16384, 2
##UNITS= PPM,     ARBITRARY UNITS, ARBITRARY UNITS, 
##FIRST=  1.2501033903057E+01, -1.17275276921027, -1.08523998633443E-01, 1
##LAST=  -2.50011824950436, -1.25437645504931, -3.09244526166243E-01, 2
##FACTOR=  9.1565355261926E-04, 3.39208283684004E-04, 3.39208283684004E-04, 1
##PAGE= N=1
##DATA TABLE=(X++(R..R)), XYDATA
$$ [...]
8615 -9447709 -9967670 -9199660 -9484078 -9833880 -6068498 -7992330 -8357845 -8790501 -11002461 -8645300
8605 -8645300 -9420352 -7864336 -5141364 -10126229 -10289567 -10237042 -8526580 -11045501 -9698910 -9893099
8595 -9893099 -9392556 -10842059 -9886656 -11675555 -9993239 -9513271 -7994734 -9093956 -8421931 -7803380
8585 -7803380 -8627967 -9068843 -9276284 -11844064 -11536203 -8943016 -10128528 -9968741 -9564767 -8229132
8575 -8229132 -9107054 -10674898 -10420251 -11283335 -7747468 -8207245 -8352535 -8082896 -9335859 -9030777
8565 -9030777 -10083298 -10004532 -10023174 -7303259 -8405563 -9176490 -9614248 -7123390 -5702375 -6829648
8555 -6829648 -8767770 -8851273 -11918986 -10047289 -9644910 -9071244 -10138868 -9273258 -7381881 -8831943
8545 -8831943 -9042749 -8793145 -10476633 -10271710 -9878844 -10447867 -12283199 -12513715 -7945897 -9080610
8535 -9080610 -10443601 -9987652 -8267990 -9421198 -11504131 -10369582 -10945744 -9655379 -9873051
8526 -9873051 -8641679 -9199200 -10182219 -9374606 -11089743 -11545256 -8385740 -8181126 -8740584 -8930247
8516 -8930247 -9130046 -8777522 -7506125 -7286502 -7566078 -7002218 -7460179 -8152181 -9274569 -8694600
8506 -8694600 -9088990 -8776356 -8192707 -9970171 -9772981 -10273815 -10246257 -10111092 -9919209 -9433186
8496 -9433186 -8356514 -9069287 -8322499 -8511063 -8745304 -8505228 -8544371 -9184274 -10952918 -10034106 -9937246
8485 -9937246 -9311409 -9107671 -8957338 -8194195 -8503012 -10672036 -9289543 -8920822 -8608983 -7504733
8475 -7504733 -9178568 -9953377 -10037056 -9996764 -11015017 -9379894 -9012433 -10529270 -9427968 -10627314
8465 -10627314 -10962988 -8192366 -9764940 -10437857 -10089835 -8853394 -10504364 -8727798 -8578701 -9054869
8455 -9054869 -9618453 -10898887 -10218713 -9887920 -9136133 -8425522 -7623022 -8700755 -10073102 -10539694
8445 -10539694 -9711483 -9739694 -8128070 -8490714 -8979680 -9882605 -9559670 -10211099 -11324862 -10172062
8435 -10172062 -9927783 -9675805 -8541332 -8721958 -8720056 -10507336 -8800137 -7737462 -8669014 -7420580
8425 -7420580 -9188732 -10631596 -10609783 -9127551 -8881338 -9569131 -10184791 -9029378 -8529670 -11551046
8415 -11551046 -10893368 -10063675 -8749787 -9777493 -9575010 -10952041 -10158628 -8824970 -11413527
8406 -11413527 -9163339 -8244233 -9254036 -9276503 -9394181 -9807537 -9764397 -8719013 -9203664 -9483915
8396 -9483915 -9980334 -7313281 -11500916 -11837395 -10197584 -10272174 -8603507 -12204676 -9379933 -8277905
8386 -8277905 -9493356 -11506520 -11830733 -9674205 -10310764 -9614081 -9151265 -10285360 -9589142 -9198304
8376 -9198304 -10780589 -8071552 -10007047 -10329912 -9322412 -10453925 -9436946 -11762921 -10106883
8367 -10106883 -10736756 -9901991 -9611478 -12179517 -11959674 -9347333 -11128561 -11112961 -10862416 -10275618
8357 -10275618 -11173575 -10998874 -11467106 -10241003 -9546582 -9003257 -7868140 -8942350 -7129640 -10939724
8347 -10939724 -9889681 -9123862 -10788137 -9497003 -6487133 -8303105 -9137857 -10577161 -9979301
8338 -9979301 -10880539 -11732522 -11499154 -8801450 -9566509 -7048998 -8844555 -8271159 -9245228 -8919426
8328 -8919426 -9524537 -9480299 -12680621 -11605539 -10150105 -9803875 -9818339 -7472868 -9327789 -9278721
8318 -9278721 -10827540 -9871825 -11643054 -8347682 -7317930 -8477654 -8696354 -8309845 -9636033
8309 -9636033 -11313514 -8663354 -9412342 -7716916 -9050856 -7173165 -7087843 -6966305 -5869176 -9290594
8299 -9290594 -7643722 -7290079 -11676030 -11975219 -10798406 -9293726 -10678107 -10376881 -8370225 -8734829
8289 -8734829 -9259098 -8337443 -8916686 -8446050 -9148746 -9173752 -9264973 -7964068 -8020350 -7180386 -8878164
8278 -8878164 -9900373 -10185647 -12543632 -10466738 -10147640 -9951681 -8872544 -10089911 -9500395 -10296805
8268 -10296805 -12373292 -11195504 -10643115 -9703662 -8415010 -10794083 -10117525 -11292161 -11499839 -12359506
8258 -12359506 -12058976 -12357692 -8050297 -7994525 -10555352 -9554178 -9881286 -10373916 -10556205 -8829006
8248 -8829006 -10163932 -10284238 -7821139 -8537710 -9206543 -8386112 -8176734 -9199132 -9720111 -10495441
8238 -10495441 -10573309 -9466606 -10545733 -11160314 -8612188 -9074979 -9255962 -8988475 -7541938 -8766012
8228 -8766012 -8764897 -10532859 -11707048 -9881404 -10486356 -9627328 -8601933 -8491741 -8824005 -9170393
8218 -9170393 -8691475 -9960058 -9673540 -9411239 -9712875 -9021463 -7931016 -9728728 -8339889 -10636217
8208 -10636217 -10768796 -10257432 -9384025 -9706214 -10823541 -9344006 -9332496 -8994713 -9789780 -10690788
8198 -10690788 -12134436 -7427066 -7419599 -10012350 -8878986 -9484722 -9298235 -7983004 -7216812 -9251226
8188 -9251226 -8878681 -8994481 -8971334 -7043515 -9006615 -10288431 -9400629 -9208877 -8132181 -7571413
8178 -7571413 -9689154 -8563773 -8043341 -8717687 -9630155 -10109302 -10525549 -9548840 -9740505 -9807204
8168 -9807204 -10032015 -11642631 -10253960 -10029557 -10148059 -9477489 -10715878 -10548431 -10179756 -8752157
8158 -8752157 -9045610 -8124425 -8675426 -8551619 -10301987 -8669462 -7801474 -6346520 -3926212 -7504899
8148 -7504899 -9527014 -10540939 -7917417 -9194505 -8920397 -9427712 -9514379 -10776249 -9299329 -9020350
8138 -9020350 -9609498 -9600605 -10485480 -4655204 -5290560 -7031537 -7889862 -8576881 -6136904 -8031698
8128 -8031698 -6342270 -6749080 -5866526 -6967819 -9268546 -9220964 -7556310 -9659881 -7594592 -8404998
8118 -8404998 -7814283 -8354384 -10092170 -6742752 -7978909 -7383469 -7274150 -7803269 -6948517 -6589666
8108 -6589666 -13198847 -10279978 -7746639 -9300255 -9308448 -9512482 -10080436 -9010182 -7187750 -9293978
8098 -9293978 -10261513 -10676539 -7633689 -8642518 -8704792 -8669838 -9794296 -10093268 -8066327 -9979805
8088 -9979805 -11075343 -10322819 -9139988 -9369897 -9823514 -9993144 -10571955 -9789216 -9238182 -10807229
8078 -10807229 -8508250 -7892450 -9655053 -8234719 -7669791 -8680301 -9155055 -8248475 -7563779 -8136555
8068 -8136555 -8703893 -9589822 -9425619 -9162286 -8931691 -11549933 -8869613 -8097537 -6424773 -6421034
8058 -6421034 -7962477 -7163936 -8842882 -8764616 -8447140 -8497409 -7365072 -8630779 -9782452 -9318876
8048 -9318876 -8731915 -8100509 -8951979 -8669165 -9139109 -9727558 -8717742 -8109204 -7658800 -9936691
8038 -9936691 -9638207 -8915311 -8082724 -9080789 -9140148 -7236070 -8231955 -7297273 -9011824 -8972552 -9019659
8027 -9019659 -10278997 -9384806 -8484457 -9678116 -8510712 -7885453 -8368450 -8524574 -8092439 -7265084
8017 -7265084 -8464464 -7503580 -8970369 -9421459 -8493832 -8782592 -8320566 -7169330 -7623522 -6957374
8007 -6957374 -7059778 -6870184 -5386076 -5479093 -6342563 -5826121 -6334762 -6151300 -6291280 -4927609
7997 -4927609 -7091135 -7440273 -7900373 -6568967 -6870753 -5058878 -4864008 -6291311 -3112485 -3677821
7987 -3677821 -4682579 -979947 -2812809 -2702619 -1317984 -3522476 -1902485 -1857497 -1990949 -2083376
7977 -2083376 -1565007 -219437 -3004034 -1109917 -1325604 -1590346 -1297480 83441 -85442 -756508
7967 -756508 506360 170868 -98140 1003541 2034444 1371876 1483801 1706948 2707150 2324871
7957 2324871 1961430 1345271 2014209 2866219 784521 -394522 -2207064 793012 914447 816973
7947 816973 1069109 1294258 2667919 1981847 1990416 2126089 2198496 3016943 4747096 4974599 7356894
7936 7356894 6443089 3338206 -1440188 38844 6073846 11604111 13688821 28631868 37850228
7927 37850228 35534332 32908157 31646075 36301064 43326494 48656986 62675002 56890340 39398914
7918 39398914 17848241 8235912 6451653 4925700 3781873 2205536 387231 -3082851 -5209958
7909 -5209958 -5503581 -5874082 -3502653 -3977483 -4785534 -6412386 -6690283 -7098667 -8763478 -11110155
7899 -11110155 -7482006 -4519612 -5374666 -6480842 -5101391 -5477673 -8811999 -9181653 -9022884 -9899494
7889 -9899494 -7085569 -8371022 -8867491 -8614764 -9263535 -8016923 -9652332 -8544371 -7516720
7880 -7516720 -10938225 -8657513 -8134749 -10505167 -9266172 -9098586 -8986279 -9407764 -9201957 -7480850
7870 -7480850 -7456946 -8464627 -7802449 -6547208 -6515918 -7615563 -8263301 -8898253 -7854624 -16418579
7860 -16418579 -9202204 -7862712 -8638517 -7406449 -7327681 -7794111 -9417859 -10101260 -9258864 -8728052
7850 -8728052 -8889937 -8983365 -9301836 -8124271 -9408155 -7118208 -8939739 -8699788 -9862684 -8703314
7840 -8703314 -7842575 -9430158 -9312304 -9039312 -6973359 -4360701 -10933959 -10331809 -10923894 -10679125
7830 -10679125 -10456588 -11009293 -9343350 -4854985 -6360125 -8373809 -9241483 -8932349 -10280434
7821 -10280434 -8980083 -8528036 -8260832 -8202828 -11860067 -10229378 -8727769 -8240128 -8577939 -8805837
7811 -8805837 -8462222 -10485369 -10159634 -10536235 -9445702 -9747719 -9608839 -9110530 -9084259 -8952563
7801 -8952563 -9196962 -9198805 -9419305 -10902721 -8901418 -10395483 -9703847 -9643097 -8417781 -8041281
7791 -8041281 -9042704 -8002762 -8647574 -8945753 -11185992 -11269605 -10465002 -10482341 -11098140 -8195260
7781 -8195260 -9831098 -9708608 -9187790 -10197947 -8374707 -9962282 -9556119 -8530339 -9484772 -8842482
7771 -8842482 -9052642 -8821947 -9693922 -10675139 -9104859 -8270708 -9579907 -9981273 -8566915 -6938550
7761 -6938550 -7244178 -8265210 -7664958 -6050870 -8493993 -11558365 -9061052 -8638382 -7999987 -8383925
7751 -8383925 -7416237 -7325141 -8112788 -9840046 -8850171 -10262108 -8728463 -10189103 -10631823 -10441894
7741 -10441894 -9505408 -9503024 -9289268 -8496760 -9378130 -8115138 -8756575 -8908912 -9628738 -8417074
7731 -8417074 -8310269 -8477216 -9751009 -8600039 -9383973 -9767159 -8556748 -7015751 -8126759 -8381472
7721 -8381472 -9934323 -10197194 -8833950 -9855673 -10510914 -9627379 -9167326 -7303598 -9973163 -11032254
7711 -11032254 -8645820 -8557466 -11304551 -8737002 -10983509 -8144095 -11336215 -7868602 -8032259
7702 -8032259 -9042021 -7521644 -8281353 -7177452 -3555984 -11010575 -11272231 -9428499 -8602831 -8323506
7692 -8323506 -9033400 -8503286 -12443354 -12629700 -10425056 -10564529 -9854256 -9389645 -10730081 -9850676
7682 -9850676 -8307859 -9535679 -10527995 -10279552 -10120521 -8644466 -8836946 -10179447 -11200022 -10433395
7672 -10433395 -9817391 -9635805 -9499205 -9016723 -10013132 -10158360 -9596805 -9425843 -9630146 -9584300
7662 -9584300 -8464331 -9788192 -10266855 -10716697 -8692573 -8911929 -9286208 -9479096 -8515439 -9564654
7652 -9564654 -9662536 -7430014 -8089700 -10141288 -10745856 -11334579 -9703495 -9002849 -9387951 -9889094
7642 -9889094 -7816681 -8469358 -8536638 -9377734 -9218251 -8125683 -10590416 -9771262 -8272611 -7654763
7632 -7654763 -7650120 -8245917 -10280402 -8881590 -8733782 -9327606 -10594508 -9120163 -8710329 -8035307
7622 -8035307 -8328961 -9517343 -8588319 -9057289 -10495717 -7771797 -7925063 -9794205 -10117086 -10315771
7612 -10315771 -11040384 -9040993 -9652482 -9047795 -9262092 -9845412 -9390284 -10071343 -8191592 -8910283
7602 -8910283 -9029563 -9536865 -9024848 -8395683 -9016179 -9697094 -9729827 -8959977 -8489779 -9347770 -7864202
7591 -7864202 -10197252 -9916693 -10814968 -9745655 -12049098 -11787569 -9515086 -9487361 -10293374 -10544828
7581 -10544828 -8752744 -8600674 -8608149 -10146396 -9681760 -9390977 -9371252 -8883788 -8943162 -8817693 -8421985
7570 -8421985 -9347110 -9623289 -9000777 -10043764 -9719624 -7595890 -8326026 -7242780 -8107173 -9442204
7560 -9442204 -10171554 -10858583 -10884404 -9518118 -9930991 -9842886 -9263081 -6940589 -9368837 -10157804
7550 -10157804 -9206373 -10771010 -9460679 -10135634 -9372388 -8510653 -8259742 -8903763 -9692176 -9412304
7540 -9412304 -9977125 -10878976 -8116332 -8150717 -9947488 -8591319 -9010953 -8455676 -8936385 -10537778
7530 -10537778 -9920114 -11253370 -10050853 -9433320 -10107355 -9059085 -9766934 -10728070 -9530143 -10652969
7520 -10652969 -9525667 -10159704 -8527095 -9525619 -9653022 -10530221 -7660077 -9729498 -9731511 -9663167
7510 -9663167 -10672838 -11706660 -10574887 -10542535 -10121724 -9743745 -9297353 -11589078 -8918395 -9513094
7500 -9513094 -9210329 -11000654 -10149786 -9459958 -8984298 -7887640 -10147807 -9707998 -8889304 -6996820
7490 -6996820 -8167704 -10283498 -10089071 -9754115 -7825213 -8624887 -9133833 -9747135 -10175424 -10138943
7480 -10138943 -9899937 -10493723 -9670695 -8913971 -8764229 -8785595 -10161478 -10516431 -9891927 -10454654
7470 -10454654 -11416142 -9744989 -11916550 -10464710 -12240106 -10631223 -9913270 -9871099 -7293704
7461 -7293704 -8868232 -9110248 -8852841 -7701139 -6817493 -8955132 -8649843 -9579218 -10440474 -8358005
7451 -8358005 -7955219 -9133051 -8725399 -8325320 -7887821 -6981004 -8249052 -7766737 -7951570 -8748780
7441 -8748780 -7079792 -5426468 -9796609 -8616198 -9700829 -9816912 -10284534 -9515666 -10281350 -10660834
7431 -10660834 -8388338 -7572354 -9752651 -8018027 -8336002 -8558096 -8211815 -12356712 -11144465
7422 -11144465 -9847762 -8932121 -10550729 -12493669 -11498251 -9863251 -8899236 -9948884 -11018149
7413 -11018149 -9250694 -10570265 -8770687 -9556926 -7202918 -7579494 -10332024 -6877162 -9319912
7404 -9319912 -9680212 -8579975 -9011172 -7913998 -7773493 -9596776 -10431043 -10395679 -9720835 -12025219
7394 -12025219 -9585249 -8613424 -9018919 -8950265 -9725699 -9229787 -10212749 -8799591 -9620572 -9021646
7384 -9021646 -10113688 -10082784 -8661552 -8860278 -9732715 -8021850 -8605910 -10049626 -10216035 -10424119
7374 -10424119 -10437489 -9574002 -9279801 -9878274 -8631428 -9302947 -10128912 -10128333 -9520460 -8843816 -10341826
7363 -10341826 -9025330 -9328214 -8718137 -10318580 -10542442 -10690832 -10244319 -10200028 -10302583 -8840063
7353 -8840063 -10837822 -11006438 -9622168 -9881967 -9621447 -9293943 -8739498 -10837779 -10190730 -9587711
7343 -9587711 -10665477 -10229896 -12489399 -11687160 -8750477 -10084471 -10961033 -8701676 -10270772
7334 -10270772 -9262497 -9821959 -9361893 -10775205 -9479714 -9387746 -8845812 -8513048 -9069668 -7538513
7324 -7538513 -7430251 -8320487 -6451192 -7478387 -8048482 -10676114 -10320778 -8500749 -10002237 -10402543
7314 -10402543 -10954085 -7538644 -9508075 -9894530 -10077868 -9247101 -9281349 -10021660 -8992469 -10083125
7304 -10083125 -8093169 -8909598 -9441459 -9362831 -8763663 -7804148 -8768240 -8841843 -8548973 -10969231
7294 -10969231 -11726299 -10503522 -10156148 -9095495 -10277524 -7694493 -10261727 -10830193 -10183573 -10936981
7284 -10936981 -11438474 -11058611 -10291310 -11499590 -12252269 -11797798 -9737483 -10372871 -9397295 -10121467
7274 -10121467 -11021611 -11718502 -6891752 -6785691 -9892191 -9587755 -10689388 -8663250 -9786035 -9436224
7264 -9436224 -8523013 -10535483 -11476179 -10447543 -9565949 -9815090 -12501944 -10740293 -9106807 -9688011
7254 -9688011 -8763470 -9115225 -9886273 -10037828 -9289231 -9535689 -7885028 -8378090 -9381807 -10391605
7244 -10391605 -9073615 -8986365 -11373382 -9714961 -9499149 -9407582 -9218120 -9388557 -7625195 -8072739
7234 -8072739 -9923268 -10413619 -11933070 -11626185 -8774450 -9740230 -8217114 -8944701 -10305851 -9568688
7224 -9568688 -11846978 -10801426 -10343898 -8746340 -7467038 -9477843 -9805040 -9278481 -7871015 -7678156
7214 -7678156 -9172746 -11855427 -11458663 -9667064 -8659896 -8832056 -9597795 -8456964 -8720356 -9704769
7204 -9704769 -10508586 -7904583 -8269190 -8038876 -8712935 -8798724 -9606544 -8426077 -7028032 -7515868
7194 -7515868 -11514853 -11046646 -9816207 -10631121 -11617649 -10359043 -8064401 -9292439 -10031338 -9451257
7184 -9451257 -10190680 -9168562 -8571708 -9999041 -9152061 -9351989 -9671064 -8577899 -8723605 -9674961
7174 -9674961 -9486830 -10819237 -10450591 -10412089 -9096579 -9254180 -9298500 -9541661 -8165740 -9157762
7164 -9157762 -9463397 -9234208 -8840502 -10247124 -10283231 -10023942 -10291833 -9783734 -8060678 -8934425 -8935461
7153 -8935461 -9284876 -9394152 -9068671 -9082791 -10555344 -9445643 -10228262 -8084778 -9951338 -10140761
7143 -10140761 -10965161 -11268389 -10319055 -8177195 -9095005 -7784545 -9202267 -9294134 -9817202 -10005373
7133 -10005373 -9039485 -10747589 -9310848 -11182881 -11367213 -11046715 -8480861 -10079571 -8452779 -8509010
7123 -8509010 -8783796 -8144083 -7727472 -9410506 -8596249 -9998595 -9797278 -9514636 -8997691 -9266147
7113 -9266147 -8912318 -8284185 -9850383 -10256967 -10762156 -11656157 -10286041 -9350483 -7967378 -9987686
7103 -9987686 -9493773 -9348748 -8655769 -8681282 -11734687 -8867017 -9751348 -9471353 -9859908 -9826590
7093 -9826590 -11161157 -10805234 -9908990 -10364083 -10819411 -10906835 -9738849 -7323215 -9289001 -10023174
7083 -10023174 -8951872 -10213162 -9962772 -9294793 -9519050 -9338545 -9883135 -9491015 -9408275 -9109685
7073 -9109685 -9467121 -9158233 -9211169 -9199280 -8019899 -9334297 -8538055 -9156311 -8622444 -9625340
7063 -9625340 -8924583 -8464815 -8022112 -7986117 -12241816 -10960771 -9397501 -9653581 -10369280 -9096663
7053 -9096663 -10673017 -10591478 -10263927 -8770125 -8970932 -10366562 -9030424 -8195088 -7757611 -8469331
7043 -8469331 -8183239 -9278761 -7420857 -7313530 -10078498 -9509531 -9784059 -10999946 -9698240 -8952073
7033 -8952073 -7582862 -8022126 -9957610 -9345679 -10503352 -9302742 -10218676 -10476789 -9886659 -8717175
7023 -8717175 -10854625 -9085689 -10309602 -8427893 -7807298 -10535605 -8074443 -8194575 -5724651
7014 -5724651 -9561488 -8787973 -9079786 -10192465 -10451070 -10730893 -9078072 -9537781 -9124858 -10719942
7004 -10719942 -9508669 -10759224 -11432180 -9703916 -9705159 -8169155 -11826485 -10472629 -8176700 -8861374
6994 -8861374 -9191212 -10427499 -9183298 -9971981 -11063967 -2535272 -5401770 -6812439 -9591050
6985 -9591050 -8293284 -10028487 -10091270 -9773788 -8441465 -8613969 -9122615 -10219200 -8987491 -7408671
6975 -7408671 -10042341 -9885173 -8412733 -8114175 -8291368 -9070471 -10210316 -11322086 -9812001 -10593973
6965 -10593973 -11871567 -10954940 -10964771 -10173991 -11639381 -9502886 -7348811 -9125460 -7312636 -10024421
6955 -10024421 -10443797 -10278386 -9934229 -10026336 -9848916 -9097155 -10569842 -10014607 -8951542 -7997538
6945 -7997538 -7050239 -9603852 -9446434 -9091300 -9015154 -8399155 -9904277 -10097094 -10104825 -9788814 -9739770
6934 -9739770 -9154264 -8883124 -8749859 -9256379 -9280621 -8436463 -7662073 -7976789 -9564208 -10471887 -10109754
6923 -10109754 -10239534 -9972015 -10553746 -10337658 -10480961 -8953810 -8097824 -10480038 -10212993 -7075923
6913 -7075923 -9347258 -8973408 -9658208 -9387654 -10026738 -12402153 -10637601 -9899786 -11703889 -11101597
6903 -11101597 -9266687 -10078351 -10808447 -8910409 -8740278 -8075368 -9328545 -8200153 -6314736
6894 -6314736 -8448146 -9313299 -8080763 -11574523 -11231042 -11112278 -10896884 -9977817 -10761222 -10242712
6884 -10242712 -10277603 -10423395 -10750899 -10876866 -9827991 -8686356 -11160393 -11637558 -10853455 -10118255
6874 -10118255 -9846675 -9327896 -10951867 -8418822 -11309186 -9964053 -10093020 -9240761 -8885875 -11323500
6864 -11323500 -10942188 -11327742 -10933114 -9933015 -9922937 -11122193 -10026335 -9163976 -8952075 -11298408
6854 -11298408 -10317586 -10573290 -11683751 -10297933 -10428268 -11323403 -10059837 -9527625 -7882037 -10270453
6844 -10270453 -9813418 -10801003 -10173695 -8470843 -9569792 -9454430 -9447182 -11027220 -9615673 -10047130
6834 -10047130 -9988087 -10074472 -9686237 -10432976 -11317698 -9144163 -10335610 -9917601 -12548578 -10842551
6824 -10842551 -9936151 -9070179 -7081636 -8415092 -9894888 -8386870 -9070238 -8709349 -8984199 -9232646
6814 -9232646 -10347685 -10295268 -11157415 -8938510 -9425158 -8461983 -10906328 -11140630 -11029400 -9601819
6804 -9601819 -7522876 -8905887 -10449743 -10899592 -11080505 -8749404 -7225714 -8627609 -10674609
6795 -10674609 -10196555 -8974871 -8630826 -9229172 -9833236 -10100264 -8927889 -9195381 -7291014 -10101730
6785 -10101730 -9327652 -9182885 -9614825 -9123078 -9200829 -10444723 -11303277 -9937724 -10254128 -10344149
6775 -10344149 -8777107 -9719761 -6949773 -7622728 -11204468 -9609011 -8839375 -9541550 -8657684 -8145835
6765 -8145835 -8894018 -10028829 -8967419 -9356536 -11209832 -10683102 -11912643 -9907730 -9654656 -9461721
6755 -9461721 -11014648 -10181209 -9495977 -10906311 -11197193 -10426784 -8284657 -10039210 -9555059 -11413538
6745 -11413538 -10316592 -10878963 -10701545 -10953333 -10546388 -9857619 -9680531 -9021828 -10143737 -10627625
6735 -10627625 -10497364 -10123578 -10442073 -9997546 -9813642 -10436110 -7736142 -7930539 -9750870 -10287359
6725 -10287359 -10057847 -10052286 -9676735 -10215043 -10109068 -9480021 -10475496 -10201184 -9161457 -9115308 -8591649
6714 -8591649 -10382835 -9482571 -9711326 -9171021 -9547049 -10241139 -10461005 -11137331 -11003550 -9599540
6704 -9599540 -10124301 -10508468 -3811005 -7556683 -10479919 -10106393 -9404081 -10738788 -10343976 -11772882
6694 -11772882 -11092707 -9463734 -11145420 -11498714 -10404982 -9684038 -9437476 -10641117 -9835662 -9703863
6684 -9703863 -9060830 -8392089 -8608483 -8271111 -8987811 -8715554 -7706456 -9135434 -10398894 -11279152
6674 -11279152 -9876469 -7357678 -9500848 -10276081 -9944291 -7531111 -7259858 -9630890 -10550769 -10495660
6664 -10495660 -10934016 -9665562 -10809503 -11471191 -10292714 -7787205 -7893815 -8841639 -8157876 -9449649
6654 -9449649 -9510753 -9113353 -7982885 -9124704 -9761308 -7686668 -9769464 -8649546 -8174382 -8222867
6644 -8222867 -9448691 -11701388 -9718669 -9205106 -9624485 -10225580 -9459391 -7116595 -9731921 -8687642
6634 -8687642 -10505794 -10032281 -8432980 -8330710 -8833322 -9535312 -8588111 -9736708 -7296873 -8478296
6624 -8478296 -10832490 -9461624 -9281907 -9462965 -7334263 -7700497 -6035941 -8549430 -10453609
6615 -10453609 -7711050 -10021368 -10881995 -9090775 -10721612 -10046874 -9405566 -9809107 -9240526 -8713615
6605 -8713615 -8913954 -10634476 -9459977 -8930342 -8803191 -9639903 -9829387 -10681018 -8963664 -9954046
6595 -9954046 -8444339 -7578086 -9268995 -16676244 -9866113 -10882022 -11786028 -10948216 -10605222 -7873861
6585 -7873861 -9473428 -9028627 -9687853 -11071961 -10733784 -8638152 -9524730 -8624930 -9851275 -11955485
6575 -11955485 -9062995 -10663642 -11890426 -10237278 -10394611 -10788069 -11118249 -8529412 -9699430
6566 -9699430 -11261452 -11774337 -10000696 -8286701 -8804179 -8190215 -10881710 -9879791 -9268166 -10979309
6556 -10979309 -11263822 -10766801 -9703601 4049871 22660996 -2663229 -7377756 -8175484 -9489663
6547 -9489663 -9996388 -11226061 -9958252 -9861608 -9226421 -8309938 -9740464 -9519221 -8168430 -8170988
6537 -8170988 -9874958 -10807170 -9389101 -9708347 -9591001 -10717828 -8636721 -10013149 -11073146 -11271186
6527 -11271186 -8717029 -9976067 -9927035 -9124515 -9960102 -10451612 -10476293 -9174784 -7953549 -7029863
6517 -7029863 -8921972 -9651923 -9280457 -10218320 -10108781 -10075010 -10777241 -10400158 -12327238 -10718418
6507 -10718418 -8356397 -8696646 -9127272 -10067725 -10592429 -9858226 -8364765 -9456791 -9843549 -10239097
6497 -10239097 -10298430 -12094856 -8632901 -9054289 -8886416 -8816036 -9371659 -7921902 -9303549 -9429921
6487 -9429921 -9537163 -8701665 -8995762 -11753232 -10896401 -10222457 -9736346 -9717437 -10051120 -10815513 -11065872
6476 -11065872 -10499157 -9688614 -9509415 -8893206 -9345694 -8879011 -8317059 -10427428 -9161887 -8753029
6466 -8753029 -11377043 -10647415 -10154234 -8698871 -9327305 -9837899 -10113726 -11071042 -8676937 -9967386
6456 -9967386 -10902847 -10336340 -11057793 -8645370 -7722791 -7505752 -10122272 -9378160 -10730096 -11273098
6446 -11273098 -9948345 -9489577 -8829251 -10137689 -9612208 -9809624 -8901719 -9042622 -10953439 -10674589
6436 -10674589 -9544796 -9199420 -9980951 -9475994 -6962737 -10808313 -8756502 -9748371 -10826341
6427 -10826341 -8784848 -10115101 -9739433 -11542844 -10114962 -10014834 -8960529 -9831934 -9470393 -9387498
6417 -9387498 -9104171 -9682436 -8357608 -8237331 -8986048 -9866168 -10969023 -9474170 -10061549 -10994119
6407 -10994119 -9284508 -9603105 -9421850 -11283686 -9919123 -7475827 -4441079 -12972818 -10278790
6398 -10278790 -12573692 -9569573 -10283630 -10011053 -9355925 -9670103 -9759834 -10523688 -8633107 -10846937
6388 -10846937 -9924400 -11119219 -9958659 -10304746 -8681721 -9478401 -10982897 -7318627 -7512850
6379 -7512850 -8727203 -13490838 -12394171 -10143734 -9264113 -9068040 -10865870 -11966754 -10589463
6370 -10589463 -9270219 -10571925 -9147450 -9711657 -9189342 -10415112 -9424410 -12036704 -12265662 -11633645
6360 -11633645 -11789066 -10020687 -9531955 -8164501 -7264081 -8776940 -9396234 -10431396 -10210760 -10094512
6350 -10094512 -10050943 -10971113 -10144937 -9938354 -10360061 -9085360 -8904273 -11157017 -11094401 -10248521 -10314447
6339 -10314447 -9595946 -10129250 -9577027 -8905282 -10669155 -12623196 -10533617 -10905052 -10772264 -9198847
6329 -9198847 -10852240 -12167676 -9202128 -8048843 -10182043 -11094122 -11028899 -10556036 -8831455 -9214398
6319 -9214398 -9929312 -9471947 -9452329 -10465841 -9392338 -8669563 -11273278 -10332377 -10582036 -9614393
6309 -9614393 -9371264 -8096862 -7847321 -9376529 -9434844 -10194306 -8672374 -7368825 -8570547 -9780070
6299 -9780070 -9378148 -8670675 -7610950 -9363878 -8506996 -8642339 -8666193 -7193920 -9220587 -8034443
6289 -8034443 -10567607 -9633675 -8918066 -8842471 -7688591 -8938074 -11150513 -11176170 -9414507 -9041928
6279 -9041928 -8843635 -8903540 -10245228 -9006636 -8250952 -8833903 -10387160 -12285237 -10942282 -11385713
6269 -11385713 -10304432 -7723088 -8501335 -10509906 -10205071 -9239451 -11322868 -9606277 -9296072
6260 -9296072 -11283224 -8601510 -10346209 -10184756 -8671879 -10023163 -11253907 -9936991 -12011551
6251 -12011551 -10869550 -10903550 -10460133 -9302854 -8872466 -11026419 -9598796 -10248133 -11355137 -8952414
6241 -8952414 -8298033 -10528949 -9478205 -10096575 -9952323 -9353789 -9774254 -9002993 -10681678 -9767170
6231 -9767170 -9561116 -10012307 -11922492 -10142216 -10074271 -9010236 -9385597 -9148845 -11601637 -11520339
6221 -11520339 -10152329 -9061914 -4911733 -9821414 -9898473 -7418497 -9391028 -9258911 -9298606 -8939958
6211 -8939958 -9413397 -8728404 -7099848 -8424053 -8604141 -7886321 -7977427 -8586927 -8053273 -8132845
6201 -8132845 -9674899 -9582780 -10280994 -10438987 -10681912 -10431900 -9441578 -9412951 -8857016 -8778310 -8021464
6190 -8021464 -11388020 -11180423 -9528899 -8628985 -9463502 -10454774 -11216886 -10381299 -9836071 -9949034
6180 -9949034 -9051161 -9598448 -12208812 -11137857 -11089196 -9995109 -10497349 -9796239 -9929595 -8508005
6170 -8508005 -9497926 -8732292 -8216438 -9359212 -9352848 -8794925 -9593321 -10418745 -9853040 -9088465 -10454469
6159 -10454469 -10698525 -9908660 -8233594 -8782218 -8466603 -8942025 -10420267 -11096225 -9910041 -5646508
6149 -5646508 -8414499 -9116686 -10016982 -9798871 -8671445 -8692288 -10527428 -9073197 -10962687 -10541177
6139 -10541177 -9442555 -10473127 -10289673 -9455547 -9032793 -8786755 -11211829 -6977764 -9201878 -10133332
6129 -10133332 -9306495 -8085971 -5609041 -6230302 -7789845 -7905975 -4729464 -6380304 -5302527
6120 -5302527 -3503063 -953026 6090111 25941949 51742465 -12573129 -16299447 -14110134 -13453028
6111 -13453028 -13794640 -12667111 -10394122 -12682482 -12277575 -14460265 -11715583 -10017298 -10181067
6102 -10181067 -10743053 -10237058 -9089202 -10706939 -10897443 -10470471 -9339892 -10027259 -10794811 -10738486
6092 -10738486 -9108539 -10156243 -11280920 -9485347 -10526959 -8630716 -8325939 -8115396 -10120071
6083 -10120071 -8058554 -9299861 -10660345 -11106034 -8279488 -9466506 -10702308 -9619956 -10958413
6074 -10958413 -10413907 -10644470 -11793733 -10638489 -10461984 -10087716 -10929654 -10970621 -11561143 -10852728
6064 -10852728 -9596173 -11263074 -10363306 -9206931 -12643117 -10799488 -10298821 -11437942 -10479005
6055 -10479005 -8843403 -10174486 -10484165 -8793171 -6707111 -8317882 -9329564 -10363529 -7743536
6046 -7743536 -8730663 -9354276 -8661900 -7695319 -10922818 -10542064 -11075918 -9822679 -8873774 -8714119
6036 -8714119 -10161625 -10717026 -11589135 -10472409 -12856464 -12889369 -12098617 -9756037 -9912380 -10816572
6026 -10816572 -11803886 -11578604 -10517686 -11975490 -10306322 -9701707 -9346794 -9564749 -10009700 -11603611
6016 -11603611 -11537691 -10032941 -8469842 -12377865 -10011362 -8611949 -9584885 -10614961 -9885542 -10266609
6006 -10266609 -10448410 -8795103 -10126408 -12453773 -11524786 -11436435 -11964104 -10945384 -9464754 -8261366
5996 -8261366 -9138245 -11625058 -10874168 -10632078 -10231810 -10457757 -10819304 -10127713 -9944521 -11368148
5986 -11368148 -5936275 -9039074 -8242372 -7982089 -9998560 -9085692 -8201523 -8570031 -8339925 -10473491
5976 -10473491 -10674291 -8640273 -9914291 -9225016 -9727132 -10359009 -10390701 -9377514 -8843730 -9627126
5966 -9627126 -11152448 -10847820 -8501639 -10744603 -11843248 -15543700 -10598198 -9360284 -9354843 -11223216
5956 -11223216 -9360549 -8440987 -10691022 -9201407 -10466073 -10855855 -9480404 -8982554 -10770842
5947 -10770842 -12163204 -10291946 -9209865 -10080244 -11074933 -9955382 -14091659 -10462396 -10728058
5938 -10728058 -9554296 -10461906 -10613010 -9663079 -9828134 -9904823 -9738793 -9284838 -11019333 -9583095
5928 -9583095 -11217770 -10135811 -9528024 -9232395 -9773274 -10710455 -9168681 -9825510 -10591785 -10946305
5918 -10946305 -9603000 -9529377 -9564517 -10773579 -10230750 -10654265 -9746836 -10331986 -9655282 -10804374
5908 -10804374 -10642799 -11287033 -10161955 -6680872 -9348027 -9947826 -11791408 -10836923 -10362796 -11900993
5898 -11900993 -9920258 -9626462 -8754902 -10259992 -8923141 -8654004 -8052095 -8603471 -8246080 -8936724
5888 -8936724 -8312019 -8133862 -10844098 -8708383 -9254882 -9996667 -10156092 -11176316 -9380802 -9202509
5878 -9202509 -9718947 -8696249 -9039550 -9228099 -8810813 -9361730 -9126272 -9498123 -8717829 -9000691
5868 -9000691 -9488176 -7928344 -7458833 -8627756 -11162816 -11279433 -10320175 -9318755 -9257361 -10018434
5858 -10018434 -9515348 -9008708 -9024917 -9702158 -8296491 -8140031 -8996280 -8077438 -9129354 -10487104
5848 -10487104 -10020127 -11166478 -9095383 -11834957 -10182834 -10685203 -10563974 -9083037 -8642053 -8768136
5838 -8768136 -8826218 -7900833 -8157335 -8365696 -8598385 -7430273 -10660875 -13538669 -11316051 -11217095
5828 -11217095 -8915746 -10683627 -8150508 -8377105 -9744119 -10909320 -9722949 -9622741 -10967027
5819 -10967027 -10838843 -8507098 -8596982 -4097593 -8984073 -9907263 -9829112 -10905538 -11836832 -8591799
5809 -8591799 -8918146 -8790650 -9441631 -8069029 -6961664 -8189584 -7975620 -7874519 -10298299 -8676183
5799 -8676183 -9528354 -8885076 -8647053 -9000317 -10090774 -9616609 -9750206 -9315062 -9326498 -11108529
5789 -11108529 -10122030 -9589966 -10584544 -10617327 -8732665 -9283723 -8715191 -9135226 -11691274 -10560855
5779 -10560855 -10700671 -11293669 -10789273 -11764713 -10964250 -10605578 -10643478 -10426714 -9344529 -9877624
5769 -9877624 -8581998 -8544830 -8338049 -9250814 -10932585 -11113021 -11091210 -10408037 -10956368 -8847918
5759 -8847918 -9417508 -10477631 -7439936 -7837749 -7738345 -9526482 -9214023 -8436243 -7018169 -8532940
5749 -8532940 -8578753 -8664288 -8002879 -6993214 -8598164 -9572358 -9970431 -9460855 -10680332 -10014770
5739 -10014770 -9132097 -10257699 -10821165 -10631596 -12477688 -12449310 -11071119 -7973982 -9242115 -9396603
5729 -9396603 -8295438 -6763073 -8758716 -10119837 -10046358 -9687497 -9108073 -9382864 -9746908 -10512757
5719 -10512757 -9992657 -8266235 -9140021 -9043764 -7905275 -8229277 -9463483 -10317597 -9685290 -10542414
5709 -10542414 -8930778 -9246567 -8048935 -7262666 -11263118 -10652957 -8637866 -8579553 -8830915 -7872575
5699 -7872575 -7964101 -6653032 -9149854 -10486480 -6982386 -7215350 -8173278 -7207940 -9041270 -6702292
5689 -6702292 -6971260 -8238127 -7675250 -5334083 -4838429 -3918920 -2305016 -724679 -920495
5680 -920495 -162621698 -45712893 -21961037 -19476715 -16900371 -14725841 -15158294 -14716001 -12998063
5671 -12998063 -13742902 -13854142 -13677943 -13639682 -12456034 -12357653 -11053270 -11828351 -12300719 -11936707
5661 -11936707 -11816313 -12999477 -11500294 -11819482 -13199813 -11558412 -10463804 -10791707 -9446140
5652 -9446140 -10182753 -9862369 -10498710 -11596732 -13150669 -12377652 -11473601 -10658135 -11034579 -10778803
5642 -10778803 -12920158 -11912058 -10215308 -11682193 -10179860 -15214361 -10548220 -10028102 -9877804
5633 -9877804 -10211753 -12217347 -9293842 -11272566 -10760897 -13240665 -11788515 -10575718 -10416721
5624 -10416721 -12037476 -10518931 -9650162 -11754469 -11077271 -10367218 -7184757 -8600693 -9459134
5615 -9459134 -11578474 -11479233 -11555140 -10683617 -11832536 -10146851 -9457575 -8593709 -11561627 -11381830
5605 -11381830 -11051034 -10199668 -9709911 -9681247 -9422597 -11576653 -11224005 -10189107 -10579626 -11427131
5595 -11427131 -8617838 -10468085 -11091420 -9750579 -7270307 -7361969 -9029201 -8997226 -10582964 -10392852
5585 -10392852 -8968424 -10715679 -10985180 -10292132 -12859317 -11180590 -10315643 -11143538 -10694621 -9159776
5575 -9159776 -9579296 -9793957 -10240924 -8988306 -11220441 -10146809 -11677891 -13178914 -13049156 -14111223
5565 -14111223 -13731008 -7500904 -8856141 -9589262 -10458353 -9441110 -8658022 -9717382 -10975124 -10604763
5555 -10604763 -9363826 -9273282 -11658412 -10591762 -9637187 -9018823 -9791468 -10823219 -9489936 -9038341
5545 -9038341 -9922155 -9202565 -8118527 -9958955 -9518944 -9084032 -11201090 -10132737 -8443135 -9503293
5535 -9503293 -10575510 -11554024 -10727477 -9757065 -11446939 -9730467 -10564309 -8103638 -11011052 -11226759
5525 -11226759 -11196903 -9994332 -9452188 -10429024 -10250364 -10854504 -11865972 -11846862 -8905620 -9276828
5515 -9276828 -10306517 -11089348 -10137020 -11197422 -10013568 -10382557 -10177030 -10299240 -9376177 -9148746
5505 -9148746 -7606732 -8263839 -8641984 -10702720 -11670812 -11100484 -10300835 -9751615 -9119915 -10197982
5495 -10197982 -9444569 -9111574 -9315631 -11039924 -11825102 -9707718 -8910085 -10020817 -11237577 -11939980
5485 -11939980 -10005727 -10044701 -9922509 -9616378 -10434917 -11111469 -9354483 -8309563 -10181511 -9821354
5475 -9821354 -7595571 -7752980 -7147795 -7659636 -8085389 -7980036 -10559265 -10735841 -11925689 -10870302
5465 -10870302 -12168236 -14740571 -16766676 -16292347 -18632199 -16426076 -9530642 -10615447 -10386558
5456 -10386558 -16675436 -13009259 -11143056 -11395650 -8484648 -10800725 -12990021 -10696750 -13381229
5447 -13381229 -12785431 -11360152 -10812995 -10305212 -10626655 -10211611 -10157047 -11421441 -11836001 -9520517
5437 -9520517 -9613781 -7483208 -11229575 -12659127 -9217275 -10629982 -10839902 -10163153 -9069257 -10213981
5427 -10213981 -10474158 -10962319 -11251389 -12674605 -12695058 -9779017 -10583908 -9881674 -11867948 -10779311
5417 -10779311 -11090036 -10281827 -9421906 -11913629 -11050978 -11043320 -9726728 -8778088 -9633229 -11032791
5407 -11032791 -10800343 -12781191 -9889547 -10256880 -10010086 -9986156 -10361327 -9669417 -9788648 -10066598
5397 -10066598 -9883296 -10826528 -10826314 -11138369 -10392295 -9063781 -12254195 -12343317 -9889939 -9456259
5387 -9456259 -10522162 -10089231 -7703470 -8415323 -10848389 -11181170 -9836709 -10759859 -9614586 -7846970
5377 -7846970 -9199471 -8959571 -8193792 -11951370 -11855715 -11640412 -11092159 -9307928 -10266047 -10728171
5367 -10728171 -10773161 -9704813 -9765540 -9616455 -10794712 -9873053 -10743442 -6072375 -8181678 -8914987
5357 -8914987 -10146054 -9040542 -9374569 -10705145 -10530668 -9688252 -10035403 -10200513 -11007710 -9587145
5347 -9587145 -10488232 -11944420 -11306866 -12030548 -10569609 -10483777 -10427654 -11604590 -10460689 -8697034
5337 -8697034 -8432709 -8275513 -8981995 -8441311 -8899799 -9718700 -8323969 -9065410 -9909607 -8312823
5327 -8312823 -10021399 -10933924 -9461430 -9208153 -9179950 -9153665 -9376871 -11505991 -9560854 -9874710
5317 -9874710 -11390101 -9983498 -10556694 -10950567 -11956807 -8777576 -11256693 -10813417 -11963775
5308 -11963775 -10164682 -13157890 -7918131 -10231483 -9906267 -10760467 -9904815 -9141497 -10167578 -9292497
5298 -9292497 -10528365 -11244064 -9857069 -9164035 -8958152 -10335982 -9484429 -10374030 -9759080 -10933061
5288 -10933061 -12052525 -7782973 -8457118 -7703466 -7407917 -7202566 -6742259 -7643553 -9379034 -9120880
5278 -9120880 -8488432 -9651855 -10683921 -10020258 -9528732 -9002559 -8515227 -8476783 -9300220 -9939601
5268 -9939601 -11848380 -8413327 -7747287 -7932856 -8680034 -9242528 -10239646 -9006344 -8731994 -7121957
5258 -7121957 -7545961 -6887897 -7271296 -7280479 -7787161 -7281469 -7259996 -5693198 -2670481 -3563932 -1440833
5247 -1440833 1086013 9245009 22765521 135212782 -23302749 -21906520 -18893931 -18689398
5239 -18689398 -14607552 -12005549 -10448634 -12940791 -13006795 -14527639 -12194757 -12522224 -10326811
5230 -10326811 -11896373 -13929165 -12853996 -12103453 -12258013 -12286894 -11821132 -13228677 -12274061 -11974537
5220 -11974537 -8559565 -9397575 -12111553 -12519254 -12398101 -11545472 -11060413 -9438512 -11211167 -10037857
5210 -10037857 -11470687 -9728869 -9369986 -9701038 -9576361 -12278700 -12040176 -12386828 -11763057 -10925048
5200 -10925048 -13039556 -13136235 -11144172 -11191248 -10576876 -10541115 -11013045 -11208714 -13709662 -11173526
5190 -11173526 -11933179 -10865206 -9605118 -10517870 -10176121 -11675915 -12270088 -12607934 -11570572 -11068872
5180 -11068872 -11836648 -12984573 -12087559 -11695536 -10810370 -11764962 -10206174 -8731802 -11491885 -9710886
5170 -9710886 -9884686 -10317281 -11155659 -11859205 -10057136 -10989700 -11774153 -10254571 -10235187 -9748015
5160 -9748015 -10178851 -11106789 -12080760 -12178795 -12357489 -10055690 -9151842 -10199411 -10121591 -10840367 -11055735
5149 -11055735 -9634845 -9468852 -10305497 -11694359 -12198802 -11916052 -13004209 -10741927 -10895685 -10572610
5139 -10572610 -10402853 -10374045 -11107502 -10845202 -9686488 -10625878 -10522119 -8897285 -10315239 -11287023
5129 -11287023 -11209226 -10895173 -11435738 -9232006 -11195354 -10731368 -9323961 -10673147 -11307194 -11164827
5119 -11164827 -11323378 -10813724 -9617836 -9362765 -10010515 -12468133 -10066694 -11321280 -10118885
5110 -10118885 -8667396 -7930219 -12870834 -11056128 -11902151 -11592910 -11744407 -10147360 -9295862 -9701761
5100 -9701761 -10294098 -8983449 -11083739 -10960239 -11608546 -10318774 -13546799 -13428009 -7538498 -10015584
5090 -10015584 -11759907 -12064380 -12173839 -9586529 -9818771 -11428169 -10940243 -12024400 -11379758 -11243486
5080 -11243486 -11710086 -11102889 -10496928 -11295851 -11714539 -10141572 -11608708 -12165982 -11445240 -11605353
5070 -11605353 -8577080 -8448255 -9650095 -10518854 -8864808 -9208410 -10823354 -10661497 -10223011 -9820167
5060 -9820167 -9711253 -10262656 -9559400 -8732141 -10249040 -10556079 -8984228 -10101040 -9334869 -12564163
5050 -12564163 -11129865 -11105965 -12066712 -12169570 -11323487 -10555612 -8820122 -9887528 -11140615 -10708463
5040 -10708463 -8935196 -8316288 -9353287 -11356755 -10908020 -12635930 -11838508 -10151409 -10286561 -10460066
5030 -10460066 -11663906 -10498191 -9124428 -10392410 -15024632 -13334230 -11500074 -12102277 -12400511
5021 -12400511 -10880439 -12121722 -11663616 -12586650 -10234482 -9707879 -9606821 -8468000 -9946863
5012 -9946863 -11216814 -10128008 -9515845 -11029956 -10514393 -10550307 -9852132 -10762336 -11467694 -9774450
5002 -9774450 -11070593 -10936194 -9135758 -9615533 -10176066 -9454119 -9542794 -9683196 -10769472 -9816290
4992 -9816290 -9985132 -11776831 -11385716 -11257053 -9475296 -9696139 -10131203 -10814717 -12596508 -10893784
4982 -10893784 -11003384 -11008326 -11504496 -11309662 -10849884 -10226040 -9510731 -9564283 -11316743 -9598292
4972 -9598292 -11154215 -10049585 -9356368 -9458256 -8926139 -8160943 -9328519 -7924752 -10162404 -12138081
4962 -12138081 -14901303 -11570982 -11096871 -11660718 -11228132 -11327812 -9150833 -6879622 -8490393 -9005398
4952 -9005398 -10452261 -9531355 -9180497 -9031241 -10927027 -11262428 -11971103 -12084532 -11379602 -11193488
4942 -11193488 -13898344 -11290212 -10974546 -10517935 -10652025 -7805815 -10832494 -11122471 -10976889 -10556886
4932 -10556886 -10408138 -7895519 -10301027 -11861159 -10606469 -10306097 -8577293 -10431408 -9536277
4923 -9536277 -9990007 -10660707 -10086453 -9603129 -8129570 -11172272 -11172661 -9375716 -10749748 -10982200
4913 -10982200 -9098642 -10060108 -13383111 -10656656 -9683886 -11459773 -11832038 -10913020 -9961923 -10453570
4903 -10453570 -11248931 -11956933 -11131548 -9941509 -10731683 -10518983 -13063053 -11417857 -10835276 -11550451
4893 -11550451 -10790012 -11645753 -10308865 -9639380 -10258663 -11647178 -10560533 -10857558 -9915963 -11537947
4883 -11537947 -11829515 -10331277 -11165280 -11846968 -9127157 -10515703 -10013389 -12028624 -11863033 -10664577
4873 -10664577 -10542189 -10780344 -11616796 -11373716 -12486985 -10226185 -10979616 -12215114 -8929719 -9727660
4863 -9727660 -10032747 -9245843 -10173933 -11854886 -10430175 -10782938 -9330479 -9639242 -10048792 -10599059
4853 -10599059 -10939950 -11254524 -11481240 -10667736 -12086353 -11839294 -12364952 -12457594 -11440986 -12586198
4843 -12586198 -10325338 -10022093 -11577337 -11775738 -11622992 -10556809 -11418014 -12089768 -9902020 -12477525
4833 -12477525 -11730814 -12213904 -11119573 -11266840 -10891474 -11303019 -11597962 -11610904 -12799266 -13372058
4823 -13372058 -12697329 -12138977 -11586299 -14754236 -14282031 -11998628 -11086296 -13261972 -12148064 -14395947
4813 -14395947 -14552100 -16336633 -16783958 -15719438 -17490688 13816281 22958511 4253640 -629893
4804 -629893 -4302727 -6125869 -7746202 -9977263 -8288475 -8344448 -8835793 -10744818 -11606522 -11458799
4794 -11458799 -9888593 -9894930 -8297980 -9773748 -9394793 -9834974 -8343232 -9786479 -9560284 -9252823
4784 -9252823 -9499245 -10025831 -9879595 -10332078 -11392783 -10571858 -12504752 -10827279 -11477762 -11875784
4774 -11875784 -12186249 -11589522 -9874363 -11037272 -9457931 -11271842 -8602593 -9959005 -10510877
4765 -10510877 -9922583 -11379151 -12386436 -10791989 -10966945 -8755832 -9505795 -9823915 -11173730 -10238117
4755 -10238117 -9903815 -10943800 -11623912 -12276274 -11976431 -12010453 -11142930 -10603181 -10258637 -12285826
4745 -12285826 -13373841 -12255573 -12343300 -11495594 -11707442 -10650886 -11784436 -11491426 -10794048 -12000793
4735 -12000793 -9953192 -11909535 -9412997 -8995664 -11523894 -10274874 -12356684 -10472063 -11529762
4726 -11529762 -11450377 -12665159 -12223966 -10693547 -10657857 -9119949 -8433647 -9952034 -8560220 -10166688
4716 -10166688 -11141488 -11249902 -8991475 -9438453 -10752671 -10770994 -11274985 -10050105 -10890718 -11990758
4706 -11990758 -12738275 -9720408 -9340690 -9034281 -10002039 -11216594 -11070735 -10718186 -9574602 -9357769
4696 -9357769 -7097652 -9295256 -11402659 -11248300 -11713123 -11414095 -11083911 -10531247 -10222326 -11170394
4686 -11170394 -9907421 -9799273 -9444965 -10996955 -9283454 -9410212 -10323118 -10804578 -11948463 -12704914
4676 -12704914 -13272696 -11320532 -11029853 -10673689 -10023064 -10698123 -10334714 -9707014 -10568175 -10217786
4666 -10217786 -9879208 -10333428 -8753223 -10075971 -7277422 -8561726 -10640273 -10339836 -9875262 -9383276
4656 -9383276 -11338369 -10756840 -12374445 -12432566 -10020711 -9322465 -9558431 -8776123 -12959716 -11799100
4646 -11799100 -11710590 -10709664 -11767037 -10803334 -11201366 -9441667 -9566150 -10167160 -8497480 -10632111
4636 -10632111 -9120538 -9297771 -10751480 -10181487 -11098616 -12904475 -10340416 -10983457 -11224553 -9540503
4626 -9540503 -11146129 -11115050 -9095058 -9746664 -9116056 -10870459 -11325729 -10505482 -10859383 -9417920
4616 -9417920 -10459885 -10027714 -9583601 -9092341 -11428204 -10120225 -10245626 -9777830 -11433192 -9986768
4606 -9986768 -10650373 -9581429 -10908281 -11153903 -12562909 -11799309 -10529000 -10536690 -11268247 -10352751
4596 -10352751 -11194038 -9186586 -10477292 -10495624 -10008401 -11132862 -11456246 -13279076 -10691381 -10448279
4586 -10448279 -11137497 -11150884 -9909274 -10354604 -9591974 -11291925 -10874437 -11430153 -12165879 -10507236
4576 -10507236 -10750680 -9668045 -11467447 -11734083 -9800977 -9983964 -10199231 -11267557 -11286384 -11437253
4566 -11437253 -12241058 -14288699 -10895413 -10115660 -9125432 -10462451 -11929534 -11646894 -9671933
4557 -9671933 -11040985 -9964219 -10023131 -10050098 -11113799 -10713395 -10278112 -10852137 -9802656 -10797900
4547 -10797900 -9906138 -9127902 -9615558 -8968833 -9975383 -12896771 -12071592 -10599175 -9405881 -10594854
4537 -10594854 -10662779 -10323154 -10443949 -11256522 -9090964 -9764156 -10812357 -10297095 -10406828 -12947185
4527 -12947185 -11589642 -12087151 -12393520 -15493503 -11670823 -9730791 -10599444 -12647788 -12107744 -12437421
4517 -12437421 -9990833 -9665527 -11945816 -11913141 -11067166 -11571948 -11115093 -11944216 -9987364 -10616179
4507 -10616179 -9975124 -11663406 -14002805 -10212250 -10474098 -9713604 -10568307 -10541613 -10247440 -10462717
4497 -10462717 -9585166 -9906517 -11773622 -12060329 -10183336 -10570598 -12350051 -11566153 -9747798 -8849282
4487 -8849282 -11467323 -11064910 -8564234 -9987112 -10489483 -10289347 -8021428 -9344102 -11378682 -11409311
4477 -11409311 -10825657 -11027671 -11743033 -11299868 -8915180 -9572881 -9130407 -11204954 -8928697 -9332472
4467 -9332472 -10027478 -10236461 -11179586 -9989003 -9995743 -10203974 -10588970 -10847093 -10405345 -10827318 -10472407
4456 -10472407 -10720705 -11360650 -10677756 -10780864 -10911130 -12147462 -11449747 -12110771 -11116746 -12288861
4446 -12288861 -12549290 -10556447 -9980555 -11864125 -12069881 -12659320 -10408255 -10505341 -10412541 -10747122
4436 -10747122 -10106001 -10181899 -10207475 -10317385 -9957853 -8244253 -10149732 -11087924 -9788253 -9303007
4426 -9303007 -7334505 -9435209 -11745516 -12285455 -11625957 -11636544 -11531274 -10888068 -10671724 -10361174
4416 -10361174 -10684700 -9835519 -11303914 -10975069 -10137590 -12194046 -11236235 -10209525 -10444907 -10689001
4406 -10689001 -8396437 -8789390 -10847607 -10595069 -10101722 -9910895 -10069571 -10396138 -12087450 -11892410
4396 -11892410 -10392519 -10192731 -9409778 -9142005 -8345328 -8685940 -9738222 -9484950 -9830884 -10090029
4386 -10090029 -11144322 -9815383 -11356468 -11107507 -11614185 -11586050 -10791581 -10074269 -13878302 -9438589
4376 -9438589 -9292053 -9788726 -8224738 -5296632 18620075 -11119929 -12305682 -8386534 -9902452
4367 -9902452 -12712110 -12799076 -13778140 -12693088 -12002126 -12810513 -11664437 -11182232 -10511551 -11613014
4357 -11613014 -11300457 -10507139 -10931074 -10982964 -12752913 -11697032 -11039462 -11949949 -11781267 -14068738
4347 -14068738 -10074317 -9732771 -10200647 -12202364 -10508451 -12164472 -13388067 -12556099 -11211566
4338 -11211566 -9946161 -11462766 -11922033 -12737067 -11238403 -10889575 -6502890 -10822265 -13327584
4329 -13327584 -11511889 -10538372 -11151657 -11744129 -11155368 -11785603 -11854352 -12058913 -11782904 -11902106
4319 -11902106 -12086425 -11429126 -11433932 -11028026 -12047734 -9796203 -10557976 -10660290 -10330841 -11157293
4309 -11157293 -10910445 -11234004 -11239868 -10191580 -10968009 -11526579 -9904424 -9129624 -11250293 -9983376
4299 -9983376 -11147164 -10860505 -11310363 -12303784 -12399437 -10522925 -11653825 -10397458 -11206204 -11956255
4289 -11956255 -12631510 -11179159 -12207913 -11376543 -11605528 -12222708 -11798911 -11932578 -12756407 -14410187
4279 -14410187 -15882240 -10558837 -9892439 -10228135 -12263064 -8670383 -9646737 -8656991 -9256438 -10724328
4269 -10724328 -10193399 -10636550 -9073481 -10139065 -10507392 -10798339 -11506969 -10766702 -11070368 -11893657
4259 -11893657 -9874997 -12251957 -11622375 -10062006 -10267062 -12180765 -11549496 -11859532 -10893130 -12608022
4249 -12608022 -13504800 -9343263 -10175205 -9875676 -10425743 -10330703 -11273633 -12140092 -11806663 -9033532
4239 -9033532 -10291081 -10657559 -10523325 -9965507 -11330766 -10975443 -10342808 -9541448 -9370500 -11555880
4229 -11555880 -10865205 -9497386 -9483768 -9729090 -9627455 -9871520 -10484975 -15145002 -14006304 -12491367
4219 -12491367 -12145169 -10221092 -10671306 -10648746 -13021274 -10912706 -10588046 -10731056 -11187400 -9752092
4209 -9752092 -12765971 -10806984 -11392164 -11567350 -12382195 -11809336 -10224606 -10488616 -10443274 -10874294
4199 -10874294 -10767073 -11285275 -12063067 -10183932 -10096173 -10735702 -10359705 -11506624 -10413453 -10889443
4189 -10889443 -10547675 -11587731 -12258812 -11864965 -9842512 -10341255 -11579509 -11334618 -10606205 -11410532
4179 -11410532 -11974600 -11591786 -10462014 -11337235 -9846013 -10948261 -11287246 -10051148 -11339691
4170 -11339691 -9942440 -8876205 -9143226 -9613119 -11095901 -8920769 -8702498 -10878133 -11350591 -11339114
4160 -11339114 -13584000 -8901312 -11333900 -9852072 -11201807 -12820254 -13507650 -9184653 -10648327
4151 -10648327 -12342387 -11842128 -10425935 -11498578 -9357912 -10553729 -10616109 -10527671 -12086599 -12089036
4141 -12089036 -10539533 -12011535 -9878144 -11291646 -12817692 -10598932 -10260158 -9037676 -11363094
4132 -11363094 -8409415 -9368453 -10597325 -10245049 -10277357 -10753103 -10539502 -10169467 -13760115 -11733982
4122 -11733982 -10592754 -11113425 -10014023 -9727605 -11595325 -12044426 -11174900 -11601901 -10824715 -11138865
4112 -11138865 -10461235 -12225693 -11809924 -11956265 -10557173 -11404393 -11947991 -11767001 -10481711 -11773072
4102 -11773072 -11286876 -9482655 -10783675 -10290226 -12664671 -12650950 -11335843 -12130279 -12775127 -11813972
4092 -11813972 -12437570 -11506877 -10678272 -10286500 -11007209 -11388460 -10845243 -12047807 -11034032 -10950761
4082 -10950761 -8980214 -9222421 -10472688 -9782739 -9173447 -9683204 -10417369 -10427893 -10162819 -9720938
4072 -9720938 -10077565 -10061300 -8330832 -9791749 -9641423 -11340783 -9973935 -9653741 -9835603 -11530001
4062 -11530001 -8891239 -11049668 -11091217 -11774028 -11715477 -10394166 -9731841 -9604120 -11183559 -9987797
4052 -9987797 -9353838 -8672911 -9706811 -10870700 -11345028 -11559007 -11325518 -10555579 -10717143 -11045125
4042 -11045125 -10666993 -10288042 -9676608 -10512506 -10110912 -10935262 -10878990 -10843167 -10943638 -10372421 -8486891
4031 -8486891 -9632672 -8479797 -11978988 -10423415 -8738760 -10390520 -10151677 -9162970 -7637232
4022 -7637232 -8373276 -8934504 -8712391 -10519323 -8878972 -9626559 -9408927 -10042851 -8219808 -8781942
4012 -8781942 -8258440 -11146823 -13008775 -11060523 -10269661 -10440919 -11502292 -11072318 -9688099 -10332532
4002 -10332532 -10182438 -11218089 -10289567 -11331106 -7740481 -10234379 -12246969 -11035591 -10842563
3993 -10842563 -9689317 -8981258 -10371144 -10200126 -11461475 -9876736 -8881537 -10173343 -10144395 -10197758
3983 -10197758 -10996401 -11355164 -9175346 -10598545 -11292471 -12013838 -10175815 -10260807 -11898887 -11453599
3973 -11453599 -10435288 -10564413 -10507355 -10969689 -11080401 -10965546 -11783562 -10271192 -11834198 -12321881
3963 -12321881 -11057166 -11745475 -11027047 -11249544 -10974190 -11366692 -11832519 -10759176 -9663937 -10325007
3953 -10325007 -9949324 -10638924 -10169748 -9453361 -10245082 -11375069 -11653703 -12883332 -13467259 -12955060
3943 -12955060 -10965639 -9666518 -10316664 -10119107 -9774525 -11082999 -11645872 -16953956 -20317875
3934 -20317875 -16817855 -12990003 -12309865 -12305035 -12491892 -10041880 -10286263 -9642200 -10032847 -8748454
3924 -8748454 -11541207 -11114851 -11535802 -12019448 -11354817 -12973453 -12453677 -11975766 -10729187 -11686308
3914 -11686308 -11524003 -12058945 -11599015 -14200367 -16112330 -14315546 -7967917 -9423447 -9491782 -11263016
3904 -11263016 -11058687 -11593876 -10692537 -9476009 -11623048 -12617437 -11661320 -11039068 -10571749 -13170010
3894 -13170010 -9778206 -11101113 -10986481 -11273820 -10550170 -9427753 -11339536 -13780161 -13529523 -12953727
3884 -12953727 -14170161 -8041221 -9022510 -9552324 -11706143 -11330829 -11544351 -10845396 -10481923 -11057824
3874 -11057824 -12251484 -12143476 -10909637 -9837117 -9025595 -10705695 -9614286 -8908009 -10080628
3865 -10080628 -14305231 -12311258 -10721306 -10383502 -8683128 -10674554 -10870996 -11205269 -10351205 -9436605
3855 -9436605 -9903718 -9706724 -8527346 -10370076 -9966331 -10281814 -9821995 -10859855 -10274243 -10761694
3845 -10761694 -10428681 -10936969 -11279933 -10655648 -10497969 -10425999 -9230589 -9680343 -8579891 -10926084
3835 -10926084 -11827485 -10420663 -9826530 -10921743 -10185206 -11292033 -11267699 -9323774 -9967762 -10979126
3825 -10979126 -11296678 -11200890 -10868357 -11990843 -13383505 -10363072 -10842680 -11864760 -11952651 -12505108
3815 -12505108 -11446416 -10862042 -11444465 -10008335 -10480080 -11432868 -10012892 -9594234 -11374299 -10542489
3805 -10542489 -10721240 -11042654 -12530699 -11417390 -10126576 -10752162 -11270471 -10436857 -12671157 -10878155
3795 -10878155 -10683264 -10155750 -10123709 -10449484 -9939925 -11999712 -11086998 -10846930 -12088763 -10443423
3785 -10443423 -10519059 -12713821 -12988563 -12292740 -10546080 -9267377 -10508955 -10372877 -9798897 -9495446
3775 -9495446 -11538815 -10161132 -11385576 -12629176 -11109310 -10733273 -12005884 -12651554 -11443582
3766 -11443582 -13074343 -12654376 -11599480 -10664719 -9639853 -11020514 -11113786 -10858730 -11252741 -9645718
3756 -9645718 -10422777 -9137996 -11254405 -11712233 -10718100 -13695836 -12092284 -10912141 -10691056 -8971259
3746 -8971259 -10971514 -9653471 -10136572 -11639014 -12037682 -10937903 -12917416 -12894182 -12018729 -10422727
3736 -10422727 -11071243 -9378647 -10002806 -12592514 -11347909 -10470319 -10314916 -10458722 -12638939 -13232391
3726 -13232391 -12373496 -10335351 -10550391 -10327867 -10040352 -11139875 -12544591 -11662316 -11184944 -11269528
3716 -11269528 -9155413 -11799521 -11754942 -11280866 -11780199 -11457649 -9685329 -10310191 -11500855 -11706417
3706 -11706417 -10994009 -11276746 -10275782 -10204178 -9829983 -10023944 -12050551 -12547957 -12933458 -10464650
3696 -10464650 -11578253 -10681825 -10802141 -11509190 -12626345 -12132353 -10838168 -10208056 -11339949 -10548067
3686 -10548067 -9299937 -9401938 -10126917 -11164262 -12400750 -11535867 -12467395 -14026695 -11966894
3677 -11966894 -9273590 -9301941 -8495183 -10991891 -12156206 -10870918 -10161741 -10358563 -10378199 -10892218
3667 -10892218 -11288407 -11575446 -12053232 -11240038 -10303683 -12821954 -13593286 -12281551 -11272486 -11729735
3657 -11729735 -10888021 -11091549 -10518048 -12294910 -12599256 -10887383 -7370282 -10755251 -10297269 -10585873
3647 -10585873 -12851729 -10846890 -12426898 -10532873 -12170535 -11431370 -10814968 -12056427 -10797633
3638 -10797633 -10879985 -12217259 -11443138 -13102048 -10529203 -11426130 -12576407 -12570649 -13947449 -16845976
3628 -16845976 -12291797 -13414262 -14464264 -10580945 -12287551 -12173384 -10830076 -11447175 -11327361
3619 -11327361 -11579577 -11652013 -10483541 -9953952 -9534126 -10928441 -10468640 -11984494 -10713082 -14698888
3609 -14698888 -12445035 -12290148 -10326215 -10271520 -8423597 -9969094 -6537145 -13534766 -12281526
3600 -12281526 -11775283 -11232340 -12055500 -11563642 -12023988 -12138953 -11933193 -13189662 -11885743 -10916519
3590 -10916519 -11300735 -12012345 -11439841 -10931780 -11577624 -12152028 -10860416 -10985733 -12001344 -11776773
3580 -11776773 -11647923 -12269113 -12088010 -13080770 -11667625 -11944898 -8184357 -10112704 -11601902 -10979082
3570 -10979082 -11621207 -11367758 -12266242 -10193283 -10887336 -10499455 -9754050 -11821752 -11385221 -12443220
3560 -12443220 -14020242 -12992651 -11379667 -14017410 -13982351 -13092952 -12042017 -10061393 -12037082
3551 -12037082 -11666761 -13278357 -12073698 -11154305 -11312188 -11555427 -11702210 -11694978 -11391457 -11363594 -11079694
3540 -11079694 -11847731 -11472112 -11332616 -9773280 -12323360 -13191251 -11545501 -12241769 -11493717 -11020266
3530 -11020266 -11776520 -12344468 -12712396 -11523374 -12149271 -11752931 -11755937 -11818164 -10128217 -12494093
3520 -12494093 -11259664 -11946895 -11579503 -10905493 -11935224 -14291226 -12968307 -12797461 -13019226 -13360975
3510 -13360975 -14579581 -14493452 -11539411 -9583179 -11860065 -11946013 -10703750 -10504678 -9692998 -9935367
3500 -9935367 -7704148 -19048581 -16140284 -15217393 -13795460 -11927623 -11058812 -10642766 -13026363
3491 -13026363 -12086196 -11615986 -12998472 -9597828 -11785749 -11400590 -8825215 -16537703 -14103416
3482 -14103416 -13512435 -11053107 -13236918 -13713540 -12741484 -12656025 -11992357 -12564478 -13563948 -12224358
3472 -12224358 -11187706 -11529727 -11002839 -11577620 -11318891 -10103465 -11398530 -13649935 -11964253 -11830312
3462 -11830312 -8341717 -11816149 -14180650 -11848976 -12353447 -12117779 -10190238 -11024823 -12446072
3453 -12446072 -12107504 -10072754 -9564430 -12083213 -11501477 -12893250 -10878273 -13085265 -12034803
3444 -12034803 -12719018 -12569690 -13825251 -11911316 -13503415 -11308606 -13246415 -12494011 -11871952
3435 -11871952 -13485662 -13409204 -11924800 -12242579 -10707369 -12508621 -12992977 -12319186 -13307771 -11399739
3425 -11399739 -12528534 -12430950 -11823332 -11635495 -12032396 -12338347 -12445590 -11224417 -11743475 -11558782
3415 -11558782 -11399013 -10630232 -12219139 -12206101 -12516222 -11714923 -12570927 -12968615 -11623756 -13264401
3405 -13264401 -12660520 -12232135 -12204323 -12160451 -10456251 -11119039 -12342168 -12696570 -13539114 -13952619
3395 -13952619 -13656360 -12690666 -13005681 -15259349 -13955352 -14058846 -13393199 -14018455 -11913251 -13861203
3385 -13861203 -14008675 -12879845 -11881543 -12526461 -12392048 -13347291 -12165282 -11674176 -12590028 -13657639
3375 -13657639 -11266589 -11820402 -13044874 -12599869 -12309165 -14310352 -12849313 -12968692 -12272269 -13058983
3365 -13058983 -13103308 -12853656 -10768954 -12670934 -12811469 -12515326 -12266110 -13913427 -12880926 -12263962
3355 -12263962 -13223260 -13504474 -14401805 -11956153 -10501784 -11171416 -11530439 -11148126 -12504049 -13541036
3345 -13541036 -12008650 -12599059 -13720564 -12226252 -12440669 -13664130 -14733058 -10741484 -11463428
3336 -11463428 -12285683 -13428930 -12940433 -10530995 -11838642 -12595160 -10424030 -11681769 -11322966 -11731162
3326 -11731162 -11208936 -10651956 -13469207 -12981139 -10898765 -13102343 -12427552 -12087147 -10084511 -10832844
3316 -10832844 -12390592 -12030682 -12710700 -13515620 -10960061 -11174416 -12643538 -13743667 -12349320 -12319166
3306 -12319166 -12860555 -12668178 -13727025 -10846915 -14496092 -14470538 -11608538 -12085623 -11301559 -12135788
3296 -12135788 -12407911 -11283268 -11181311 -11112048 -10428973 -12381373 -11819157 -11516004 -11406757 -10218702
3286 -10218702 -11468319 -11762795 -12400934 -13724808 -11698533 -12775615 -12300082 -12450279 -11905108 -11363324
3276 -11363324 -11377553 -11930901 -12706226 -14109028 -12985897 -12156668 -13191635 -12779119 -12850657 -13297954
3266 -13297954 -12803972 -11426197 -9699653 -9378972 -12137147 -12898030 -11893387 -12272973 -12400495 -12035903
3256 -12035903 -10675059 -11658060 -11581123 -11711933 -12948981 -10782570 -11537967 -14444238 -12427780 -13343688
3246 -13343688 -11414982 -11935749 -13544954 -10809483 -10863860 -11450225 -12097630 -12755119 -9545136 -11264908
3236 -11264908 -11147422 -10165793 -18021456 -11140287 -11607569 -12598628 -11233891 -11356428 -12259891 -10211089
3226 -10211089 -15841528 -13561869 -13741686 -14447759 -13976042 -13529907 -12417346 -12744877 -11484217 -14773001
3216 -14773001 -12866673 -13376175 -12585195 -12634735 -13631914 -14541277 -13585325 -13133459 -14393321 -10979156
3206 -10979156 -12489371 -12004872 -12960746 -12540213 -13864196 -11849195 -11555840 -12077832 -12894507 -13002456
3196 -13002456 -12575296 -11959280 -13067030 -11535381 -11484235 -11531783 -11141418 -12137127 -12167936 -12306366 -12608009
3185 -12608009 -13404677 -11760288 -13039738 -13509320 -13585057 -12165212 -13879142 -13574275 -12483976 -13965949
3175 -13965949 -11914728 -12440804 -11461792 -10856366 -11185533 -12135433 -10981726 -11440050 -11419039 -10929151
3165 -10929151 -12916114 -11099571 -12255962 -11319771 -12072476 -13493796 -13720573 -11927158 -12808407 -12750913
3155 -12750913 -12665567 -12186413 -12261274 -10518452 -11181298 -12098936 -13216052 -13134631 -13302545 -14429713
3145 -14429713 -12984242 -12229442 -11887858 -11037375 -11693105 -12477631 -14221060 -12885160 -12290761 -11956545
3135 -11956545 -14948843 -14087259 -10960815 -11929311 -12388434 -10528822 -13033476 -13422670 -13434124 -13128125
3125 -13128125 -13703184 -13378235 -12641955 -11512534 -13200845 -13857049 -13717170 -13484939 -13079395 -14166477
3115 -14166477 -13485518 -12441195 -14767057 -13369160 -15392550 -13007252 -12586746 -12990235 -11002095
3106 -11002095 -11351447 -11145266 -12879037 -13874860 -14294751 -11480525 -12541392 -12313098 -13734077 -16417698
3096 -16417698 -12708212 -11396455 -12095568 -11712730 -11706681 -11842079 -10768664 -16676522 -13589762 -13087832
3086 -13087832 -13498944 -12595849 -12940616 -11727439 -12677550 -12905884 -11657711 -13908833 -13185519 -13656909
3076 -13656909 -13780428 -13940455 -10923237 -13176641 -12819330 -13049819 -8923842 -11899641 -13196375 -13142451
3066 -13142451 -12288483 -11899091 -13276234 -17041667 -15532644 -14070606 -14431571 -15390588 -15027087 -12999061
3056 -12999061 -12527319 -12256853 -11194618 -12611065 -12259070 -11376370 -13087100 -12904595 -12351142 -10873856
3046 -10873856 -11212072 -13547333 -13907367 -11379830 -11790843 -11128236 -10204234 -12472745 -11992099 -13262175
3036 -13262175 -12571085 -12143147 -12042391 -13551454 -12420594 -11354825 -11620219 -12281702 -13929880 -13870458
3026 -13870458 -11734397 -10268565 -17191899 -14967283 -15495267 -15326005 -11975661 -12465179 -12470948 -12360951
3016 -12360951 -13771730 -11209167 -13014705 -13251556 -11898302 -12425438 -13407613 -13713989 -13208071 -13103797
3006 -13103797 -13673098 -14191934 -14482148 -14157669 -12751131 -13063426 -12918212 -13481759 -13350824 -12507864
2996 -12507864 -13953906 -14651042 -14334182 -12769217 -12204130 -13350453 -14016499 -14181395 -15107071 -13408313
2986 -13408313 -13350240 -12290547 -13450570 -13240847 -14525960 -13348987 -13324102 -13410971 -13676724 -12841143
2976 -12841143 -12308612 -12972030 -13687062 -12874905 -14444831 -13436262 -13703276 -13364728 -12975726 -13414123
2966 -13414123 -12237650 -13411287 -13826396 -12372928 -13982800 -13119055 -13396893 -13379332 -14467566 -12623977
2956 -12623977 -13646652 -13539815 -11439977 -12788405 -13823580 -12354345 -13598796 -11949595 -13253583
2947 -13253583 -12593696 -12960714 -12984955 -12170888 -12244081 -12293313 -13032870 -14284680 -12834257 -12596295 -11937739
2936 -11937739 -12088786 -11487597 -12378381 -12968707 -12783874 -11872389 -13283322 -13671545 -12935323 -12063938
2926 -12063938 -12530095 -13133470 -11632271 -12282512 -12248899 -13128897 -12858270 -13779300 -12430122 -11087766
2916 -11087766 -10686117 -13818874 -12932240 -14513976 -14523706 -14438581 -11916168 -11924451 -11781231 -11602320 -12579436
2905 -12579436 -10937775 -12345113 -12199991 -12401192 -12014924 -12747050 -13027467 -12328672 -10226361 -12206499
2895 -12206499 -11298728 -13625997 -14425968 -13075750 -11311569 -11529056 -12835853 -11885297 -11804064 -13822409
2885 -13822409 -11238407 -9593908 -12283592 -11381482 -11399178 -9938944 -12473016 -13024309 -11252352
2876 -11252352 -10112033 -10365388 -11106871 -11206464 -10590913 -8641890 -9271846 -9339745 -8250217 -8889757
2866 -8889757 -7303620 -9715594 -8714876 -9815784 -12042790 -10179127 -10370647 -11554723 -10698588
2857 -10698588 -9356303 -8617773 -7527655 -9261793 -9699767 -10141668 -9692313 -9331861 -9302966 -7955737
2847 -7955737 -10670714 -9667698 -6142993 -5624390 -5092026 -6300987 -4698674 -4330533 -3648278 -4209470
2837 -4209470 -6140607 -5955948 -5141750 -3738764 -4867183 -6482213 -8518531 -7830263 -6907362 -6157062
2827 -6157062 -3858382 -5342708 -7786406 -6310094 -7742749 -7479862 -6930789 -6164833 -5778836 -5689502
2817 -5689502 -4196279 -7884051 -4670705 -2320645 -2090794 1191349 14727 157521 2426307
2808 2426307 1461053 203656 910641 -301995 -3019911 -4852639 -4796007 -4856158 -3422610 -3982346
2798 -3982346 -2919617 -5767277 -6009407 -5036947 -6258846 -5537070 -5390725 -4840288 -4500676 3371599
2788 3371599 777535 -70820 -1043231 1451263 924824 -254307 4633750 2440388 2737831 3887337
2778 3887337 3539370 2826144 885305 1765001 3650880 1987803 1702674 1078805 -122091 -2318208
2768 -2318208 -3133216 863658 2029292 602814 3098542 2096529 4260120 4543750 5816902
2759 5816902 6665583 6985244 8077897 8393593 8459506 10247347 10023379 11260014 10256966 11813892
2749 11813892 12096888 9301594 7921497 10118840 7747824 6846953 8126047 7432920 9280173
2740 9280173 11325873 6765339 8398186 9724699 10126754 12640709 13033093 14303722 17664797
2731 17664797 18437564 18510326 19463947 19914564 21995140 21929244 25506167 27182962 24541469 27543177
2721 27543177 27754183 26059877 22845915 21275218 19389910 19867954 22500387 21545923 22582199
2712 22582199 21082564 19831022 18581398 22657982 25644864 26814852 29559631 31586665 34960723
2703 34960723 37226900 38906168 44087477 46714865 49948230 52202502 57063450 59297496 63308346
2694 63308346 63949852 66786762 65361762 63587229 61419413 64826474 68966346 70490567 71365763
2685 71365763 70761698 68509290 66428385 69056591 74559067 79054823 85459039 88526619 94877671
2676 94877671 96144981 99099584 107814077 117727748 125439662 131629844 140798773 147241361 152755558
2667 152755558 159029659 162234085 165662386 166275686 167516432 169472709 173288841 176745881 181845571
2658 181845571 186024299 186629610 187601008 190533321 196812270 199337444 206609428 214521755 225907257
2649 225907257 233566764 237292355 244293765 253200637 257487389 262927491 284392334 314656701
2641 314656701 335357207 365826376 413839537 445262425 442267103 438332127 449582624 468067494
2633 468067494 497051521 544364527 563151604 525950337 459042529 398592635 379660220 375042823
2625 375042823 368629602 364066206 375947959 386003337 385259027 384199372 390067433 381054784
2617 381054784 370094165 380726976 431762387 490957363 560402345 676969984 814794487
2610 814794487 827793622 790703978 798320424 850789209 920575265 1023143626 1143136992
2603 1143136992 1087987536 885293457 656521421 510406677 463917715 452112165 420106375
2596 420106375 403048566 403472736 388535830 364207881 356217929 350463048 336197423 324413415
2588 324413415 338454793 381068659 438407081 539775130 687246652 774195271 742535950
2581 742535950 723303567 749826654 815204801 904561898 1027784528 1070725127 894498441
2574 894498441 647450430 440831973 345483915 320261657 293778089 256884189 240985926
2567 240985926 222612935 188118407 163722378 161237481 162149901 152917329 143025229 137207752
2559 137207752 148023521 177966628 227129564 275286600 282230334 274027956 276408268 293737567
2551 293737567 319565197 361001757 397099738 358129010 274869395 190581535 139621819 117316655
2543 117316655 106591627 90306479 82171454 71989146 56914920 42675659 38825164 39262416
2535 39262416 41999261 42353403 34946184 25640521 20253085 18823107 19580989 22508508 27502124
2526 27502124 28447049 28365457 27395091 28995753 29612887 31830647 31663611 31142867 33739899 31085142
2516 31085142 28288324 22185180 21707638 20748130 20504571 20427132 17052676 17660427 19419667 20109210
2506 20109210 23527373 25912476 22445138 17149406 13779522 15551756 17023583 17189598 18359287
2497 18359287 17122712 15042016 15447840 17846109 16662398 16178035 16983331 20486755 23146445
2488 23146445 21544093 23563031 23359965 21407476 23417212 23862706 23158961 20915452 21794114
2479 21794114 22923195 25175039 25589422 15553474 11627691 8949687 11171978 13113762 14010331
2470 14010331 14281657 6720972 1571667 -510754 784086 2633276 4803535 7450614 8763826
2461 8763826 9155409 10823701 11294277 14800491 18703411 19173526 21013447 19854247 22569082
2452 22569082 26578954 28749988 34413010 37483480 34193418 33474749 37468477 40764205 44924683
2443 44924683 43993630 44544659 37776441 35554294 35047365 35420675 41391063 46390523 48652992
2434 48652992 55510763 55664586 52343191 57659390 71813903 82277728 91694317 105807226 115800190
2425 115800190 119669549 118023781 123042660 128179846 131383607 130143346 134217768 140385010 143682286
2416 143682286 144176976 144760677 146702145 152176299 153991691 158281873 158496899 157453169 160804475
2407 160804475 169119081 173336318 172729084 178412991 182235433 181741029 179870108 193618739 200917646
2398 200917646 198039438 190959606 194845042 202245178 201656777 203537567 206271290 200953129 191919180
2389 191919180 197009983 208911337 226777893 229960186 227787964 227413631 228012587 226646005 225683459
2380 225683459 247206654 276171269 280064375 293127238 293134615 264601134 230145795 226769269
2372 226769269 307203587 392598633 475817571 667237735 951139725 903118948 831494865
2365 831494865 815602200 898013450 1010111391 1141220380 1429263246 1349318196 1024473103
2358 1024473103 621254113 381550199 327062690 328309822 270571677 230051098 212049723
2351 212049723 177382737 134953704 109700571 120566292 121603691 112802181 82161033 54954597
2343 54954597 51576394 57929895 62265441 69778060 75784039 71385135 64211971 64066333 67461886
2334 67461886 60047768 52490118 45209438 32620065 26500971 15667627 10223021 1521868 3169873
2325 3169873 1397124 -6213840 -11756874 -12278134 -11013334 -11558636 -9358279 -10217938 -13607646
2316 -13607646 -17684540 -15632496 -11024818 -7522610 -4453930 -1862973 3758279 4804318 5326790
2307 5326790 9615820 19207566 21069952 19520549 18357485 23033448 22479078 19846286 16291317
2298 16291317 15973038 16848781 17212401 13774832 8872967 11310841 11728508 13749547 17003262
2289 17003262 19240039 13452274 6165008 2035625 2419113 3805191 4420577 6939140 3357315
2280 3357315 -253114 -2032283 -4975956 -3779925 2244651 3196748 228108 -3016409 -2866302
2271 -2866302 -263510 2203094 2591445 2185082 1795748 -421019 -2867857 -1337695 429830 1124683
2261 1124683 -1340754 -2825801 -2090200 -2413931 -190916 -1047423 504993 -813225 -5978077 -6423005
2251 -6423005 -5636100 -6972284 -8911263 -9826987 -8796302 -9128952 -7839537 -9207074 -9035113 -10322976
2241 -10322976 -9532516 -7771286 -8097406 -7808746 -8359320 -8019309 -9383712 -7452310 -7275752 -6151311
2231 -6151311 -6253746 -5560973 -7138159 -7075800 -8985464 -8395723 -8807375 -10814645 -10654216 -10371841
2221 -10371841 -10277101 -9932708 -11835849 -10285040 -8664815 -9359829 -9590183 -9109221 -8852908 -8260638
2211 -8260638 -9588715 -9636917 -10106940 -6819314 -6686012 -6344627 -6388946 -5031575 -4755501 -3317091
2201 -3317091 -3570228 -4462529 -4091877 -5109872 -5495753 -5557839 -7713915 -5578323 -2888628 -4300614
2191 -4300614 -3488343 -4482258 -5830189 -6233739 -5713577 -3995704 -5632497 -5287507 -7426257 -6238474
2181 -6238474 -5680207 -7023569 -4628176 -4109973 -6935478 -5118991 -4134873 -4855729 -3268976 -6558186
2171 -6558186 -7007837 -7535768 -5574373 -8110569 -6290501 -6981144 -5419069 -6970713 -6629545 -6310646
2161 -6310646 -4535408 -7433551 -6858549 -5193004 -5105285 -6754917 -5127468 -4393516 -4057430 -7084851
2151 -7084851 -6420506 -6234233 -4770955 -5394863 -5223379 -4743915 -5918469 -4087450 -4682913 -4182371
2141 -4182371 -3068403 -4022048 -3916692 -5339297 -6062087 -5061362 -5416893 -2755621 -4410836 -4318710
2131 -4318710 -3181643 -2581808 -2796006 -4932857 -4022840 -4155966 -6166730 -5823838 -7492798 -5287333
2121 -5287333 -8252228 -5587042 -3595731 -6299122 -6948593 -5266252 -5272845 -5861515 -6533838 -5398800
2111 -5398800 -6365273 -6973573 -6531461 -6776452 -6694447 -5847385 -4985666 -4805905 -6803293 -5750042
2101 -5750042 -7302562 -7309656 -5925297 -6823963 -7592862 -8190438 -6662591 -6720863 -6561457 -5892926 -6469114
2090 -6469114 -7346777 -8024852 -8654128 -6450241 -5756238 -6835277 -6250921 -5082213 -5990430 -6956444
2080 -6956444 -7611448 -7912672 -8377635 -8246452 -8176250 -6372156 -6213971 -7220670 -7034985 -5802322
2070 -5802322 -7342499 -6861134 -6270399 -6322090 -6464205 -6736466 -8662687 -8520392 -8588354 -7130966
2060 -7130966 -7595127 -6152314 -8992643 -9953223 -7517476 -6326209 -7678604 -8473968 -8650152 -8930621
2050 -8930621 -6949097 -7711406 -7494587 -8784107 -10008613 -7736517 -8283431 -9586182 -8784918 -7150796
2040 -7150796 -6512970 -8134008 -10021286 -8714508 -9164906 -8970329 -9021457 -8712957 -8372223 -8788322
2030 -8788322 -9398223 -10693249 -8724094 -5819863 -6682109 -6899269 -9117389 -9594518 -8366717 -8302204
2020 -8302204 -10784140 -7989261 -8304890 -9415981 -9046271 -8100560 -8974660 -8617213 -8844585 -10354718
2010 -10354718 -9076872 -9756924 -8333091 -9052425 -10920578 -11251165 -9186272 -9106263 -9037262 -9777590
2000 -9777590 -10142022 -9869975 -9400082 -8826376 -7883386 -9708615 -9161266 -9160117 -9127195 -8737217 -8398168
1989 -8398168 -9124406 -9713823 -9186201 -9840473 -11023882 -10299938 -10202551 -9500495 -9570405 -10341630 -8611836
1978 -8611836 -8995091 -11072435 -10748730 -9837357 -8527210 -9810977 -10444166 -10000411 -8989115 -9080679
1968 -9080679 -8243269 -7888867 -10750593 -8989472 -8868712 -10144203 -9678108 -9609549 -8572704 -8703894
1958 -8703894 -7882004 -8868032 -7987643 -7445390 -9233397 -9001785 -8882755 -8374764 -8456100 -9827551
1948 -9827551 -10796240 -9546233 -8745769 -9248046 -6973499 -8592121 -10391598 -8528292 -8231143 -8316402
1938 -8316402 -7401190 -9627762 -8094287 -8983999 -9166583 -8091664 -7744680 -9226137 -8180049 -7725992
1928 -7725992 -9075789 -8440368 -10044436 -8556992 -8543892 -10254401 -8228959 -10346155 -10149909 -10122332
1918 -10122332 -11070528 -9954059 -9775184 -10088445 -10194265 -7795451 -8123674 -9807089 -9425950 -8494059
1908 -8494059 -10378774 -4817688 -8931325 -7918516 -7393573 -8881177 -9830805 -10124742 -8946380
1899 -8946380 -7395259 -8109035 -8484569 -8491455 -9052274 -8199758 -9075889 -8489578 -8888686 -10690015
1889 -10690015 -8746311 -8984792 -8928660 -9211914 -9706317 -8810201 -9399337 -8739239 -8304004 -8431583
1879 -8431583 -7995606 -7829765 -7692806 -7214706 -7571540 -9451574 -9668573 -9561148 -9957806 -8972383
1869 -8972383 -9594244 -11840080 -10981143 -10726283 -8155438 -9042341 -8535749 -7997799 -9497711 -11093159
1859 -11093159 -10188798 -10821229 -4927598 -6745543 -9728266 -10285878 -8886464 -9700179 -9982224 -9738221
1849 -9738221 -9458217 -9917622 -11041006 -10358470 -9945641 -10147062 -8712945 -9637824 -9395859 -10670017
1839 -10670017 -9328718 -9522577 -10145938 -9581030 -9206741 -8957177 -9498975 -9376952 -10596169 -9011180
1829 -9011180 -9844826 -9505117 -9442125 -9662820 -10745004 -10441273 -9659741 -9358823 -9574705 -8368097
1819 -8368097 -8876430 -9019409 -7236744 -9304568 -10799863 -10845527 -10615137 -9652903 -9489330 -10093260
1809 -10093260 -11992013 -10239489 -6300384 -8179217 -9203371 -7474183 -9529906 -8779034 -8542599
1800 -8542599 -9559534 -9027127 -9843163 -12045619 -8939163 -9314284 -10247913 -10801942 -8377225 -8236440
1790 -8236440 -10105078 -7584305 -8674551 -8373813 -8082661 -7410455 -9195834 -14058698 -11641087 -11159469
1780 -11159469 -9913916 -9271201 -10185912 -9970622 -8994362 -10178220 -9826148 -11412215 -9899030 -9930529
1770 -9930529 -10315034 -10182384 -10806426 -9214490 -11056854 -11202272 -10422412 -9634827 -9846830 -11304300
1760 -11304300 -10618865 -9810231 -10443951 -9961008 -11160360 -10735952 -9346251 -10819517 -10783587 -10122719
1750 -10122719 -9547510 -10433847 -11168444 -12938238 -11107531 -10582065 -9704332 -10653070 -11080858 -11237163
1740 -11237163 -11170136 -11408923 -10246231 -9580412 -9008226 -9606479 -9198018 -8971386 -10175507 -11062775
1730 -11062775 -10671166 -9756166 -10278282 -12015505 -10941922 -11969074 -12355231 -13415241 -11194285 -10389161
1720 -10389161 -10586665 -10624007 -10944627 -10655824 -8139066 -9123029 -8899743 -9085928 -8813549 -8830422 -8796121
1709 -8796121 -10182009 -9662564 -11049872 -10462138 -9750282 -10395948 -10361582 -9703299 -8981571 -10508843
1699 -10508843 -8297815 -10547001 -9325778 -11232288 -9671276 -9897908 -9696526 -9737486 -10283125 -10536515
1689 -10536515 -10427333 -10840915 -11504414 -9873700 -9341903 -9355908 -11467493 -9039886 -8027558 -10335903
1679 -10335903 -11024533 -9615391 -10834824 -11284377 -10073744 -10441368 -11120582 -10861110 -10601892 -11553091
1669 -11553091 -11673335 -10574327 -9539000 -10077760 -11692120 -11847275 -8624531 -9792091 -10847017
1660 -10847017 -10009939 -11828368 -12331131 -11291953 -9724601 -10766798 -10602285 -12033161 -10600615 -10529012
1650 -10529012 -8830680 -8298195 -7760586 -9614541 -12146193 -11309440 -11730216 -11943336 -11901004 -10478771
1640 -10478771 -9112980 -10032530 -8929761 -9726166 -9958311 -9468673 -10519965 -10407291 -10562011 -10350278
1630 -10350278 -8686492 -10323942 -8963796 -8811121 -7587935 -9226816 -9727155 -8910314 -9885317
1621 -9885317 -11122750 -9948282 -8696817 -8991994 -10615346 -9268233 -9814126 -7435074 -9624757
1612 -9624757 -10848097 -11504236 -12534131 -12430818 -12777594 -9478324 -9760899 -10750090 -10328038 -9391472
1602 -9391472 -9098352 -8167896 -8166523 -7662601 -6743831 -8746198 -11197348 -10301622 -7987604 -8183563
1592 -8183563 -9794616 -10362910 -8805298 -9105165 -10516846 -11693466 -11941001 -9810274 -10433742 -11195664
1582 -11195664 -10713377 -11446423 -12016024 -9592143 -9348378 -9992888 -9149818 -10678176 -9953073 -10321235
1572 -10321235 -10478840 -10243171 -10341922 -8656018 -8994262 -10276699 -9048174 -8601365 -8908095 -10316650
1562 -10316650 -8314676 -9479781 -9881292 -9023162 -10052860 -10498196 -6742217 -6531780 -9558987
1553 -9558987 -7089645 -8035467 -8038007 -8082279 -10013575 -10854751 -10768414 -7255225 -7322995 -8428773 -9330798
1542 -9330798 -8365992 -7670592 -9162649 -8423398 -7451114 -7560554 -7355879 -8965054 -8435024 -9421548
1532 -9421548 -7734256 -8333575 -6934869 -4966085 -6646387 -6765586 -8250792 -7429088 -7364174 -6767248
1522 -6767248 -7089490 -5440439 -5718993 -6409844 -5614344 -5941159 -4760447 -5219561 -5350710 -5733566
1512 -5733566 -5670641 -6259749 -5101677 -3338116 -1825834 -1392976 -3113132 -1868920 -2317041 203715
1502 203715 -101986 -331509 487873 551230 1493711 127142 -1179377 -1679111 -2512943 -3500401 -2575922
1491 -2575922 -765347 -312604 -2007615 -3625512 -5140248 -4040418 -2720676 -2502193 -3475088 -3542409
1481 -3542409 -4289388 -2222821 -391351 2009778 5934536 4001741 3801984 5439717 6925967
1472 6925967 8306266 6898743 7678389 7618477 4899197 1891702 1235948 -55946 -484076 310405
1462 310405 3724490 1554602 -2037244 -2282858 -3294701 -1510185 511254 400030 1509587 2298282
1452 2298282 2719119 4124497 6108914 6536682 6974204 9674983 8923168 7842698 8318018 10352284
1442 10352284 11328064 10102917 9245427 7696710 5230832 4476966 5943201 6739568 4380250 4885024
1432 4885024 3134522 3458558 3708901 3944411 3832124 4071524 4786778 6880559 8803618 9929246
1422 9929246 9677642 9957318 12845718 10862929 11828627 11612484 14303189 16468023 17194230 16241667
1412 16241667 16958915 13847001 12507682 15462261 15908522 14754268 14963013 14463040 14951768 13472653
1402 13472653 14674260 15815196 15269567 17659373 18042003 19213977 22603517 24743757 26247195
1393 26247195 26701422 28955336 27608307 28178978 30630437 34152227 33699585 34373447 30711833 30849969
1383 30849969 31405145 33102287 29740124 26619940 26867304 28054824 27010090 26980524 27427051 25621432
1373 25621432 26424951 26972498 28303629 32089801 36130829 40056663 43835327 45278288 46456833
1364 46456833 48265735 49232104 56955895 56506843 54206147 52957580 57798318 59674277 62645835
1355 62645835 63678989 57920551 52470484 50539087 54460171 57923501 57866236 58444553 53963004
1346 53963004 47772094 42662121 48108045 58520001 66202520 70844137 77455889 81015288 85247514
1337 85247514 89589110 99827436 111753837 119327167 124618740 133947986 143691216 150359863 154531211
1328 154531211 162134492 164458488 162420288 159411799 164372571 172258433 177544088 179159223 179360634
1319 179360634 177381853 174663259 178515600 185779638 195121303 206010656 214460742 227348935
1311 227348935 232427102 234178167 242291168 262588544 282156560 295844229 317317336 335130794
1303 335130794 341465522 343310474 352962413 362188945 367626316 369526929 371903365 376095941 380815013
1294 380815013 389640508 399089308 407569761 414791540 422200496 429308443 435302880 440426943 451959727
1285 451959727 480604469 502320605 507659502 524540443 530488720 519830562 515198364 554868915
1277 554868915 629771305 695453410 776313697 925019798 1050869713 1035617902 1007393315
1270 1007393315 1032010380 1089941403 1168709389 1309135517 1421488833 1305772612 1077477752
1263 1077477752 851021680 733023557 706509467 686143422 651917716 654658890 674880128
1256 674880128 659314431 648170674 648594274 620584093 581540664 574992162 650352076 753837302
1248 753837302 885051501 1118137362 1448026788 1490050753 1413747745 1395366837 1483348828
1241 1483348828 1622890208 1822079122 2147483647 2066488338 1653858050 1144209689 801705987
1234 801705987 689064623 660303716 585722625 531365650 515618331 476997271 413368763
1227 413368763 378336074 373464656 360944324 340118776 323915927 336279747 384786476 478681202
1219 478681202 624822796 730930275 716245338 691147732 705878468 760392087 848329911
1212 848329911 971489666 1039563576 888453386 645898807 429904079 316638883 280324522
1205 280324522 244696519 209116409 187766494 161679746 124871558 92324319 82373223 85941955
1197 85941955 86998231 77446322 56170349 39529760 35466811 40897868 47950240 57235413 61448656
1188 61448656 65275035 62761496 63728202 67516118 72411292 70598535 64440095 62427298 61411145
1179 61411145 53182430 44482123 37924579 35945802 32021608 28258173 24449923 19281197 18819886
1170 18819886 20178559 23006233 28390615 27999773 19627050 9314852 5837668 11461456 17600230
1161 17600230 19165497 21337050 16619031 11578409 11928312 14431883 15551278 18788372 22455401
1152 22455401 21776678 19898193 18016181 17665233 19246105 20882807 19910155 18821529 14865752
1143 14865752 13660936 16344002 18155205 21962028 21116780 15278902 10220692 8851090 9181313
1134 9181313 11710393 12156489 9276270 2408614 -2049402 -4334667 -2103660 -8073897 -6176501
1125 -6176501 -4527204 -3379159 -5073933 -4845565 -5704072 -4218287 -2628596 -1248865 -2744474
1116 -2744474 -3838988 -2261490 -723551 919860 2378662 2095367 2421752 2067282 2490244 4757544
1106 4757544 3118140 4121915 2882537 -18609 -1771445 -1830451 -4333165 -6415945 -8713535
1097 -8713535 -8311913 -9339115 -6446504 -7608237 -6313698 -5613431 -6143311 -7236309 -5269819
1088 -5269819 -2016300 -2093773 -2477438 -1316609 447650 -1143734 31957 1877626 2872871 3470037
1078 3470037 4221274 3856211 3179880 2554669 1252094 352954 -728847 -364601 -1212049 -2329511
1068 -2329511 -2511299 -2140537 -2364964 -1833915 152999 2581416 3894940 936860 3413443 3297158
1058 3297158 1206464 1217105 2478541 2951819 3108200 4015254 4447266 5928202 3657590 3490073
1048 3490073 4170856 4997053 4835803 2072593 2728647 839041 2763434 3606949 3418827 1029193
1038 1029193 3816873 2599876 2228131 1882755 3578858 5032177 5531523 6652151 8036901
1029 8036901 4894460 7197986 4515438 4596448 6120659 6351852 7097919 7009396 5975162 6308496
1019 6308496 5489411 4370219 4106519 2137833 1583548 930226 773435 3758366 4103313 6535670
1009 6535670 2611874 6057712 4461037 6704510 6095212 8667837 9515145 9796219 9123847 6687324
999 6687324 4701052 7878208 7910287 6244780 6547130 6075664 5029905 4783977 7299499 6120141
989 6120141 4761066 5778880 6487001 2945282 3054964 2848249 2410044 5831249 8766825 7077153
979 7077153 6491338 4182436 3507634 5499081 7521636 5896471 5123652 4224233 5279090 5463962
969 5463962 5137158 2022785 5776676 5149037 4143629 4301916 5209496 3000754 2792041 1991904
959 1991904 2612482 431867 2375598 962957 -200965 -1781652 -1177227 -2167656 -500695 778595
949 778595 -107463 927336 249506 -905245 -1160655 -2147521 -1199615 -629085 -570171 -2368639 -2438524
938 -2438524 -1780017 349578 -1216538 -2522588 -227282 -2064086 -2618932 -1039923 -1580590 -1094791
928 -1094791 -2513796 -2270632 -2979526 -3240696 -3737370 -2135357 -2444986 1432410 -2622173 -1370898
918 -1370898 -1506632 -1650916 -3394656 -3190081 -3017519 -4383755 -3637109 -3748456 -3567578 -3955130
908 -3955130 -3567311 -4715732 -4446535 -3143455 -2174685 -4259618 -2027009 -2572119 -1213851 -3517619
898 -3517619 -3346289 -4500134 -4043005 -3491939 -4731415 -4947772 -5332457 -5494730 -6488744 -6424908 -6501680
887 -6501680 -5776180 -7101533 -7714653 -5527463 -4222153 -5502253 -3693324 -5036000 -2660903 -3011553
877 -3011553 -4729687 -4528424 -2165647 -4884254 -5812574 -5454392 -4779663 -9462824 -1072213 -577523
867 -577523 -2783035 -4476706 -5053822 -3253953 -5426109 -5771972 -5317990 -4478329 -4103707 -5669209
857 -5669209 -5635643 -5211129 -4750881 -6733919 -5955261 -5014658 -5524916 -3540048 -4058698 -4878487 -5231853
846 -5231853 -4197282 -3898537 362148 -1228670 -3598701 -1525936 -3886256 -4744931 -4842671 -4983825
836 -4983825 -4491944 -6359374 -4985783 -5329242 -3685659 -3881661 -4820073 -4841095 -4236069 -5099124
826 -5099124 -3329323 -3236650 -5245261 -4946024 -4653934 -4901795 -3874359 -2721646 -2898341 -4606779
816 -4606779 -5748740 -6302168 -5021465 -6108855 -3835136 -6218490 -6695456 -3980950 -4217672 -4325900
806 -4325900 -4349809 -3934838 -3685012 -4118311 -4909045 -5022928 -6573665 -4491349 -4244790 -3196833
796 -3196833 -5350492 -4232793 -5126603 -4780469 -4972568 -4077363 -4526931 -4870089 -4001022 -4644268
786 -4644268 -5616102 -5251146 -4823155 -5517346 -4638765 -3511933 -6775475 -6576492 -6096022 -5132953
776 -5132953 -5327136 -6475573 -4571134 -5221201 -7447364 -5139962 -5600516 -5849517 -7425041 -7406518
766 -7406518 -6052928 -4833574 -5552052 -6589971 -5650983 -4843077 -5441061 -1995156 -5089859 -5864918
756 -5864918 -6154968 -4929420 -4308904 -6638591 -5049857 -4541486 -4378412 -2743187 -3065315 -6683658
746 -6683658 -4401096 -6491562 -4791708 -4247053 -5251445 -4604580 -6887132 -5301362 -6471394
737 -6471394 -4666790 -6129305 -5582854 -5806437 -5656115 -7217801 -5353925 -6688840 -4499925 -6017374
727 -6017374 -7738055 -10558293 -8656004 -5459413 -4890725 -5882372 -6782013 -6057376 -6456813 -7181687
717 -7181687 -6532489 -5586991 -4872571 -5998405 -8329013 -5723445 -6636563 -5590932 -4772130 -8193341
707 -8193341 -7446550 -6623361 -5677855 -5602176 -5508835 -4811124 -8066642 -8317737 -8593681 -6143559 -5397443
696 -5397443 -4967965 -6578565 -8626359 -8563647 -7294903 -6901128 -6328619 -4895338 -6707044 -6116934
686 -6116934 -3683542 -6369114 -5247561 -5388456 -6812914 -5536405 -6853935 -5775858 -5721693 -6155304
676 -6155304 -7300531 -6022282 -4782564 -6833290 -6068649 -5993536 -5556285 -7919430 -8516692 -6978499
666 -6978499 -6164346 -6479338 -6474013 -7999287 -7614110 -7581510 -6731007 -6119190 -7246396 -6696754 -6856678
655 -6856678 -7573603 -6443902 -6041488 -6142457 -6304223 -6103765 -6976940 -7615774 -6016960 -5696221
645 -5696221 -5205410 -6442948 -6270244 -7140544 -5169213 -6459680 -4818940 -6251439 -6420812 -7357982
635 -7357982 -6037334 -6948563 -7019692 -6962800 -6068270 -6250606 -6483815 -6885150 -6229228 -5547586 -5513247
624 -5513247 -7265065 -4110054 -4207717 -6724263 -6533266 -5879904 -5212607 -7245348 -8849033 -6990093
614 -6990093 -7527602 -8839313 -5933567 -7388996 -7292363 -9052667 -6918410 -7698847 -7949936 -6677904
604 -6677904 -6745367 -5722683 -6870727 -7635972 -6169203 -6261968 -6957714 -5520041 -5789429 -7159161
594 -7159161 -6267856 -5936305 -6530947 -5309701 -6665780 -6009018 -6876483 -5546285 -8092906 -8319600
584 -8319600 -7452082 -7878410 -8926993 -7736038 -7199395 -7316278 -6624785 -8470493 -8929052 -8056170
574 -8056170 -6456203 -7915270 -7684659 -6648906 -8518688 -8434938 -9138194 -5581219 -6212930 -6070122
564 -6070122 -5946297 -7019354 -7314148 -5935426 -5451313 -6501441 -6917091 -11462959 -5769392 -5148972
554 -5148972 -4833180 -5943419 -6461766 -6214326 -6221477 -6531007 -5231424 -6502402 -6120767 -9336710
544 -9336710 -6147401 -7923218 -8370523 -9339345 -8395439 -7180337 -7202808 -6407761 -8962447 -7904542
534 -7904542 -8557232 -7513948 -7699939 -7019593 -5807109 -6182167 -4565144 -6363452 -5883275 -6767241
524 -6767241 -6115662 -6158343 -5651030 -5376117 -7638043 -9501811 -7435238 -5355455 -7066262 -6543441
514 -6543441 -6528588 -7467114 -7568158 -7126322 -5140306 -7443790 -8048188 -8952092 -8453525 -5054466
504 -5054466 -6440517 -6883206 -4867977 -5537729 -7681077 -5699763 -5495289 -5879058 -6995621 -7117619
494 -7117619 -6736161 -7729200 -6702582 -7258463 -6771265 -7814324 -5713305 -5385517 -7615121 -5718643
484 -5718643 -5527591 -5712491 -4495837 -5878403 -7854055 -7753093 -7883143 -6924556 -7161460 -6167349
474 -6167349 -5659686 -6208041 -6547185 -8197020 -7809460 -7661616 -5716889 -8303183 -8171198 -6987466
464 -6987466 -6492775 -6332115 -7971618 -8110513 -6189031 -7024638 -6573746 -8478461 -8363157 -8377942
454 -8377942 -8951619 -6803065 -6692595 -6766731 -6056508 -5668022 -5974574 -6112021 -6805992 -6016455 -7895078
443 -7895078 -6976303 -7695884 -9550078 -8115980 -8514376 -5978590 -7591374 -5991600 -6698514 -6943199
433 -6943199 -7933007 -7326453 -8261012 -6704161 -7221165 -7532463 -3643429 -9997709 -7683653 -7838711
423 -7838711 -8306286 -8277830 -8084718 -7451248 -7688582 -6293729 -6779604 -7714382 -6806324 -6332640 -5759813
412 -5759813 -5856383 -11644591 -8333511 -8044068 -7303166 -6662798 -8729473 -8499384 -8781803 -7808302
402 -7808302 -8939611 -9133765 -8705357 -7182318 -7961357 -7788287 -6411493 -5719392 -6609476 -7097299
392 -7097299 -8746575 -8233585 -7381036 -8337236 -9162325 -7486355 -6811919 -7581747 -7623349 -5977394
382 -5977394 -7224019 -5609884 -7038178 -7061247 -7649963 -6630338 -6700503 -7772962 -6256416 -6597774
372 -6597774 -6547420 -7494787 -5948258 -5962892 -6121928 -7205828 -7767602 -8096121 -7498934 -7160076 -7133052
361 -7133052 -7040123 -6044785 -8131100 -8017315 -7407789 -7450523 -7890135 -6973461 -8745262 -7981588 -8790384
350 -8790384 -10342522 -8757011 -8540580 -8786396 -7589135 -6694758 -5257863 -4959670 -5509918 -7035870
340 -7035870 -6980261 -8495883 -8319177 -8520811 -6914138 -7168926 -7543567 -8310605 -6384822 -7642602
330 -7642602 -7753676 -6522756 -7602710 -8958774 -6136040 -7045654 -7385310 -7325735 -4855497 -8707786
320 -8707786 -7233412 -7221391 -12095929 -7806607 -7590399 -9192075 -7874630 -7207334 -7418789 -7581979
310 -7581979 -7092284 -7081033 -7171442 -8430901 -8807660 -7386767 -7834291 -5908960 -6910383 -7209863 -7179933
299 -7179933 -4922489 -9082765 -9013072 -8419781 -7528793 -7095704 -8296202 -9502513 -7576686 -7241582
289 -7241582 -7716152 -9017398 -7298069 -6569399 -8730444 -8159016 -7603530 -4811654 -7035980 -7231384
279 -7231384 -7465591 -7300407 -6610797 -7366891 -8226334 -9892221 -7926321 -7746880 -8983811 -8281510
269 -8281510 -8321548 -8428385 -7089652 -7278509 -7941466 -7881758 -8134780 -7334046 -7237484 -7509626 -7480080
258 -7480080 -8841122 -8613477 -9051015 -7527718 -8485804 -8923250 -9070825 -9840006 -9990281 -6942718
248 -6942718 -8283775 -6465315 -6433107 -6159680 -9383342 -8931433 -8457003 -8060187 -7444230 -7739927
238 -7739927 -7928744 -7286442 -6888225 -7055723 -8175538 -7007330 -7741947 -6760364 -6894421 -7258919
228 -7258919 -6938857 -5901392 -5181606 -5837694 -7689735 -7818013 -8926230 -7527437 -8032716 -7223749
218 -7223749 -8154982 -5998911 -7929683 -7934717 -6836981 -7556820 -7650409 -8356278 -8919562 -9687243 -8318540
207 -8318540 -8441112 -8900339 -8618607 -9076359 -9561854 -6942283 -8214547 -10548944 -6758447 -4809384
197 -4809384 -5601146 -6502302 -8691625 -5851595 -7025430 -8067509 -9212243 -9069305 -9138488 -8014201
187 -8014201 -7932860 -7727898 -7818635 -9259898 -8893797 -7132934 -7217980 -11078377 -5588684 -6715682
177 -6715682 -7143497 -7831102 -6621867 -6899350 -5166931 -9317248 -8790486 -8167050 -8003641 -5881674
167 -5881674 -7352469 -7125561 -9150622 -8409298 -8051353 -8233243 -8122143 -8446861 -6883444 -7333723
157 -7333723 -6224367 -7963484 -8903971 -8021777 -6733761 -6841096 -6620184 -7429136 -8390348 -8763590
147 -8763590 -8562219 -9473157 -8326423 -8178851 -7542650 -7650896 -4862252 -6718351 -8212513 -7903341
137 -7903341 -7555363 -7905112 -7729575 -8495023 -6154935 -8334164 -8662128 -6474162 -7610173 -9854634
127 -9854634 -9447268 -8183244 -7773401 -5746048 -8919671 -6588383 -7677375 -7634010 -6817612 -6325732
117 -6325732 -6129766 -8114488 -7644509 -9050387 -6716970 -8917149 -8576620 -8056166 -7986603 -10496993
107 -10496993 -7666500 -8073680 -8006886 -6904358 -7276729 -8564541 -8100334 -8017574 -7533299 -5925599
97 -5925599 -6870661 -6446280 -8347306 -7139914 -7799233 -8938100 -9039708 -9688357 -6260852 -6646233
87 -6646233 -5914771 -7892888 -9253571 -10716959 -9025555 -8232329 -10543796 -9227514 -9067841 -9637885
77 -9637885 -9319932 -8813655 -9534352 -7894287 -10989571 -11641039 -9073606 -9447108 -8766599 -8686312 -9063909
66 -9063909 -9257424 -8841632 -8180778 -8481866 -8734115 -9166337 -9033406 -7986141 -8391097 -9435376
56 -9435376 -7918343 -10535825 -8924123 -8952206 -9210581 -6052543 -7167720 -8843706 -8814065 -8416049
46 -8416049 -8563797 -6940460 -6758707 -8584917 -7370476 -7691055 -7941567 -8043106 -7723565 -7001092
36 -7001092 -7914187 -9595118 -7748670 -9178352 -6468442 -8591056 -9316876 -8799992 -9013497 -9425508
26 -9425508 -8075369 -7083362 -7148898 -7344300 -6767585 -11197205 -10088955 -8924205 -8589383 -7647712
16 -7647712 -8321362 -8645765 -6655939 -7329312 -7368885 -7887121 -7984095 -8733201 -6891552 -7893192 -7428992
5 -7428992 -7789142 -8925280 -7639326 -6703803 -7218359 -8997777 -8869217 -7416878 -7844581 -8455439
-5 -8455439 -10870354 -9188089 -6963601 -7328250 -7835393 -7022095 -6640195 -7068435 -5661476 -7902880
-15 -7902880 -9416636 -9164399 -7235031 -9375151 -8772130 -7749246 -9649706 -8154881 -9152952 -8561037
-25 -8561037 -8946741 -7561422 -7747735 -8042650 -9101631 -8416780 -9824332 -7898241 -6890703 -8630901
-35 -8630901 -7639842 -10806724 -9731224 -8159294 -7791317 -8619245 -9935578 -9166257 -8833874 -8510705
-45 -8510705 -8208284 -7895756 -8210525 -7824692 -7013469 -7351859 -8093126 -7845617 -7850475 -9998013 -8752012
-56 -8752012 -9532846 -8183155 -8849083 -8166406 -7886237 -8474708 -9499921 -8686420 -9254950 -9094233
-66 -9094233 -8964729 -10177898 -8934958 -8596039 -8350758 -8025803 -8742697 -8272303 -7397409 -7149508
-76 -7149508 -8802582 -7429984 -6507261 -8283568 -8582716 -9603420 -9314936 -8226348 -8474574 -9598721
-86 -9598721 -8199888 -8962498 -9059540 -6874481 -8600915 -10374538 -8356805 -6915215 -8739575 -7219377
-96 -7219377 -6768051 -6546452 -8669849 -7321044 -5919880 -9493796 -8601979 -8914819 -9498527 -9094588
-106 -9094588 -10296423 -9626609 -8430236 -7984750 -7431594 -7759764 -8173655 -8361367 -7086670 -6564489
-116 -6564489 -6919308 -7728658 -8382476 -8366549 -8815665 -6708922 -8374302 -8309420 -7650858 -7549481
-126 -7549481 -9872489 -3850256 -7464780 -8518575 -9016987 -7382298 -7803110 -8380629 -8150266 -8211077
-136 -8211077 -8553170 -9104909 -9938390 -8469096 -10639332 -6883288 -9578398 -9333442 -9684113 -9915536
-146 -9915536 -6709946 -8282261 -9072539 -9433779 -8710776 -8965950 -9062453 -9194040 -9801916 -9088782
-156 -9088782 -8498139 -9165452 -9010550 -8741867 -10606470 -8078061 -7794121 -9377329 -9741701 -8522778
-166 -8522778 -7973636 -7784009 -8068467 -7749717 -6434326 -8682155 -7354285 -8789069 -9439190 -9706438
-176 -9706438 -11645485 -5692053 -5703367 -7872141 -7962586 -7005781 -7941353 -6831391 -2457729 -8154748
-186 -8154748 -9406122 -9056525 -9650842 -8972200 -8837845 -9859798 -7987373 -7377574 -8994658 -8740290
-196 -8740290 -8188119 -8277226 -7032995 -7983629 -9551469 -8943697 -8987020 -8179947 -9816386 -10473150
-206 -10473150 -8572874 -10144950 -8963547 -6920357 -8204876 -7875310 -10660924 -10734310 -9716742
-215 -9716742 -7331454 -9008212 -8745386 -10516033 -9637152 -8900065 -6843490 -6066513 -6175069 -7753670
-225 -7753670 -7161153 -5894385 -12711901 -8721748 -9290181 -6733688 -7325118 -9783547 -7762254
-234 -7762254 -9778550 -11009607 -10031738 -9570358 -9317786 -9270856 -9743936 -10079607 -9082628 -9373527
-244 -9373527 -8265360 -12425400 -8922831 -8622821 -7593301 -6604764 -8990622 -9508667 -8359908 -9264682
-254 -9264682 -9361012 -9666795 -10939338 -9537018 -8984077 -8841191 -9279254 -8692116 -9409829 -10089385
-264 -10089385 -9771371 -8253709 -8836502 -7824215 -9395244 -9413466 -9113425 -9744938 -6983184 -7992108
-274 -7992108 -8621008 -8836549 -7716211 -9055599 -8978568 -9287325 -8073470 -8443306 -8769337 -7659672
-284 -7659672 -8004046 -9754278 -8833445 -8718515 -8397453 -7657344 -7892465 -10447765 -8487624 -9241919
-294 -9241919 -7922318 -9047897 -10230951 -10197263 -9861129 -7931559 -6876092 -8293369 -9109636 -9074336
-304 -9074336 -8820021 -7987071 -7976228 -8031270 -9731786 -9574567 -8837995 -9725229 -8846074 -9147454 -10110435
-315 -10110435 -10759987 -8456337 -10656688 -7847464 -8505817 -8196920 -6526610 -7200488 -7541836 -9570629
-325 -9570629 -7890747 -8462225 -9024305 -9367238 -11217691 -12044040 -9355552 -8097714 -10652474 -8712643
-335 -8712643 -9104582 -8709420 -10310318 -8125376 -8824042 -5224349 -10200305 -10513133 -11318214 -10868213
-345 -10868213 -9077927 -10076260 -9757090 -9144178 -11348187 -8829507 -9898500 -10986948 -9357537
-354 -9357537 -9123694 -9764417 -7589616 -9112969 -9438813 -7487547 -6941345 -6905231 -7537335 -9640982
-364 -9640982 -7807773 -8325402 -7669002 -8533278 -7822070 -8305399 -8023952 -8772253 -9358625 -8412964
-374 -8412964 -9729593 -9338352 -9635319 -8942952 -9734777 -8229990 -6924030 -8270175 -6162229 -8879164
-384 -8879164 -10043517 -8712531 -8130215 -9619254 -7896936 -8743076 -8508948 -6941552 -7488573 -7546604
-394 -7546604 -7910042 -7477160 -9788496 -9935790 -11141955 -9209727 -7475167 -8184246 -10719905 -8934616
-404 -8934616 -10166438 -9595857 -10271363 -7609959 -8760360 -9043775 -9557869 -7903319 -8165223 -8517156
-414 -8517156 -7697034 -6880181 -8704766 -10856668 -9423256 -8288685 -8694372 -8251946 -6755889 -9445645
-424 -9445645 -10024665 -9203175 -7734327 -5939397 -5687123 -7715539 -8565068 -7701200 -8728814 -10210296
-434 -10210296 -9718581 -9059848 -7456751 -6754638 -8112562 -7517247 -4436363 -7885212 -10006422
-443 -10006422 -9000512 -8510110 -7660672 -7180414 -8209094 -9667193 -9616938 -8674825 -7897413 -8760996
-453 -8760996 -8576154 -8036274 -9986257 -9686406 -7875641 -10136539 -8725709 -8105219 -9214340 -9206087
-463 -9206087 -8623342 -7508079 -7597143 -8944394 -7480254 -9101240 -9392838 -8761336 -8797606 -8599920
-473 -8599920 -7299787 -8337901 -7126672 -9636406 -6919907 -8344485 -8025056 -7558560 -9834832
-482 -9834832 -9194933 -8868172 -6924539 -8363147 -8926899 -11132341 -9021351 -9026267 -8785756 -8354574
-492 -8354574 -9124419 -8609095 -10445160 -9770725 -9406108 -9198438 -7055529 -9159401 -6655269 -7101095
-502 -7101095 -7304050 -7358367 -7401175 -8312671 -8498704 -9008582 -8535593 -6463136 -6067966 -6188745 -7335799
-513 -7335799 -8729130 -9262867 -10090775 -9209939 -9849873 -9769095 -9421282 -9878031 -8628486 -10173759
-523 -10173759 -8480254 -9037179 -9715804 -9771836 -8940602 -8206089 -7691385 -7474456 -9154720 -10502717
-533 -10502717 -9527567 -10419313 -8819870 -9805002 -9409803 -8608251 -8254680 -8069989 -9253724 -8842827
-543 -8842827 -10206660 -8838676 -7842233 -9218133 -8266510 -9354244 -8611113 -8368598 -9605995 -9643025
-553 -9643025 -9766501 -9504434 -8843886 -7115532 -9271046 -10109525 -8235527 -7086576 -8081168 -8894386
-563 -8894386 -7867131 -6295247 -9442874 -9213865 -8778974 -10438684 -9092837 -8308240 -7901596 -9186100
-573 -9186100 -10024494 -9953741 -10605629 -10169737 -9796011 -9975981 -9033673 -9724890 -9918496 -10030495 -9666123
-584 -9666123 -9267306 -9331291 -10472601 -10529857 -9548654 -7862636 -8542365 -7913037 -9296600 -9265474 -9078677
-595 -9078677 -9544837 -8257654 -6796199 -7512547 -6378953 -8685194 -9916588 -8969410 -6673590
-604 -6673590 -9105601 -8546871 -9789044 -9525366 -9077652 -9933052 -9552470 -9220560 -8527571 -5924232
-614 -5924232 -10985969 -8355473 -7759823 -8343239 -7976802 -8099120 -7115950 -3674678 -11376633 -10035081
-624 -10035081 -10002764 -10232060 -9569422 -9593027 -9942517 -7277159 -9628189 -9141593 -8100429 -8676035
-634 -8676035 -8375281 -8107503 -6357620 -9210913 -11793746 -10006494 -7072340 -9027088 -8548649 -9205188
-644 -9205188 -9611693 -9632293 -9174382 -8699332 -8735777 -8818418 -8271473 -8943753 -11010856 -9313147 -7855739
-655 -7855739 -10011287 -9345848 -8698795 -9456612 -7649639 -8816186 -9448636 -9718378 -9290540 -7604269
-665 -7604269 -8412018 -6700789 -7934570 -11229864 -10174411 -9434912 -9574092 -8495604 -7555501 -9678480
-675 -9678480 -8795442 -6343955 -9114002 -9245543 -8779723 -7900429 -9199809 -7779878 -11311089 -16420978
-685 -16420978 -8319540 -8104907 -9533984 -9982690 -10443800 -10819639 -10101352 -8584519 -9738931 -8233564
-695 -8233564 -7242164 -9250347 -8055879 -9329703 -8752946 -9247354 -7196684 -9026214 -10685213 -11405446
-705 -11405446 -11171341 -10603493 -9019814 -9422357 -10361925 -8459260 -9578421 -9456653 -8007862 -10331085
-715 -10331085 -7936177 -8610838 -7591763 -7793072 -9120957 -9160887 -11205175 -9992724 -9754005 -9208938
-725 -9208938 -8704976 -9164284 -10552510 -10559663 -10464729 -11345434 -9609760 -8958653 -6994108 -9584364
-735 -9584364 -9822138 -9279929 -10047498 -8052201 -9581185 -10314655 -8798146 -8390057 -8284599 -9424360
-745 -9424360 -9037920 -9616712 -9580959 -10030979 -11063193 -9538637 -8458985 -10755077 -9034063 -8325382
-755 -8325382 -10526470 -8065647 -8904509 -7779627 -8911809 -10473949 -9077274 -9940152 -9903040 -7630559
-765 -7630559 -8928582 -9569048 -9070617 -9665258 -10546837 -9153017 -10240046 -9842291 -10441334 -9876645
-775 -9876645 -9836550 -10528696 -8767221 -9605235 -10958103 -9848897 -10939132 -8493268 -6858670 -6670670
-785 -6670670 -8037501 -9715953 -9049494 -8239654 -9237943 -9116547 -9984704 -8924730 -7237310 -7993533
-795 -7993533 -8884809 -8718426 -8006051 -8355684 -7398647 -8064658 -8745685 -8059605 -7530139 -6631040
-805 -6631040 -8532374 -9352492 -8435601 -9095502 -9088837 -9750286 -9385877 -9000943 -8603957 -10222011
-815 -10222011 -8850789 -8898280 -9291486 -8619734 -7903985 -8614446 -7015997 -8497114 -8830211 -8644014
-825 -8644014 -8638617 -10117221 -10146765 -8185158 -9822986 -9164355 -8586719 -8664133 -9948526 -9897998 -7596472
-836 -7596472 -8469467 -9553739 -10612225 -9008004 -11620638 -7803792 -9152834 -10059108 -7571191
-845 -7571191 -8048709 -9166061 -8183505 -8384496 -10000341 -8980772 -9153194 -9618894 -9827711 -10337201
-855 -10337201 -9630567 -10249117 -8898173 -9659781 -9716711 -8349835 -8534791 -10840421 -11299293 -10243262
-865 -10243262 -11374857 -9626756 -10383658 -9551519 -9372193 -9852918 -9274426 -9297108 -10218127 -10727387
-875 -10727387 -10095927 -8041520 -9997115 -10561642 -9620655 -7073022 -8506399 -10082739 -8151430
-884 -8151430 -9821548 -8947940 -8871007 -8586914 -9327293 -10569273 -9101719 -8317181 -8139001 -7811456
-894 -7811456 -8694747 -6084657 -7447012 -8284667 -9033945 -9048547 -11988069 -9019285 -6889961 -8829315
-904 -8829315 -8646282 -8281508 -8930374 -7529390 -8240369 -7837880 -8723038 -7891478 -9705442 -9731791
-914 -9731791 -8351337 -8401916 -9704035 -8586670 -8099817 -9430924 -8545291 -9569048 -9366358 -11416888
-924 -11416888 -10110778 -8897701 -9285165 -9404291 -8061067 -9417550 -8607664 -10098589 -10312107 -9754436
-934 -9754436 -10830701 -9818821 -8732258 -7914653 -9528551 -8758266 -7836097 -8033619 -10530190 -9025025
-944 -9025025 -9297875 -10347212 -9235224 -8172637 -8981677 -9668626 -10598373 -9185514 -8590422 -9791187
-954 -9791187 -9269995 -7498133 -9402421 -7364658 -6838359 -9541325 -8173594 -8521920 -8410086 -8556374
-964 -8556374 -9706671 -7033487 -8234945 -9477379 -6993353 -7533741 -9298563 -9229145 -9697923 -9338180
-974 -9338180 -7508347 -7792216 -9288381 -8305434 -9035817 -8470979 -7896231 -8494639 -10042060 -9094634
-984 -9094634 -9029687 -8815680 -7897367 -8503767 -8901233 -8383594 -9029336 -11192618 -9481320 -9473035 -8812293
-995 -8812293 -8649542 -7899651 -7415629 -8188561 -8768180 -8571815 -8488521 -9474758 -7761825 -7809559 -10235190
-1006 -10235190 -8546763 -7191604 -8784925 -9860174 -11447473 -10258855 -10950439 -8816112 -8445068
-1015 -8445068 -7400746 -8319687 -5126454 -9096769 -9493669 -9959057 -8991301 -10003421 -9528296 -9809547
-1025 -9809547 -9895729 -9680265 -9767878 -8788094 -8545342 -7840663 -8732486 -7833528 -8369280 -7494861 -9945901
-1036 -9945901 -8889756 -9252010 -9155700 -9113454 -9781779 -11456067 -10121038 -8938269 -10375098 -11398006
-1046 -11398006 -9661969 -10207374 -9519404 -8256963 -9884854 -11347787 -10703859 -11617101 -10006899
-1055 -10006899 -8310260 -9526458 -7748666 -7473120 -11199839 -11826932 -10217744 -10447990 -11352069
-1064 -11352069 -10643869 -9029373 -9760790 -9556697 -10750405 -11482581 -10512552 -9700760 -8995938 -9981789
-1074 -9981789 -10727839 -9456919 -8707498 -9167945 -7678907 -8047561 -8240647 -7427601 -9882046 -9886986
-1084 -9886986 -8530372 -9690576 -11103775 -8752935 -9276234 -12365677 -7536434 -9248758 -8995096
-1093 -8995096 -10438467 -10781911 -11105479 -9921541 -9973746 -9548437 -10584676 -9642541 -10462708 -10399921
-1103 -10399921 -10020491 -8345543 -8707642 -7579999 -9163453 -6446279 -9602653 -9678652 -9068604
-1112 -9068604 -11211166 -10746599 -10926327 -10925163 -9997323 -9645713 -9155700 -10237664 -10552548 -10011864
-1122 -10011864 -8462435 -7678672 -9608459 -9834425 -9695849 -8869371 -9564445 -8923662 -9401908 -6312446
-1132 -6312446 -8382372 -7999468 -9020150 -10428631 -8426384 -7840588 -9410124 -9387154 -10100988 -11559022
-1142 -11559022 -8732751 -8637796 -8094557 -9567124 -9459491 -9388745 -10198401 -10137941 -10503253 -10570910
-1152 -10570910 -9485878 -7388336 -8666296 -11174785 -9720670 -10236408 -9530121 -8545667 -10175053
-1161 -10175053 -9806684 -9377676 -8436866 -9038759 -9530010 -10010320 -8769002 -10458037 -8222568 -8135521
-1171 -8135521 -8170542 -9781007 -10374416 -8762306 -8653759 -10533593 -8952224 -10079938 -10460223 -8617890
-1181 -8617890 -9880967 -13304376 -11622866 -10465208 -9012411 -9634818 -9992063 -11216805 -10481467
-1190 -10481467 -10743789 -9930027 -10188820 -10809040 -10661947 -10071995 -8218206 -9253118 -9012018 -10267210
-1200 -10267210 -8115932 -9059026 -9349983 -11399938 -9814602 -9432602 -9879496 -9495964 -9833035 -10447223
-1210 -10447223 -8990075 -8982895 -9256590 -9473054 -9061902 -9370663 -8659858 -8728836 -7695628 -9157469
-1220 -9157469 -8699731 -9582475 -9657522 -7640054 -7604960 -9418580 -8811148 -9845909 -9480367 -9129237
-1230 -9129237 -8765312 -7775161 -10892969 -9557159 -9606830 -9892181 -9415572 -8063069 -9274539 -8145606
-1240 -8145606 -8720570 -9913582 -10903834 -10328661 -10994797 -9220602 -9540225 -8145155 -8271604 -10605672
-1250 -10605672 -9687728 -8652935 -11142804 -7318560 -8996052 -11049039 -9380536 -9227503 -9965201
-1259 -9965201 -10235126 -8749411 -10553822 -10098334 -8717960 -9865064 -9653358 -10083481 -9678375 -10999137
-1269 -10999137 -10423146 -8930454 -9430494 -9083117 -9681398 -10215524 -9130983 -10581185 -13017479
-1278 -13017479 -10411444 -9522870 -9696587 -8990256 -9202861 -9790260 -9155357 -9925904 -9928770 -9395978
-1288 -9395978 -10474182 -9992524 -9953179 -8424208 -8238404 -8476037 -8652457 -8306548 -9673298 -9099570
-1298 -9099570 -8879026 -9465285 -9979643 -10747096 -8489206 -8373757 -8455003 -11414754 -9721306 -9369320
-1308 -9369320 -9117590 -9825618 -10082175 -9894080 -10925470 -9115109 -7980487 -9017218 -9152006 -7921692
-1318 -7921692 -7569976 -7880953 -8516033 -9712897 -7166413 -9157383 -7538909 -9674688 -11310274
-1327 -11310274 -10016972 -8339685 -10135715 -9208153 -8143948 -8878356 -8835116 -8382409 -10438050 -9659584
-1337 -9659584 -9233524 -9740539 -8887830 -11823769 -10863900 -8245897 -9067548 -8863080 -10406034 -10417077
-1347 -10417077 -9832241 -9578940 -8529333 -11022423 -9431617 -10030836 -9497814 -8922260 -8934629 -9675367
-1357 -9675367 -9306583 -10324868 -9933884 -8767306 -8174120 -8532406 -5947598 -7633559 -7944094 -9172468
-1367 -9172468 -7238343 -7852245 -10019135 -10286538 -11095361 -8763135 -8410441 -10401710 -9181674 -9450611
-1377 -9450611 -10289970 -12281506 -11724995 -10455715 -9764666 -10722740 -11548393 -9931918 -10231035 -11165661
-1387 -11165661 -8613115 -9450610 -11082511 -10050429 -10058943 -9277784 -9954349 -8139631 -9074783 -9270985
-1397 -9270985 -11348290 -10382298 -9436160 -8742500 -9793779 -9601875 -10453937 -9107495 -9169154 -9502614
-1407 -9502614 -7474742 -7052952 -2903658 -8327500 -10282424 -10218977 -9155168 -8423862 -9798175
-1416 -9798175 -13911478 -10471466 -10731510 -9882456 -10430261 -11127376 -8743195 -9966882 -10868975 -9715995
-1426 -9715995 -8612535 -8291973 -8600095 -9248466 -8793057 -7795863 -8184867 -7696438 -7351857 -5793795
-1436 -5793795 -11177123 -12026958 -11109553 -11593357 -9372522 -10960360 -10478819 -8865255 -7788656
-1445 -7788656 -9288591 -8879810 -8430049 -8752167 -7955846 -9226831 -10626896 -10937751 -9012115 -11627117
-1455 -11627117 -12017272 -11049537 -9411695 -8996842 -7544078 -7853110 -10860691 -7258051 -6796305
-1464 -6796305 -9393718 -7659666 -8896641 -9611747 -7902832 -8155132 -6042634 -13079039 -11388680
-1473 -11388680 -10171016 -9311740 -8965322 -9638085 -9543296 -9529064 -10225790 -11087171 -11630258 -10703409
-1483 -10703409 -10110099 -12753369 -7198011 -9001190 -10077984 -9061183 -9713469 -9802295 -9680177 -10045681
-1493 -10045681 -11164546 -10026162 -11290567 -10447610 -9789873 -8749432 -8873203 -8325652 -8110857 -8115031
-1503 -8115031 -8055358 -7842404 -8570685 -9180232 -9545281 -10187698 -10971217 -9939184 -8066967 -9831807
-1513 -9831807 -11265358 -9856544 -8973424 -8924432 -9357153 -10886779 -10861968 -8601974 -9160348 -9765035
-1523 -9765035 -10000648 -10760968 -10972925 -8749209 -9427526 -9720597 -8755854 -11880973 -9059357 -9577495
-1533 -9577495 -11382845 -10489903 -7958154 -9358332 -8449797 -8920855 -7749906 -8176778 -9794609 -9733843
-1543 -9733843 -9703775 -9436267 -8267063 -8386076 -8487081 -9728521 -10177480 -9256233 -9988320 -8045512
-1553 -8045512 -6012671 -10222303 -9422013 -10304719 -10136041 -11189444 -9648495 -9093670 -9413194 -9676149
-1563 -9676149 -8955794 -8286592 -7747457 -9194409 -10282147 -8826063 -9762790 -9620808 -8975846 -10369869
-1573 -10369869 -11645587 -9014337 -7300502 -8837675 -10348061 -10432135 -10176798 -9516214 -10720797
-1582 -10720797 -9767027 -10139930 -9627727 -7887925 -8536123 -8572207 -9940582 -10395328 -8871995 -9419794
-1592 -9419794 -10897716 -12140100 -11406240 -10200019 -11572389 -10421439 -9649205 -10645701 -10413609 -9738640
-1602 -9738640 -8285286 -11189350 -12841026 -10384036 -9849694 -9169441 -7109503 -8604189 -9094892
-1611 -9094892 -10082656 -10631848 -9470430 -10092840 -10424722 -10925769 -10471380 -8936064 -11819434 -11172664
-1621 -11172664 -10727556 -10908873 -9485647 -10954414 -9081502 -8705950 -9410381 -8502180 -10554913
-1630 -10554913 -8788917 -8471063 -10066669 -9374368 -9521182 -10563742 -10921475 -10814703 -10508156 -9766791
-1640 -9766791 -9460587 -10724171 -10334702 -9590043 -7604941 -10146763 -12001019 -10119112 -7768002
-1649 -7768002 -8397780 -6961571 -8447862 -8602278 -9714245 -9293135 -11534207 -11580555 -11173475 -10001937
-1659 -10001937 -10409024 -11688786 -10837827 -10838192 -11392100 -8515933 -10397434 -9119249 -6843963 -7402105
-1669 -7402105 -8650113 -7889073 -8735591 -9275708 -10204778 -9139732 -8760286 -10179253 -10722441 -9528000
-1679 -9528000 -7656846 -11523219 -5978056 -8872311 -10662645 -10539606 -9627507 -10331105 -9181742
-1688 -9181742 -10505390 -8568469 -7077448 -8954953 -9162513 -8876685 -8862417 -7067704 -10301539 -10213136
-1698 -10213136 -10115677 -9852456 -8926004 -10195049 -9540614 -10503875 -10611526 -9002529 -10196351 -9183415
-1708 -9183415 -8980727 -9273332 -10086793 -9368914 -10703584 -10994996 -8851697 -9647164 -11523264 -11227405
-1718 -11227405 -10650374 -11112603 -8979021 -8669621 -8038681 -8827481 -10415493 -10717227 -9336077 -10589853
-1728 -10589853 -9529473 -11403789 -10420398 -9722968 -9794788 -8684645 -8887448 -9841844 -8246614 -9486939
-1738 -9486939 -8584369 -9998675 -10047554 -9995264 -9454394 -10191089 -9077975 -8564521 -10760737 -10164839
-1748 -10164839 -11706915 -12007483 -9145998 -10194455 -10111790 -12268279 -13355567 -10481772 -10730910
-1757 -10730910 -9389477 -10648124 -9727543 -12009946 -10031160 -8746694 -7619265 -9408312 -10824597
-1766 -10824597 -11638379 -10323574 -9310508 -10710222 -9029193 -10675483 -9323457 -8965902 -9461233
-1775 -9461233 -8300739 -8596458 -10240378 -10124101 -9638003 -8505263 -9808627 -9162726 -9678710 -9000366
-1785 -9000366 -10248853 -10762494 -9520009 -10415249 -10432697 -10523157 -11491762 -11608669 -9829406 -10114307
-1795 -10114307 -9072446 -9000809 -9818784 -12162186 -11592257 -11959209 -10005560 -8314699 -8821507 -9059691
-1805 -9059691 -10054692 -8732304 -9326748 -9427717 -11738387 -10215395 -10124090 -11266342 -10002883 -8264007
-1815 -8264007 -9047217 -8410094 -7712966 -9522927 -9628306 -9917105 -11633589 -9556291 -9828797 -10431259
-1825 -10431259 -8239820 -9524763 -11310069 -11194691 -12885885 -10216157 -7500405 -9415628 -10196420
-1834 -10196420 -9614654 -9717145 -11213483 -11234062 -10147350 -10374296 -10688094 -10016520 -9231578 -10608039
-1844 -10608039 -10351900 -10199666 -9520472 -8704957 -8099834 -8985614 -10010844 -10762222 -11664111 -11058583
-1854 -11058583 -7182509 -7681696 -10215666 -10077654 -8979740 -7075272 -8762308 -8698148 -9537387 -10397892
-1864 -10397892 -9328484 -9202304 -10372447 -7891511 -8936709 -10094096 -11248486 -8585636 -8395106
-1873 -8395106 -7635314 -8285871 -8063327 -8247697 -10085977 -11098215 -8856421 -7574707 -9117307 -9609976
-1883 -9609976 -11322086 -11594056 -8609430 -10650539 -9559541 -9202338 -7597982 -11844470 -11339883
-1892 -11339883 -9810933 -9632800 -10105256 -10707010 -9563254 -9878435 -8756331 -8262196 -7222190
-1901 -7222190 -9456234 -8881755 -7324538 -11369167 -9300163 -10500094 -8615860 -8691816 -10583010
-1910 -10583010 -11191771 -11232797 -12251554 -10310456 -9365962 -9805466 -10804164 -8895389 -8195127 -8905490
-1920 -8905490 -10156344 -10574939 -7610160 -6514844 -14069670 -9684409 -11170586 -10198801 -9330999
-1929 -9330999 -9951244 -11903894 -10017134 -11006022 -10447230 -9289371 -9457022 -9312599 -9485519 -9955458
-1939 -9955458 -10806568 -8029437 -9524650 -10484620 -9903513 -8160490 -7627842 -8721773 -9608171 -9597482
-1949 -9597482 -9616343 -9487220 -10502987 -11050562 -7608429 -7699703 -9583197 -11260552 -9889194 -9317307
-1959 -9317307 -10308899 -10266095 -9287372 -8998250 -9058243 -7886431 -9203059 -9231394 -8810206 -7936086
-1969 -7936086 -9798185 -12641072 -9951564 -8359040 -9353168 -10273001 -10392876 -10541651 -8684146
-1978 -8684146 -11153229 -10654894 -10418232 -10314939 -9099026 -11546586 -10148826 -9604095 -10115942 -9859826
-1988 -9859826 -9080511 -10025437 -10527793 -8559942 -10485840 -10321389 -9654066 -8026444 -10231688 -10518286
-1998 -10518286 -8493003 -10443831 -9853702 -10670617 -9537095 -8932249 -9287006 -10012268 -8054964
-2007 -8054964 -9344703 -8437234 -9355489 -9498939 -10508241 -9927894 -10543749 -8394978 -9000448 -8702070
-2017 -8702070 -12073849 -9600497 -9903658 -8809638 -9978897 -9199687 -9517737 -9453108 -9399890 -10046276
-2027 -10046276 -8949355 -10357789 -10196290 -11208757 -10805108 -8398876 -10267575 -9360948 -8754149
-2036 -8754149 -7631466 -7752739 -8927170 -9404576 -9253995 -9670428 -10128298 -8539711 -7821993 -9572635
-2046 -9572635 -9855689 -9712700 -8136896 -8055514 -10963830 -11832714 -9527743 -8683892 -9906572 -9781431
-2056 -9781431 -9859346 -9891402 -9402960 -9840301 -9992905 -9772609 -9152709 -9293873 -9509380 -9175321 -9739269
-2067 -9739269 -10062737 -10257028 -9024818 -7412826 -11351737 -10401980 -7435644 -9258465 -9449015 -9505585
-2077 -9505585 -10179644 -8383810 -9200087 -10918313 -9795098 -9835787 -10867239 -9546439 -9012867 -8191555
-2087 -8191555 -9248314 -9217922 -9815876 -8445447 -9553900 -8519644 -10801447 -10509946 -8581528
-2096 -8581528 -7129404 -9814540 -9294541 -8407152 -8583675 -8198583 -7836554 -7973543 -10593936 -10945426
-2106 -10945426 -9247509 -9865733 -14251246 -11713915 -10029418 -10587908 -8031849 -8883061 -9408538
-2115 -9408538 -10603513 -11015771 -9927718 -11376777 -10770867 -10137539 -10193330 -9676135 -9938436 -9296150
-2125 -9296150 -8310568 -8220700 -8107521 -10579095 -10660891 -12632931 -10251492 -9121891 -9988240 -9145902
-2135 -9145902 -9104419 -10786397 -9638801 -10091569 -9097011 -8671253 -9741164 -9554873 -10452898 -9964478
-2145 -9964478 -8771649 -7930578 -8756515 -9553154 -8041994 -8425440 -9323866 -9747473 -10583768 -10690092
-2155 -10690092 -9890826 -10117067 -9225333 -9740585 -9733648 -9101554 -10998040 -11024806 -9553377 -9314205
-2165 -9314205 -9639139 -10593162 -8833824 -8595827 -9454961 -8735772 -11175628 -9213819 -7776001 -7372028
-2175 -7372028 -8849153 -9575429 -10204960 -10567535 -9216971 -8847995 -9871089 -8334885 -9037219 -11287200
-2185 -11287200 -11635077 -10990029 -11466385 -10763696 -11668538 -10071685 -9578876 -9218840 -8493632 -8613226
-2195 -8613226 -9134645 -8898446 -8635773 -11474456 -10351313 -8504263 -8612030 -8159703 -8769941 -9323914
-2205 -9323914 -7514909 -9560780 -11144288 -10414839 -9305992 -7718240 -8248791 -8998830 -10988565
-2214 -10988565 -9677506 -8869581 -8926017 -11252784 -11477197 -9460864 -9520431 -8993571 -10062905 -9558375
-2224 -9558375 -10405036 -10636998 -8788670 -9694759 -9321101 -9491465 -10201887 -10400692 -9202672 -9376447
-2234 -9376447 -8841552 -9499791 -8634124 -7616338 -10070192 -10072808 -10552816 -9958254 -10512620 -9753371 -9848401
-2245 -9848401 -9976845 -10032213 -9658968 -10720152 -9896872 -9910615 -11074718 -10014719 -9038390 -8270789
-2255 -8270789 -7592980 -9474287 -11420651 -10074277 -9762779 -10463803 -11083298 -10130111 -10503244 -9665516
-2265 -9665516 -9202354 -9187292 -10712462 -9024716 -10041502 -8704399 -10241505 -10413156 -9989370 -10425416
-2275 -10425416 -10085919 -9333838 -9828063 -10033963 -11312157 -10434745 -8832720 -9252711 -10870704 -10897193
-2285 -10897193 -10031390 -9627030 -9492633 -9248892 -8905157 -9244843 -9598906 -10764920 -10539737 -8484317
-2295 -8484317 -7870569 -9280645 -10461625 -15919835 -9493795 -9463454 -9859422 -9179552 -9491020 -10189814
-2305 -10189814 -10904251 -9963992 -10354065 -8403677 -10470536 -10144015 -7356934 -7951540 -10175520
-2314 -10175520 -12104031 -8972944 -8521817 -8378566 -6966482 -8435492 -8485066 -8082873 -9144802
-2323 -9144802 -8128391 -8597692 -7037851 -7206445 -7898825 -9836760 -11110366 -11696418 -10070821
-2332 -10070821 -8726616 -9294673 -10251475 -10075997 -10111423 -9169925 -9063537 -10588500 -11238522 -9933483
-2342 -9933483 -10599983 -10689704 -11284047 -10334319 -9236721 -10034290 -7811786 -9500270 -9705570 -7798922
-2352 -7798922 -10565047 -9668144 -10953234 -9468063 -9725775 -9152313 -10873093 -10523346 -10390708 -9846671
-2362 -9846671 -10045583 -9952285 -10323008 -10210679 -8287606 -8207511 -9565893 -10222970 -9069377 -10467961
-2372 -10467961 -9026142 -10118173 -10164650 -9613716 -11077698 -9234866 -10836618 -11356133 -9768420 -9740284
-2382 -9740284 -9886109 -8960991 -9529837 -7875485 -8207354 -9159144 -9906097 -9638929 -9740095 -10035350
-2392 -10035350 -10377970 -9955470 -9495366 -7756792 -9669888 -9737751 -8261433 -8836597 -8148209 -9462036
-2402 -9462036 -8769297 -9778160 -10853813 -9671907 -8550792 -9777263 -11425909 -10437587 -6625916
-2411 -6625916 -9882486 -10945639 -9228091 -8675653 -8277586 -7800704 -10075302 -11308202 -9226424 -9275597
-2421 -9275597 -8157870 -8218141 -8461913 -9631855 -10390177 -10465361 -10791369 -8788582 -9976586 -9219723
-2431 -9219723 -8371954 -8778214 -7454589 -9800375 -8518665 -10894805 -9609080 -11322800 -9345320
-2440 -9345320 -9972600 -11523590 -10606105 -8462241 -10830833 -12123094 -10447079 -9759135 -9582811 -10117684
-2450 -10117684 -9327905 -9870479 -10251284 -10620346 -8338576 -9199703 -10035901 -11311824 -8941130 -9788260
-2460 -9788260 -7950292 -10119327 -12311835 -8133991 -8527655 -9307784 -9354291 -10198762 -10029639 -8878128
-2470 -8878128 -8508890 -8763343 -8273383 -9368705 -8202097 -10045044 -11289716 -10035536 -9437480 -10118164
-2480 -10118164 -11216748 -8639835 -8016093 -8839381 -8309202 -8719141 -9431437 -9557547 -9600023 -8150399
-2490 -8150399 -8506012 -10101726 -8695234 -9908093 -10820429 -9244508 -9523423 -10962524 -10470614
-2499 -10470614 -8505178 -10588320 -10364672 -8859069 -9172129 -9326853 -9331012 -8891358 -9333016 -7382625
-2509 -7382625 -9180599 -10755480 -8535908 -10452380 -8759671 -10750551 -10707065 -10966031 -9604555
-2518 -9604555 -8378124 -9995318 -10462100 -9153540 -11848355 -10868481 -10748114 -9455961 -8346174
-2527 -8346174 -8172706 -10229650 -10461870 -10438231 -9137895 -9916320 -9571921 -9187883 -9330187 -8485681
-2537 -8485681 -10686162 -9590871 -9244472 -8080033 -8730297 -6920241 -10142922 -11091717 -7283448
-2546 -7283448 -9517361 -10226084 -9812313 -9549738 -7963823 -9722630 -9626462 -9074527 -9528288 -9447587
-2556 -9447587 -10923733 -10894676 -10452617 -9189036 -9592343 -10339258 -11058207 -9305095 -10663536 -8787602
-2566 -8787602 -10138219 -9296054 -8437706 -9464234 -9300016 -8946393 -7956512 -8963851 -9999083 -7539126
-2576 -7539126 -9692972 -9975382 -10254935 -10324348 -9955849 -9105269 -8188123 -8000139 -8057998 -9504908
-2586 -9504908 -10684110 -10342254 -9580288 -9163749 -8752521 -8229496 -8020041 -10399243 -8609378 -14131997
-2596 -14131997 -10032623 -10458035 -7864879 -7571523 -8343081 -10541795 -9074229 -8425137 -10473785
-2605 -10473785 -8995342 -10213497 -11007311 -10491779 -9238536 -9247636 -9003713 -8888624 -7229283 -7503862
-2615 -7503862 -9959133 -9731375 -6802207 -10326039 -8468399 -9485660 -8822221 -8530232 -10124643
-2624 -10124643 -8314084 -8765731 -10064104 -10314182 -11027697 -10401983 -10243988 -10042557 -10184298 -9915736
-2634 -9915736 -11043276 -8788136 -9319453 -10649325 -10645735 -11808079 -9766030 -10139109 -10375998 -9614243
-2644 -9614243 -8222700 -8678470 -9629427 -10605731 -9929594 -10902679 -10237349 -8621669 -7498356 -7562246
-2654 -7562246 -9657866 -8526173 -10194912 -9600444 -9513336 -8959338 -7979919 -9007308 -9807288 -11060088
-2664 -11060088 -11916571 -10014410 -9107190 -5756684 -8063817 -10737259 -10502811 -8013800 -9106770
-2673 -9106770 -9347103 -8982320 -8875463 -8383691 -9084796 -10783294 -10035111 -9200941 -6719735 -7452699
-2683 -7452699 -8058508 -9649073 -8803496 -8350658 -8333528 -9453106 -10044238 -8868503 -9218734 -8795023
-2693 -8795023 -8873099 -9691768 -9262900 -8498659 -10380105 -9236333 -9071303 -10553827 -9869216 -8707777
-2703 -8707777 -9737882 -9825148 -11596203 -10426135 -12437527 -9692890 -9413987 -9313108 -8888362 -8832414
-2713 -8832414 -8718092 -8830601 -7478860 -6177925 -8868272 -10610151 -9278652 -8155279 -9730897
-2722 -9730897 -10375992 -9791879 -11566108 -11547158 -10511507 -11535217 -12530312 -10901719
-2730a0901719  $$ checkpoint
##PAGE= N=2
##DATA TABLE=(X++(I..I)), XYDATA
13653 -943176 -1038268 -1020082 -1172621 -2400733 -3705335 -647099 97721 -2039262 -1809707 -319447
13643 -319447 -445471 569576 1407007 3190759 1653966 1694611 1587003 -1496843 1287793 -141142
13633 -141142 -1180620 677102 -1081383 -1694667 -1768050 -1230774 -1067825 -833796 -884736 -2087459
13623 -2087459 93609 60016 210524 -387796 -1447686 -835440 -216113 247740 -1120533 -2424684
13613 -2424684 -686489 -256334 -1764500 -2326644 -1222112 -1501714 -1131035 -1030621 -303167 1400442
13603 1400442 -154166 -1336354 -3152774 -1719937 -1075987 -2299625 -871512 -2181507 -2482814
13594 -2482814 256254 -2061465 -690810 821893 -756148 -866552 606306 937642 -317625
13585 -317625 1159735 -359994 -1023831 -268495 601275 -95727 -778034 -1049690 -2311706 -1424240
13575 -1424240 200848 681665 211056 949495 400809 -426769 259667 -252064 -1059065 288893
13565 288893 1010504 -557520 -937422 454795 655750 772508 1096129 2218700 49425 1097765
13555 1097765 355654 1577418 944291 436561 891003 80348 -1668567 -824386 -285007 -92383
13545 -92383 963124 1668417 173606 848567 318661 95421 -258159 -1229735 -2144859 -745511
13535 -745511 -287996 -146447 -374213 -1451506 831483 -382837 343178 -56419 114071 629833
13525 629833 678448 159758 -891314 1565643 3084815 2108156 2501093 -2494115 -1739379 -1259711
13515 -1259711 -472510 -303778 -739082 -1074412 -30907 -1927622 -1525552 -2381297 121771 -98013
13505 -98013 -466914 -851492 -42871 -477729 342727 -489120 -939406 538914 1515866 -458985
13495 -458985 1545835 2063660 1264618 -557432 -533061 1711693 1163283 2092729 617697 1553956
13485 1553956 -545887 412924 443567 2330114 103531 -295365 791445 959759 1603043 312524
13475 312524 143586 -965643 -414032 -671467 1502967 827776 -61309 156252 -481298 1702502
13465 1702502 933547 1772649 -352225 1672473 1866735 2454906 1798251 1086086 1011108 2381106
13455 2381106 1555003 2454056 951279 -1717470 -323084 750000 1893135 687872 1634581
13446 1634581 731228 670009 1000491 348400 -196471 1168162 -321319 1098738 -552671 -105034
13436 -105034 762314 1200188 534131 2718903 2525162 72411 510406 2059898 2371368 1066634
13426 1066634 931160 2042974 3465401 3000989 2742975 2492289 1167342 1714148 3450349 2926779
13416 2926779 2016540 2198452 2455734 -977669 755547 60024 2769200 1077135 990811 2198971
13406 2198971 3449666 3691051 3106865 1893252 2667615 809261 439855 2892970 1451026
13397 1451026 258686 763429 1115973 1138529 1733318 -120380 569895 -111185 224063 -398958
13387 -398958 -370097 3374986 2238002 702748 785239 1265528 1292714 705557 2303276 1736873
13377 1736873 1053720 1735019 2391517 2714438 2376538 1987131 943263 1503190 2770171 2433853
13367 2433853 2727498 2940860 1865797 726882 952926 1585322 758780 1831196 -657287 -183176
13357 -183176 -83636 2539065 2983657 2378602 317023 945560 2414827 1561492 1639681 2853621
13347 2853621 1970121 2208904 2224803 1636466 489626 907424 1652427 2579787 1282415 636151
13337 636151 2508440 2225769 737403 472470 3694381 2568520 3882454 2344835 3039921
13328 3039921 1953717 2930293 2532225 1826594 1108039 702131 1005329 -128396 2191143 3334055
13318 3334055 2611174 2930866 4322518 3774820 1777692 1293263 940021 2785900 1740696 1908875
13308 1908875 2505399 2997314 3005668 2092081 3975035 2797722 1574431 3676932 4252361 2921287
13298 2921287 2956101 2299658 3110531 3126588 3505221 3862867 4194024 3246400 2850061 2764713 2019484
13287 2019484 3306795 2808231 4953640 4696085 3786103 2251683 2283080 3036357 3749625 4793995
13277 4793995 4394883 3818248 1464690 2522240 4409590 4669144 2511039 2632371 3171824 3152658
13267 3152658 3360937 3278327 2401308 2859539 2094606 2793947 3700284 3074031 3226288 4384990
13257 4384990 4096082 3669302 1959218 1939231 3881315 2863444 2896110 4045774 4397272 5570607
13247 5570607 4229012 4589262 4475434 3357550 2028589 4900578 2327891 4386177 2173309
13238 2173309 1635090 4589909 3696365 2255362 2656941 3725596 3132565 3072557 1830103 2403486
13228 2403486 2300124 3494386 3793434 4748759 4128645 3323236 -762751 2283302 2587333 4397086
13218 4397086 5683966 4421294 3736802 3969577 3686830 4144370 3776244 3927554 3926064 3639561
13208 3639561 1955528 3090091 3572380 3604931 5237927 6018117 5063504 5324745 3047528 3491834
13198 3491834 2563622 3445838 3234618 4142689 4095101 2914391 4170356 2828540 4076753 4297602
13188 4297602 2566328 2964861 5413187 4141320 2252002 3160196 3592569 4227078 3074786 2379488
13178 2379488 2147009 2878960 3322131 3540538 4119974 3677980 5927598 5204489 4806015 2468905
13168 2468905 4448820 3336504 5164301 5633967 5499257 5179769 2438539 2016187 1282026 3006552
13158 3006552 3975937 5084846 2326850 5510734 5273285 5953175 6064052 6433973 6079932 4860047
13148 4860047 4943464 5777542 6159705 5074734 4888229 4572033 3899851 5847824 5657814 4457501
13138 4457501 5284083 4523833 3313255 4042273 4487273 3495135 3517069 2596241 4451436 4104880
13128 4104880 5156823 3230781 4766198 4795037 6205700 5172935 6378105 5161042 6277616
13119 6277616 5481842 4701732 6154760 3602533 3642137 3238787 4581784 3855193 5349072 5927276
13109 5927276 6340628 6852409 6630565 5571744 5513769 5984131 5147554 5922028 4290997 4894171
13099 4894171 5182852 6112195 4258049 6127385 4705530 3689658 6342665 6009253 5594903 6195864
13089 6195864 8087953 7570802 5817803 3933551 5319858 4683171 5092737 7404052 5105016
13080 5105016 5386981 5538078 7770739 4762591 6157112 6935766 6645187 6210399 6181529 4976311
13070 4976311 4127564 3964869 5733286 6341784 6330529 6470146 6477276 6371232 6654882 5544459
13060 5544459 6710986 7599785 6766131 6833773 5614069 5796624 3955377 5012663 5674899 4899310
13050 4899310 6642422 6561805 5116758 5611653 5649102 7060252 5312190 5022206 6144667 6931191
13040 6931191 5505857 5510129 5364183 6271864 6229336 5587671 5732292 3708535 5666646 7716328
13030 7716328 6865742 7214863 9359490 5511940 4969844 6003828 6074762 4230851 5717653 5372810
13020 5372810 6205614 6807006 4181140 4535102 5178357 5232338 7016566 7999348 7647789 6292763
13010 6292763 5137989 3649091 6147974 6657713 7744755 7530425 6553238 5114880 5864771
13001 5864771 6865873 6564896 6155182 6136503 5945713 5570520 7113349 8722168 7502269 6485997
12991 6485997 7001936 8055630 7373699 8377169 7651292 4950594 7589457 6370597 6430556 8799771
12981 8799771 7499303 7657389 6099076 6628132 5832561 5265632 7153694 7003560 6107497 6294716
12971 6294716 8798280 7966409 5702225 5227119 5052740 5350340 7851478 8737547 6816045 7072593
12961 7072593 6484057 7090464 7622732 7449779 7083649 7706637 11266682 9552539 8670411 7347363
12951 7347363 8029386 6854436 7978485 9039372 7221815 5601922 8181148 7310408 7052680
12942 7052680 7965416 7888489 6615996 6851414 6463139 8428741 8182881 7124044 8834974 10305395
12932 10305395 8633389 9105442 9033672 8838585 9386289 7827207 6624237 6936068 7843845 6976884
12922 6976884 7790739 7063221 7627165 8728867 9926359 8874190 9511159 9824284 8627467 10079591
12912 10079591 8506864 7965008 6898544 7766951 7792068 6238757 7700572 6509976 8569437
12903 8569437 8856168 8831248 7853338 8474148 8312748 8314961 8458965 10232092 10988433 9932961
12893 9932961 8180219 9669935 9638041 8927728 9445465 9030500 8768136 8072909 8237782 9409196
12883 9409196 9592519 9648479 10051145 9185850 10106093 7938992 8532849 9724095 9103762 8642951
12873 8642951 10264941 7701454 9204188 8939915 10367954 10368677 8757802 8595995 10237678 9340787
12863 9340787 9459739 9900561 9122167 9019428 7936767 9937345 9752511 8829991 7658880 9365484
12853 9365484 8361479 8134567 9497241 8926942 5934356 1556190 10804246 9062385 8475729
12844 8475729 8301801 10768216 11164420 9865464 10683337 9626182 10089345 9975032 11579283 9850319
12834 9850319 11078120 9846408 9980234 13054980 9509313 8877973 9666639 11211209 10705017 9837446
12824 9837446 9904919 9738326 11056925 12187400 10528476 10196211 9236888 9772428 9492910 10705710
12814 10705710 8786998 11463132 10147284 10345895 10146156 10028933 7798686 9177021 8434517
12805 8434517 7959828 8064191 7705145 10408014 9907645 11985869 12836868 11617821 11817100 11347170
12795 11347170 10151448 10973179 8917108 9302970 7868076 9247545 8906826 10092116 12210623
12786 12210623 11929765 10886125 11367848 11655013 11192820 9414369 9069796 9975766 7747749 8792658
12776 8792658 9216720 8798298 9882781 11621609 9977612 9944246 10197227 9977812 11080701 11956023
12766 11956023 10727317 10889068 10505568 8859162 11479546 12111976 12071911 12721561 9981626 10515106
12756 10515106 9890896 8413531 8541415 10015924 8963755 9930635 10668968 10333568 9922654 10440783
12746 10440783 11009980 11154679 11117644 10259305 12184181 12430772 12332550 10148806 11096133 11069020
12736 11069020 11921101 11661871 11091279 11718044 10189481 9628243 10833787 11127995 12820332 12127534
12726 12127534 12809334 12378926 13258478 9884588 10498938 10242516 9683872 10654001 11351755 9870664
12716 9870664 9655390 11141477 9927891 10712879 9881018 9702548 12027818 11723641 10729355 10560344
12706 10560344 10255255 9422844 8903569 10537175 9463303 9602859 9928363 11723442 11058038 9683357
12696 9683357 11154599 11039962 10393337 9153788 12840350 12147031 12833495 9130111 10835660
12687 10835660 13293592 12529135 11882636 10935542 10753502 9915943 10617726 10867198 11588713 10911778
12677 10911778 11753154 11106700 10596259 13015150 9518877 9251494 10593711 10824031 12211529
12668 12211529 10119865 10398526 10406493 11958487 11339647 11220820 10804872 10310442 11696660 9914178
12658 9914178 9059195 11578069 9375318 9661764 11823703 10578913 9604234 9995676 9849242 10363992
12648 10363992 10063484 10988743 9311713 10129040 11061577 10083480 10863022 9360068 9895226 10902129
12638 10902129 10667063 10333646 11097905 10582247 9424789 9569838 8956244 8386699 7479773 10370144
12628 10370144 10363540 8964471 9441699 9715133 9872600 9729439 9851692 10920052 11592033 10220502
12618 10220502 9724051 9468025 9637348 11204821 11783296 10035414 9860431 9363478 8588422 9204498
12608 9204498 8754687 8943763 8599758 9568409 8492934 10382220 11974865 10748089 9391420 10202553
12598 10202553 9489711 8973874 8853129 9751679 8949681 9460200 10668636 9674798 10762816 9558424
12588 9558424 8652249 6967962 8608395 9379957 10073471 7650935 9756251 9413822 8791393 9111553
12578 9111553 8673097 8636154 8822989 8351785 9768237 10928968 8919414 9986569 9602166 8563567
12568 8563567 9501401 6672183 7609785 8633457 8043837 7427187 7401430 6826714 7349614 8411949
12558 8411949 8924474 9690443 8538725 8475941 9284109 9191250 7359517 9223982 7741269 6647057
12548 6647057 7833319 8587825 8672820 7285252 7894626 8191408 7682529 8381894 8157604 8069549
12538 8069549 7953129 7678692 7494318 8348845 9772894 7992138 12298713 4489953 6198331 6630780
12528 6630780 6982075 8099445 5666366 5776143 6441628 5945908 6946256 6720395 7497050 6310337
12518 6310337 8364499 5803579 4190163 6159704 4661785 4950473 5077631 5781697 4852625
12509 4852625 7272212 5796347 5725240 5913587 5854528 5000689 5092291 4986425 4065024 2980555
12499 2980555 3699691 5804458 4375025 3582577 4033131 5065761 2890871 3101952 3422157 4206555
12489 4206555 4522311 3013782 4004003 3592410 3927530 2595385 1951859 3926167 4982364 3414990
12479 3414990 2237414 -217906 2301107 3797555 3357954 2179248 2510386 2461633 2282725 1833659
12469 1833659 3927533 3073585 3243537 1398573 1700132 1742117 2088393 2059613 703524 1688796
12459 1688796 -1034219 2579410 2521507 2115733 1454355 2182690 2879566 2676624 1590430 115811
12449 115811 1233577 606490 1255008 1645385 143451 -25808 823378 -108616 -317725 293047
12439 293047 1341564 1161986 -1149080 448123 -1138275 -1000706 -2145880 -2152590 -1177158 -418663
12429 -418663 -336825 -3399218 -906646 -2273644 -3486056 -3182134 -2690790 -2948299 -3215196 -3699783
12419 -3699783 -804694 -2562985 -1580305 -1660324 -2205476 -1656844 -2448056 -3032277 -3451186 -3665781
12409 -3665781 -6706391 -1539489 -2649190 -2021015 -1070134 -1453809 -2845365 -1831374 -3065423
12400 -3065423 -2888196 -2533624 -2880360 -4604796 -3630212 -2241120 -8490254 -4190793 -3723191 -5540468
12390 -5540468 -3832927 -5485421 -7714305 -5723472 -4869622 -6329518 -5260808 -4937812 -7125826
12381 -7125826 -6453135 -6140813 -6667782 -8499061 -4387014 -4255176 -5153841 -7325256 -5762361 -6929307
12371 -6929307 -5882100 -4247671 -6904746 -6590848 -5504112 -5344352 -6619214 -7540764 -7157186 -7440651
12361 -7440651 -9789194 -7792678 422207 -3694739 -6059559 -6236112 -7046741 -8462463 -7813538
12352 -7813538 -7453139 -8485426 -8384815 -8897588 -9043182 -9399296 -7752751 -7664280 -9346780 -9263094
12342 -9263094 -7770170 -7510120 -6000801 -7296174 -8767409 -8646422 -9831708 -10564025 -9706185
12333 -9706185 -12924215 -10964994 -8269983 -8776265 -9017064 -10817143 -10905446 -9985321 -8451704 -10081587
12323 -10081587 -8405057 -9337404 -12178077 -9844556 -11391268 -10542135 -9006561 -10557893 -10870432
12314 -10870432 -11537803 -11635621 -11622323 -11442694 -11070311 -11008128 -10037992 -9517791 -9221501 -9716161 -10907115
12303 -10907115 -11075655 -9890017 -11699790 -12283331 -11703890 -11963602 -11212567 -11756009 -12481332 -13153916
12293 -13153916 -11327860 -10880893 -10731186 -12377021 -12081729 -12752213 -12435712 -12711406 -11791892 -13564508
12283 -13564508 -12488650 -13670580 -12593838 -12413839 -12864970 -11664715 -11921987 -12082775 -12363083 -13175237
12273 -13175237 -14402231 -13596695 -12208127 -10869899 -14070984 -13406417 -12432890 -11071425 -12018421
12264 -12018421 -13281900 -13242971 -12334607 -11866744 -12830102 -12261382 -12767897 -12489853 -14384863 -14404166
12254 -14404166 -14578349 -13753018 -13721185 -16424548 -16110173 -14127173 -14413849 -13017305 -14335501 -15416585
12244 -15416585 -14360863 -15468105 -13440267 -12929136 -13529584 -13718322 -13308082 -13772298 -13510682 -15901447
12234 -15901447 -15335590 -16218134 -13776859 -12996303 -13601382 -13778180 -16101019 -15401985 -16319641 -15554824
12224 -15554824 -13790771 -15397039 -14241511 -14805387 -14716598 -16314711 -15859784 -16943902 -15224169
12215 -15224169 -15907220 -15994977 -15565364 -16701481 -17687138 -14768590 -13090201 -13774204 -14655633 -15927481
12205 -15927481 -16362829 -15700355 -15038952 -16136024 -14710908 -15649724 -14355684 -16384787 -14767995
12196 -14767995 -15067025 -17590352 -16253405 -17824839 -17822825 -14665517 -14686861 -14330382 -16639961 -16863895
12186 -16863895 -16514952 -16699692 -16548979 -14949575 -16276274 -15364465 -17322693 -16597481 -15904300 -15415979
12176 -15415979 -12380849 -13183699 -15201586 -16002166 -15019402 -14996834 -14356848 -15835603 -14892088 -15185235
12166 -15185235 -14555614 -13695761 -13815125 -14207224 -14257468 -15515783 -15279410 -15453330 -16456332 -15708628
12156 -15708628 -14922271 -14512436 -17054521 -17531541 -16443740 -16752363 -16445239 -17547550 -17502849 -16433335
12146 -16433335 -16818836 -16140759 -14184240 -16120398 -16843664 -16391370 -18296966 -17560890 -17537896 -16220605
12136 -16220605 -16413742 -17201486 -17108223 -16711331 -18295199 -16880352 -16885614 -17634135 -17446876 -17933777
12126 -17933777 -16511158 -16703736 -17065323 -15357613 -13946991 -17287506 -16560723 -16741090 -15306712
12117 -15306712 -16810187 -15855477 -18347068 -17478233 -17938993 -16847884 -17860562 -17317288 -16270610 -16298119
12107 -16298119 -16880921 -14715920 -17827836 -15310341 -14620272 -14816018 -16320434 -14378454 -14937139 -14955916
12097 -14955916 -15484296 -13850064 -18077072 -17514172 -17127107 -18035721 -17234469 -15939667 -17672683 -17813141
12087 -17813141 -16217475 -15890026 -14195122 -14021614 -16548779 -15994193 -16411452 -16984176 -17410159 -20485781
12077 -20485781 -17739659 -15968196 -18088447 -17262707 -17471467 -17391581 -18057013 -16983913 -15568693
12068 -15568693 -17337245 -17177495 -17557884 -15089533 -17129736 -17099974 -17357325 -16210748 -16788627 -16280884
12058 -16280884 -15952819 -15909838 -16411159 -16515969 -15788050 -16485286 -17574855 -17354842 -18444369 -17654262
12048 -17654262 -16393203 -16930448 -16572261 -15194098 -15578736 -15200333 -15757351 -16558048 -17287649 -16036646
12038 -16036646 -16327398 -15817245 -15597987 -17684300 -18713600 -20207455 -17770568 -16175726 -17557651
12029 -17557651 -18257363 -15851118 -15576082 -17982065 -15864477 -17571404 -16426729 -18769520 -17626817
12020 -17626817 -18363316 -17677981 -16443745 -15145888 -15383185 -17179924 -17723064 -14610068 -15353540 -15281492
12010 -15281492 -16550702 -17292667 -16599682 -16521978 -17241492 -17450318 -16835634 -17085748 -16799404 -16371585
12000 -16371585 -15530894 -16379660 -15942805 -16455956 -15326472 -16623528 -15911875 -16499089 -15922399 -17153658
11990 -17153658 -15147695 -16146838 -15637087 -17628407 -16913405 -15803645 -17633413 -14357739 -14571066
11981 -14571066 -15813163 -15062111 -14857465 -15877321 -16008684 -15470988 -12072017 -14595342 -16626814
11972 -16626814 -14682537 -15115252 -15738534 -13267596 -12884015 -16495213 -17519735 -17877174 -18664232
11963 -18664232 -17457643 -16981023 -15863808 -13845119 -16471274 -15395075 -15467968 -13870539 -16503377
11954 -16503377 -16810231 -16144912 -15888420 -15913444 -14348007 -15627732 -15450244 -14018545 -13992536 -15301240
11944 -15301240 -16504982 -15412793 -15669571 -15586397 -16160881 -15676347 -15965642 -16228989 -15204218 -16481862
11934 -16481862 -16419553 -18610601 -15054461 -15430600 -14429680 -14758973 -14962014 -14703487 -15243634 -13826806
11924 -13826806 -13890298 -14878904 -16834712 -16664258 -14530920 -14428360 -16555157 -14042543 -14766800 -15484319
11914 -15484319 -11598761 -16619973 -16641292 -16303311 -16670583 -15382365 -14838684 -16562949 -16341872 -14737476
11904 -14737476 -14474589 -14847870 -15154918 -14439523 -15697097 -14461338 -13432147 -14011260 -13514598 -12831409
11894 -12831409 -15037822 -15164243 -15081644 -12997177 -13089228 -13971264 -14624717 -15817432 -16092645 -15262766
11884 -15262766 -16056566 -15004303 -14230030 -14802023 -12412687 -13306825 -13949935 -13818070 -13878524 -12484989
11874 -12484989 -12389723 -13546593 -14707683 -15694116 -14333656 -14609596 -13956009 -12894477 -12765323 -12007744
11864 -12007744 -14732451 -15272877 -14304930 -14801035 -15632892 -14460972 -15628201 -14828794 -15551707 -14938217
11854 -14938217 -13699409 -15387051 -15032458 -13290251 -12942688 -12755215 -12638733 -13748075 -15525025
11845 -15525025 -14118618 -13703201 -14341408 -13674086 -13619468 -13328671 -13741185 -14837492 -14028768 -13780858
11835 -13780858 -14204672 -13094704 -13380503 -13844858 -13147057 -14432224 -13998878 -12404401 -13395312 -14915361
11825 -14915361 -14733352 -12637529 -14114124 -15163488 -14645588 -14169440 -12721852 -12072234 -12371982
11816 -12371982 -11089785 -11679242 -12779076 -12510764 -11799904 -12918753 -12187712 -14024899 -14049794 -14016436
11806 -14016436 -13796997 -14181555 -16023632 -12467729 -14582838 -12975174 -15879057 -14373680 -13919102
11797 -13919102 -13888998 -14754647 -15025615 -12724122 -13830664 -14065439 -14650159 -13953885 -13740654 -13699686
11787 -13699686 -12300099 -11305705 -11953760 -13727234 -15474623 -15884060 -13829124 -13705242 -15804823
11778 -15804823 -17105171 -12540782 -11626997 -13291738 -12763196 -13519965 -13607321 -13895983 -12585333 -12703266
11768 -12703266 -12907134 -13471689 -11960986 -12336794 -13837386 -14188825 -13015658 -12103713 -14819774 -14549828
11758 -14549828 -15097001 -13956764 -13333630 -14072075 -13755029 -13974230 -12393588 -13645282 -14989487
11749 -14989487 -13584193 -14094327 -14535781 -11748983 -13157910 -12511664 -12870126 -12796378 -11940442 -11837798
11739 -11837798 -13348213 -11159178 -9950445 -11606298 -13040065 -11410109 -11963617 -12637677 -12130571
11730 -12130571 -14292462 -11417866 -12103186 -12412176 -12168686 -13101825 -13255267 -12085934 -12607072 -14022380
11720 -14022380 -13223969 -10950227 -10967302 -10631710 -10907719 -11097411 -13891450 -12143809 -11398533 -11369598
11710 -11369598 -12310816 -13423775 -13652061 -12245063 -13549926 -12572940 -11919772 -10969561 -11924285 -12211702
11700 -12211702 -12708872 -12772649 -11917516 -12014231 -12979531 -13576505 -13150794 -11814291 -10430378 -11288821
11690 -11288821 -13331435 -12325075 -11370426 -10281602 -11097739 -12273881 -13618327 -14222803 -13270386
11681 -13270386 -12633735 -11630454 -11461388 -13362462 -13569980 -11682177 -11860082 -12679198 -13213084 -13237969
11671 -13237969 -13111230 -12384807 -12532674 -11434840 -9535863 -11483731 -12404571 -11056225 -13029242
11662 -13029242 -12172945 -11425012 -13160596 -13247879 -11505165 -12216953 -10383647 -10339036 -9415837 -11930327
11652 -11930327 -11423191 -12368354 -10652998 -9367917 -9947771 -11110338 -11206833 -11243155 -10689928 -8798520
11642 -8798520 -10144558 -10461357 -11346079 -11500345 -12780744 -12511788 -13551490 -12485095 -12705234 -11361231
11632 -11361231 -9406269 -9987597 -11349866 -9109902 -10078395 -11914457 -10781530 -12186988 -10343469
11623 -10343469 -10819181 -11746720 -10028111 -10960689 -11077398 -11510223 -12072777 -10586557 -10185233 -9552571
11613 -9552571 -8854114 -9493401 -9673500 -10330288 -4166282 -18607252 -14337937 -13912455 -12540874 -12358133
11603 -12358133 -12031643 -12945514 -11700627 -11845358 -9770539 -12859100 -10942684 -10241459 -11362765
11594 -11362765 -10819962 -12393585 -10747820 -10842797 -11647220 -11858838 -10992094 -10458835 -11600960 -11446793
11584 -11446793 -11368202 -12834055 -10818831 -11078562 -11125078 -10503012 -11208234 -10341666 -11633369 -10980814
11574 -10980814 -11050096 -10484773 -9852623 -11126689 -10479295 -10899371 -9387090 -10162415 -11212182 -10112291
11564 -10112291 -12002623 -11003113 -8807877 -10533653 -11805354 -10706241 -10713786 -11618958 -11267968 -11446007
11554 -11446007 -10668182 -11516266 -11673958 -11506509 -11970441 -13422165 -12298339 -11518269 -11094150 -7153302
11544 -7153302 -9209859 -11032635 -12172104 -11523745 -12651720 -12370169 -13584823 -9790868 -12227878
11535 -12227878 -10193104 -11358194 -11316096 -11489626 -11406622 -10582845 -11048938 -10023666 -9276160 -9244133
11525 -9244133 -8469968 -10632239 -10320526 -10477091 -9655735 -9280207 -12305578 -12747940 -11681704 -11340095
11515 -11340095 -10833651 -8884634 -10775020 -9905241 -9086723 -11733445 -12488545 -9941581 -10483543
11506 -10483543 -9466518 -11630132 -10627583 -10381254 -10781626 -9681813 -11128684 -10582883 -10780249
11497 -10780249 -9316945 -9507329 -8985536 -9832959 -9625217 -11523716 -10058626 -7995640 -8674162
11488 -8674162 -11021603 -11646938 -9213682 -11117327 -12648832 -12133592 -9198785 -10496436 -9454712 -9450346
11478 -9450346 -8087784 -10657120 -9949677 -10960715 -8861594 -10871556 -9793373 -10037577 -10663712
11469 -10663712 -10765736 -10423063 -11412579 -10426973 -10345596 -8321253 -9681043 -9172167 -8451296 -9630740
11459 -9630740 -10422007 -9722557 -9810063 -7844067 -9501626 -12862488 -10715080 -10868916 -10522195 -8965606
11449 -8965606 -9603705 -11261833 -10031107 -8588771 -8797917 -10225667 -10103621 -11277798 -9697797 -9729352
11439 -9729352 -6699720 -9870698 -9446964 -10032536 -8626382 -8828323 -10583782 -11246621 -11408015 -10309937
11429 -10309937 -9843121 -10159841 -9953487 -9335281 -10255448 -9131041 -9653625 -9773242 -9270907 -11712632
11419 -11712632 -11026975 -9577236 -9819171 -9038581 -9926787 -10375240 -8927179 -9766460 -10252663 -9725249
11409 -9725249 -10290026 -8959884 -8631524 -9999101 -10992317 -9363129 -9331878 -11071863 -10600638 -8432402
11399 -8432402 -8551840 -9068512 -10477321 -10229565 -11099094 -9770673 -10179422 -10378890 -11494834 -8122550
11389 -8122550 -8416755 -9310847 -9793872 -9058882 -10299338 -10326289 -10203904 -8787052 -9722285 -8913710
11379 -8913710 -9694227 -8648723 -8461140 -8880505 -9558047 -9167671 -8354128 -9909895 -7728315 -7975501
11369 -7975501 -10056335 -8346641 -7046793 -8705107 -7997730 -9323248 -10180114 -10214528 -7732695 -7803167
11359 -7803167 -10066449 -7760723 -9816520 -10694435 -7944262 -9235960 -9572712 -7208902 -9413586
11350 -9413586 -7828769 -7642895 -9197549 -8009074 -9540450 -9091691 -8525893 -10115217 -10720714
11341 -10720714 -9646447 -7864738 -7500116 -8807773 -8540237 -8104343 -8524382 -7651463 -9464440 -10000933
11331 -10000933 -7209139 -7731174 -10959871 -9160838 -9013904 -9972322 -8209856 -6381734 -6998027
11322 -6998027 -7873689 -8212657 -9279806 -8537999 -7254414 -6522195 -8895998 -8404396 -10953002 -9592090
11312 -9592090 -8309088 -9774177 -7657408 -8284972 -7767078 -6923461 -7947100 -9591778 -9158751 -9050630
11302 -9050630 -9317831 -9753048 -10898567 -10668498 -11250267 -8489233 -8326287 -7481631 -6578955 -7531830
11292 -7531830 -7310353 -9407257 -7948931 -8391567 -7123256 -8467191 -8665885 -9321256 -9077195 -10680374
11282 -10680374 -9800839 -8864404 -8442083 -8306889 -8381955 -8162931 -7677639 -9239340 -9380697 -7401621
11272 -7401621 -7194848 -9729641 -8326452 -8190512 -6166643 -6761911 -7687150 -6698617 -12719334 -10182428
11262 -10182428 -7805396 -8284061 -9393355 -8835120 -8954257 -7009567 -8330461 -9691238 -12620609
11253 -12620609 -10193227 -8856271 -7700567 -7474639 -9594413 -9351344 -8127786 -8185101 -9646312
11244 -9646312 -6943752 -5489952 -8597870 -8213124 -7456516 -7427066 -8388409 -8248997 -7738167 -9420268
11234 -9420268 -9064466 -6677637 -7337670 -8783974 -9273295 -9143479 -8214041 -9121670 -10078049 -8861721
11224 -8861721 -7598927 -9548265 -8267546 -8715070 -6956883 -8247971 -8727539 -10599083 -9501318
11215 -9501318 -8630290 -9212750 -8345093 -8874171 -8839271 -8479657 -7584313 -7460087 -6388972 -7317267
11205 -7317267 -7671015 -7690875 -7548374 -7235130 -7406821 -6596672 -9109392 -6544110 -7046994 -6217231
11195 -6217231 -6934581 -7368759 -8906338 -8238457 -9034040 -6867734 -7741243 -7317165 -7423220 -8896834
11185 -8896834 -8492263 -7333705 -7866033 -8228812 -6699261 -7266278 -7289785 -8852768 -9823580 -10116754
11175 -10116754 -7730923 -8196192 -10223374 -6772575 -7352258 -6831188 -6869374 -7025296 -7697664 -8216519
11165 -8216519 -6854074 -8686792 -6759237 -6765267 -7712406 -5567125 -8384325 -8297339 -9178397 -9949208
11155 -9949208 -7406327 -6092314 -7448260 -8184499 -6328610 -6941759 -6675421 -7137853 -7854944 -8524216
11145 -8524216 -8472309 -9050443 -8390045 -6599659 -4850177 -6021307 -8598493 -7360408 -6412454 -8111884
11135 -8111884 -7070505 -6558036 -7301365 -8418789 -6580766 -6018412 -6813045 -6920293 -7756637 -7657076
11125 -7657076 -7397411 -7527149 -6338583 -8138901 -7413434 -7979233 -8146034 -7355334 -8093191 -7357496
11115 -7357496 -6219218 -7544539 -7415367 -7000697 -8251270 -7603258 -9455565 -9297672 -6325604 -5613335
11105 -5613335 -7336445 -6980848 -7513707 -8278617 -7594758 -10015735 -9532913 -8406400 -8231006 -5643804
11095 -5643804 -7358758 -8974342 -8403048 -6490814 -7403457 -5987163 -6015938 -5418390 -5881789 -7982149
11085 -7982149 -8112793 -6215128 -5011005 -7867933 -4637580 -4811453 -7641933 -8451497 -6350631
11076 -6350631 -6838175 -3449936 -5281490 -6990635 -6317289 -4578516 -4161816 -7917642 -6992030 -7407234
11066 -7407234 -11018528 -8491433 -6455890 -7104389 -7234886 -6550451 -6690444 -6714670 -5198286 -8070132
11056 -8070132 -9368618 -7674281 -7259065 -6252803 -8000891 -10626516 -7600674 -6270097 -7797812
11047 -7797812 -7978680 -7814137 -8164413 -5956498 -6688751 -6644242 -6297765 -6917539 -8397297 -5650821
11037 -5650821 -6910993 -7358362 -7157523 -6798640 -6514288 -5038405 -6383032 -6924659 -9111307 -7689429
11027 -7689429 -8210448 -7015108 -9612513 -8510063 -6795170 -5452515 -5596862 -6381800 -6815093 -6738382
11017 -6738382 -6844041 -5822593 -6380605 -7777094 -7507038 -5918022 -4696935 -6631041 -4597242
11008 -4597242 -4014403 -5792790 -7478002 -8746292 -7439111 -7154917 -5974130 -4344081 -6054588
10999 -6054588 -7174522 -6252785 -6447767 -6614298 -6010153 -5858857 -7645507 -7467032 -6008471 -7606051
10989 -7606051 -6536342 -5261331 -5232252 -5867987 -5857980 -5280443 -5674648 -5801957 -6617096 -6432518
10979 -6432518 -5669816 -6114365 -6927024 -8320646 -6395465 -7972942 -7073509 -7416709 -8184023 -6939443
10969 -6939443 -6143909 -5640456 -4964293 -5841847 -5004725 -7375925 -7015709 -6109389 -6425203 -7605805
10959 -7605805 -7440390 -6738684 -6672033 -8050551 -7413050 -7275433 -6389798 -5287165 -5076774 -5779308
10949 -5779308 -6895077 -5416801 -5239382 -5062644 -6779229 -7183006 -6949813 -5722540 -5819822 -6575613
10939 -6575613 -8060086 -5358495 -7237466 -7627876 -6819451 -7791002 -6715422 -7278523 -6271935 -6458417
10929 -6458417 -6987491 -5171289 -5143340 -5084661 -1224744 -4724276 -5030716 -4512037 -4802010 -4865880 -4808495
10918 -4808495 -4421746 -6222234 -5642873 -4724219 -5290645 -5665583 -6190214 -6569784 -5286455 -5213190
10908 -5213190 -6468201 -6600116 -6888624 -5555890 -7405987 -8409381 -3876479 -5058681 -6354513 -6345326
10898 -6345326 -5400143 -5599225 -5682133 -6886629 -7052544 -5612342 -1696499 -1963185 -5272403 -6298134
10888 -6298134 -4067813 -4839409 -6257666 -6564939 -6992869 -5327226 -5382817 -4740897 -3727796 -5388990
10878 -5388990 -5138165 -4887193 -6189222 -6251583 -4458320 -3528644 -6962234 -5206116 -6948062 -3824795
10868 -3824795 -5068108 -6403161 -7059776 -6901076 -4225800 -4447323 -4920544 -4654430 -5763146 -4603379
10858 -4603379 -4887386 -4997569 -4521266 -4007134 -4314323 -4276274 -4044869 -3210893 -5647560 -7390970
10848 -7390970 -7544953 -6127871 -4962206 -5260694 -3552962 -4517330 -6306899 -3660319 -3918037
10839 -3918037 -5115446 -6737265 -6299874 -5463872 -3590474 -5853524 -4322403 -5175251 -5960869
10830 -5960869 -4773465 -5536564 -5600348 -5950001 -6397027 -5221465 -6002568 -5057147 -5102869 -5299680
10820 -5299680 -4737047 -5844776 -6619540 -5887267 -7104378 -5843657 -5646482 -4943587 -3955818 -5099144
10810 -5099144 -5143921 -6444835 -5783109 -7855984 -7001984 -5071645 -4027649 -3873534 -5180743 -8350339
10800 -8350339 -6390810 -6424878 -5296735 -6191270 -6706104 -2392112 -2434974 -3180560 -3825937 -2851518
10790 -2851518 -4437550 -4952198 -5412315 -3400356 -4550280 -3913442 -3881326 -6901483 -6723335 -5563858
10780 -5563858 -6677092 -5077783 -6915028 -6611598 -7147937 -5013459 -3307569 -3788288 -5392400 -5372774
10770 -5372774 -8993571 -6882934 -4302489 -4196816 -3575732 -4829891 -4646167 -4166199 -4795199 -4208364
10760 -4208364 -4592036 -4987315 -5237826 -5055078 -4470918 -5414649 -4839278 -5788023 -6029383 -10604308
10750 -10604308 -3926552 -4126548 -4880332 -4130090 -3750668 -4691511 -2323122 -6065875 -5418624 -6139886
10740 -6139886 -5261920 -5747762 -4536897 -5492307 -5000887 -3694031 -4336996 -7297740 -3015732 -3657602
10730 -3657602 -3752026 -5915364 -4703523 -7134579 -5177679 -3490898 -2037536 -4603856 -6019671
10721 -6019671 -6075421 -4953525 -4880881 -5397924 -4134139 -6662285 -6756397 -4981226 -6076423 -4770414
10711 -4770414 -3554163 -5095347 -5753672 -5052451 -4888524 -2654155 -5087571 -4545621 -4719937 -3045638
10701 -3045638 -2994168 -3895268 -4868096 -6264220 -6383232 -4835607 -2795972 -4173375 -5239149 -5685690
10691 -5685690 -7070776 -5225628 -4859621 -4919382 -3444167 -4127973 -3977978 -5668086 -5370694 -5268125
10681 -5268125 -3815954 -3645531 -3098890 -3760541 -2979633 -2395766 -3850549 -5704124 -3443973 -6191795
10671 -6191795 -6756007 -6242496 -5282670 -3537031 -4687508 -3300771 -4512157 -4675005 -4860515 -5056263
10661 -5056263 -4506814 -2444843 -4276336 -5316164 -4699614 -7953720 -6678213 -5762940 -4546380
10652 -4546380 -3768882 -2228697 -3466761 -4238487 -6934229 -5625622 -4371513 -3914861 -4397634
10643 -4397634 -2820996 -2800002 -3337142 -4010426 -4362957 -3661550 -3430089 -4832909 -3988752 -4178007
10633 -4178007 -4539649 -5270859 -5589100 -4109673 -5115595 -3574784 -2290095 -3445884 -4391399
10624 -4391399 -3369117 -3414082 -4392769 -4283097 -3989996 -4877140 -4869293 -4390571 -5230646 -4797715 -4847992
10613 -4847992 -4820200 -3459712 -4770886 -4376247 -4352410 -5876538 -4180775 -1932500 -5697116 -6453765
10603 -6453765 -7013689 -6480937 -4986762 -5037724 -4635743 -3095759 -3325196 -4199543 -5197220 -4666175
10593 -4666175 -3987269 -4611236 -5693686 -5326550 -5367982 -3822264 -5060028 -3722650 -4953330 -4905049
10583 -4905049 -3116983 -4187337 -4075952 -4624730 -5781210 -4628660 -4877150 -3260627 -2929723 -3766012
10573 -3766012 -3269535 -3112724 -3653644 -3913229 -3185461 -2458905 -3561581 -5082785 -2998041 -3925423
10563 -3925423 -2413459 -2423879 -3240973 -5165861 -5454192 -4972426 -3360636 -4012310 -3395292 -4721779
10553 -4721779 -4614811 -3534315 -4687616 -2876949 -4130375 -4193738 -4124855 -2768693 -4686884 -3630956
10543 -3630956 -5271562 -5249146 -2945716 -4116458 -4678661 -3458954 -5200329 -4203869 -5582905 -5280274
10533 -5280274 -3172489 -3697515 -4414317 -5671337 -3768877 -3090595 -3668001 -3861576 -3852091 -4505086
10523 -4505086 -5277967 -3424836 -3247274 -3426512 -3085389 -4125178 -3590571 -1380526 -3452619 -4091440
10513 -4091440 -391687 -4487820 -4916227 -5442586 -4871071 -2382771 -3552130 -1639561 -1216797 -770270
10503 -770270 -2530048 -3637421 -2858299 -2878362 -4358477 -4181976 -561622 -3572703 -3699068 -3784287
10493 -3784287 -2558048 -4247603 -2858686 -4349610 -3681888 -2851716 -3074659 -4166426 -3889349
10484 -3889349 -2131400 -3043419 -4561028 -3908620 -987421 -1786271 -4809735 -2545427 -3245362 -2906961
10474 -2906961 -3318761 -3795430 -2839932 -3050671 -6019017 -5086234 -4598936 -4216388 -4752327 -5688038
10464 -5688038 -3845606 -3132142 -3246295 -4635741 -5996406 -6038397 -5473448 -2650254 -3211968 -3044890
10454 -3044890 -3245902 -3449200 -2715627 -6271562 -4181636 -2812065 -3514133 -2394514 -3619696
10445 -3619696 -4726218 -2709450 -1934969 -3207595 -3494026 -3940369 -3618532 -3696752 -2079786 -2405965
10435 -2405965 -4561639 -1447338 -2007486 -2385722 -2387120 -2767587 -4830492 -5121764 -4178234 -4032521
10425 -4032521 -3107040 -3314132 -3322377 -2186197 -3308913 -3599521 -2511826 -4012914 -3715319 -4866072
10415 -4866072 -3579448 -1762965 -3698764 -3242007 -3912451 -2246851 -4424448 -4449599 -2592416
10406 -2592416 -3734737 -4512470 -3431403 -2815849 -3956614 -4275769 -2849294 -3789598 -2028029 -2552150
10396 -2552150 -5709414 -3841331 -2141311 -2728260 -1050644 -4630558 -2721123 -2840169 -3294328
10387 -3294328 -4340294 -4210795 -2987454 -2671854 -2222198 -2055245 -1978081 -3149488 -7711456 -6245773
10377 -6245773 -2505313 -3469828 -2653369 -4288656 -3580512 -4391906 -1268896 -2085635 -3127074 -4384375
10367 -4384375 -1742570 -3945561 -3147795 -4132039 -3116443 -3988070 -2587519 -3150715 -1594848 -1354936
10357 -1354936 -2732830 233378 -2638016 -1752170 -2718044 -3413027 -3090817 -2822742 -1656805 -2113261
10347 -2113261 -2751645 -1341384 -3486389 -3757487 -5135160 -3009776 -3890812 -2453477 -2875662
10338 -2875662 -5793607 -3987011 -2724599 -3795265 -3179642 -1846660 -1426415 -2979832 -3278538
10329 -3278538 -4644285 -2048817 -1052697 -1798928 -2570727 -197375 -1546946 -2373671 -4111986 -4057610
10319 -4057610 -3276975 -4031186 -2107452 -4206150 -2761243 -4586275 -5037269 -4995153 -3012849 -2561403
10309 -2561403 -3045173 -5003035 -3896263 -6383011 -4699493 -2949635 -2524147 -4572104 -3343781
10300 -3343781 -2294813 -1677784 -1438851 -3773995 -2140718 -4055367 -2856560 -3744609 -3500959 -2618964
10290 -2618964 -341634 -2371726 -2524886 -2128553 -3236526 -2514288 -2129730 -2351993 -3688758 -2320189
10280 -2320189 -3644127 -3980779 -4492189 -2649398 -3046853 -3232492 -2235394 -2694684 -1844855 -3118092
10270 -3118092 -1626141 -3939067 -2547244 -2951368 -911787 -3132321 -3132814 -4514811 -3107728 -2948477
10260 -2948477 -3630366 -2620193 -2299153 -2964695 -1796372 -2061072 -2799849 -2486556 -3876151 -2828297
10250 -2828297 -467860 -1091681 -2138041 -3159803 -2066027 -2213149 -3440350 -4837746 -3717923
10241 -3717923 -2412728 -2639296 -3125264 -3774712 -6431908 -3889685 -1727471 -2655516 -3352526 -4788560
10231 -4788560 -3730235 -5379006 -2412756 -2484721 -1634977 -2453016 -3039238 -1820557 -1880794 -5028995
$$ [...]
-2730b687628  $$ checkpoint
##END NTUPLES=
##END=
