##TITLE= S#344046
##JCAMP-DX= 5.00 $$ JEOL NMR v1.10
##DATA TYPE= NMR SPECTRUM
##DATA CLASS= NTUPLES
##NUM DIM= 1
##ORIGIN= DELTA_NMR
##OWNER= organic
##SPECTROMETER/DATA SYSTEM= DELTA_NMR
##.OBSERVE FREQUENCY= 3.00529655924288E+02
##.OBSERVE NUCLEUS= ^1H
##.DELAY= (2.194E+02,2.194E+02)
##.ACQUISITION MODE= SIMULTANEOUS
##.FIELD= 7.0586013
##.FILTER WIDTH= 1.81675738660864
##.ACQUISITION TIME= 3.6339712
##.SPINNING RATE= 14
##.OBSERVE 90= 9.6
##NTUPLES= NMR SPECTRUM
##VAR NAME= FREQUENCY,    SPECTRUM/REAL, SPECTRUM/IMAG, PAGE NUMBER
##SYMBOL=   X,            R,             I,             N
##VAR TYPE= INDEPENDENT,  DEPENDENT,     DEPENDENT,     PAGE
##VAR FORM= AFFN,         ASDF,          ASDF,          AFFN
##VAR DIM=  16384, 16384, 16384, 2
##UNITS= PPM,     ARBITRARY UNITS, ARBITRARY UNITS, 
##FIRST=  1.2501033903057E+01, -1.56698621269663, -1.21145999259004, 1
##LAST=  -2.50011824950436, -1.1915407361764, -1.34201303588949, 2
##FACTOR=  9.1565355261926E-04, 2.85933321384102E-04, 2.85933321384102E-04, 1
##PAGE= N=1
##DATA TABLE=(X++(R..R)), XYDATA
$$ [...]
5413a5278109j842076K710187k694307K623988P26680k93902j596426q74966O93949n59224
5403a6384206O04445k000035J5847J378623K88040r77427j256634Q86868J707933k563954
5393a8300500J555303J138317J118994k545775q43177n77085M459977q39980N83359m87048
5383a4737615j119673j613049l042K63605J764550j953937J640973k275726q96797P67492
5373a8163219P05648N53281J505893j833590l93293K477829j758908J716707j377808
5364a6567460j210377J025286K132324j166486k3765l636604N12466J872892K123959
5355a4937765m37493k790829o83478Q30594J087158J32673j756355R25543R60552j241554
5345a7910954n07155L757874k378112Q52725P74069j034494l038644m05003K660816
$$ plain form
5413 -15278109 -17120185 -14409998 -17104305 -14480317 -13753637 -14047539 -15643965 -16518931 -15824982 -16384206
5403 -16384206 -15779761 -17779796 -17763949 -16385326 -16097286 -17074713 -18331347 -17444479 -15736546 -18300500
5393 -18300500 -16745197 -15606880 -14487886 -17033661 -17876838 -18453923 -13993946 -14833926 -14250567 -14737615
5383 -14737615 -15857288 -17470337 -17473379 -17209774 -15445224 -17399161 -15758188 -18033914 -18930711 -18163219
5373 -18163219 -17457571 -16904290 -15398397 -17231987 -17625280 -15147451 -16906359 -15189652 -16567460
5364 -16567460 -17777837 -16752551 -14620227 -15786713 -15810478 -19447082 -18934616 -17061724 -14937765
5355 -14937765 -15375258 -18166087 -18849565 -18018971 -16931813 -16799140 -18555495 -17629952 -16669400 -17910954
5345 -17910954 -18418109 -14660235 -17038347 -16185622 -15411553 -16446047 -19484691 -19889694 -17228878
5336a7228878J747265o85897O13051J565359j896105j20166o14503O43236j352653q07541
5326a8136832J902142k573502L643432M55445n52669p37739p59785O68398q40791j153945
5316a8085846l29703j229671K799386J085212J537020p34217p15586q1041J138149q59643
5306a5475940o285974K308810L026075k039784o43171K886492O99579j145902K50550O4208
5296a6355057J468126p46085O24924q74941j40504j395046R12025J152940J511890l282522
5286a7124250l913531K024777K196963n27401j287183M77957P10833R98309J004231q39610
5276a6278905n91706j71619J197906l613978L144025j031059k13426j157331m453523
5267b3169616M626929N53294J034710k257030J962224j679621k22992j234903M36345
$$ plain form
5336 -17228878 -15481613 -16167510 -15554459 -13989100 -15885205 -16005371 -16619874 -15976638 -17329291 -18136832
5326 -18136832 -16234690 -18808192 -15164760 -14709315 -15261984 -15999723 -16759508 -16091110 -16931901 -18085846
5316 -18085846 -18415549 -19645220 -16845834 -15760622 -14223602 -14957819 -15673405 -15754446 -14616297 -15475940
5306 -15475940 -21761914 -19453104 -16427029 -18466813 -19109984 -16223492 -15523913 -16669815 -16419265 -16355057
5296 -16355057 -14886931 -15633016 -15008092 -15883033 -16023537 -17418583 -16506558 -15353618 -13841728 -17124250
5286 -17124250 -21037781 -19013004 -16816041 -17343442 -18630625 -18152668 -17441835 -16443526 -15439295 -16278905
5276 -16278905 -16870611 -17042230 -15844324 -19458302 -16314277 -17345336 -17558762 -18716093 -23169616
5267 -23169616 -18542687 -17989393 -16954683 -19211713 -17249489 -18929110 -19152102 -20387005 -19950660
5258a9950660J02467J077245j072697M02467m81070l232107k583291j005441K06907
5249b6536180l524696k919849o294258q679902j3076206m704875J06052375k3733762
5241A6582647r213735n500877j824455j154114l365869k120073m161982J619317K473748
5232f665393j517670J4079Q34403m020090l341376J366821k99997p11984O5986P29481
5222a3545740P13464r31488J219408j519037J348952k49253O21990R98176j490869j727361
5212a4561758q93053K321341j247019j70958K830067J140542j261478j646505j390970
5203a4879791m07830N98849J963646q44759j020286j845405Q66369K400941j618320
5194a4786586j667046k114584J894547J531617P08729j771106O72153J824719N7954
$$ plain form
5258 -19950660 -19848193 -18770948 -19843645 -19441178 -19922248 -23154355 -25737646 -26743087 -26536180
5249 -26536180 -30060876 -32980725 -39274983 -47954885 -61031091 -65735966 40316409 16582647
5241 16582647 7368912 1868035 43580 -1110534 -4476403 -6596476 -10758458 -9139141 -6665393
5232 -6665393 -8183063 -8168984 -7334581 -11354671 -14696047 -13329226 -13629223 -14341207 -14275221 -13545740
5222 -13545740 -12832276 -13763764 -12544356 -14063393 -12714441 -12963694 -12341704 -11343528 -12834397 -14561758
5212 -14561758 -15454811 -13133470 -14380489 -14551447 -11721380 -10580838 -11842316 -13488821 -14879791
5203 -14879791 -15287621 -14688772 -12725126 -13569885 -14590171 -16435576 -15569207 -13168266 -14786586
5194 -14786586 -16453632 -18568216 -16673669 -15142052 -14433323 -16204429 -15532276 -13707557 -13649603
5185a3649603J526362j852821k483346p11086l42032J230712N51539m41441o0883J449627
5175a4782972M348R07160N3221p77060p83788M92344j96511k035227K163156j545490
5165a6500819K289936j702929P2003q08184Q34222l49972l68475O88237J016897q46948
5155a5676032L92117j423j264271q58680q03214K140855J873778j484185j590288K492669
5145a4778674l062662R26284M15411L742757k857487J784060Q42614l4634j671337m16341
5135a5110009J180128o97010l920j877756J204484J52592K242685m955738m12029K707707
5125a5568866q546J180115j043694j127685K18878P15433R31578M77145J25106k349267
5115a6449803R45890J476799j195596o24778P99571n11555L640591q823711K301327
$$ plain form
5185 -13649603 -12123241 -13976062 -16459408 -17170494 -17512526 -16281814 -15730275 -16171716 -16232599 -14782972
5175 -14782972 -14778624 -13871464 -13818243 -14595303 -15379091 -14886747 -15083258 -17118485 -14955329 -16500819
5165 -16500819 -14210883 -15913812 -15841809 -16649993 -15815771 -16165743 -16534218 -15845981 -14829084 -15676032
5155 -15676032 -15283915 -15285338 -16549609 -17408289 -18211503 -16070648 -14196870 -15681055 -17271343 -14778674
5145 -14778674 -17841336 -16915052 -16499641 -12756884 -15614371 -13830311 -12987697 -13022331 -14693668 -15110009
5135 -15110009 -13929881 -14626891 -14630811 -16508567 -15304083 -15151491 -12908806 -17864544 -18276573 -15568866
5125 -15568866 -15577412 -14397297 -15440991 -16568676 -16349798 -15634365 -14702787 -14225642 -14100536 -16449803
5115 -16449803 -15503913 -14027114 -15222710 -15847488 -15047917 -15559472 -11918881 -20742592 -18441265
5106a8441265K417199m92529o5907J309844j051450O1443J577432j357194K662791k644272
5096a6023908L52565J351671j161880L223343q672409J174946J002350K399495o04173
5087a6958000N03405r89596P55392J52293k34709L20461j33351Q27807K054023k448894
5077a6151169J652871j117335n16516P38611j971477j042976O48276J559993L40509
5068a5859213j257732K85940m43923K871284l19554m653003L317244J175660j971924K6429
5058a6828792P22392j677242p85706K243306j158068N42824l591509K01015M390583
5049a5941197k741822J711280m37717K255016n10018j307751J240995l168099P82947
5040a8116366K877288o13945k056883L190479p74298N08846j574485l10681O40023j820589
$$ plain form
5106 -18441265 -16024066 -16516595 -16582502 -15272658 -16324108 -16262665 -14685233 -16042427 -13379636 -16023908
5096 -16023908 -15671343 -14319672 -15481552 -12258209 -20930618 -19755672 -18753322 -16353827 -16958000
5087 -16958000 -16454595 -17444191 -16688799 -16536506 -16771215 -16450754 -16584105 -15756298 -13702275 -16151169
5077 -16151169 -14498298 -15615633 -16132149 -15393538 -17365015 -18407991 -17759715 -16199722 -15859213
5068 -15859213 -17116945 -16831005 -17274928 -14403644 -14723198 -19376201 -16058957 -14883297 -16855221 -16828792
5058 -16828792 -16106400 -17783642 -18569348 -16326042 -17484110 -16941286 -20532795 -20331780 -15941197
5049 -15941197 -18683019 -16971739 -17409456 -15154440 -15664458 -16972209 -15731214 -18899313 -18116366
5040 -18116366 -15239078 -15853023 -17909906 -14719427 -15493725 -14984879 -16559364 -16870045 -16230022 -18050611
5030a8050611o40081R70720K70608J36280J111376K107386k184972o34206p88983P52290
5020a6950193M92941J034416k127605j854684J525156n6098K130126M33666m48190l578418
5010a9398883J874025q76198j32022K955505j705579j64959J249165j785813o79031
5001a8663790J656815l24846L22659Q46820j629167N43353j262638J370352K302596l21993
4991a5159839j71812q46446j164112J627478K8966m28581j141464k200431O201718l594086
4981a6848609K843322q75155k187342o31805O61582J089232M05740n53874K17595j637902
4971a7517216J103645M24090j586560p65525m9693J26859L13582K96307N298845l75397
4961a2731063k888947j07727r1028j087710K383264l162843M66050K495768k138493N70865
$$ plain form
5030 -18050611 -18690692 -17719972 -17449364 -17313084 -16201708 -14094322 -16279294 -16913500 -17702483 -16950193
5020 -16950193 -16457252 -15422836 -17550441 -19405125 -17879969 -17936067 -15805941 -15372275 -15820465 -19398883
5010 -19398883 -17524858 -18401056 -18533078 -15577573 -17283152 -17448111 -16198946 -17984759 -18663790
5001 -18663790 -17006975 -17331821 -17009162 -16162342 -17791509 -17248156 -18510794 -17140442 -14837846 -15159839
4991 -15159839 -15331651 -16178097 -17342209 -15714731 -15685765 -16114346 -17255810 -19456241 -13254523 -16848609
4981 -16848609 -14005287 -14880442 -17067784 -17699589 -17038007 -15948775 -15543035 -16096909 -15879314 -17517216
4971 -17517216 -16413571 -15989481 -17576041 -18341566 -18391259 -18264400 -17950818 -17654511 -12355666 -12731063
4961 -12731063 -15620010 -15727737 -15818765 -16906475 -14523211 -17686054 -17220004 -14724236 -16862729 -16291864
4951a6291864J457288j233159j399140j3365J17912R43058j124774J860379k21453j409258
4941a7314376j112434Q69680Q90534j920095q65330K929885J55068P10518j99673j327247
4931a7183470q03988n5958J86342K466078j086780N69884j399478J136388k408258P0312
4921a8508928J772716k51058o32920K88606k71446k003783J507487J490610l76054q32012
4911a7816782L506991k71577k105172j383337n71678P88296J549109j398758p7726J15278
4901a7665356J395531J1713L67965J61377m64212k360945K270120n01746n09944k878349
4891b0173846K568451N95045Q37421N93324j479123n26544P87412n23159J063969j620875
4881a7877925L051663k85526r09796L34215k70946J367443l320495J119621J69619J457870
$$ plain form
4951 -16291864 -14834576 -16067735 -17466875 -17480240 -17362328 -16419270 -17544044 -15683665 -15905118 -17314376
4941 -17314376 -18426810 -17557130 -16666596 -18586691 -19452021 -16522136 -16367068 -15656550 -15856223 -17183470
4931 -17183470 -17987458 -18043416 -17857074 -15390996 -16477776 -15907892 -17307370 -16170982 -18579240 -18508928
4921 -18508928 -16736212 -16987270 -17620190 -17331584 -17603030 -19606813 -18099326 -16608716 -16984770 -17816782
4911 -17816782 -14309791 -14581368 -16686540 -18069877 -18641555 -17853259 -16304150 -17702908 -17780634 -17665356
4901 -17665356 -16269825 -16258112 -15890147 -15728770 -16192982 -18553927 -16283807 -16785553 -17295497 -20173846
4891 -20173846 -17605395 -17010350 -16172929 -15579605 -17058728 -17585272 -16797860 -17321019 -16257050 -17877925
4881 -17877925 -14826262 -15111788 -16021584 -15687369 -15958315 -14590872 -17911367 -16791746 -16622127 -15164257
4871a5164257j653176q78456K413120l143949j467150L68968K660127Q48137j962557
4862a7979193R95562k97543K262296m26095l26731n62165k61834j25249l34840q08904
4852a7864696J662858k074093J665867J363647j029097k185408O97629K76606J768957
4843a5717730l122441j724526J438094K892527j669671j190367L027499j266157M0005
4834a7292767k79709Q29938o80838M07754r1268j14993J565111j865732P22240J120541
4824a5679723j792377k526539J39249J674781k496643J313118J855651l066018k26935
4815b0805436o88487L67720p64779j771744j35154k906637j753771L6466203J2076286
4806B0084201k0320122o583730k155076l624534j711373R03596J443540j601783j955410
$$ plain form
4871 -15164257 -16817433 -17695889 -15282769 -18426718 -19893868 -19524900 -16864773 -16016636 -17979193
4862 -17979193 -16983631 -17281174 -15018878 -15444973 -15771704 -16333869 -16595703 -16720952 -17055792 -17864696
4852 -17864696 -16201838 -18275931 -16610064 -15246417 -16275514 -18460922 -17763293 -17486687 -15717730
4843 -15717730 -18840171 -20564697 -19126603 -16234076 -17903747 -19094114 -16066615 -17332772 -17292767
4834 -17292767 -17572476 -16742538 -17423376 -17015622 -17106890 -17221883 -15656772 -17522504 -16800264 -15679723
4824 -15679723 -17472100 -19998639 -19859390 -18184609 -20681252 -19368134 -17512483 -20578501 -20805436
4815 -20805436 -21493923 -21126203 -21890982 -23662726 -23797880 -26704517 -28458288 8007915 20084201
4806 20084201 -235921 -6819651 -8974727 -12599261 -14310634 -13407038 -11963498 -13565281 -15520691
4797a5520691J143357R86495l20383m139528K23653O153614o24122k388394j095298q05184
4787a6386481L63642R4518n69489j130052K524597K02963o44992j112395K988967n87896
4777a4256618j379081k260408L24373q59421N533821l034029n03926o88803K309288
4768a4814804J029199k336522k50788K724086j178131P65499n47642j2169M4071j431099
4758a6008300j077839O80526k643148K293188J865681j125529l79444M5692J424520
4749a4924653j333528P78390N97199J453502j560877M539J24973j782209q35021J151962
4739a6325723J588933l737757L872824j216771R30787j30361m37509o32872N76225J648666
4729a3863558l162455J561789J7823j402075L24254j018579K885649j004631j389503
$$ plain form
4797 -15520691 -14377334 -13390839 -13711222 -17850750 -17627097 -11473483 -12097605 -14485999 -15581297 -16386481
4787 -16386481 -16022839 -15928321 -16497810 -17627862 -15103265 -14900302 -15545294 -16657689 -13668722 -14256618
4777 -14256618 -15635699 -17896107 -17571734 -18431155 -12897334 -15931363 -16435289 -17124092 -14814804
4768 -14814804 -13785605 -16122127 -16372915 -13648829 -14826960 -14061461 -14609103 -14621272 -14577201 -16008300
4758 -16008300 -17086139 -16405613 -19048761 -16755573 -14889892 -16015421 -16394865 -16349173 -14924653
4749 -14924653 -16258181 -15479791 -14882592 -13429090 -14989967 -14985428 -14860455 -16642664 -17477685 -16325723
4739 -16325723 -14736790 -18474547 -14601723 -15818494 -14887707 -15018068 -15455577 -16088449 -15512224 -13863558
4729 -13863558 -17026013 -15464224 -15446401 -16848476 -16524222 -17542801 -14657152 -15661783 -17051286
4720a7051286j333121k44509K010888M62686J12132Q93280j767565N70227p54620K011798
4710a5090090o22947P85773o28164p2273q19000Q85194l489048R40051J674240k397259
4700a8833523J591711J43808Q63933J320849k026105J92165L807762k348065k359221
4691a7646686J726058j071960O54331O16869m093067K730582K46913r37735k62063J680515
4681a6356243j291307k37788N79645R7906N07330q65227j640600K190851K437632j172969
4671a5750770m70247J470490o92726K68100N11856r33522r65895M79819Q66799j699724
4661a6915820k508450K99514K061785J568439k578000J530613J29059P77388N19955m68367
4651a5583884k569544L102799k825479J570152k201228K673388j340885j13206o44180
$$ plain form
4720 -17051286 -18384407 -18628916 -16618028 -16155342 -16043210 -15149930 -16917495 -16347268 -17101888 -15090090
4710 -15090090 -15713037 -14927264 -15555428 -15627701 -16446701 -15561507 -19050555 -18110504 -16436264 -18833523
4700 -18833523 -17241812 -17098004 -16234071 -14913222 -16939327 -16747162 -12939400 -15287465 -17646686
4691 -17646686 -15920628 -16992588 -16338257 -15721388 -19814455 -17083873 -16836960 -17774695 -18036758 -16356243
4681 -16356243 -17647550 -17885338 -17305693 -17207787 -16700457 -17565684 -19206284 -17015433 -14577801 -15750770
4671 -15750770 -16221017 -14750527 -15443253 -15175153 -14663297 -15596819 -16562714 -16082895 -15216096 -16915820
4661 -16915820 -19424270 -19124756 -17062971 -15494532 -18072532 -16541919 -16412860 -15635472 -15115517 -15583884
4651 -15583884 -18153428 -15050629 -17876108 -16305956 -18507184 -15833796 -17174681 -17287887 -17932067
4642a7932067O61748J212743k429751N65689k798927M191784J279044p65853j685421
4633a7701011m62829K868083p04979j341573R77592n93737O84728k281036Q21491J228802
4623a6504469j61276J430127L5469j199515r27131J139138k608421O17281r12863J640678
4613a7450982j59169M65412J556824K57976j93356n16567k39990n12455K71904m977
4603a6525380J805536k046509p67159j20501p76066R11492O25421P03322j651193K330732
4593a5510305j532129k77860l06255K771974K321605k707572n20604l02611J33070m68132
4583a6398819R01880j836829m35163j227629q46983K984594J6679K837058n07730k906186
4573a7419128N4283k300608K772305j288268k47391j36475J251545M69882O25602j28124
$$ plain form
4642 -17932067 -17270319 -16057576 -18487327 -17921638 -20720565 -16528781 -15249737 -16015590 -17701011
4633 -17701011 -18163840 -15295757 -16000736 -17342309 -16364717 -16958454 -16273726 -18554762 -17733271 -16504469
4623 -16504469 -16665745 -15235618 -15200149 -16399664 -17326795 -16187657 -18796078 -18178797 -19091660 -17450982
4613 -17450982 -17610151 -17144739 -15587915 -15329939 -15523295 -16039862 -16279852 -16792307 -16520403 -16525380
4603 -16525380 -14719844 -16766353 -17533512 -17654013 -18430079 -17518587 -16893166 -16189844 -17841037 -15510305
4593 -15510305 -17042434 -17320294 -17626549 -14854575 -12532970 -15240542 -15761146 -16063757 -15930687 -16398819
4583 -16398819 -15496939 -17333768 -17768931 -18996560 -19843543 -16858949 -16842270 -14005212 -14512942 -17419128
4573 -17419128 -17364845 -19665453 -16893148 -18181416 -18428807 -18565282 -17313737 -16843855 -16218253 -16346377
4563a6346377q64498L75303M15383j340432J821447j80945j634706M70804k267416K145794
4553a7405643N9352L67258j43182J454380J009078k202542P23780j971208M18564J446132
4543a6244031l10858J064130L70885L0000j21491j869309n16001J024996J352967l137810
4533a8356522j075554N32211K359479K0256k577301J375344o3044J950910j170919j921633
4523a8926773M853785k995216K90718j375478L359801j571704J038404j635275n94044
4514a7555782P66250N84619k528263J848307J013213q58904n09214J644240j455625L38507
4504a6712652j600899K256493n34357j58065J379319n77442r45076J638227l697401k21424
4494a9173277K84239O99176M019963o94094l48852j466890M57644O11360k08194j28274
$$ plain form
4563 -16346377 -17210875 -16835572 -16420189 -17760621 -15939174 -16120119 -17754825 -17284021 -19551437 -17405643
4553 -17405643 -17346291 -16979033 -17122215 -15667835 -14658757 -16861299 -16137519 -18108727 -17690163 -16244031
4543 -16244031 -16554889 -15490759 -15119874 -15089874 -15211365 -17080674 -17596675 -16571679 -15218712 -18356522
4533 -18356522 -19432076 -18899865 -16540386 -16520130 -19097431 -17722087 -17785131 -15834221 -17005140 -18926773
4523 -18926773 -14072988 -17068204 -16777486 -18152964 -14793163 -16364867 -15326463 -16961738 -17555782
4514 -17555782 -16789532 -16204913 -18733176 -16884869 -15871656 -16730560 -17239774 -15595534 -17051159 -16712652
4504 -16712652 -18313551 -16057058 -16591415 -16749480 -15370161 -15947603 -16892679 -15254452 -18951853 -19173277
4494 -19173277 -18889038 -18189862 -14169899 -14863993 -15212845 -16679735 -16222091 -15610731 -15818925 -15947199
4484a5947199M8058j285878J403266Q90120N31399r03696p01985K20501M12920j377938
4474a6710432J01820k005272J658578q58460r06521K044515m45793M29088n8314k04198
4464a6954989J389988j204770Q62638j413910J054125k464015Q71325R91989K147984
4455a4719635j542564J214251o78330j110561J95555j44436n60867j373290J435671
4446a7284206j416578j02160o07993J005021J727602P2249O32153K372885j394575l46980
4436a5342582j057474j99972J407654l22848j510750l29360J493851n75775K235056P37371
4426a3464829j015240J87323j877540L90216l62571m05641M92913M29738m0043R04839
4416a4760835j275049M9607l64290O85093o20508Q82133k184830K94215K65500j529822
$$ plain form
4484 -15947199 -15899141 -17185019 -15781753 -14891633 -14360234 -15263930 -15965915 -15745414 -15332494 -16710432
4474 -16710432 -16608612 -18613884 -16955306 -17813766 -18720287 -16675772 -17121565 -16692477 -16750791 -16954989
4464 -16954989 -15565001 -16769771 -15907133 -17321043 -16266918 -18730933 -17859608 -16867619 -14719635
4455 -14719635 -16262199 -15047948 -15726278 -16836839 -16641284 -16785720 -17346587 -18719877 -17284206
4446 -17284206 -18700784 -18802944 -19410937 -18405916 -16678314 -16606065 -15973912 -13601027 -14995602 -15342582
4436 -15342582 -16400056 -16600028 -15192374 -15515222 -17025972 -17355332 -15861481 -16437256 -14202200 -13464829
4426 -13464829 -14480069 -14292746 -16170286 -15780070 -16142641 -16548282 -16055369 -15625631 -15665674 -14760835
4416 -14760835 -16035884 -15986277 -16350567 -15665474 -16285982 -15403849 -17588679 -17294464 -17028964 -18558786
4406a8558786M361961j273295j27758J578764M3245k958677J798811n9838p41590O06565
4396a5330598m0792Q8863l63765J783712K85277m79710O53148J84499k060030K20129
4386a5059267j601043L40631n42928m0219N119513m92998J24590P29160n03935k32234
4376a2158730j55299J572478K943067Q089564N0903332q1447032N455127J477972M67562
4367b2851959J096278K243388j243710M78605K365914r58345j432241J070951K168434
4358a7062685J3531o35023K307842l64280J07627J75644k4213k32758j405993R7279
4348a7023029j155985J961447J322086q82365q54662m85959J272618J526371k867539
4339a7187017O88996j158671J840047J151163m94842R9289k318668q00152N39713L775900
$$ plain form
4406 -18558786 -14196825 -15470120 -15597878 -14019114 -13975869 -16934546 -15135735 -15195573 -15937163 -15330598
4396 -15330598 -15371390 -15282527 -15646292 -13862580 -13577303 -14057013 -13403865 -13219366 -15279396 -15059267
4386 -15059267 -16660310 -16319679 -16862607 -16902826 -11783313 -12276311 -12151721 -11422561 -11926496 -12158730
4376 -12158730 -12314029 -10741551 -7798484 291080 51194412 -30252620 -24797493 -23319521 -22851959
4367 -22851959 -21755681 -19512293 -20756003 -20277398 -17911484 -18869829 -20302070 -19231119 -17062685
4358 -17062685 -17049154 -17684177 -15376335 -15740615 -15632988 -15457344 -15481557 -15714315 -17120308 -17023029
4348 -17023029 -18179014 -16217567 -14895481 -15777846 -16632508 -17118467 -15845849 -14319478 -17187017
4339 -17187017 -16498021 -17656692 -15816645 -14665482 -15160324 -15061035 -17379703 -18179855 -17640142 -13864242
4329a3864242j147589j626969k672028J630848K194484q6083j408613J501646j316539
4320a6795085l51391L509259P58887k399594P67026k969396K888630q33791k133312
4311a7558767K088386K207143o38968J076068j221599L50947m76040Q74682k683715
4302a5981863l575105K415938K444111j414162k62321m22170j091349J982368J448979
4293a4455574J242787k140446r16618N11962j2842R36348q73060P32503J284881R56939
4283a2733120J92597j246110j32124j736205p678128O343025p00685k815020M481511
4274a6024259L490814k974563J87996P54601m01717K638587k474625N00655k10956P19572
4264a3793895j040779R01195J293566j744784O96850j705718J64642m61757j211821
$$ plain form
4329 -13864242 -15011831 -16638800 -19310828 -17679980 -15485496 -15571579 -16980192 -15478546 -16795085
4320 -16795085 -17146476 -13637217 -12878330 -15277924 -14510898 -17480294 -14591664 -15425455 -17558767
4311 -17558767 -15470381 -13263238 -13902206 -12826138 -14047737 -13696790 -14172830 -13298148 -15981863
4302 -15981863 -19556968 -17141030 -14696919 -16111081 -16373402 -16795572 -17886921 -15904553 -14455574
4293 -14455574 -13212787 -15353233 -16269851 -15757889 -15770731 -14834383 -15707443 -14974940 -13690059 -12733120
4283 -12733120 -12540523 -13786633 -13918757 -15654962 -23333090 -16990065 -17690750 -20505770 -16024259
4274 -16024259 -12533445 -15508008 -15320012 -14565411 -14967128 -12328541 -14803166 -14302511 -14513467 -13793895
4264 -13793895 -14834674 -13933479 -12639913 -14384697 -13687847 -15393565 -15228923 -15690680 -16902501
4255a6902501J986385K696320L99727m63005j364254j197472o89888l66893K544880O38017
4245a2718684l57950q33053P57398k54159n00845J135749j944368J647080L1514M7462
4235a2989856m70523n39110j079213K054352l88262K064791j467926N4991J230226j83867
4225a1714397J780254p86865J001787L572153n483883k755519R47684j00145J297588
4216a2241343l52418K38j401548K993052k006981L05877l2220N16274Q42161j887339
4206a3264247O65271J115062J645826n55021M52482m67090J865134k672355J707876l80936
4196i887998J34958j022229K047921K49636j503765j553200L126579r55719q72301J132473
4186i103645J648743J387739j854588k9227J579074k224005j06525Q6341o47113J445313
$$ plain form
4255 -16902501 -14916116 -12219796 -11820069 -12283074 -13647328 -14844800 -15534688 -15901581 -13356701 -12718684
4245 -12718684 -13076634 -13909687 -13152289 -13406448 -13907293 -12771544 -14715912 -13068832 -13037318 -12989856
4235 -12989856 -13460379 -13999489 -15078702 -13024350 -13412612 -11347821 -12815747 -12760756 -11530530 -11714397
4225 -11714397 -9934143 -10721008 -9719221 -6147068 -11630951 -14386470 -13438786 -13538931 -12241343
4216 -12241343 -12593761 -12593523 -13995071 -11002019 -13009000 -12703123 -12735343 -12219069 -11376908 -13264247
4206 -13264247 -12598976 -11483914 -9838088 -10393109 -9940627 -10407717 -8542583 -11214938 -9507062 -9887998
4196 -9887998 -9753040 -10775269 -8727348 -8477712 -9981477 -11534677 -8408098 -9363817 -10236118 -9103645
4186 -9103645 -7454902 -6067163 -7921751 -7950978 -6371904 -8595909 -8702434 -8616093 -9263206 -7817893
4176g817893R30907l66571O07625M99834P36233p34220J824777j038326J451052K70491
4166c636091J403626K952682J728671j701163J313176J586813N58347J27587K235305
4157F568953k676110J537470K38307q11357j380188M694773J3121L74896Q6616P12266
4147I358747M43615K958133J530084K579901O39491K616330J066259K015449L041064O9344
4137B6318417l93150L922823Q96683J747884J518759k90998K060149k9818K618289K470741
4127D0839779K624606L291162L048437q84956N274003M851037L855121K026759N842441
4118G0768389L22159K497566M417273L372623K198880K533155L204884J854934J156092
4109I2325955K877732K612815O045673M272889O979493P153681M817692J342355Q011575
$$ plain form
4176 -7817893 -6886986 -7253557 -6645932 -6146098 -5409865 -6144085 -4319308 -5357634 -3906582 -3636091
4166 -3636091 -2232465 720217 2448888 747725 2060901 3647714 4206061 4333648 6568953
4157 6568953 3892843 5430313 5668620 4857263 3477075 8171848 8184969 8559865 8646481 9358747
4147 9358747 9802362 12760495 14290579 16870480 17509971 20126301 21192560 23208009 26249073 26318417
4137 26318417 25925267 29848090 30744773 32492657 34011416 33720418 35780567 35750749 38369038 40839779
4127 40839779 43464385 46755547 49803984 48919028 54193031 59044068 62899189 64925948 70768389
4118 70768389 71090548 73588114 78005387 81378010 83576890 86110045 89314929 91169863 92325955
4109 92325955 95203687 97816502 103862175 108135064 115114557 122268238 127085930 128428285 136439860
4100A36439860R738358R588642Q016513K228582K597788j528196j658594L713178N012343
4091A74148474M344008J708237J613378j466193L409172N053161N588665O046486Q408107
4082B08853495P895666Q233993J1559559J6613172K1115049J9761892J5207026R044472
4074C18284324n202923j4736706k1443817j4527350o073443k062226l006274l170891
4066B48060694k591989L86656O398276M400397N489106N147994Q612107R142517J2924659
4057B97970417J9915665K7914894L0681682L1406532J2466401n222079k9239181m4573091
4049C41321240m7399547l1336478j9969499j1758521j2119850j0977078l165302K965210
4041B07560175O823244O374209M034794L901609P660916R717221J1052494J7007779
$$ plain form
4100 136439860 146178218 155766860 163783373 166011955 168609743 167081547 165422953 169136131 174148474
4091 174148474 178492482 180200719 181814097 180347904 183757076 188810237 194398902 200445388 208853495
4082 208853495 216749161 224983154 236542713 253155885 274270934 294032826 309239852 318284324
4074 318284324 313081401 298344695 276900878 262373528 256300085 254237859 251231585 248060694
4066 248060694 245468705 245855361 252253637 256654034 262143140 267291134 275903241 285045758 297970417
4057 297970417 317886082 345800976 376482658 407889190 420355591 415133512 385894331 341321240
4049 341321240 293921693 262585215 242615716 230857195 218737345 207760267 204594965 207560175
4041 207560175 214383419 220757628 224792422 228694031 236354947 246072168 257124662 274132441
4033B74132441K6409867K4269910K0673868J641692k2009124m2896701m9844777m5267462
4025A87109714l0521061k1790396j5052346j0168932l838876J463897K009727O078836
4017A15290563O509095J544683K450664K600663L149570M773068P262629J2440817R829305
4008A65851057L194134p010538j9717260k6574084k6321927k1914067j4302793r414490
4000D3790032o429691l945052J536737L882057Q41212M077898J748223N04765K418685
3991D8424866k941428l862145J226437q02396K390213k18689r71989k932180m787908
3982C5524781p226997o331064m669965l289625j50855m14936o43946J261436O42441r23659
3972A3777611R4655o71005R4827K28653j933510l137333k004693J423003l822859K816481
$$ plain form
4033 274132441 300542308 324812218 345486086 347127778 325118654 282221953 232377176 187109714
4025 187109714 156588653 134798257 119745911 109576979 105738103 107202000 109211727 115290563
4017 115290563 121799658 123344341 125795005 128395668 131545238 136318306 143580935 156021752 165851057
4008 165851057 169045191 162034653 142317393 115743309 89421382 67507315 53204522 43790032
4000 43790032 37360341 33415289 34952026 38834083 39675295 43753193 45501416 46006181 48424866
3991 48424866 45483438 41621293 42847730 42045334 44435547 44216858 43244869 40312689 35524781
3982 35524781 28297784 21966720 17296755 14007130 13856275 13441339 12797393 14058829 14701270 13777611
3972 13777611 13872266 13201261 13296088 13524741 11591231 8453898 6449205 7872208 4049349 6865830
3962F865830j58552K92475j535206j287752k79138j827393L077279l49437j463235J302043
3952D636914j713951k706943M04681J39192r04221J460354r94137l05731l301046J346222
3942a938666l470177j818731p7366m68976K562807l95986o83022R652695l007266l564521
3932c209209o88553j138635O45597m337235K79K776495j41564m20048k685196j63573
3922i361642j447077J361038j650827r17935j760106L866965p71116r94190j404035N03535
3912a2575390J40546J628639J188381P11903q774999J348168J37792j98402Q56532L83360
3902a5153470j163446J088509k433895J616576J231396j482729q28584j766128L962527
3893a4929244j388226p21494Q67417j159244J038460n49070p5227j34487o49969J364590
$$ plain form
3962 6865830 6707278 6999753 5464547 4176795 3897657 2070264 5147543 4798106 3334871 4636914
3952 4636914 2922963 216020 620701 759893 -144328 1316026 321889 16158 -3284888 -1938666
3942 -1938666 -5408843 -7227574 -7304940 -7773916 -5211109 -5607095 -6290117 3362578 355312 -3209209
3932 -3209209 -3897762 -5036397 -4390800 -8728035 -8727756 -5951261 -6092825 -6512873 -9198069 -9361642
3922 -9361642 -10808719 -9447681 -11098508 -12016443 -13776549 -9909584 -10680700 -11674890 -13078925 -12575390
3912 -12575390 -12434844 -10806205 -9617824 -8905921 -17680920 -16332752 -16194960 -16393362 -15536830 -15153470
3902 -15153470 -16316916 -15228407 -17662302 -16045726 -14814330 -16297059 -17125643 -18891771 -14929244
3893 -14929244 -16317470 -17038964 -16171547 -17330791 -16292331 -16841401 -16916628 -17051115 -17701084 -16336494
3883a6336494K475932K42675l086626N57486q9931J260909R20618l18610L94070q0028
3873a4059999j425119J689330k388301l121251J904396J041786k509942J338939J694439
3864a5835722j558709j75295l19143J690786J87817o42777L378561k304980J95469r31745
3854a6315738J846784j271214K12901o43911J580545k58493j455866M71740m76776P1652
3844a6238376Q86139n65296j035873K235289K0818J131932k380124j440625J745751j62875
3834a5803240j233646K41183R38067k10747Q98249k809278K390034N55764M30240j36090
3824a4739464m01733j70660L65554j883784J888072Q18960J948773k088051K35272j60560
3814a4187621q07565r40928K244709q54074o41216J33415n58042R63508j81032J014955
$$ plain form
3883 -16336494 -13860562 -13617887 -16704513 -16147027 -16236958 -14976049 -14055431 -14374041 -13979971 -14059999
3873 -14059999 -15485118 -13795788 -16184089 -19305340 -17400944 -16359158 -18869100 -17530161 -15835722
3864 -15835722 -17394431 -17569726 -17888869 -16198083 -16010266 -16653043 -13274482 -15579462 -15383993 -16315738
3854 -16315738 -14468954 -15740168 -15527267 -16171178 -14590633 -14849126 -16304992 -15833252 -16310028 -16238376
3844 -16238376 -15352237 -15917533 -16953406 -14718117 -14697299 -13565367 -15945491 -17386116 -15640365 -15803240
3834 -15803240 -17036886 -16795703 -15857636 -16068383 -15170134 -17979412 -15589378 -15033614 -14603374 -14739464
3824 -14739464 -15141197 -15311857 -14946303 -16830087 -14942015 -14123055 -12174282 -14262333 -14027061 -14187621
3814 -14187621 -14995186 -15936114 -13691405 -14545479 -15186695 -15053280 -15611322 -14647814 -14828846 -13813891
3804a3813891q59216j463770K254733O81398j58353j574942j443195n06714L636961N95889
3794a2651100l34182J084279k440166j105093O58280J017528q55861J0639J92270q64232
3784a5287638J630701o21547L3811J001180J20452J59815j176707M04113k20474P43091
3774a3213203N51934p54549M94282o58225M8420K623765k430727k454382P19160k82696
3764a5356221M83109M52723j127941j388558R91512M33479j2200M58672K39083j104315
3754a5930657J49066j497955j048460L500289K76203J16116j729047J23333P96681r47288
3744a6191719J696706j065091j002598o0673q8397K122071K66502J45220l54706j042626
3734a5575311J604755Q62136J47041j565428j237818k867905L633316o65535l17988p8119
$$ plain form
3804 -13813891 -14673107 -16136877 -13882144 -13200746 -13359099 -14934041 -16377236 -16883950 -13246989 -12651100
3794 -12651100 -12985282 -11901003 -14341169 -15446262 -14787982 -13770454 -14626315 -14615676 -14423406 -15287638
3784 -15287638 -13656937 -14278484 -14244673 -13243493 -13123041 -12963226 -14139933 -13735820 -13956294 -13213203
3774 -13213203 -12661269 -13415818 -12921536 -13579761 -13531341 -10907576 -13338303 -15792685 -15073525 -15356221
3764 -15356221 -14873112 -14420389 -15548330 -16936888 -15945376 -15511897 -15524097 -15065425 -14826342 -15930657
3754 -15930657 -15781591 -17279546 -18328006 -14827717 -14551514 -14435398 -16164445 -16041112 -15244431 -16191719
3744 -16191719 -14495013 -15560104 -16562702 -16623375 -16711772 -14589701 -14323199 -14177979 -14532685 -15575311
3734 -15575311 -13970556 -13108420 -12961379 -14526807 -15764625 -18632530 -14999214 -15664749 -15982737 -16060856
3724a6060856j407825o38435J681003L19246n11384m62050P65008J585992l115741L58396
3714a7486646Q17423q52571P71878K17094r47992Q73625Q58727k87403k629294Q78790
3704a7786369J29733j476760J127786M476888k905777o24286K402527L37461r36204P75160
3694a4479841o64750K14909j982024J673164J361750k772214Q3010J223630q08183J679323
3684a4471226k719687R63445P31227j209550R05354J062862k941107J955579q08947
3675a6532050J139940j567037J048755J53075j204931J183700j829825k05374J34867
3666a7678880L918049q27439M06791j802858J073918J662594q19653k803222P95576k21876
3656a6297000J81383j142595K36653M78597j405256j576737J562445O78522Q69596J822372
$$ plain form
3724 -16060856 -17468681 -18107116 -16426113 -16106867 -16618251 -17080301 -16315293 -14729301 -17845042 -17486646
3714 -17486646 -16669223 -17521794 -16749916 -16532822 -17480814 -16607189 -15748462 -16035865 -18665159 -17786369
3704 -17786369 -17656636 -19133396 -18005610 -13528722 -16434499 -17058785 -14656258 -14318797 -15255001 -14479841
3694 -14479841 -15144591 -14929682 -16911706 -15238542 -13876792 -16649006 -16565996 -15342366 -16150549 -14471226
3684 -14471226 -17190913 -16227468 -15496241 -16705791 -15800437 -14737575 -17678682 -15723103 -16532050
3675 -16532050 -15392110 -16959147 -15910392 -15757317 -16962248 -15778548 -17608373 -17813747 -17678880
3666 -17678880 -13760831 -14588270 -14181479 -15984337 -14910419 -13247825 -14067478 -16870700 -16075124 -16297000
3656 -16297000 -16115617 -17258212 -17021559 -16542962 -17948218 -19524955 -17962510 -17283988 -16414392 -14592020
3646a4592020j663538J011472Q3262l521433j16264J746665N2029j321266J258360j052202
3636a8114935P18068o88245O29730N43306k21195L16431j45445Q693901m556542o76618
3626a3501544L764416m096458k360027J213251R03250N80718m036010n0581J5196J004989
3616a6562800j059217K130011o25587r74815J402739j28340O65191k134347J129562
3607a6157603J485236L92304k654784N56292J415519k521697l39361K140140n10034
3598a6193988k766909K267313r22491O50412J041219l95930j084950O33611q38393l27560
3588a7937666K069924j101990L2020j398778J285178r40634K330878j149332j0951J873002
3578a4948349l633850J756480j007536Q0318k11776J238441J436813K20425m80305n33729
$$ plain form
3646 -14592020 -16255558 -15244086 -15160824 -18682257 -18798521 -17051856 -16999827 -18321093 -17062733 -18114935
3636 -18114935 -17396867 -18085112 -17455382 -16912076 -17133271 -16816840 -16962285 -8268384 -12824926 -13501544
3626 -13501544 -9737128 -13833586 -16193613 -14980362 -14077112 -13496394 -17532404 -17582985 -17567789 -16562800
3616 -16562800 -17622017 -15492006 -16117593 -17092408 -15689669 -15818009 -15152818 -17287165 -16157603
3607 -16157603 -14672367 -14280063 -16934847 -16378555 -14963036 -17484733 -17824094 -15683954 -16193988
3598 -16193988 -18960897 -16693584 -17616075 -16965663 -15924444 -16320374 -17405324 -16771713 -17610106 -17937666
3588 -17937666 -15867742 -16969732 -16937712 -18336490 -17051312 -17991946 -15661068 -16810400 -16821351 -14948349
3578 -14948349 -18582199 -16825719 -17833255 -17752937 -17964713 -16726272 -15289459 -15069034 -15549339 -16083068
3568a6083068k232073J169613J254739j607209M90819l46864J50122P74M09835l1341
3558a6824653j205143L161681j57521j498152o5869q10984M62666k85575M17079j65407
3548a6971878J783442q40424j482999p02219N72214r02516o94055J340016K10138L82515
3538a7305766k090250J361718j63974J281600N66059K13599P06682j805594J118958p26545
3528a6843513m10912o89322k8523m99529K82809K411866R76765k090802J623588k300375
3518a7567948K844928R22024j843775j703946p32541m52467R37851P66161j498533l43194
3508a8671440J446033K827750k577919o10932Q80405j529488r41570L43017J329157j75104
3498a7680091R89286J968101k1079J057234l088814R76613l340069K342978M8517l23900
$$ plain form
3568 -16083068 -18315141 -17145528 -15890789 -17497998 -17007179 -17354043 -17203921 -17203147 -16793312 -16824653
3558 -16824653 -18029796 -14868115 -15025636 -16523788 -16589657 -17400641 -16937975 -17223550 -16806471 -16971878
3548 -16971878 -15188436 -16028860 -17511859 -18214078 -17641864 -18544380 -19238435 -17898419 -17688281 -17305766
3538 -17305766 -19396016 -18034298 -18198272 -16916672 -16350613 -16137014 -15430332 -17235926 -16116968 -16843513
3528 -16843513 -17254425 -17943747 -17972270 -18471799 -18188990 -15777124 -14800359 -16891161 -15267573 -17567948
3518 -17567948 -14723020 -13800996 -15644771 -17348717 -18081258 -18533725 -17595874 -16829713 -18328246 -18671440
3508 -18671440 -17225407 -14397657 -16975576 -17586508 -16706103 -18235591 -19177161 -18834144 -17504987 -17680091
3498 -17680091 -16690805 -14722704 -14743783 -13686549 -16775363 -15798750 -19138819 -16795841 -16747324 -17071224
3488a7071224j612240Q72398Q69311L385612L070164n216900J10112l77153j490549M16769
3478a7043700K89832j819064J340167P87195o76042L89347J461180r14860K14020k315140
3468a8287065R38510j290712J680398p49339O53127L84529k583135J101406J176738N50045
3458a6425498j25273p92102n32851m31094J382112j210623O66817K6819J760J071895
3448a6368038N54792j538720o91350J00996J470330P56709j953351O23530q73426n53652
3438a8472180K35465m14326K25413M32961K7246K18774R86744l390793L412563l887335
3428b0625468K308518K75077p07171L120354m52311q37329K29626m39107j14251Q49756
3418a6392306k94978o21337o09487P29857m95033N08702N72714L72293j479289q70447
$$ plain form
3488 -17071224 -18683464 -17811066 -16941755 -13556143 -10485979 -15702879 -15592767 -15969920 -17460469 -17043700
3478 -17043700 -16753868 -18572932 -17232765 -16445570 -17121612 -16732265 -15271085 -16185945 -15971925 -18287065
3468 -18287065 -17348555 -18639267 -16958869 -17708208 -17055081 -16670552 -19253687 -18152281 -16975543 -16425498
3458 -16425498 -16550771 -17342873 -17875724 -18306818 -16924706 -18135329 -17468512 -17441693 -17439933 -16368038
3448 -16368038 -15813246 -17351966 -18043316 -17942320 -16471990 -15715281 -17668632 -17045102 -17918528 -18472180
3438 -18472180 -18236715 -18651041 -18425628 -17992667 -17965421 -17746647 -16759903 -20150696 -16738133 -20625468
3428 -20625468 -18316950 -18041873 -18749044 -15628690 -16081001 -16918330 -16688704 -17127811 -17242062 -16392306
3418 -16392306 -16687284 -17308621 -17918108 -17188251 -17683284 -17174582 -16601868 -16229575 -17708864 -18579311
3408a8579311J746684Q18301k672029J347539M60790n28010l09528K326821j489056
3399a6877799j139207l50014J402982R99724k433490P42602p86217k8730j532295K315484
3389a7686960P51439n60506j10408O53078j001513P06963k04484k98866p67567m9840
3379a8568664O00762J375810j008796l51768J390933p25686M53214J856354k052894
3370a7030735k342022J381644Q78767j920793O59178J94216K0019j280727J499051j678328
3360a9619730J356364J889023o11768Q33707l77101n33695j089368K97499R91953L2075
3350a6831041k400083J472155j713171K399008J87889j719122L34629r54826r40131
3341b0164693J141970J658276Q45691K341107k538580k75100l434094J669616M127986
$$ plain form
3408 -18579311 -16832627 -16014326 -18686355 -17338816 -16878026 -17406036 -17715564 -15388743 -16877799
3399 -16877799 -18017006 -18367020 -16964038 -15964314 -18397804 -17655202 -18441419 -18470149 -20002444 -17686960
3389 -17686960 -16935521 -17496027 -17606435 -16953357 -17954870 -17247907 -17452391 -17751257 -18518824 -18568664
3379 -18568664 -17967902 -16592092 -17600888 -17952656 -16561723 -17287409 -16834195 -14977841 -17030735
3370 -17030735 -19372757 -17991113 -17112346 -19033139 -18373961 -18179745 -18159726 -19440453 -17941402 -19619730
3360 -19619730 -18263366 -16374343 -16986111 -16152404 -16529505 -17063200 -18152568 -17855069 -16863116 -16831041
3350 -16831041 -19231124 -17758969 -19472140 -17073132 -16885243 -18604365 -18269736 -19224562 -20164693
3341 -20164693 -19022723 -17364447 -16518756 -14177649 -16716229 -16991329 -20425423 -18755807 -14627821
3332a4627821k131012O78592j021601Q58137k50615k753031J446524k4922j219903J12991
3322a8932661J297534O14612L5428j639003k210991J852612J742520P04221q04191m61387
3312a7801306M85398j623584K057397Q71195k081655K114590o97187L65412j486553n8507
3302a7854800J68988J066079n91405K21138L59874j157134K244438o18705j308866Q24279
3292a6646114j220602K30136Q45460J608106k934011J529932r26622L31767N47517K86599
3282a6347832O96532q58342k275445J252224L54169k584623J478613K604634m497200
3273b0177270J783351J386464J383437j986249J6917k76020M67961P37756J61616R62918
3263a5539119j172184J3477N2035j736378R0971m02241j451084K863413J937r25359R54821
$$ plain form
3332 -14627821 -16758833 -16080241 -17101842 -16243705 -16494320 -19247351 -17800827 -17825749 -19045652 -18932661
3322 -18932661 -17635127 -17020515 -16985087 -18624090 -20835081 -18982469 -17239949 -16535728 -17339919 -17801306
3312 -17801306 -17315908 -18939492 -16882095 -16010900 -18092555 -15977965 -16675152 -16309740 -17796293 -17854800
3302 -17854800 -17685812 -16619733 -17211138 -16990000 -16630126 -17787260 -15542822 -16161527 -17470393 -16646114
3292 -16646114 -17866716 -17636580 -16791120 -15183014 -18117025 -16587093 -17513715 -17181948 -16634431 -16347832
3282 -16347832 -15651300 -16509642 -18785087 -17532863 -17178694 -19763317 -18284704 -15680070 -20177270
3273 -20177270 -18393919 -17007455 -15624018 -17610267 -17593350 -17869370 -17401409 -16663653 -16502037 -15539119
3263 -15539119 -16711303 -16697826 -16645791 -18382169 -18291198 -18693439 -20144523 -17281110 -17279173 -18204532 -17249711
3252a7249711r42980J86959N68934J293737k107377J79944k6503L56939O70990K297597
3242a4771471m97320m329732k03647J915827r0567P590m1256M962740k44750m855987
3232a8148573J70495q0523J017408M45727j87440K469962l27271k333753o32803J583523
3222a6023248j082500j383018l75087J709695K860679j023868l43415l282789j4207
3213a8957758J002617m52097Q80530o55055m66244J767636j681976P27950J60334J143832
3203a6530231l006266M79376J070322J222407R4761j237875j61551K284846r41165J612321
3193a5113055n86816j473844n56045k6251Q10715o01953k64312J295944k646953J673808
3183a7488762l08725o41666o97443q90759K977950j889186P99442m76488O33538J504032
$$ plain form
3252 -17249711 -18192691 -18005732 -17436798 -16143061 -18250438 -18070494 -18096997 -17740058 -17069068 -14771471
3242 -14771471 -15268791 -19598523 -19802170 -17886343 -17976910 -17969320 -18010576 -13047836 -13292586 -18148573
3232 -18148573 -17978078 -18058601 -17041193 -16595466 -16782906 -14312944 -14640215 -16973968 -17606771 -16023248
3222 -16023248 -17105748 -18488766 -18863853 -17154158 -14293479 -15317347 -15660762 -18943551 -18957758
3213 -18957758 -17955141 -18407238 -17526708 -18181763 -18648007 -16880371 -18562347 -17834397 -17674063 -16530231
3203 -16530231 -19536497 -19057121 -17986799 -16764392 -16669631 -17907506 -18069057 -15784211 -16725376 -15113055
3193 -15113055 -15699871 -17173715 -17729760 -17756011 -16945296 -17547249 -17811561 -16515617 -19162570 -17488762
3183 -17488762 -17797487 -18439153 -19136596 -20027355 -17049405 -18938591 -18139149 -18615637 -17982099 -16478067
3173a6478067q80933r45701K155987j352584O31876j138014k497185J73775J4052K665187
3163a7651607L02739j689056r39842J853164j136328J649325K25837n32798J101226l59898
3153a7177238J74250q17397n24999p59421K87628K614906J89272P5911j737615j104943
3143a8779646J084708j327305J477405P91749k184832J438714n32420L18731k154015
3134a9866911J476164J035484k42936J252336p76088q32179r36074k78201P41423N09016
3124a7917966K074270l177398j016048K117071j729037j994162J778397M2460m49393
3115b0271806J840081j047217J813737J051532j088855J178195K643594j337351k755789
3106a7973879L26557J18024L24008m2728O94495j961478k21094J40619J962198K961408
$$ plain form
3173 -16478067 -17359000 -18304701 -16148714 -17501298 -16869422 -18007436 -20504621 -20330846 -20316794 -17651607
3163 -17651607 -17348868 -19037924 -19977766 -18124602 -19260930 -17611605 -17385768 -17918566 -16817340 -17177238
3153 -17177238 -17002988 -17820385 -18345384 -19104805 -18817177 -16202271 -16012999 -15937088 -17674703 -18779646
3143 -18779646 -17694938 -19022243 -17544838 -16753089 -18937921 -17499207 -18031627 -17712896 -19866911
3134 -19866911 -18390747 -17355263 -17598199 -16345863 -17121951 -17954130 -18890204 -19168405 -18426982 -17917966
3124 -17917966 -15843696 -19021094 -20037142 -17920071 -19649108 -21643270 -19864873 -19822413 -20271806
3115 -20271806 -18431725 -19478942 -17665205 -16613673 -17702528 -16524333 -13880739 -15218090 -17973879
3106 -17973879 -17647322 -17529298 -17205290 -17248018 -16553523 -18515001 -18736095 -18595476 -16633278 -13671870
3096a3671870m885782K816385P12952J327548m066315J574936J756251o468643N80137
3087b0324401J370309K059879o49374k529493K122076j059628J274890K18445J049692
3078a6467605j948175Q33630j612267L76954L045764j706607m32363K386490o431042
3069b1955221K381472N91045r42363j512762Q03612k253418M061710O45440L79642j609145
3059a9409988r22897P2174K198719l97239j188372p4228R27195J238736L42131n76229
3049a7789998j603776J47530K01713R12540j616874K063844k419426P07327j416120o40853
3039b1454093M373127L65021l07647P2324J477180j086072k075592P49353L3191Q80542
3029a6972666k308262K309633K435482j053690l485785N624243l844250j70292M18217
$$ plain form
3096 -13671870 -18557652 -15741267 -15028315 -13700767 -17767082 -16192146 -14435895 -20904538 -20324401
3087 -20324401 -18954092 -16894213 -17543587 -20073080 -17951004 -19010632 -17735742 -17517297 -16467605
3078 -16467605 -18415780 -17582150 -19194417 -18817463 -15771699 -17478306 -17910669 -15524179 -21955221
3069 -21955221 -19573749 -18982704 -19925067 -21437829 -20634217 -22887635 -18825925 -18180485 -17800843 -19409988
3059 -19409988 -20332885 -20260711 -18061992 -18459231 -19647603 -19721831 -18794636 -17555900 -17213769 -17789998
3049 -17789998 -19393774 -19246244 -19044531 -18131991 -19748865 -17685021 -20104447 -19397120 -20813240 -21454093
3039 -21454093 -17080966 -16715945 -17023592 -16951268 -15474088 -16560160 -18635752 -17886399 -17853208 -16972666
3029 -16972666 -19280928 -16971295 -14535813 -15589503 -19075288 -13451045 -17295295 -17465587 -17047370
3020a7047370J740149q83119n82115q03641k973518K490398J36488n84454K542012j413765
3010a7378935n62257j582751J495601J224333o65467l432974K169149k34271K534505
3001a6433067j708007n01391K04643J830414k180775L1281o48757j598495K80581L102278
2991a7621295o28134l457564J556333N53053O17781J313445k33083k81124k50442p96237
2981a9227267K876843k619429J134740o41044k28470J595908j302346J662922N31726
2972a6216417j238167J353858l861030J634611J632434q46506p99687j305638J157847
2963a8488695J829271j047111j368909o48671K963994j580046K076999k867399r74913
2954b0105480K752858o85176J71018o52589j428503J98714N480117p89867k641771j349255
$$ plain form
3020 -17047370 -15307221 -16190340 -16772455 -17576096 -20549614 -18059216 -17922728 -18507182 -15965170 -17378935
3010 -17378935 -17941192 -19523943 -18028342 -16804009 -17469476 -20902450 -18733301 -18967572 -16433067
3001 -16433067 -18141074 -18642465 -18437822 -16607408 -18788183 -18756902 -19405659 -21004154 -20723573 -17621295
2991 -17621295 -18249429 -21706993 -20150660 -19597607 -18979826 -17666381 -17899464 -18180588 -18431030 -19227267
2981 -19227267 -16350424 -18969853 -17835113 -18476157 -18704627 -17108719 -18411065 -16748143 -16216417
2972 -16216417 -17454584 -16100726 -19961756 -18327145 -16694711 -17541217 -18340904 -19646542 -18488695
2963 -18488695 -16659424 -17706535 -19075444 -19724115 -16760121 -18340167 -16263168 -19130567 -20105480
2954 -20105480 -17352622 -18037798 -17866780 -18519369 -19947872 -19749158 -14269041 -15058908 -17700679 -19049934
2944a9049934K111218j130940R91573l12738l06491K69536m50906q61197n0050Q94148
2934a7895781j192300J208658j751145O45606o04748R52816J057827j16520K08968p73969
2924a8260588N60889n44269J947221j733928p71788R61612k05740O34353k107314K623791
2914a6895761M7527L18118O92986q53135l46921K30382n03143J061394o66393M43133
2904a6471813j23245j241729J236939j423787J040726J897144j477543q15072p5706j85854
2894a7639940R78937p95661j11702K96844j602772K12918P02821J619847k455133j607700
2884b0401541K581084j00309j679245j70269q86260K207627p21740M92997R42106k659670
2874b0395220M42998J484332J95990J684348j230984Q39670K95745N81102k145801K63504
$$ plain form
2944 -19049934 -16938716 -18069656 -17078083 -17390821 -17697312 -17427776 -17878682 -18739879 -18789929 -17895781
2934 -17895781 -19088081 -17879423 -19630568 -18984962 -19589710 -18636894 -17579067 -17695587 -17486619 -18260588
2924 -18260588 -17699699 -18243968 -16296747 -18030675 -18802463 -17840851 -18046591 -17412238 -19519552 -16895761
2914 -16895761 -16848234 -16530116 -15837130 -16690265 -17037186 -16806804 -17309947 -16248553 -16914946 -16471813
2904 -16471813 -16595058 -17836787 -16599848 -18023635 -16982909 -15085765 -16563308 -17378380 -17454086 -17639940
2894 -17639940 -16661003 -17456664 -17568366 -17271522 -18874294 -18661376 -17958555 -16338708 -18793841 -20401541
2884 -20401541 -17820457 -17920766 -19600011 -19770280 -20656540 -18448913 -19170653 -18677656 -17735550 -20395220
2874 -20395220 -19952222 -18467890 -18271900 -16587552 -17818536 -16978866 -16683121 -16102019 -18247820 -17984316
2864a7984316j49410l32756K150265J154667j048547j454673k91763J583296p0506j529267
2854a7973010m774950K528938K667564q23013o35286m12081J986737Q34224j636278j23481
2844a8360636o35575N30129K849542j63989j53046j706479L32854j33403N61044j885812
2834a8765371O14404Q42554j289418k8506J525590p32946Q839J163494K01809k140593
2824a8600144J932560j023688o0218k63054O85103p50454J234084K526956M456038n872107
2814a5734924l16916r74031j952534J351918K16887J501253L29283j050197j790628
2805a8419889K303653j346760R14820k393549J621488L70162J96195M79966j894400K88872
2795a7879442O84756N55077j342365J068278J641322K125535r757408M719261k77803
$$ plain form
2864 -17984316 -18133726 -18466482 -16316217 -15161550 -16210097 -17664770 -17956533 -16373237 -16443743 -17973010
2854 -17973010 -22747960 -20219022 -17551458 -18374471 -19009757 -19421838 -17435101 -16600877 -18237155 -18360636
2844 -18360636 -18996211 -18466082 -15616540 -15780529 -15933575 -17640054 -17307200 -17440603 -16879559 -18765371
2834 -18765371 -18150967 -17308413 -18597831 -18626337 -17100747 -17833693 -17824854 -16661360 -16459551 -18600144
2824 -18600144 -16667584 -17691272 -17751490 -18014544 -17329441 -18079895 -16845811 -14318855 -9862817 -15734924
2814 -15734924 -16051840 -17025871 -18978405 -17626487 -17409600 -15908347 -15579064 -16629261 -18419889
2805 -18419889 -16116236 -17462996 -16548176 -18941725 -17320237 -16950075 -16753880 -16273914 -18168314 -17879442
2795 -17879442 -17194686 -16639609 -17981974 -16913696 -15272374 -13146839 -22904247 -18184986 -18462789
2786a8462789J301634o36506O02751j840380n01866L382067k778279J318537J520655
2777a6094176l033020J41432j011771L793235n96834j49945Q44328J763578k434543
2768a6777716j070100J317196P37304P36304J55703p2585p648R28604j236914r13348
2758a6203200P01142P4124j74988J476649Q12977j657914m51703J371696J2877J950645
2748a2087695k90734R38949J379349o09248j536476M11046J129864P96090k121840j036522
2738a3027217J066688P71638m20382K015826Q17408j73044l68833K216726j524933j6817
2728h642940J051321O35734j346233K116684j113967k48973J178611O0946j703416K784952
2718e227281Q85573J786227J963886j181011K33808K587035l89931o05174J311407J00189
$$ plain form
2786 -18462789 -17161155 -17797661 -17194910 -19035290 -19537156 -16155089 -18933368 -17614831 -16094176
2777 -16094176 -19127196 -18985764 -19997535 -16204300 -16801134 -16951079 -16106751 -14343173 -16777716
2768 -16777716 -17847816 -16530620 -15793316 -15057012 -14901309 -14973894 -14981542 -14052938 -15289852 -16203200
2758 -16203200 -15502058 -15427934 -15602922 -14126273 -13313296 -14971210 -15422913 -14051217 -14038340 -12087695
2748 -12087695 -12378429 -11439480 -10060131 -10669379 -12205855 -11794809 -10664945 -9868855 -11990695 -13027217
2738 -13027217 -11960529 -11188891 -11609273 -9593447 -8776039 -8949083 -9317916 -7101190 -8626123 -8642940
2728 -8642940 -7591619 -6955885 -8302118 -6185434 -7299401 -7548374 -6369763 -6308817 -8012233 -5227281
2718 -5227281 -4341708 -2555481 -591595 -1772606 -1538798 1048237 658306 53132 1364539 1464728
2708A464728J333508m89668J341506p28211k6197O12417K013242L023022n12770J487614
2698I519191K040355K708424K48937J103537k973610O44656k044742j837447j561429
2689G847872N70422K264389J376324N26670j345003M637064o574j598776p70004K689030
2679A6191414j110530J398169l38454K375864K479899K755325L564718M723447N294057
2670C7333909k139528n51430l964078m470928r622491l794874m538636O42957k987545
2661E907356K585257j039153M825052k967723L103146r136p19232p48850p53719J618738
2651A1801736j134353O2340n04016J310599N607731L666176L670601L705987k705886
2642B5480915j745108n616274o571209q375860m018241k671519j280756k309595J53798
$$ plain form
2708 1464728 2798236 2308568 3650074 2921863 2895666 3508083 5521325 8544347 8031577 9519191
2698 9519191 11559546 14267970 14516907 15620444 12646834 13291490 11246748 9409301 7847872
2689 7847872 8418294 10682683 12059007 12585677 11240674 15877738 15871164 14272388 13502384 16191414
2679 16191414 15080884 16479053 16140599 18516463 20996362 23751687 27316405 32039852 37333909
2670 37333909 35194381 34642951 30678873 26207945 16585454 12790580 8251944 8894901 5907356
2661 5907356 8492613 7453460 12278512 9310789 12413935 12404799 11685567 10936717 10182998 11801736
2651 11801736 10667383 10729723 10225707 11536306 17144037 20810213 24480814 28186801 25480915
2642 25480915 23735807 18119533 11548324 3172464 -845777 -3517296 -4798052 -7107647 -6953849
2633f953849N59904k19200k1939J124483J8252k268628Q614503k891157m025630N03906
2623e559355j317693R97115M926763k946342J747140N7474J283864l272482Q07374L67849
2613b908293l838783m495324l180476J040396R80551K797167r02505J096109k198267
2604a1609425K12808k61322m655336J314136l2861J13398N37479L427169j369131j186332
2594a3509417j343817J549221p17379J462764r01424q36388L9923o09470j471926K121066
2584a4216847n36418R10944n06003J097117q6694O77516j759773m09332k976790L941759
2574a3864521j66817p26241Q8582j616960k05577J679035q44586J536688q31021J769190
2564a3182228r04813l90271K124043k960682m23110J27611m15043O31524K74136j185103
$$ plain form
2633 -6953849 -6393945 -6613145 -6635084 -5510601 -5492349 -7760977 853526 -2037631 -6063261 -5559355
2623 -5559355 -6877048 -5879933 -953170 -3899512 -2152372 -2094898 -811034 -4083516 -3276142 -2908293
2613 -2908293 -6747076 -11242400 -14422876 -13382480 -12401929 -9604762 -10507267 -9411158 -11609425
2604 -11609425 -11396617 -11657939 -16313275 -14999139 -15032000 -14918602 -14381123 -10953954 -12323085 -13509417
2594 -13509417 -14853234 -13304013 -14021392 -12558628 -13460052 -14296440 -14256517 -14865987 -16337913 -14216847
2584 -14216847 -14753265 -13842321 -14348324 -13251207 -13337901 -12660385 -14420158 -14829490 -17806280 -13864521
2574 -13864521 -14031338 -14757579 -14668997 -16285957 -16491534 -14812499 -15657085 -14120397 -14951418 -13182228
2564 -13182228 -14087041 -14477312 -12353269 -15313951 -15737061 -15609450 -16024493 -15392969 -15118833 -16303936
2554a6303936N18263j276933j53070K68942M26796J734776k517101j69224K015485k06091
2544a5662093R92668j759469Q76868k101362J196099O32495L22257J151639j474156
2535a5825054k827608K599710j868919Q87956N49374L56678k943990J027773P42157
2526a7301923J331240q69588o99807K98703J202439n40219k073042J095726J633918n98220
2516a6520773J058247k268205M79208M12053O41590k222457P25589J126004o27504O05220
2506a6591028K76951l78048j08459l94945K86961R96862o210k76418q11864k14857J58117
2495a7062938R59569m04809n65283L80687j153415m09249K648985l41189N98656J226006
2485a4122980j710664o27341j237145j097547L063530j170411J222523j70146j733875
$$ plain form
2554 -16303936 -15785673 -17062606 -17215676 -16946734 -16519938 -14785162 -17302263 -17471487 -15456002 -15662093
2544 -15662093 -14669425 -16428894 -15552026 -17653388 -16457289 -15824794 -15502537 -14350898 -15825054
2535 -15825054 -18652662 -16052952 -17921871 -17033915 -16484541 -16127863 -19071853 -18044080 -17301923
2526 -17301923 -15970683 -16840271 -17540078 -17241375 -16038936 -16579155 -18652197 -17556471 -15922553 -16520773
2516 -16520773 -15462526 -17730731 -17251523 -16839470 -16197880 -18420337 -17694748 -16568744 -17196248 -16591028
2506 -16591028 -16314077 -16692125 -16800584 -17195529 -16908568 -15911706 -15917916 -16194334 -17006198 -17221055 -17062938
2495 -17062938 -16103369 -16508178 -17073461 -16692774 -17846189 -18255438 -15606453 -15947642 -15348986 -14122980
2485 -14122980 -15833644 -16460985 -17698130 -18795677 -15732147 -16902558 -15680035 -15850181 -17584056
2476a7584056r53414M129760j350450N4853J233662k448989L54862J750749M57066k905883
2466a7261840M02254r33372n24912J353396P30770r44820N09183l76712J23525L29312
2456a6593216l08462p11493J778617l117089J369807L301570j376000q34644J98607R0879
2446a6201424P6642j375588N27228k736159J148080J698146K634358j68219l307833
2437a7704769K022374J489785l581534Q69741K42076J787219j325973J70205L68113
2428a5662763J834168N84679m56527L94121m2753J663511m19402M0132r54164R08049r4423
2417a2205372Q59859j482366L40600q05677j327710M069389o33848k109458K860395
2408a0434188k945749J669134m91787N48182j002962K030591o73994K094306m13830M58169
$$ plain form
2476 -17584056 -18537470 -14407710 -15758160 -15703307 -14469645 -16918634 -16563772 -14813023 -14355957 -17261840
2466 -17261840 -16859586 -17792958 -18317870 -16964474 -16233704 -17178524 -16669341 -17046053 -16922528 -16593216
2456 -16593216 -16901678 -17613171 -15834554 -18951643 -17581836 -14280266 -15656266 -16490910 -16292303 -16201424
2446 -16201424 -16124782 -17500370 -16973142 -19709301 -18561221 -16863075 -14228717 -14396936 -17704769
2437 -17704769 -15682395 -14192610 -17774144 -16904403 -16662327 -14875108 -16201081 -16030876 -15662763
2428 -15662763 -13828595 -13243916 -13700443 -13306322 -13349075 -11685564 -12104966 -12064834 -13018998 -12110949 -12205372
2417 -12205372 -11345513 -12827879 -12487279 -13292956 -14620666 -10551277 -11185125 -13294583 -10434188
2408 -10434188 -13379937 -11710803 -12202590 -11654408 -12657370 -10626779 -11300773 -9206467 -9620297 -9162128
2398i162128r7389r4939J575612o2366J367039k172339J293564j168926j496993K826746
2388g192119J160936R98062p95109K097816j341515N61019K087265J505528l53272M69018
2378h02371l54962o59606L60849M066622k51815R36092R4033Q39996K731694K833231
2368I793763J215607p53539J020677O59569M24743M99740J548699J750066P95210K163857
2358A9118392J464480J608227L686027o39367n38918j180238K983253p95324K15743
2349B5922275J795748K120583J441141P76170R81776L874709J141496L897813L116366
2340D5068077O0994K895901L141698L45148Q35909L324865M65549L344078M614397M269985
2330F8366601O355054M26555n88000m72782j32280j494142j291781L5721J340804j906572
$$ plain form
2398 -9162128 -9259517 -9354456 -7778844 -7841210 -6474171 -8646510 -7352946 -8521872 -10018865 -7192119
2388 -7192119 -6031183 -5033121 -5828230 -3730414 -5071929 -4510910 -2423645 -918117 -1271389 -802371
2378 -802371 -1157333 -1816939 -1456090 2610532 2358717 3294809 3388842 4228838 6960532 9793763
2368 9793763 11009370 10255831 11276508 11936077 12360820 12860560 14409259 16159325 16954535 19118392
2358 19118392 20582872 22191099 25877126 25237759 24698841 23518603 26501856 25706532 25922275
2349 25922275 27718023 29838606 31279747 32055917 33037693 36912402 38053898 41951711 45068077
2340 45068077 45129071 48024972 51166670 51511818 52347727 55672592 56138141 59482219 64096616 68366601
2330 68366601 74721655 75148210 74560210 74087428 73955148 72461006 71169225 71204946 72545750 70639178
2320G0639178J212539O804017J4842913J7371982K0749127J4220948L640336j5050810
2312A34430230k6290962l2548900k9513179k1364402j0537868j2633430n366871k763962
2304f589344j029277K540588M519128L283405K256083L445759P50405l458504j096531
2295D621712J28782o188291M2095l008651j637080k605055N54664O95511L76529R3309
2285f926475K001910p56626L044667K558486J664969M0271k618768K372642j100707
2276B80369J599657M04320j849473l81895l98580r40117m13987J61392K159147J114323
2266A735156o91790L397438Q73766k897312K80310j469406p00397N08775J555821j459777
2256A132584K802758J843998j452875L68900p65797k40919o5912j123625j018489K838384
$$ plain form
2320 70639178 71851717 78655734 93498647 110870629 131619756 145840704 149481040 134430230
2312 134430230 108139268 75590368 46077189 24712787 14174919 1541489 -3825382 -6589344
2304 -6589344 -7618621 -5078033 -558905 2724500 4980583 8426342 9176747 5718243 4621712
2295 4621712 4750494 -1437797 -1395702 -4404353 -6041433 -8646488 -8091824 -7396313 -7019784 -6926475
2285 -6926475 -4924565 -5681191 -2636524 -78038 1586931 1627202 -991566 1381076 280369
2276 280369 1880026 2284346 434873 52978 -345602 -1285719 -1699706 -1538314 620833 1735156
2266 1735156 1043366 4440804 5314570 2417258 2697568 1228162 527765 1036540 2592361 1132584
2256 1132584 3935342 5779340 4326465 4695365 3929568 3688649 3622737 2499112 1480623 4319007
2246D319007n00382K782828L96522Q0648K160074k659203J151554J277044j322509j391718
2236F293865J306163K984052o98510J811524p990j205169O66081L166956n79623n46470
2226A3190879L863698K69707K175841Q86154l61263Q90189q25021J353659j769488K079704
2216B1754059M429235o62396l168156P43432m27815j00854N324304j106910K245904
2207B9030803j019845K72342R52434p30345L629131L267949K838656K260992j079226
2198C9422891m325277n371534j105414K273404j57831R93963j669167k447649n654642
2189B1958744j326802J663682P1642L99238J277389k912219K298927J552290J155163
2180B6138054J499755j108778J516036L10235K367780j816086J277085o17639j66902
$$ plain form
2246 4319007 3818625 6601453 6997975 7078623 9238697 6579494 7731048 9008092 7685583 6293865
2236 6293865 7600028 10584080 9885570 11697094 11689104 10483935 11150016 14316972 13737349 13190879
2226 13190879 17054577 17324284 19500125 20386279 20025016 20915205 20090184 21443843 19674355 21754059
2216 21754059 26183294 25520898 22352742 23096174 22668359 22567505 27891809 26784899 29030803
2207 29030803 28010958 28283300 29235734 28505389 32134520 35402469 38241125 40502117 39422891
2198 39422891 35097614 29726080 28620666 30894070 30736239 31730202 30061035 27613386 21958744
2189 21958744 20631942 22295624 22367266 22766504 24043893 21131674 23430601 24982891 26138054
2180 26138054 27637809 26529031 28045067 28355302 30723082 28906996 30184081 29566442 29399540
2171B9399540k29266j369591J023595K254825J016974P23237J15896o87153J466203Q14725
2161C4528985J556844Q51400M61179J281063J355804L932198M00321p93802L686995
2152D7260987J300466P92560O19614K000107L92169N7826J319193L043845m60119L440636
2142E9767284K396345J499263O47593J943778J171933M97529J286141K088144J13775
2133G1411785L998828L330539J84157K842763M264049J622345J649635L265174P23714
2124I3292989R23656K199360L259659K832304L830219J213374K832583K16888J890642
2115A12491674N200364K308053K247130K650270L285480N126934L642760K760725N020682
2106A44734072J932934L702472L029048K603499K728787N613670L005653L950342M784538
$$ plain form
2171 29399540 29170274 27800683 28824278 31079103 32096077 32819314 32935210 32248057 33714260 34528985
2161 34528985 36085829 36937229 37398408 38679471 40035275 43967473 44367794 43573992 47260987
2152 47260987 48561453 49354013 49973627 51973734 52365903 52423729 53742922 56786767 56326648 59767284
2142 59767284 62163629 63662892 64310485 66254263 67426196 67923725 69209866 71298010 71411785
2133 71411785 75410613 78741152 78925309 81768072 86032121 87654466 89304101 92569275 93292989
2124 93292989 94216645 96416005 99675664 102507968 106338187 107551561 110384144 110601032 112491674
2115 112491674 117692038 120000091 122247221 124897491 128182971 133309905 136952665 139713390 144734072
2106 144734072 146667006 150369478 153398526 156002025 158730812 164344482 167350135 171300477 176085015
2097A76085015N435117N306748K049473M936129O033021L579332L830078K858957P108823
2088B17222693M806407N816459N587776O569446M919126M215715N881689P017999K623585
2079B64660895N916426M580913N197242N691802M906012N106020M820686L990252Q183845
2070C13054093L838598M214383M555891M494006L004217N225099L052319K740232p6569
2061C44102269J356347J850204M933639p77204K337479J419818l40448J081468j36610
2052C55826962m226533l151746j339997m705238l496104m934404n278597n477501n055758
2043C18161084p795695q050106p565104p333392p920805r522987q382617r367533q526459
2034B43696386r140957r055301r120254q849330n051006p713323q482935n243447p253204
$$ plain form
2097 176085015 181520132 186826880 188876353 193812482 199845503 203424835 207254913 210113870 217222693
2088 217222693 222029100 227845559 233433335 240002781 244921907 249137622 255019311 262037310 264660895
2079 264660895 270577321 275158234 280355476 286047278 290953290 296059310 300879996 304870248 313054093
2070 313054093 316892691 321107074 325662965 330156971 333161188 338386287 341438606 344178838 344102269
2061 344102269 345458616 347308820 352242459 351465255 353802734 355222552 354882104 355963572 355826962
2052 355826962 351600429 348448683 347108686 342403448 338907344 333972940 328694343 323216842 318161084
2043 318161084 310365389 302315283 294750179 287416787 279495982 269972995 261590378 252222845 243696386
2034 243696386 234555429 225500128 216379874 207530544 202479538 194766215 186283280 181039833 173786629
2025A73786629p997035n418876p101069o148592o630743l219725n200562m840724k951874
2016A24277429m694299n584697k727853m580393j940629o966124j523846k488114j858265
2007I1913209j358431m491051k426889j782242k329623k463386l298367k567764k765354
1998F8430102O35291j006477l389126K59217K35785l623373k594267n83321k064779j62320
1988E6136732r96586k928481k273365k481064p39126j178049j284258j120983k155416
1979D0979404o67713j518433J494627p36790o176836L23378K75035K275426j862770
1970C4385328k409207j087055j787379j253001k260091K298500j604380k167315j735976
1961B2379424J79921n0010j148092l003014M44498O96775j337933j335766J587369k038161
$$ plain form
2025 173786629 165789594 160370718 153269649 147121057 140490314 137270589 132070027 127229303 124277429
2016 124277429 119583130 113998433 111270580 106690187 104749558 97783434 96259588 93771474 91913209
2007 91913209 90554778 86063727 83636838 81854596 79524973 77061587 73763220 71195456 68430102
1998 68430102 69065393 68058916 64669790 64929007 65164792 61541419 58947152 58363831 56299052 56136732
1988 56136732 55140146 52211665 49938300 47457236 46718110 45540061 44255803 43134820 40979404
1979 40979404 40311691 38793258 40287885 39551095 33374259 33697637 33972672 36248098 34385328
1970 34385328 31976121 30889066 29101687 27848686 25588595 27887095 26282715 24115400 22379424
1961 22379424 22559345 22509335 21361243 18358229 18802727 19499502 18161569 16825803 18413172 16375011
1951A6375011l028622O83578j465117k99186J746095m745794M04707J275223l780967
1942G164928K491361j498755l92894j821109k9780j475633K11872q85400j816544j655293
1932B92753m67217J318554K481798l523958m82796j113162M28319k8890j336933L58589
1922b072943M53616P01309k358344o82517R47068j208812J551215k98155j999852J046999
1912c920416l42070L13059j169405L075568l010733j550929K453371j332583K02429
1903e281709J758163k203355r75037n23745l071921L192034M96062k157187r31955P25646
1893h973004J457961j413669O84362N59108m23148J52014N98273j061995J277033k51651
1883g394716j553587M93873n76551J774374j216644p46507L65300K970645k094996o18550
$$ plain form
1951 16375011 13346389 14029967 12564850 12265664 14011759 9265965 9670672 10945895 7164928
1942 7164928 9656289 8157534 7764640 5943531 5913751 4438118 4649990 3764590 1948046 292753
1932 292753 -174464 1144090 3625888 101930 -380866 -1494028 -1065709 -1094599 -2431532 -2072943
1922 -2072943 -1619327 -918018 -3276362 -3958879 -3011811 -4220623 -2669408 -2967563 -4967415 -3920416
1912 -3920416 -4262486 -3949427 -5118832 -2043264 -5053997 -6604926 -4151555 -5484138 -5281709
1903 -5281709 -3523546 -5726901 -6701938 -7225683 -10297604 -7105570 -6609508 -8766695 -9698650 -8973004
1893 -8973004 -7515043 -8928712 -8244350 -7685242 -8108390 -7956376 -7358103 -8420098 -7143065 -7394716
1883 -7394716 -8948303 -8454430 -9030981 -7256607 -8473251 -9219758 -8854458 -5883813 -7978809 -8597359
1873h597359l225365K798914P0604j684751J443695K786661l25981k208543L63972K69817
1863h308336O93472j130758o59232q6917q01183L460170j179880o508658K900638K86747
1853a1333937P37331J055146j386788L12819o7138P46454N69349N24577R41128m78318
1843h379377j460498n71863K769052l56430Q67241j352845J70901P20310j653287J13084
1833i133712r60224J15461Q92394J981474j137105n09530r86528p70109k02729Q47707
1823i862901j188270J895692O486M3864q83274J223231O92911J683080j198968K71194
1813g316955p79680J580525p34037J437798j296693R840M378387o14448l173220P53653
1803e754830j433654M41943J891803k85317N78862m39451j864024J319543j487165N86630
$$ plain form
1873 -8597359 -11822724 -9023810 -8953206 -10637957 -9194262 -6407601 -6733582 -8942125 -8578153 -8308336
1863 -8308336 -7614864 -8745622 -9404854 -9491771 -10292954 -6832784 -8012664 -14521322 -11620684 -11333937
1853 -11333937 -10596606 -9541460 -10928248 -10615429 -10682567 -9936113 -9366764 -8842187 -7901059 -8379377
1843 -8379377 -9839875 -10411738 -7642686 -7999116 -7131875 -8484720 -8313819 -7593509 -9246796 -9133712
1833 -9133712 -10093936 -9978475 -9086081 -7104607 -8241712 -8751242 -9737770 -10507879 -10710608 -9862901
1823 -9862901 -11051171 -9155479 -9148993 -9105129 -9988403 -8765172 -8072261 -6389181 -7588149 -7316955
1813 -7316955 -8096635 -6516110 -7250147 -5812349 -7109042 -7099202 -2720815 -3335263 -6508483 -5754830
1803 -5754830 -7188484 -6746541 -4854738 -5140055 -4561193 -5000644 -6864668 -5545125 -7032290 -6445660
1793f445660j476334m75498j60540J944491K537120m879308L597683j105333J267919
1784e195460K960136m024112R75327J324121M34410j858695J88575R74622q89667P13741
1774d397002j632548L994125l246969o50670N83705J449680n37456p24542R5619Q49176
1764d216882j071001p84031j899534K934243Q89794n87503J060420Q19757l18947k96143
1754c469827J220965p9152l49255K092845l12131J615137k437906r92753J678733K234802
1744A201458q0727K15890j892721J91919J135247p19740N87963J929737j057556K28370
1734A739840J664595J569446n91216r34624K797391j595168q98079J411390Q88794P87087
1724F839456J200833J148788L495318j318437L23626K038777J842511q50797l737828
$$ plain form
1793 -6445660 -7921994 -8397492 -8558032 -6613541 -4076421 -8955729 -5358046 -6463379 -5195460
1784 -5195460 -2235324 -6259436 -5284109 -3959988 -3525578 -5384273 -5195698 -4221076 -5110743 -4397002
1774 -4397002 -6029550 -2035425 -5282394 -5933064 -5349359 -3899679 -4437135 -5161677 -5066058 -4216882
1764 -4216882 -5287883 -6071914 -7971448 -5037205 -4147411 -4734914 -3674494 -2854737 -3173684 -3469827
1754 -3469827 -2248862 -2328014 -2677269 -584424 -896555 718582 -1719324 -2712077 -1033344 1201458
1744 1201458 1120731 1336621 -556100 -364181 771066 51326 639289 2569026 1511470 1739840
1734 1739840 3404435 4973881 4382665 3448041 6245432 4650264 3752185 5163575 6052369 6839456
1724 6839456 8040289 9189077 12684395 11365958 11689584 13728361 15570872 14720075 10982247
1715A0982247J671990p24171L826920J379053Q6096K382994P10842P89080r79894J830375
1705B1955532J756693K930189J864197k13749J182767J858308J053731L058476M846305
1696D0292449N42833K851362K392612N448298O44852J714247L732427o59300K596105P4937
1686E9630822J449443M547006R86140K518866M713026J248367K198875R23400N811272
1677H4027217L825815K127114M286606N729714L048267M810618M414665N881291N176851
1668A23328158L408676O738583P927047P694163O748385O35716O427342K922424L219562
1659A69050056Q024240L319432O542740N948861M568564M573607N062553M918258O736317
1650B18744628L341911Q595384P549483J2004920Q361405J1722611J2831376J5091260
$$ plain form
1715 10982247 12654237 11930066 15756986 17136039 17222135 19605129 20315971 21105051 20125157 21955532
1705 21955532 23712225 26642414 28506611 28292862 29475629 31333937 32387668 35446144 40292449
1696 40292449 40835282 43686644 46079256 51527554 52172406 53886653 57619080 56959780 59555885 59630822
1686 59630822 61080265 65627271 66613411 69132277 73845303 75093670 77292545 78215945 84027217
1677 84027217 87853032 89980146 94266752 99996466 103044733 107855351 112270016 118151307 123328158
1668 123328158 126736834 133475417 141402464 149096627 155845012 156480728 162908070 165830494 169050056
1659 169050056 177074296 180393728 186936468 192885329 197453893 202027500 207090053 212008311 218744628
1650 218744628 222086539 230681923 238231406 250236326 258597731 270320342 283151718 298242978
1642B98242978J4028538J2163194O737567N05042l417006L809344M044224M374189
1634C40488070J3244140R781644J0528260J6693613J5353513R712714K427804q049875
1626D10179883K050662K332347L247744O026603O964762J0598638J8183214K1153387
1618D80737240J9950436K1852045K2345005K0363410R513838L840477J84208j5825908
1610E62960751k0062300j1301785J527578J0273752O984646J5864240Q508869P650781
1602E82406532K456159j5547308k8763808j7889659q275275k927891r92027L086823
1594E13553546Q237022K0056369K8032337K5938528J7747955J9056283J5344434j722633
1586F46243841j4238667j0027565j0059353j7032712k6391388j9438203j6755933j4424886
$$ plain form
1642 298242978 312271516 324434710 331172277 331677319 328260313 332069657 336113881 340488070
1634 340488070 353732210 363513854 374042114 390735727 406089240 415801954 418229758 410179883
1626 410179883 412230545 414562892 417810636 423837239 430802001 441400639 459583853 480737240
1618 480737240 500687676 522539721 544884726 565248136 574761974 578602451 578786659 562960751
1610 562960751 542898451 531596666 533124244 543397996 550382642 566246882 574755751 582406532
1602 582406532 584862691 569315383 540551575 522661916 514386641 511458750 510466723 513553546
1594 513553546 521790568 541846937 569879274 595817802 613565757 632622040 647966474 646243841
1586 646243841 632005174 621977609 611918256 594885544 568494156 549055953 532300020 517875134
1578E17875134j0991168q135783j3450029j8014153k9496853k9845522k4186385p420742
1570C76334499m945716l513586k574283J047517R398743J9845313K0437031J0529258
1562D26558776P890399Q174659j1786524k2872858j2438486l948749j0633687j8744977
1554C62198553k1855772l2729637l6372901k3497490j2105558j5196432k0101115j4858387
1546A85481261j0382603n520605k661192J85053l576772l370247l087347k77117J190334
1537A57980765N095467O169409L166102K420623o189577q983123p735595n567018k181439
1528A44175614l192665j0683012j8782939j8457015q821061q735583j151151l092196
1520G1259992k759066o78266o66933j838445J701030K022163p44750k290663l719212
$$ plain form
1578 517875134 506883966 498748183 485298154 467284001 437787148 407941626 383755241 376334499
1570 376334499 371388783 367875197 365300914 366348431 375747174 395592487 416029518 426558776
1562 426558776 434449175 442623834 430837310 407964452 395525966 391577217 380943530 362198553
1554 362198553 340342781 307613144 271240243 247742753 235637195 220440763 200339648 185481261
1546 185481261 175098658 169578053 166916861 167101914 163525142 160154895 157067548 156790431 157980765
1537 157980765 163076232 169245641 172411743 174832366 168642789 159659666 151924071 146357053 144175614
1528 144175614 140982949 130299937 111516998 93059983 84238922 75503339 74352188 71259992
1520 71259992 68500926 67822660 67155727 65317282 67018312 69040475 68295725 66005062 62285850
1511F2285850k786618k463945J131178k063524m470531J866020J945591j089252l691577
1502E0663192l367985J67003K274675K59116M63447l451003l809453l820256k162127
1493C7216609R62017j877398j553716k659159N26646m67063k82071o94992m873623K852199
1483B9149449N73377m462020M702743O02078j397800o29225j188954k093639j119096
1474B4136913k664973m017898M0381p11051k318193p42349k175013l39981Q00705K585035
1464A4593576K08345o60370o045837P97129j845581j788973l24529k24489M06243M88629
1454E604143K949410l276327j434229L995919j69129k449384j122725j169268q86267
1445B042143q13730J212598j697309J976124J226364k790954J487523n39897r92436L72625
$$ plain form
1511 62285850 59499232 57035287 58166465 56102941 51632410 53498430 55444021 54354769 50663192
1502 50663192 47295207 47462210 49736885 49996001 50459448 47008445 43198992 39378736 37216609
1493 37216609 38178626 36301228 34747512 32088353 32614999 32147936 31865865 31170873 26297250 29149449
1483 29149449 29722826 25260806 29963549 30565627 29167827 28538602 27349648 25256009 24136913
1474 24136913 21471940 17454042 17494423 16783372 14465179 13722830 11547817 11207836 12008541 14593576
1464 14593576 14801921 14141551 8095714 8892843 7047262 5258289 4933760 4709271 5115514 5604143
1454 5604143 8553553 5277226 3842997 7838916 7669787 5220403 4097678 2928410 2042143
1445 2042143 1228413 2441011 743702 2719826 3946190 1155236 2642759 2102862 1110426 1483051
1435A483051j177112O47437P99495m94797K416937J256995N01850K043191j675479p71711
1425E029857K97038j827343L320400j321724P79878o4291j203977j834457m778L016l56641
1414B816978k220994K446853k918980J430429M52094q09720K417770m368J728973L012860
1404H351895j51481j199023r81289j268379o65461K646800L619831Q39257m600196k672155
1394C919799J614367k440187O82192K177983L259759K335271J131624k440297M05165
1385A0645676L162322q05O001179J0509864Q340846k453232p490534p43481K016258
1376B9988093J735275q25271P80199j046946K056690J977926K14402q3444K894099O684565
1366D4375588M646504O456836N205052L862759M097884N093514R232827J1809113K646395
$$ plain form
1435 1483051 305939 953376 1752871 1258074 3675011 4932006 5433856 7477047 5801568 5029857
1425 5029857 5326895 3499552 6819952 5498228 6278106 6213815 5009838 3175381 3170603 3173619 2816978
1414 2816978 595984 3042837 123857 1554286 2006380 1196660 3614430 3610062 5339035 8351895
1404 8351895 8200414 7001391 6020102 4751723 4086262 6733062 10352893 11192150 6591954 3919799
1394 3919799 5534166 3093979 3776171 5954154 9213913 11549184 12680808 10240511 10645676
1385 10645676 13807998 13807193 19808372 30318236 38659082 36205850 28715316 27971835 29988093
1376 29988093 31723368 30898097 31678296 30631350 32688040 34665966 34880368 34796924 37691023 44375588
1366 44375588 49022092 55478928 60683980 64546739 68644623 73738137 82970964 94780077 97426472
1357I7426472l060988p48480J247852J439996K041370J842960K346584L409320M748046
1348A10693132O345598P684369N46338J1139577Q976528P239156J8156607J6808865
1340A87590170L514099K88023j70947P287011Q008321J2619159J4790537J768031P916323
1331B43610727K302650N745697J6209998J7169441J3250608L2008780Q395328k649806
1323C36043423J5495407J4793020M669974J9082565L0279569K2733493Q101008J1526616
1315D62725075O643438J1523712J8971674J0558307J64307O132342J4718447O341969
1307E37779271K0018990L3108570K9885563L9896815N0267355J2423659K6780233K0189239
1299G70349695K4976253L1131177M0030729L1036223J5766258P071435L0109411M7094507
$$ plain form
1357 97426472 94365484 93617004 94864856 96304852 98346222 100189182 102535766 105945086 110693132
1348 110693132 117038730 124723099 125269437 136409014 145385542 152624698 170781305 187590170
1340 187590170 191104269 191392292 191221345 198508356 206516677 219135836 233926373 235694404 243610727
1331 243610727 245913377 251659074 267869072 285038513 298289121 330297901 338693229 336043423
1323 336043423 351538830 366331850 371001824 390084389 420363958 443097451 451198459 462725075
1315 462725075 469368513 480892225 499863899 510422206 510586513 516718855 531437302 537779271
1307 537779271 557798261 590906831 620792394 660689209 710956564 723380223 750160456 770349695
1299 770349695 795325948 826457125 866487854 897524077 913290335 920361770 950471181 997565688
1291I97565688O6905014N5721429L5133983q386958r724171Q235739R974694J3495281
1283A168920699L727182j0148309J3503943N2365313M8450707N1762565J32839667
1276A461421767K55446364J97519847J21211524J11884145j66316910l63502944l42327397
1269A275336396j69401823q6621676l5546322m7024125r2446750o0565511K8300177
1262H12030366N5841083K4419539p619547K650683L2368621L0139267m915529M1398192
1254I86312675J68482299K16619532R1591332O4615734j7466847k99639584l94857613
1247H15657528k82871832j80094839j04165917m6980074n3760244o6041537J1644576
1240I3387661N7909408N2577305J4224093J5440912K9699760J1805909k6787011l2805604
$$ plain form
1291 997565688 1064470702 1120192131 1155326114 1146939156 1137214985 1145450724 1155425418 1168920699
1283 1168920699 1172647881 1162499572 1176003515 1228368828 1276819535 1328582100 1461421767
1276 1461421767 1716868131 1914387978 2035599502 2147483647 1981166737 1617663793 1275336396
1269 1275336396 1105934573 1019312897 983766575 936742450 844295700 783730189 812030366
1262 812030366 867871449 892290988 884671441 887322124 919690745 949830012 944914483 986312675
1254 986312675 1154794974 1371414506 1463005838 1527621572 1510154725 1210515141 815657528
1247 815657528 532785696 352690857 248524940 201544866 147784622 81743085 93387661
1240 93387661 151297069 203874374 218098467 233539379 263239139 275045048 248258037 215452433
1232B15452433k4587462j9196938k2620027l0998482k7938205p619524J5536572J4063115
1224A12091482p034649j620311N274731M188502L405186J1615056K911872J7965506
1216A48797375L651822j1336910o221323M708162n629907r687392p57762q430101j1514806
1207A03579158K456624M639808K212874M736854R316128K7061q446028q062149j0319898
1198A00140432K338681j89592r927474M480494O018248k596719m436002m087628j142851
1189I0597589m891012k662082K699003L550444O317180M634197J738331j322263j386172
1180I9275215l350925l976769m163540l458302O286932n82099q030137p78307j517453
1171G9704615j831485n26136K66212J393981r45348o288253q59002l979873M99952j556318
$$ plain form
1232 215452433 190864971 171668033 149048006 118049524 90111319 82491795 98028367 112091482
1224 112091482 105056833 103436522 108711253 112899755 116304941 127919997 130831869 148797375
1216 148797375 152449197 141112287 134890964 139599126 133969219 124281827 123524065 115093964 103579158
1207 103579158 106035782 110675590 112888464 117625318 126941446 126968507 118522479 110460330 100140432
1198 100140432 102479113 102289521 92362047 96842541 102860789 100264070 95828068 91740440 90597589
1189 90597589 85706577 83044495 85743498 89293942 95611122 100245319 101983650 100661387 99275215
1180 99275215 95924290 91947521 87783981 84325679 90612611 90030512 82000375 81222068 79704615
1171 79704615 77873130 77346994 77613206 79007187 78061839 71773586 70914584 66934711 67434663 65878345
1161F5878345K841189L509904N879472l806313n239247K846350J871637Q872751J0231980
1152I2886068O217599j341013j578795m11280j0746203q515418J73937l708450q630842
1143F4345603n002417m276546m131147j956175M086205O605535O569291N971930l521814
1134F8690465J711403k843779l368900l036949K029976J009317r78524J1325249J2015078
1125H6553336J0426749Q546279N003642l077139j7056095j2322361p525956p772396
1117F2776059p959550Q45268m209761J32445P00395J062870J549245J442476J515871
1108E7855318j613063j450767m589573k903076J940363K313567M215506L504130Q733685
1099F8006090Q833064M403515L363554M949672n358019p289603j250767J708733O03539
$$ plain form
1161 65878345 68719534 72229438 78108910 74302597 69063350 71909700 73781337 82654088 92886068
1152 92886068 99103667 97762654 96183859 95772579 85026376 76510958 76684895 72976445 64345603
1143 64345603 59343186 55066640 50935493 48979318 53065523 59671058 66240349 72212279 68690465
1134 68690465 70401868 67558089 64189189 61152240 63182216 64191533 63213009 74538258 86553336
1125 86553336 96980085 105526364 110530006 107452867 90396772 78074411 70548455 62776059
1117 62776059 54816509 55661777 51452016 51584461 52284856 53347726 54896971 56339447 57855318
1108 57855318 56242255 54791488 50201915 47298839 49239202 51552769 55768275 59272405 68006090
1099 68006090 76839154 81242669 84606223 89555895 84197876 76908273 75657506 77366239 77969778
1090G7969778m532833Q51305J39030q22605K671104N309912L097712K472648P445143
1081I4601194M322172N048782N926791L042185M662751M728267N787519J0457213J0005012
1072A48581886R234493O273744K089202L752925N034540O530535J2664754J1999975
1064B06162054J2026978J2271907k385935j971476O554575O638113J0812380J4128485
1056B64237081J3845476J5722245J1924660J3621120R765317R950924K805660J554967
1048C43427450L831313J3786738J7709649J9305418J7300827J1807527J2761315J4621403
1040D54551640K0394270K5478660K5485931L0512723K3680157R380715J0680087J0543421
1032F10707604J0384543J7227567L3484402M6765986M6092852L6611318K5406539P127299
$$ plain form
1090 77969778 73436945 74288250 74427280 73604675 76275779 81585691 84683403 87156051 94601194
1081 94601194 98923366 103972148 109898939 112941124 117603875 122332142 128119661 138576874 148581886
1072 148581886 157816379 164090123 166179325 169932250 174966790 181497325 194162079 206162054
1064 206162054 218189032 230460939 228075004 226103528 232658103 239296216 250108596 264237081
1056 264237081 278082557 293804802 305729462 319350582 329115899 339066823 341872483 343427450
1048 343427450 347258763 361045501 378755150 398060568 415361395 427168922 439930237 454551640
1040 454551640 474945910 500424570 525910501 556423224 580103381 589484096 600164183 610707604
1032 610707604 621092147 638319714 671804116 718570102 764662954 801274272 826680811 833808110
1024H33808110N123867M50890k447993o25860l261201M640761J3357162K8330606M1264312
1015I20640654P1468478J03086262J20371567J07765859N8397790o464103r4056477
1008A281210030j43478260j34579229r7744257o5158531l3909876J490309L1037232
1001H38867418N9741214O5919422L9621776J0375528Q239952Q305291P062077j3880970
993A024251708k9761858k6406475l257571J4466978K6668581P2722863J58092809
986A236777035K00294312J56232837J04935594q478720k09344222l20165091k85278701
979H74973044j88667492j17265695o9959610n3018749l7412571O453036M8367604N0033509
971E13503076K0303224J3295106J9873862O323412j3373493k8410191k5465294j2530146
$$ plain form
1024 833808110 838931977 839382867 836934874 836309014 833047813 837688574 851045736 879376342 920640654
1015 920640654 992109132 1095195394 1215566961 1323332820 1381730610 1375266507 1281210030
1008 1281210030 1137731770 1003152541 905408284 840249753 806339877 807830186 838867418
1001 838867418 898608632 964528054 1004149830 1014525358 1022765310 1031070601 1038132678 1024251708
993 1024251708 994489850 968083375 964825804 979292782 1005961363 1078684226 1236777035
986 1236777035 1437071347 1593304184 1698239778 1689761058 1480416836 1160251745 874973044
979 874973044 686305552 569039857 499080247 446061498 408648927 415101963 463469567 513503076
971 513503076 533806300 547101406 566975268 573298680 559925187 531514996 506049702 493519556
963D93519556p896363j3332295N200818M3589026P4030233P2292933M0726077j1941488
955F96188497p2453374j22749889j21095686r1229246n2407821l4491844l0099459
948A71661178k7968839j3090997O103905J0060187M727778N009956J099995p87080j737741
939A55078342m383943q294471o445497n009333j3133336j3384613j0889312o431809
931H7106028j106438j896077l553813J625295O085228L545293J281702L439562O540372
922A03067152J865946o614491o661575m72460k341795k836575l023433l169129k820460
913G6993180j230000j031415n363044o031716K644133q10101J68557j977297J285742
904F4648039k254449j0551713k722080o166446n899365k563616K973306M039328L096350
$$ plain form
963 493519556 485623193 472290898 477491716 521080742 595110975 667403908 708129985 696188497
955 696188497 623735123 500985234 379889548 288660302 236252481 201760637 171661178
948 171661178 143692339 130601342 136705247 146765434 151493212 156503168 157603163 156816083 155078342
939 155078342 150694399 142399928 135954431 130945098 117811762 104427149 93537837 87106028
931 87106028 85999590 84103513 80549700 82174995 88260223 91805516 93087218 96526780 103067152
922 103067152 104933098 98318607 91657032 91184572 88842777 86006202 82982769 79813640 76993180
913 76993180 75763180 74731765 69368721 63337005 65981138 65171037 65339594 63362297 64648039
904 64648039 62393590 51841877 49119797 42953351 37053986 34490370 37463676 41503004 44599354
895D4599354J029022K04844j142674k065799n045084j071039J676349Q72449N87862R20343
885D0565627m697283o604184k125448n560223N89067J615991L164434j059607m239556
876B1648818r011261n361591q750110l112281Q79128N211611R529744n451690K02716
867E785084j448759j068502p85129n85065J628618k070067j6868J08473l156781L024866
857A415870O97247k446802J126817J837320J434356K618009l73932j940449m190436
848A78000k902209j322010q66731K499740m189033L1190J301082k963677j208400O57453
838h784595j597237j88596j056156L887216j661155R25075r66755J063927R8597n22722
828h802401K29024j32780P94697J793466J995286R0913k548102J93526J91968K06577
$$ plain form
895 44599354 45628376 45833220 44690546 42624747 37579663 36508624 38184973 39057422 39645284 40565627
885 40565627 35868344 29264160 27138712 21578489 22167556 23783547 26947981 25888374 21648818
876 21648818 12637557 7275966 -1474144 -4586425 -3707297 1504314 11034058 5582368 5785084
867 5785084 4336325 3267823 2482694 1897629 3526247 1456180 1439312 1547785 -1608996 1415870
857 1415870 2113117 -333685 793132 2630452 4064808 6682817 6308885 4368436 178000
848 178000 -2724209 -4046219 -4912950 -2413210 -6602243 -6571053 -5269971 -8233648 -9442048 -8784595
838 -8784595 -10381832 -10570428 -11626584 -7739368 -9400523 -8475448 -9442203 -8378276 -8279679 -8802401
828 -8802401 -8573377 -8706157 -7911460 -6117994 -4122708 -4031795 -6579897 -6386371 -6194403 -5987826
818e987826l928329L5101K932879r80927J317881j006647J978807K76342k413530J574147
808f202102j075638R61044R38762k10936O79747k278741q18649j935554J767441J011931
798g162695n81773N74171k575227J419953J636368k105342o50385K940286j958616j384267
788i847527K867629P61717l49993R15997o17008K418357k67924L809694j015395K97858
778a026595j699556k89536P59238r35160j003377J129537O97694j922988j673335p84790
768f748868Q0264R22661J214130J236283q84401K086531J221810j746847k38397K070156
758g86678k493628O19364p82313K682104K930781q88305P41058j256784Q25665l369622
748a778358J78564k227262l89578j002257j465648L308844j48287n682120K812629j53915
$$ plain form
818 -5987826 -9916155 -9881054 -6948175 -7929102 -6611221 -7617868 -5639061 -5362719 -7776249 -6202102
808 -6202102 -7277740 -6316696 -5377934 -5588870 -4909123 -7187864 -8006513 -9942067 -8174626 -7162695
798 -7162695 -7744468 -7170297 -9745524 -8325571 -6689203 -8794545 -9444930 -6504644 -8463260 -9847527
788 -9847527 -6979898 -6218181 -6568174 -5652177 -6269185 -3850828 -4118752 -309058 -1324453 -1026595
778 -1026595 -2726151 -3015687 -2256449 -3191609 -4194986 -3065449 -2367755 -4290743 -5964078 -6748868
768 -6748868 -6668604 -5745943 -4531813 -3295530 -4179931 -2093400 -871590 -2618437 -2856834 -786678
758 -786678 -3280306 -2660942 -3443255 -761151 2169630 1281325 2022383 765599 1591264 -1778358
748 -1778358 -1599794 -3827056 -4216634 -5218891 -6684539 -3375695 -3523982 -9206102 -6393473 -6547388
738f547388J008172P91076O71496k1029L33381O03748k397322j369508J682837Q368n59978
727e796147L37522p5298J051293K43942k700116J308709J588954j939675p54241r52578
717g687635L12167O46432n94889J386273j512643J698101k469015j764492K15233K680043
707g090425P4008k381738K789408j286477l117664J300359L658336k285450j151241
698i490884K472181j702258Q96553n67138J828067j499711Q3021l73173K01037j347578
688i499883K070805L50653n99106J371262j067954k603940j66515R64949J917946k38516
678g500299J106865m192734K617657J389238m54350j865567m54145J181254L18799j861675
668i714957P81082M72094n23037J274752J183702k477700Q09394r73131K19066j001150
$$ plain form
738 -6547388 -5539216 -4748140 -4076644 -4097673 -3764292 -3160544 -5557866 -6927374 -5244537 -5236169 -5796147
727 -5796147 -5458625 -5533923 -4482630 -4238688 -6938804 -5630095 -4041141 -5980816 -6735057 -7687635
717 -7687635 -7375468 -6729036 -7323925 -5937652 -7450295 -5752194 -8221209 -9985701 -9770468 -7090425
707 -7090425 -7016417 -9398155 -6608747 -7895224 -11012888 -9712529 -6054193 -8339643 -9490884
698 -9490884 -7018703 -8720961 -7824408 -8391546 -6563479 -8063190 -7980169 -8353342 -8152305 -9499883
688 -9499883 -7429078 -7078425 -7677531 -6306269 -7374223 -9978163 -10144678 -9179729 -7261783 -7500299
678 -7500299 -6393434 -10586168 -7968511 -6579273 -7033623 -8899190 -9353335 -8172081 -7853282 -9714957
668 -9714957 -8933875 -8461781 -8984818 -7710066 -6526364 -9004064 -8194670 -9167801 -8948735 -9949885
658i949885j358111Q87910K872244p68342J233410L37405q85360J656757l067141L26597
648h714516J697314N4593l63866j915902j002633Q87523Q8429M13975J331110l97797o7669
637g989439r06768J798836q33678N39843j532268k02157j254664J273024K43864j350666
627a0214073k76315l05223p13763K835442j151319N79839J83576l66328o24916j04557
617a0157637j855547K70381J483628M282k486791L253728o1713n76732K86303k30009
607a0070107k09428M76216j078914k126417P35680j259609J655491J335013k38950P62416
597a0018609k29726j909570K820019j835472j012285K602531k612524k54202p30918
588a3180756K261279j561592L021720J15618j941908L37344J743635j903797Q89428K39860
$$ plain form
658 -9949885 -11307996 -10420086 -7547842 -8316184 -7082774 -6745369 -7630729 -5973972 -9041113 -8714516
648 -8714516 -7017202 -6962609 -7326475 -9242377 -10245010 -9357487 -9269058 -8855083 -7523973 -7921770 -7989439
637 -7989439 -8896207 -7097371 -7931049 -7391206 -8923474 -9125631 -10380295 -9107271 -8863407 -10214073
627 -10214073 -10490388 -10795611 -11509374 -8673932 -9825251 -9245412 -9061836 -9428164 -10053080 -10157637
617 -10157637 -12013184 -11742803 -10259175 -10254893 -12741684 -9487956 -9549669 -10126401 -9840098 -10070107
607 -10070107 -10279535 -9803319 -10882233 -13008650 -12272970 -13532579 -11877088 -10542075 -10781025 -10018609
597 -10018609 -10248335 -12157905 -9337886 -11173358 -12185643 -9583112 -12195636 -12449838 -13180756
588 -13180756 -10919477 -12481069 -9459349 -9343731 -11285639 -10948295 -9204660 -11108457 -10219029 -9979169
578i979169j644670J230514j254523m23366K7001J035446j304197N03411J700758k377350
568a2486145J517303r50190J92080k85420k34666P24119K062070j246893N03774j418212
558a1622180J800482J082258j913518j069259j049731P75497l29054Q15289J849485Q82491
548h778240j788169j409749q87926N001955j095184j67899p70633j73509J524476q46350
538i391228j622119j669656n26651K007571q06920J189524j739324j345607L225581q39155
528a1517984o9068j180246K323985o24824j590084m6007j182535J100143j43432J722412
518a1207640k452762J188876J135530r05266K599720j261036P69764j835662k37342
509a2205818J010268O56463l04770q33348N12676P02592j693333j771733J718298J699179
$$ plain form
578 -9979169 -11623839 -10393325 -11647848 -12071214 -12044213 -11008767 -12312964 -11809553 -10108795 -12486145
568 -12486145 -10968842 -11919032 -11726952 -12012372 -12247038 -11522919 -9460849 -10707742 -10203968 -11622180
558 -11622180 -9821698 -8739440 -10652958 -11722217 -12771948 -11996451 -12325505 -11510216 -9660731 -8778240
548 -8778240 -10566409 -11976158 -12864084 -7862129 -8957313 -9125212 -9895845 -10069354 -8544878 -9391228
538 -9391228 -11013347 -12683003 -13209654 -11202083 -12009003 -10819479 -12558803 -13904410 -10678829 -11517984
528 -11517984 -11587052 -12767298 -10443313 -11068137 -12658221 -12704228 -13886763 -12786620 -12930052 -11207640
518 -11207640 -13660402 -12471526 -11335996 -12241262 -9641542 -10902578 -10132814 -11968476 -12205818
509 -12205818 -11195550 -10539087 -10843857 -11677205 -11164529 -10461937 -12155270 -13927003 -12208705 -10509526
499a0509526k519467J523280R48734j549430K335175k227666O95419r01247K097494
490a0107234l347519J634904k31778K48274J549469N91543O35858k955384o41103K264856
480a0358114l477728N71028Q61605L37424o82077J619556p34547l325259K730288j849845
470a4307669K794988q12678Q65410J40824q41042L22269j92492o80818O48948k83603
460a2345863m52528j716919l20766K886056q6847k387925j363416L995316J316271P54588
450i722033k348476J948465j305430K138068k24910j099386J001577o72382r57467J976901
440i265073J13938j936526J213395r27540J32984k468186m7069P04075K026310j174910
430a1628602N94166q25608N27480K458920k517852n44978J612844M89979j741545J320789
$$ plain form
499 -10509526 -13028993 -11505713 -10556979 -12106409 -9771234 -11998900 -11303481 -12204728 -10107234
490 -10107234 -13454753 -11819849 -12051627 -11803353 -10253884 -9662341 -9026483 -11981867 -12622970 -10358114
480 -10358114 -13835842 -13264814 -12403209 -12065785 -12747862 -11128306 -11862853 -15188112 -12457824 -14307669
470 -14307669 -11512681 -12325359 -11459949 -11319125 -12160167 -11837898 -12030390 -12711208 -12062260 -12345863
460 -12345863 -12798391 -14515310 -14836076 -11950020 -12036867 -14424792 -15788208 -11792892 -10476621 -9722033
450 -9722033 -12070509 -10122044 -11427474 -9289406 -9514316 -10613702 -9612125 -10284507 -11241974 -9265073
440 -9265073 -9151135 -11087661 -9874266 -10801806 -10668822 -13137008 -13184077 -12480002 -10453692 -11628602
430 -11628602 -11034436 -11860044 -11332564 -8873644 -11391496 -11936474 -10323630 -9833651 -11575196 -10254407
420a0254407p67384r79265J070845n97423M04209j255244j68747L536126K56697n699121
410a4453714K341249j307382k315966K858383J441985j648094J169203j140709j043960
401a4099005J873440n04008l14764l45250J302021o36922j039380L077145m152127O19409
391a4219441M48081K900817j733897J455546j133194m23741J904201n99972m96967J240517
381a0658050j702993j079904O76483n10715J332393j801117K151040n49375j699513k43162
371a4084913J180524q17020l39682J684687j860073J318942L03390j263554L66459L49775
361a3161465j97409K041570j08626j806583O88795j69451q20384J903112j942648M18668
351a3154421o51307q83227l2084L873293q72769j283418J684241r8311p22715M36648
$$ plain form
420 -10254407 -11021791 -12001056 -10930211 -11527634 -11123425 -12378669 -12547416 -9011290 -8754593 -14453714
410 -14453714 -12112465 -13419847 -15735813 -12877430 -11435445 -13083539 -11914336 -13055045 -14099005
401 -14099005 -12225565 -12729573 -13044337 -13389587 -12087566 -12724488 -13763868 -10686723 -14838850 -14219441
391 -14219441 -13771360 -10870543 -12604440 -11148894 -12282088 -12705829 -10801628 -11401600 -11898567 -10658050
381 -10658050 -12361043 -13440947 -12764464 -13275179 -11942786 -13743903 -11592863 -12142238 -13841751 -14084913
371 -14084913 -12904389 -13721409 -14061091 -12376404 -14236477 -12917535 -12614145 -13877699 -13511240 -13161465
361 -13161465 -13358874 -11317304 -11425930 -13232513 -12543718 -12713169 -13533553 -11630441 -13573089 -13154421
351 -13154421 -13805728 -14688955 -14721039 -10847746 -11720515 -13003933 -11319692 -11418003 -12140718 -11704070
341a1704070k598907J48916j410606J266697J879646R47419n67088r21576q50226K83
331a3809512K83797j204159J550827n25335K331680j947558j419389J597908J116270
322a2025471K178326k710805J171189k48419L336683n485712R18995N08880j844998J25829
312a4075503n69900K13717M51732P54313K151811l334678J186951j546338J515513J484540
302a1767842k63712L80131K021005j905381k159039O75504J97990J506478j272016j96257
292a2783139J875307n29354q28873o38497k30955j736352J661294k2311p87244j220633
282a5240757m6292J488485j286857J273428l6426J942883j180993j176809k437795J011019
272a5690114j004077L048104J052770l033035M032326j312822P29878j217183Q2538Q63111
$$ plain form
341 -11704070 -14302977 -14154061 -15564667 -14297970 -12418324 -11470905 -12037993 -12959569 -13809795 -13809512
331 -13809512 -13525715 -14729874 -13179047 -13704382 -11372702 -13320260 -14739649 -13141741 -12025471
322 -12025471 -9847145 -12557950 -11386761 -11635180 -8298497 -13784209 -12865214 -12356334 -14201332 -14075503
312 -14075503 -14645403 -14431686 -13979954 -13225641 -11073830 -14408508 -13221557 -14767895 -13252382 -11767842
302 -11767842 -12031554 -11651423 -9630418 -11535799 -13694838 -13019334 -12821344 -11314866 -12586882 -12783139
292 -12783139 -10907832 -11437186 -12266059 -12904556 -13135511 -14871863 -13210569 -13232880 -14020124 -15240757
282 -15240757 -15287049 -13798564 -15085421 -13811993 -13848419 -11905536 -13086529 -14263338 -16701133 -15690114
272 -15690114 -16694191 -13646087 -12593317 -15626352 -11594026 -12906848 -12176970 -13394153 -13311615 -12448504
262a2448504o819p68094j61133k89110Q95060K49833J51516j37063j617100J46165L474588
251a0510661o68253L46188k996689j057370K896810q46938J719660k215855j051666
242a4384774J787565R25912j338379O5193P47404k163959m53997J351042P19985P52413
232a1991595R74714j591822j779982r70433J664407O82302J569297Q24283k677308P35109
222a2561028j89584J340186r24770N61254O00912p85257n90027j547199M661454k902759
212a2336818q03166J702529k351493L26724n34573K923162k751899k05955p6109K166
202a4105432M51163O32886j818934L848096j943193K60028Q89020L02629L76180r73191
192a2080748k078560J531555j991164M52793L376509l698214j069278L058453J075713
$$ plain form
262 -12448504 -12455323 -13223417 -13384550 -13673660 -12778600 -12528767 -12377251 -12514314 -14131414 -13985249 -10510661
251 -10510661 -11178914 -10832726 -13829415 -14886785 -11989975 -12836913 -11117253 -13333108 -14384774
242 -14384774 -12597209 -11671297 -13009676 -12944483 -12197079 -14361038 -14815035 -13463993 -12744008 -11991595
232 -11991595 -11016881 -12608703 -14388685 -15359118 -13694711 -13012409 -11443112 -10618829 -13296137 -12561028
222 -12561028 -12750612 -11410426 -12335196 -11773942 -11173030 -11958287 -12548314 -14095513 -9434059 -12336818
212 -12336818 -13139984 -11437455 -13788948 -13462224 -13996797 -11073635 -13825534 -14031489 -14107598 -14105432
202 -14105432 -13654269 -13021383 -14840317 -10992221 -12935414 -12675386 -11786366 -11483737 -11107557 -12080748
192 -12080748 -14159308 -12627753 -14618917 -14166124 -10789615 -14487829 -15557107 -12498654 -11422941
183a1422941O97457j641310K612022K797461n851769o15646J485474l542620J986221
174a3495651J216666N972327n423971m95436j8900M51715l092094l63680L604157j431036
164a3075903k64873M76171q29977J423608M94240k759791L43606j621832K764363J224273
154a1826115j675677J146781o59321j740545K386731j534434N81905K89441l764914
145a6796148K359383p4355O67970K052760M66040k119900J968355j234387l57266j233718
135a4301266o57646J522467L61686k5909p8660l34705L111663j562893k007225j17342
125a4089830m71411K33744O536663k152224k444726n68436k02456j024501J050699O35791
115a2496687K34181j484873j64645J220933r90675L09472j92393K745099m629363o94427
$$ plain form
183 -11422941 -10725484 -12366794 -9754772 -6957311 -12809080 -13424726 -11939252 -15481872 -13495651
174 -13495651 -12278985 -6306658 -11730629 -12226065 -12244965 -11793250 -14885344 -15249024 -11644867 -13075903
164 -13075903 -13340776 -12864605 -13694582 -12270974 -11776734 -14536525 -14192919 -15814751 -13050388 -11826115
154 -11826115 -13501792 -12355011 -13014332 -14754877 -12368146 -13902580 -13320675 -13031234 -16796148
145 -16796148 -14436765 -14511120 -13843150 -11790390 -11324350 -13444250 -11475895 -12710282 -13067548 -14301266
135 -14301266 -14958912 -13436445 -13074759 -13100668 -13179328 -13514033 -10402370 -11965263 -13972488 -14089830
125 -14089830 -14561241 -14327497 -7790834 -9943058 -12387784 -12956220 -13158676 -14183177 -13132478 -12496687
115 -12496687 -12262506 -13747379 -13912024 -12691091 -13681766 -13372294 -13564687 -10819588 -15448951 -16143378
105a6143378q94647J860483q14054L24603J410391J917259P05848k37814M27133j8492
95a1462668k480287j353301L468555k431960p38439K80295j579238K736000K9326M39027
85a3092690Q30588j349758M4292j573901K58856J217438j596782L93083N28027J52496
75a4188351n84145m25677K458888j8659r28278Q207j386241J494610P40229k308183N12765
64a4624835K48947n27904Q177L62882J124471J830729j792499K927o40161N64097J616452
53a1826717l168825N83958R21476L060036j691884J32630p05958o71795r06680L485111
43a0788648j191589j418204n10104l96751j651923J564738O81331J341154o52385n61029
33a3583410J306399k133885L06475L06549J442526n52052j362595J191160j027629L46382
$$ plain form
105 -16143378 -17038025 -15177542 -15991596 -15666993 -14256602 -12339343 -11633495 -11871309 -11444176 -11462668
95 -11462668 -13942955 -15296256 -11827701 -14259661 -14998100 -14717805 -16297043 -13561043 -13531717 -13092690
85 -13092690 -12262102 -13611860 -13567568 -15141469 -14882613 -13665175 -15261957 -14868874 -14340847 -14188351
75 -14188351 -14772496 -15198173 -12739285 -12757944 -13686222 -13678015 -15064256 -13569646 -12829417 -15137600 -14624835
64 -14624835 -14375888 -14903792 -14895615 -14532733 -13408262 -11577533 -13370032 -13367105 -14007266 -13443169 -11826717
53 -11826717 -14995542 -14411584 -13490108 -10430072 -12121956 -11989326 -12695284 -13367079 -14273759 -10788648
43 -10788648 -11980237 -13398441 -13908545 -14305296 -15957219 -14392481 -13711150 -12369996 -13022381 -13583410
33 -13583410 -12277011 -14410896 -14104421 -13797872 -12355346 -12907398 -14269993 -13078833 -14106462 -13760080
23a3760080J176744j533848K425346k396279P0855M90060j139274Q78401O12127k140724
13a5316672K184137n69725R79890j605542N00071N35937j24576M29950r89000j754775
3a5730305p05715K492946J65812R14385J310707j607312J389897r05842J055652j019630
-7a2639405q33817J843187J46215j66248l032867K408866J205278k603929J045506J817878
-17a0809336k228442j610955R48315p42777j235816J963724R76472l83089k03989k653533
-27a5979426K114695J887388k996794k91000l28498j673349J157096J438061L268371
-36a1403456j493039J203454j372947j152802j837712L379236j438472J763112k47848
-45a2600474j971085N83427k7016J739354n8110j293974j58057J538444k763676J035497
$$ plain form
23 -13760080 -12583336 -14117184 -11691838 -14088117 -14017262 -13527202 -14666476 -13788075 -13175948 -15316672
13 -15316672 -13132535 -13702260 -12722370 -14327912 -13827841 -13291904 -13416480 -12986530 -13975530 -15730305
3 -15730305 -16436020 -13943074 -13777262 -12862877 -11552170 -13159482 -11769585 -12675427 -11619775 -12639405
-7 -12639405 -13473222 -11630035 -11483820 -11650068 -14682935 -12274069 -11068791 -13672720 -12627214 -10809336
-17 -10809336 -13037778 -14648733 -13700418 -14443195 -15679011 -13715287 -12738815 -13121904 -13325893 -15979426
-27 -15979426 -13864731 -11977343 -14974137 -15265137 -15593635 -17266984 -16109888 -14671827 -11403456
-36 -11403456 -12896495 -11693041 -13065988 -14218790 -16056502 -12677266 -14115738 -12352626 -12600474
-45 -12600474 -14571559 -13988132 -14015148 -12275794 -12333904 -13627878 -13785935 -12247491 -15011167 -13975670
-55a3975670n0345j189844K345766J803217j598344K76728k79094N29975k691436L209101
-65a1619946R40912k256515j582769P47488o75851J475200J75261j933751n12507J257883
-75a3984595j430986l57774J345744M02448j75931P93637j676148J855811j007010q17504
-85a5052308p1169j457185K065907P78091k127479J914358l54062n93304j59610j526311
-95a6583072M5532M53103n6989O03210l56222m83842M647028J469379k209316K68936
-105a2202253m08157k983122Q97400M7606J899046q28057n32204N52410J099973r60512
-115a3417870M93231k086415L555712r93681K53252o74449j843579J076227L49544k012620
-125a5300648K584412r55032m793550M274184k599204K670921Q0823K41007q56491p79745
$$ plain form
-55 -13975670 -14026015 -15215859 -12870093 -11066876 -12665220 -12388492 -12667586 -12137611 -14829047 -11619946
-65 -11619946 -10679034 -12935549 -14518318 -13770830 -14446681 -12971481 -12796220 -14729971 -15242478 -13984595
-75 -13984595 -15415581 -15773355 -14427611 -14025163 -14201094 -13407457 -15083605 -13227794 -14234804 -15052308
-85 -15052308 -15123477 -16580662 -14514755 -13736664 -15864143 -13949785 -14303847 -14897151 -15056761 -16583072
-95 -16583072 -16537540 -16084437 -16141426 -15538216 -15894438 -16378280 -11731252 -10261873 -12471189 -12202253
-105 -12202253 -12610410 -15593532 -14696132 -14648526 -12749480 -13577537 -14109741 -13557331 -12457358 -13417870
-115 -13417870 -12924639 -15011054 -11455342 -12449023 -12195771 -12870220 -14713799 -13637572 -13288028 -15300648
-125 -15300648 -12716236 -13671268 -18464818 -14190634 -16789838 -14118917 -14038094 -13797087 -14653578 -15433323
-135a5433323J526838j280642N3490O0611K010482j765728K384030k744212L93854O0452
-145a4734148l83729Q90570J547912o09824K50954j675990P50370J000718k375176k629604
-155a7967947K595088N40666M86557j337910J127176K929040l257221j02911p6059r60193
-165a6023714R47639o71018L418053j089508m45042j79013L239427j325042L741493
-174h386725m918012j627633k18861L748334k007399N0023j42206P72373p88153k762597
-184a6280856n020006O446139j124971J11598J232602N37343j657051J314217J681733
-193a2759252j665535M53730j579859L32306K765492J411600m956908K335473j305990
-202a4968943O59330q81840K238221j625066j33803j750554K531577Q32140p93964j796645
$$ plain form
-135 -15433323 -13906485 -15187127 -15133637 -15073026 -13062544 -14828272 -12444242 -15188454 -14794600 -14734148
-145 -14734148 -15117877 -14227307 -12679395 -13289219 -13038265 -14714255 -13963885 -12963167 -15338343 -17967947
-155 -17967947 -15372859 -14832193 -14345636 -15683546 -14556370 -11627330 -14884551 -14987462 -15063521 -16023714
-165 -16023714 -15076075 -15747093 -12329040 -13418548 -13863590 -14042603 -10803176 -12128218 -8386725
-174 -8386725 -13304737 -14932370 -15151231 -11402897 -13410296 -13360273 -13502479 -12730106 -13518259 -16280856
-184 -16280856 -21300862 -14854723 -15979694 -15868096 -14635494 -14098151 -15755202 -14440985 -12759252
-193 -12759252 -14424787 -13971057 -15550916 -15218610 -12453118 -11041518 -15998426 -13662953 -14968943
-202 -14968943 -14309613 -15191453 -12953232 -14578298 -14712101 -16462655 -13931078 -13098938 -13892902 -15689547
-212a5689547J586077q31880m98439J14383r66857K443954j884220J206958J398642n25160
-222a3646089p61106J977074k722746r24589l34782O157337l306654k538828P69836
-231a5330547J895285j115884L69380n65714m54252l02490J200342k03020n8168P68215
-241a3796853J396980q39032k86270j398098k479767j738947K527092J552587k441063
-250a7503371J052007K727544l8087j788311L51132n50562Q2392R96376k17428N7074
-260a4831234K062902L06394j938491P07532m69558J626544j992069K30642m84098O36610
-270a4144826l85407J551903l15039j520858L76207j139909J174180n57172J592562N73503
-280a2794856r69952q03845K324087n49406j907871L29172k85973N61501q27932k69339
$$ plain form
-212 -15689547 -14103470 -14935350 -15433789 -15319406 -16286263 -13842309 -15726529 -14519571 -13120929 -13646089
-222 -13646089 -14407195 -12430121 -15152867 -16077456 -16412238 -10254901 -13561555 -16100383 -15330547
-231 -15330547 -13435262 -14551146 -14181766 -14747480 -15201732 -15504222 -14303880 -14506900 -14565068 -13796853
-241 -13796853 -12399873 -13238905 -13525175 -14923273 -17403040 -19141987 -16614895 -15062308 -17503371
-250 -17503371 -16451364 -13723820 -13761907 -15550218 -15199086 -15749648 -15667256 -14670880 -14888308 -14831234
-260 -14831234 -12768332 -12461938 -14400429 -13692897 -14162455 -12535911 -14527980 -14297338 -14781436 -14144826
-270 -14144826 -14530233 -12978330 -13293369 -14814227 -14438020 -15577929 -14403749 -14960921 -13368359 -12794856
-280 -12794856 -13764808 -14568653 -12244566 -12793972 -14701843 -14372671 -14658644 -14097143 -14925075 -15194414
-290a5194414J111581J424974q90160l9711n64977j836348j580876K298643l79485J808677
-300a3842096p26169P78955J2620J31209P33207l061341N00554J077941j739437j336724
-310a7471281M08584J100418K70567M32883O59908j667489K34769P21908K412836R85941
-320a1910956j606831r72749n19670K015534k141667L8574K11561K350835o71907l863656
-330a7070932k378045K562387J317385k17009K543710j394730j998871K229591o04111
-339a5010625M20665K338789q89354k62575o99128J64237Q02946j545471K117577k307950
-349a4870889J051885J421688o23597P20892k221918o61903r51533o32023K271683J224392
-359a3271323l6430o92895L4911J7074n88195O08857M10930j166253J036427r42491L49138
$$ plain form
-290 -15194414 -14082833 -12657859 -13548019 -13587730 -14152707 -15989055 -17569931 -15271288 -15650773 -13842096
-300 -13842096 -14568265 -13789310 -13776690 -13645481 -12912274 -15973615 -15473061 -14395120 -16134557 -17471281
-310 -17471281 -17062697 -15962279 -15691712 -15258829 -14598921 -16266410 -16031641 -15309733 -12896897 -11910956
-320 -11910956 -13517787 -14490536 -15010206 -12994672 -15136339 -15097765 -14886204 -12535369 -13207276 -17070932
-330 -17070932 -19448977 -16886590 -15569205 -15786214 -13242504 -14637234 -16636105 -14406514 -15010625
-339 -15010625 -14589960 -12251171 -13140525 -13403100 -14102228 -13937991 -13135045 -14680516 -12562939 -14870889
-349 -14870889 -13819004 -12397316 -13020913 -12300021 -14521939 -15183842 -16135375 -16767398 -14495715 -13271323
-359 -13271323 -13307753 -14000648 -13965737 -13948663 -14536858 -13928001 -13517071 -14683324 -13646897 -14589388 -14240250
-370a4240250K55850r35215J729849J19652j283990J80204l692754K411527J52766k66532
-380a5568893m65490p24251J852165r54037N09960k57704P58417r58195r78592n12373
-390a7298993J67955K918105j372041j475710j259839L701710K64391m42881K3898k01862
-400a4975267J170061l088282O40196p05898J6413L593179r07587j455429J493623K51385
-410a3967606m89707N86954p61965Q23076j207757Q73665o45539j643168R6209O50317
-420a5685521L23116j063118J725874j86000n84405J70872M38609J247827N48945j322002
-430a4385803J202764o81647k1738o85791j51671J49848j370315n47812J771914K088613
-440a2631638J08180j144719L327186j823976k556628K11170j218107J058893j634164
$$ plain form
-370 -14240250 -13984400 -14919615 -13189766 -13070114 -14354104 -14173900 -17866654 -15455127 -15302361 -15568893
-380 -15568893 -16034383 -16758634 -14906469 -15860506 -15350546 -15608250 -14849833 -15808028 -16786620 -17298993
-390 -17298993 -17131038 -14212933 -15584974 -17060684 -18320523 -14618813 -14354422 -14797303 -14773405 -14975267
-400 -14975267 -13805206 -16893488 -16253292 -16959190 -16942777 -13349598 -14257185 -15712614 -14218991 -13967606
-410 -13967606 -14457313 -13870359 -14632324 -13809248 -15017005 -14143340 -14788879 -16432047 -16335838 -15685521
-420 -15685521 -15362405 -16425523 -14699649 -14885649 -15470054 -15299182 -14860573 -13612746 -13063801 -14385803
-430 -14385803 -13183039 -13864686 -13886424 -14572215 -14723886 -14574038 -15944353 -16492165 -14720251 -12631638
-440 -12631638 -12523458 -13668177 -10340991 -12164967 -14721595 -14510425 -15728532 -14669639 -16303803
-449a6303803J397787N62581l00533R25886J04486j294585R66632k97769j700251K18063
-459a5721506M39455Q24675J645898j390669j049907J873224j160427k075392J878798
-468a4735851m48501k60351k07227K05212o49357M410338l271657l42760r66512J069201
-478a5197465P92343q4805p90885k36235R40138J115026k962554J160850N26395j32350
-488a4869542R66021j855328J637758j675108J563516j191528J124883Q1587j265960
-497a5483701n73570M73041R26178q7783Q09029l55898j714999n58136K547446j267513
-507a5285906P25723P50282j118009J25823p75795J206517j037994m249581N332718r68199
-517a5294421j02606N72164K7867j501743O13439O61911k92185m15193J203192Q61109
$$ plain form
-449 -16303803 -14906016 -14343435 -14643968 -13718082 -13613596 -14908181 -13941549 -14239318 -15939569 -15721506
-459 -15721506 -15282051 -14457376 -12811478 -14202147 -15252054 -13378830 -14539257 -16614649 -14735851
-468 -14735851 -15184352 -15444703 -15651930 -15446718 -16096075 -11685737 -14957394 -15300154 -16266666 -15197465
-478 -15197465 -14405122 -14489927 -15280812 -15517047 -14576909 -13461883 -16424437 -15263587 -14737192 -14869542
-488 -14869542 -13903521 -15758849 -14121091 -15796199 -14232683 -15424211 -14299328 -14217741 -15483701
-497 -15483701 -16057271 -15584230 -14658052 -14745835 -13936806 -14292704 -16007703 -16565839 -14018393 -15285906
-507 -15285906 -14560183 -13809901 -14927910 -14802087 -15577882 -14371365 -15409359 -19658940 -14326222 -15294421
-517 -15294421 -15397027 -14824863 -14796996 -16298739 -15685300 -15023389 -15315574 -15730767 -14527575 -13666466
-527a3666466j236503J0913k21096j634053L174058o14853p62319r00980J899868m76207
-537a4427638J92560j639514J917564r07137k047518J040785J130960Q87496J22819
-546a3729623j141950L15164q18598j70839n5206J700866L03137k425894R50064j403910
-556a6476789J649141M40107r4068K25077L5078j475358L86274j151669J803173J334170
-566a3324864J391646j428681j374854j256471Q63631o1412Q23916K284301j300200j94742
-576a3577730K42899n31469k80474j017640M38332p50378J84286J799154j67766o20340
-586a4281126m35605L76167J145261O3768N30343o06177j058562j093655P04931j04885
-596a4759540K398735j240722J039078m78570k025326p77022J082977k045171K552918
$$ plain form
-527 -13666466 -14902969 -14892056 -15113152 -16747205 -13573147 -14188000 -14950319 -15851299 -13951431 -14427638
-537 -14427638 -14235078 -15874592 -13957028 -14864165 -16911683 -15870898 -14739938 -13852442 -13729623
-546 -13729623 -14871573 -14556409 -15375007 -15545846 -15601052 -13900186 -13597049 -16022943 -15072879 -16476789
-556 -16476789 -14827648 -14387541 -14481609 -14256532 -14221454 -15696812 -15310538 -16462207 -14659034 -13324864
-566 -13324864 -11933218 -13361899 -14736753 -15993224 -15129593 -15191005 -14367089 -12082788 -13382988 -13577730
-576 -13577730 -13334831 -13866300 -14146774 -15164414 -14726082 -15476460 -15292174 -13493020 -13660786 -14281126
-586 -14281126 -14716731 -14340564 -13195303 -13131535 -12601192 -13207369 -14265931 -15359586 -14654655 -14759540
-596 -14759540 -12360805 -13601527 -12562449 -13041019 -15066345 -15843367 -14760390 -16805561 -14252643
-605a4252643k490853Q46059J115813j387933K497536k272520J354428j906749J702549
-614a4794313L303361k505150M16920M66133J82880r8132o20624N059309l666885j383372
-624a3639873j179800J255305O23663M34350j945779n75996j028573J32380Q02544j015673
-634a6137452N85459J251492o15382k341602K506577J171190J094593l391201q34768
-643a6711094K352069j131764k75459j388429J802874o41588J339004n50955P39766Q89832
-653a3575744k012579K801969l4096k179674l78835O79284k231190K242015q94418L72906
-663a5210362j253267J063281j84745M94906q42165J088402j685001n89835J844327
-672a5274459j032533k50413K169001k016976J755740J218789m86600j145108J567718
$$ plain form
-605 -14252643 -16743496 -15897437 -14781624 -16169557 -13672021 -15944541 -14590113 -16496862 -14794313
-614 -14794313 -11490952 -13996102 -13579182 -13113049 -12930169 -13028301 -13648925 -8589616 -12256501 -13639873
-624 -13639873 -14819673 -13564368 -12940705 -12506355 -14452134 -15028130 -16056703 -15924323 -15121779 -16137452
-634 -16137452 -15551993 -14300501 -14915883 -17257485 -14750908 -13579718 -12485125 -15876326 -16711094
-643 -16711094 -14359025 -15490789 -15766248 -17154677 -15351803 -15993391 -14654387 -15205342 -14465576 -13575744
-653 -13575744 -15588323 -12786354 -12820450 -15000124 -15378959 -14699675 -16930865 -14688850 -15583268 -15210362
-663 -15210362 -16463629 -15400348 -15585093 -15090187 -15932352 -14843950 -16528951 -17118786 -15274459
-672 -15274459 -16306992 -16557405 -14388404 -16405380 -14649640 -13430851 -13917451 -15062559 -13494841
-681a3494841j699910M3237j013155k317823M50601L497333K061337k668835K793158
-690a2348898j1002479P153419j022950R1593k12895K109650j341272P50876P27566M01948
-700a4693442r73537k329734K132911P84903J903761l230908R06204J481078m129836
-709a8148600K105090k051387O84479J17982M28913J277334J127955k924759Q86945M83109
-719a6012939J789425J049219k235135m85725J019384K795369j648439j179924m85134
-728a5393899O03281J049717K027679l041943j81278j211551k74516M29090j286131
-737a7279551K727988Q45682n43390L301287l188342N82330J048200o43882p76952k01906
-747a4128536P91380o69449k943463p86838K480920k680273L170379j95998j184874L3541
$$ plain form
-681 -13494841 -15194751 -15151514 -16164669 -18482492 -18031891 -14534558 -12473221 -15142056 -12348898
-690 -12348898 -23351377 -16197958 -17220908 -17129315 -17342210 -15232560 -16573832 -15822956 -15095390 -14693442
-700 -14693442 -15666979 -17996713 -15863802 -15078899 -13175138 -16406046 -15499842 -14018764 -18148600
-709 -18148600 -16043510 -18094897 -17410418 -17292436 -16863523 -15586189 -14458234 -17382993 -16496048 -16012939
-719 -16012939 -14223514 -13174295 -15409430 -15895155 -14875771 -12080402 -13728841 -14908765 -15393899
-728 -15393899 -14790618 -13740901 -11713222 -14755165 -14936443 -16147994 -16422510 -15993420 -17279551
-737 -17279551 -14551563 -13705881 -14249271 -10947984 -14136326 -13553996 -12505796 -13149678 -13926630 -14128536
-747 -14128536 -13337156 -14006605 -16950068 -17736906 -15255986 -17936259 -14765880 -14961878 -16146752 -16113211
-757a6113211j736033J546855J321144O35019J140586k439160J08153j93180j87542
-766a5917369K223580J94276p19693Q09374j644136j185602Q59407q65403Q63183K64360
-776a5118023k21291J099721R94352p52181J842718K03253k237065j332331J9332m67928
-786a5969443J589847p43565J766243P73559j944939j649251k6032J236429j294706
-795a6261858j428464J779270L54368j55532J160665l48391r72518o73998O74757K291561
-805a3580140k711894M185381j967159k668531Q40444R62204o17980l39435M24655L92755
-815a5079700q14282K593463L4695k080539J642871q50001j765728K170902j83321m10537
-825a4742177M24997Q44027J523858j418026j473596j664101O86434J514265j58861
$$ plain form
-757 -16113211 -17849244 -16302389 -14981245 -14346226 -13205640 -15644800 -15536647 -15729827 -15917369
-766 -15917369 -13693789 -13499513 -14219206 -13409832 -15053968 -16239570 -15380163 -16245566 -15382383 -15118023
-776 -15118023 -15339314 -14239593 -13245241 -13997422 -12154704 -11951451 -14188516 -15520847 -15501515 -15969443
-786 -15969443 -14379596 -15123161 -13356918 -12583359 -14528298 -16177549 -16203581 -14967152 -16261858
-795 -16261858 -17690322 -15911052 -15556684 -15712216 -14551551 -14899942 -15872460 -16546458 -15871701 -13580140
-805 -13580140 -16292034 -12106653 -14073812 -16742343 -15901899 -14939695 -15557675 -15897110 -15472455 -15079700
-815 -15079700 -15893982 -13300519 -13265824 -15346363 -13703492 -14553493 -16319221 -14148319 -14331640 -14742177
-825 -14742177 -14317180 -13473153 -11949295 -13367321 -14840917 -16505018 -15818584 -14304319 -14463180
-834a4463180k377021J553130J14726K68929l06772N72988N18005j901392N74795j043877
-844a6489669J504830j285096K45678J236768l185311J690216M4833P31538R74460k103390
-854a6635143Q36236R75784j912112Q0469J980234k179771J064535k52452J629491O1560
-864a4351169m63315J069820k15230n8314j642317K13621L130016r92936l155735P44512
-874a5721047m91867K4427K785938j428186j371535j530988J725410N53604N18864M52441
-884a4482939r33680J98720J501631p83710m0465L21891j88706j017125j044359K375664
-894a4093078n37853n195947J692470K664507N05595N02950m868999L421065n22009
-903a6431299K222753j280981O12854q98374M5945l85408l87012P93912P95056J685216
$$ plain form
-834 -14463180 -16840201 -15287071 -15172345 -14903416 -15210188 -14637200 -14119195 -16020587 -15445792 -16489669
-844 -16489669 -14984839 -16269935 -16024257 -14787489 -17972800 -16282584 -16237751 -15506213 -14531753 -16635143
-854 -16635143 -15798907 -14823123 -16735235 -16654766 -14674532 -16854303 -15789768 -16042220 -14412729 -14351169
-864 -14351169 -14814484 -13744664 -13959894 -14018208 -15660525 -15446904 -12316888 -13309824 -16465559 -15721047
-874 -15721047 -16212914 -16188487 -13402549 -14830735 -16202270 -17733258 -16007848 -15454244 -14935380 -14482939
-884 -14482939 -15416619 -15217899 -13716268 -14499978 -14540443 -14218552 -14407258 -15424383 -16468742 -14093078
-894 -14093078 -14630931 -19826878 -18134408 -15469901 -14964306 -14461356 -19330355 -15909290 -16431299
-903 -16431299 -14208546 -15489527 -14876673 -15775047 -15729102 -16114510 -16501522 -15707610 -14912554 -13227338
-913a3227338q55713k20571k132900P16796K181640j864573J282576k494349P7123K54436
-923a6282873p64973O85883m39873Q3708K210688o53050j150657J2926J562293J62385
-933a4573543j574631L70771N08482J102412n37355r65661K410480j766842p33542Q39885
-943a4919544j695788J007235p17829J470842J345768k984498J456691r03521j078661
-952a7019305p09361Q53938J867718L70039q43315J9262J36148k453749K597402k97613
-962a5478836j351859K009917j479044n7196P64700k773344J600893j66028J000037
-971a5930760J421747k18724M27607j120897r28412J220110O22077j450574j258439Q27703
-981a6388562J33248J501822O9959q61150q82627k97601O01122N83987q76036j639119
$$ plain form
-913 -13227338 -14083051 -14303622 -16436522 -15719726 -13538086 -15402659 -14120083 -16614432 -16537309 -16282873
-923 -16282873 -17047846 -16361963 -16801836 -16718128 -14507440 -15160490 -16311147 -16298221 -14735928 -14573543
-933 -14573543 -16148174 -15777403 -15268921 -14166509 -14703864 -15669525 -13259045 -15025887 -15759429 -14919544
-943 -14919544 -16615332 -15608097 -16325926 -14855084 -13509316 -16493814 -15037123 -15940644 -17019305
-952 -17019305 -17728666 -16874728 -15007010 -14636971 -15480286 -15461024 -15324876 -17778625 -15181223 -15478836
-962 -15478836 -16830695 -14820778 -16299822 -16357018 -15592318 -18365662 -16764769 -16930797 -15930760
-971 -15930760 -14509013 -14727737 -14300130 -15421027 -16349439 -15129329 -14507252 -15957826 -17216265 -16388562
-981 -16388562 -16255314 -14753492 -14683533 -15544683 -16427310 -16724911 -16123789 -15539802 -16415838 -18054957
-991a8054957K821003Q09850N46618q19910l31354m52298R10740J407826j34863k065511
-1001a5362856K252324j239875m90059M29166j239461J435387l71669J813060J713538
-1010a1060445o502853P83139J826484o11033J899165j653247J124571l487384K077558
-1019a5604045k38151J405586k077523J110602J38120J296923r98573K56010j215253
-1028a5926304J113554J507863q66827q1490N43324j736970M41158q78609K065567p25008
-1038a4543742j291407K53771J563353j321356l67046J016709r06181j401110J795271
-1047a5201738J594672o23844P91129N48253j090071K26001J394237o07776k548739o68176
-1057a6186052J534642k530943k713042M209500r25072L213122M20911k121266k3160
$$ plain form
-991 -18054957 -15233954 -14424104 -13877486 -14697396 -15028750 -15481048 -14570308 -13162482 -13297345 -15362856
-1001 -15362856 -13110532 -14350407 -14840466 -14411300 -15650761 -14215374 -14587043 -12773983 -11060445
-1010 -11060445 -17563298 -16780159 -14953675 -15564708 -13665543 -15318790 -14194219 -17681603 -15604045
-1019 -15604045 -15842196 -14436610 -16514133 -15403531 -15265411 -13968488 -14967061 -14711051 -15926304
-1028 -15926304 -14812750 -13304887 -14171714 -14253204 -13709880 -15446850 -15005692 -15884301 -13818734 -14543742
-1038 -14543742 -15835149 -15581378 -14018025 -15339381 -15706427 -14689718 -15595899 -16997009 -15201738
-1047 -15201738 -13607066 -14230910 -13439781 -12891528 -13981599 -13755598 -12361361 -12969137 -15517876 -16186052
-1057 -16186052 -14651410 -17182353 -19895395 -15685895 -16610967 -13397845 -12976934 -15098200 -15121360
-1066a5121360O81784j200049N6706J871524l249270J462558j59310L73151J035858
-1075a4248408j485101K466158j747485J34746o19650J095972M12172j851474J48990
-1084a5694080J413345O00059j865050R53689j69827o47984k917855J612966k59078
-1093a6973815J057181J7417n53664J692189l268529j622603L009972L67315l37274M52918
-1103a6158893Q4156K535403p32279l112550J453271q9312K344107l443194O30867p24445
-1113a7212869q74572J71285K822094n92163r12758o34992j76847R5780L252728L78034
-1123a3684280l67319j89189m08464n79677n81434J110879j173954K28105J462558k688709
-1133a6871484n20974Q6329L39651L622462j432660k72744K06700J209888k585874K322750
$$ plain form
-1066 -15121360 -14439576 -15639625 -15582919 -13711395 -16960665 -15498107 -15657417 -15284266 -14248408
-1075 -14248408 -15733509 -13267351 -15014836 -14880090 -15499740 -14403768 -13991596 -15843070 -15694080
-1084 -15694080 -14280735 -13680676 -15545726 -14592037 -14761864 -15409848 -18327703 -16714737 -16973815
-1093 -16973815 -15916634 -15899217 -16452881 -14760692 -18029221 -19651824 -16641852 -16274537 -16611811 -16158893
-1103 -16158893 -16074737 -13539334 -14271613 -17384163 -15930892 -16020204 -13676097 -17119291 -16488424 -17212869
-1113 -17212869 -18087441 -17916156 -15094062 -15686225 -16598983 -17233975 -17410822 -17315042 -14062314 -13684280
-1123 -13684280 -14051599 -14240788 -14649252 -15228929 -15810363 -14699484 -15873438 -15645333 -14182775 -16871484
-1133 -16871484 -17392458 -17306129 -16966478 -13344016 -14776676 -15049420 -14842720 -13632832 -16218706 -13895956
-1143a3895956k207077J314833M85169n72208J13722K78835N82574k065410J096052n67741
-1153a5437207P68905j26357J482780r71821L2981j172389j048967P70675M82476J400843
-1163a3818081l90997j352679R52556j093177k117761r3946K988017J372578j767605
-1172a5321095j845623j72096N44344J378189J327108K3039o02433m44921K5469p25868
-1182a5813887n9978r11706R47139K921513k764120j63030q15059J196188P68793k44648
-1192a4938795l33494j124351j90299k61116N37856J000878j124300J562097J582393
-1201a3289131m068723J100950J950362R67662j645946n72454j031327J784680j769691
-1210a6573618J914730o82953L1743J36843l045893J753687l81729J556489j766126
$$ plain form
-1143 -13895956 -16103033 -14788200 -14303031 -14875239 -14761517 -14482682 -13900108 -15965518 -14869466 -15437207
-1153 -15437207 -14668302 -14794659 -13311879 -14283700 -14250719 -15423108 -16472075 -15701400 -15218924 -13818081
-1163 -13818081 -14209078 -15561757 -14609201 -15702378 -17820139 -17914085 -14926068 -13553490 -15321095
-1172 -15321095 -17166718 -17338814 -16794470 -15416281 -14089173 -14066134 -14668567 -15113488 -15088019 -15813887
-1182 -15813887 -15873865 -16785571 -15838432 -12916919 -15681039 -15844069 -16659128 -15462940 -14694147 -14938795
-1192 -14938795 -15272289 -16396640 -16586939 -16848055 -16310199 -15309321 -16433621 -14871524 -13289131
-1201 -13289131 -17357854 -16256904 -14306542 -13338880 -14984826 -15557280 -16588607 -14803927 -16573618
-1210 -16573618 -14658888 -15341841 -15310098 -15173255 -18219148 -16465461 -16847190 -15290701 -17056827
-1219a7056827J010556j223346J304127J57609j065959J508134Q51923j04268k214077
-1228a6832128J739651L56873k759415J726072J843643l285562l2255m50503L591172
-1237a4102452j253938N02993o90749L72102M03485k985453P55189k59746O81838p53580
-1247a7330311Q47061J176849K432779j479226j404184N2634J80500l159757J577364
-1256a7106291m55438J803217K305058q17241k417361J296895R61773k459198K186340
-1265a4702246J83420o15243k318562M236338j057031k076997J224127j247101J995742
-1274a4377553j93505j570994j505562M017169k078248k3213j338003R45768P13760N28413
-1284a4881968J299485q18551J275977m312861J422624M90378n37972J486879j288389
$$ plain form
-1219 -17056827 -16046271 -17269617 -15965490 -15807881 -16873840 -15365706 -14513783 -14618051 -16832128
-1228 -16832128 -15092477 -14735604 -17495019 -15768947 -13925304 -17210866 -17243121 -17693624 -14102452
-1237 -14102452 -15356390 -14853397 -15544146 -15172044 -14768559 -17754012 -16998823 -17258569 -16576731 -17330311
-1247 -17330311 -16483250 -15306401 -12873622 -14352848 -15757032 -15704398 -15523898 -18683655 -17106291
-1256 -17106291 -17561729 -15758512 -13453454 -14270695 -16688056 -15391161 -14429388 -16888586 -14702246
-1265 -14702246 -14518826 -15134069 -17452631 -13216293 -14273324 -16350321 -15126194 -16373295 -14377553
-1274 -14377553 -14571058 -16142052 -17647614 -13630445 -15708693 -15731906 -17069909 -16124141 -15410381 -14881968
-1284 -14881968 -13582483 -14401034 -13125057 -17437918 -16015294 -15524916 -16062888 -14576009 -15864398
-1293a5864398j78273P82175r07590l47411K730923J51831n500k233824L15538o21515
-1303a6178044Q21744N86535J514078o94467O78106k499696O9515j168069K30203M17269
-1313a6222826k54468n86381J000848j639587N27082J699592R90m21885q20269N63295
-1323a6153609K117662l2288k743303Q93689J418463k722081K253395r55952r89977K13633
-1333a6700368k38555J461332r14413p01476L362765j561992k33627k507268j07688K68522
-1343a7872768K035392p150J147414r43328m84248P452J559583r5722m12502j257079
-1353a6322956P18873o13157J881526l64975N93691l0623K21910j702156j8912j25567
-1363a5762346Q36813j427937L81082Q77988N16896O67735k56254m78457J454451o54670
$$ plain form
-1293 -15864398 -16042671 -15260496 -16168086 -16515497 -13784574 -13632743 -13638243 -15872067 -15556529 -16178044
-1303 -16178044 -15356300 -14769765 -13255687 -13950154 -13272048 -15771744 -15702229 -16870298 -16640095 -16222826
-1313 -16222826 -16477294 -17063675 -16062827 -17702414 -17175332 -15475740 -15474750 -15896635 -16716904 -16153609
-1323 -16153609 -14035947 -14068235 -16811538 -15917849 -14499386 -17221467 -14968072 -15924024 -16914001 -16700368
-1333 -16700368 -16938923 -15477591 -16392004 -17093480 -13730715 -15292707 -15526334 -18033602 -18141290 -17872768
-1343 -17872768 -15837376 -15844526 -14697112 -15640440 -16124688 -16117236 -14557653 -14653375 -15065877 -16322956
-1353 -16322956 -15604083 -16217240 -14335714 -14700689 -14106998 -14137621 -13915711 -15617867 -15636779 -15762346
-1363 -15762346 -14925533 -16353470 -15972388 -15094400 -14577504 -13909769 -14166023 -14644480 -13190029 -13844699
-1373a3844699l700803K141124N2923l52756K84070L01910o55629J325022j430305J474803
-1383a4404340k82433j659875j093652J648652P05141J06565J90748k79911J929812
-1392a3139293k486588r31995J732300R77283j817440J947174j633976j591051R53723
-1401a5989863j05816K296166N22930j967266r17850j62631J934983Q68682o814279
-1410b0334944K655325P12988K11630P46903K164533m34674o2649j039024j17958J76818
-1420a5321052j245432j606730m305J864531P89728j951735o0532k16196J210645K002257
-1430a4538821j890294l62197J033868n68878K026447l147825j709888K671074N5669
-1439a6430845j278712K418855j067070p89953r69076J935765q30206K36209j308927
$$ plain form
-1373 -13844699 -17545502 -15404378 -15351455 -15704211 -15420141 -15118231 -15773860 -14448838 -15879143 -14404340
-1383 -14404340 -14686773 -16346648 -17440300 -15791648 -15086507 -14979942 -14789194 -15069105 -13139293
-1392 -13139293 -15625881 -16557876 -14825576 -13848293 -15665733 -13718559 -15352535 -16943586 -15989863
-1401 -15989863 -16095679 -13799513 -13276583 -15243849 -16161699 -16324330 -14389347 -13520665 -20334944
-1410 -20334944 -17679619 -16966631 -16755001 -16008098 -13843565 -14278239 -14340888 -15379912 -15497870 -15321052
-1420 -15321052 -16566484 -18173214 -18177519 -16312988 -15523260 -17474995 -17535527 -17751723 -16541078 -14538821
-1430 -14538821 -16429115 -16791312 -15757444 -16326322 -14299875 -17447700 -19157588 -16486514 -16430845
-1439 -16430845 -17709557 -15290702 -16357772 -17147725 -18116801 -16181036 -17011242 -16775033 -18083960
-1448a8083960n57955O4914N74434J273166O54593q92941M728595j257092k033890o02480
-1458a6132616J961617j927158j488526J368847K44068j422201K235562o72062l83784
-1467a6216253J011070l322888J770920J093631O995374n792015J328790k870819k2712
-1476a6024902Q08799j725836J033318k348810L031151j208950Q41040k046833q20959
-1485a8461982N325410j205962m80925k92150P44205N94104j857158J114050K07151L13679
-1495a3999578M20713q44847j647099j16200J604222p9731k547487J294495K298447
-1504a3617065n439487L616863l81681k77524L14635K407282l084850O17306L52890K34575
-1514a5257056j217348J898914r57427o06478J881973j721939P47486j63381K77616
$$ plain form
-1448 -18083960 -18641915 -18577001 -18002567 -16729401 -16074808 -16967749 -12239154 -13496246 -15530136 -16132616
-1458 -16132616 -14170999 -16098157 -17586683 -16217836 -15973768 -17395969 -15160407 -15832469 -16216253
-1467 -16216253 -15205183 -18528071 -16757151 -15663520 -8668146 -14460161 -13131371 -16002190 -16024902
-1476 -16024902 -15216103 -16941939 -15908621 -18257431 -15226280 -16435230 -15594190 -17641023 -18461982
-1485 -18461982 -13136572 -14342534 -14823459 -15115609 -14371404 -13777300 -15634458 -14520408 -14313257 -13999578
-1495 -13999578 -13578865 -14423712 -16070811 -16187011 -14582789 -14662520 -17210007 -15915512 -13617065
-1504 -13617065 -19056552 -15439689 -15821370 -16098894 -15784259 -13376977 -16461827 -15844521 -15491631 -15257056
-1514 -15257056 -16474404 -14575490 -15532917 -16139395 -14257422 -15979361 -15231875 -15395256 -15117640
-1523a5117640J791132j164421l11394j192482J95344K49010M33173O38681l064265P84305
-1533a6758557r47103M331193k333172j451700O25086J38872p4836o45181J667666k099902
-1543a7547634J563763k3348M05425j934279J191435l48108K841969j429786j092780
-1552a6373343j511012K11209N198041L09158j691755l059627J59838J561502O62260
-1561a4533729j642580j062061K026934j754822j816109K947359q03183J377747j90510
-1570a5450954k726248l35453K624275m67992J06573l99175M54182M4087J507943l04659
-1580a4947421j14497J3859J216414k55322m41200k914092J478920q84308P56082J230243
-1590a4861322k649740K614553Q63130k159527L454187k62140k063051M58540K27964
$$ plain form
-1523 -15117640 -13326508 -14490929 -14802323 -15994805 -15799461 -15550451 -15117278 -14478597 -17542862 -16758557
-1533 -16758557 -17705660 -13374467 -15707639 -17159339 -16534253 -16395381 -16470217 -17115398 -15447732 -17547634
-1543 -17547634 -15983871 -16007219 -15601794 -17536073 -16344638 -16692746 -13850777 -15280563 -16373343
-1552 -16373343 -17884355 -17673146 -12475105 -12165947 -13857702 -16917329 -16757491 -15195989 -14533729
-1561 -14533729 -16176309 -17238370 -15211436 -16966258 -18782367 -15835008 -16638191 -15260444 -15450954
-1570 -15450954 -18177202 -18512655 -15888380 -16356372 -16249799 -16648974 -16194792 -16150705 -14642762 -14947421
-1580 -14947421 -15061918 -15048059 -13831645 -14086967 -14528167 -17442259 -15963339 -16847647 -16091565 -14861322
-1590 -14861322 -17511062 -14896509 -14033379 -16192906 -12738719 -13000859 -15063910 -14605370 -14377406
-1599a4377406o21664j155110q61936R62485J455519k069169K07360O76233q67896
-1608a6651584J0137868p497091j718458K612055k083405o4544O36454j589485L67512
-1617a5850678R45519M55164j237855N03569j861654O60012M0583N81550p01597M80370
-1627a5985017p49869J999388J188788j434556M43735L23977j985638k36194K68619p06793
-1637a6873560K998601r62051L6247n40728k00653p39473j224493J719768j85798R26933
-1647a5045207l4743K56336j713345J443253j40920K93325j82247R9305K163566j814748
-1657a4675425j001609P52743j342357J890810j862705L47253L416425k223959k25743
-1666a4924567J827002J640740o68913j884238j414535L97470l79986j202403M18461
$$ plain form
-1599 -14377406 -14999070 -16154180 -17016116 -16053631 -14598112 -16667281 -16459921 -15783688 -16651584
-1608 -16651584 -6513716 -14010807 -15729265 -13117210 -15200615 -15265159 -14628705 -16218190 -15850678
-1617 -15850678 -14905159 -14449995 -15687850 -15184281 -17045935 -16385923 -16345340 -15763790 -16465387 -15985017
-1627 -15985017 -16734886 -14735498 -13546710 -14981266 -14537531 -14213554 -16199192 -16435386 -16166767 -16873560
-1637 -16873560 -13874959 -14837010 -14800763 -15341491 -15542144 -16281617 -17506110 -15786342 -15972140 -15045207
-1647 -15045207 -15079950 -14823614 -16536959 -15093706 -15234626 -14941301 -15123548 -15024243 -12860677 -14675425
-1657 -14675425 -15677034 -14924291 -16266648 -14375838 -16238543 -15891290 -12474865 -14698824 -14924567
-1666 -14924567 -13097565 -11456825 -12125738 -14009976 -15424511 -15027041 -15407027 -16609430 -16190969
-1675a6190969K32256L928518k385830j414788J423364k111087Q61043n98739J741976
-1684a4514256j190914j754945N07880K587682J899784j850520m648422J515395J980974
-1693a5467342j610077N05233J921197k834529L105747N68955m24935j786059q03157
-1702a6824967k34442M87337Q80136j685659O18462P70665L326619k243862j869586Q2504
-1712a6692793R6573j085430J397832L477905k332746J471964l691373J684587J810937
-1721a3862544k670165K327831r02420K615397j804302n60195j68291j257347O97788
-1730a5584248n688114P234773j240787j116324M2828J158357j050703N60680J246501
-1739a4437037j822028o57265J3509l72364j55511J661564m2435j170256M33554L47761
$$ plain form
-1675 -16190969 -15958713 -12030195 -14416025 -15830813 -14407449 -16518536 -15657493 -16256232 -14514256
-1684 -14514256 -15705170 -17460115 -16952235 -14364553 -12464769 -14315289 -18963711 -17448316 -15467342
-1693 -15467342 -17077419 -16572186 -14650989 -17485518 -14379771 -13810816 -14235751 -16021810 -16824967
-1702 -16824967 -17059409 -16572072 -15691936 -17377595 -16759133 -15988468 -12661849 -14905711 -16775297 -16692793
-1712 -16692793 -16596220 -17681650 -16283818 -12805913 -15138659 -13666695 -17358068 -15673481 -13862544
-1721 -13862544 -16532709 -14204878 -15107298 -12491901 -14296203 -14856398 -15024689 -16282036 -15584248
-1730 -15584248 -21272362 -14037589 -15278376 -16394700 -16351872 -15193515 -16244218 -15683538 -14437037
-1739 -14437037 -16259065 -16916330 -16902821 -17275185 -17430696 -15769132 -15811567 -16981823 -16548269 -16200508
-1749a6200508J597724P08809o30843N85740k129639n71872N55548q45852L043560l662042
-1759a7549375J629012j13756L75207k873527m2146O68435R82952N67749p73010m17651
-1769a7546110j343221J295201J256612M5986L11971L17945Q02408r81486J626019j786214
-1779a6000889J138441j221992q35500J596632j745160M25971l05897N38696J273204q471
-1789a5144965R39135q34248k505249O52912N27100l44575O97704N17107k181806R03745
-1799a6773140K237255j153216J161531j120072K766884m150607K59894k27762J056781
-1808a5942452J744334r54761l7050p50898P18324O04037r03127j004797L0793N82866
-1818a5912731K28346j71048n08090m91784J004110M89208r5855k399553q24662L399886
$$ plain form
-1749 -16200508 -14602784 -13893975 -14524818 -13939078 -16068717 -16640589 -16085041 -16930893 -13887333 -17549375
-1759 -17549375 -15920363 -16034119 -15658912 -18532439 -18574585 -17906150 -16923198 -16355449 -17128459 -17546110
-1769 -17546110 -18889331 -17594130 -16337518 -16291532 -15979561 -15661616 -14859208 -15840694 -14214675 -16000889
-1779 -16000889 -14862448 -16084440 -16919940 -15323308 -17068468 -16642497 -16948394 -16409698 -15136494 -15144965
-1789 -15144965 -14205830 -15040078 -17545327 -16892415 -16365315 -16709890 -16012186 -15495079 -17676885 -16773140
-1799 -16773140 -14535885 -15689101 -14527570 -15647642 -12880758 -17031365 -16771471 -16999233 -15942452
-1808 -15942452 -14198118 -15152879 -15189929 -15940827 -15222503 -14618466 -15521593 -16526390 -16495597 -15912731
-1818 -15912731 -15684385 -15855433 -16363523 -16855307 -15851197 -15361989 -15457844 -17857397 -18682059 -15282173
-1828a5282173J553333p34242k63406k830031L179438j314553j963401J362924J028382
-1837a5263729J101419k92140J580499l52369j242824p80992j468640j56309J302708
-1846a5572377o02577j70278q88628M12990R06458m57781J200956j043803L682671j800827
-1856a4333196l56382p95971p73343N56479O36357j426548J679958J00420K71958j146598
-1866a5586866R38727J07395k039279N10843J759641j296109k310317J979242P08281
-1875a5228442l38933K533876k97828j387338n89583l33068R7696K87190O1353m92937
-1885a5688014k70242k91307P21854J080405K513877k428821k993213L47413J338765
-1894a5669283m06734K33568p0572k98133P81696L27171n11870J179628k99168K127776
$$ plain form
-1828 -15282173 -13728840 -14463082 -14726488 -17556519 -14377081 -15691634 -17655035 -16292111 -15263729
-1837 -15263729 -14162310 -14454450 -12873951 -13226320 -14469144 -15250136 -16718776 -16875085 -15572377
-1846 -15572377 -16174954 -16345232 -17233860 -16820870 -15914412 -16372193 -15171237 -16215040 -12532369 -14333196
-1856 -14333196 -14689578 -15485549 -16258892 -15702413 -15066056 -16492604 -14812646 -14712226 -14440268 -15586866
-1866 -15586866 -14648139 -14540744 -16580023 -16069180 -14309539 -15605648 -17915965 -15936723 -15228442
-1875 -15228442 -15567375 -13033499 -13331327 -14718665 -15308248 -15641316 -15543620 -15256430 -15195077 -15688014
-1885 -15688014 -15958256 -16249563 -15527709 -14447304 -11933427 -14362248 -17355461 -17008048 -15669283
-1894 -15669283 -16076017 -15842449 -15913021 -16211154 -15429458 -15102287 -15614157 -14434529 -14733697 -12605921
-1904a2605921l519737o40604o20123K048268J878050k148137J231480O87315k163115
-1913a5852524M03121M64689q82210J837523k021845J264089O1052M44787m47393M69708
-1923a4259003k10143J739071j951884J021163k732082q9591K590168M0922p77558n79728
-1933a5208665Q33481Q89003l87787o64970j332554J33403M37911K17899j264064L79940
-1943a5966403q83667J319230q8741j353265L57936M018215r55851j410499P9324J198503
-1953a3685218j343786j799325J175057K14865j551647J454811J030319j363590J614902
-1962a4253612l39377k191729J821746j019294n42797Q41432j154868L060700P29686
-1971a3048113L52377k348007M50876j699050J023693J140919j023916j393427K045905
$$ plain form
-1904 -12605921 -16125658 -16766262 -17386385 -15338117 -13460067 -15608204 -14376724 -13689409 -15852524
-1913 -15852524 -15449403 -14984714 -15866924 -14029401 -16051246 -14787157 -14726105 -14281318 -14728711 -14259003
-1923 -14259003 -14469146 -12730075 -14681959 -13660796 -16392878 -16482469 -13892301 -13851379 -14628937 -15208665
-1933 -15208665 -14375184 -13486181 -13873968 -14538938 -15871492 -15738089 -15300178 -15082279 -16346343 -15966403
-1943 -15966403 -16850070 -15530840 -15619581 -16972846 -16614910 -12596695 -13552546 -14963045 -14883721 -13685218
-1953 -13685218 -15029004 -16828329 -15653272 -15438407 -16990054 -15535243 -14504924 -15868514 -14253612
-1962 -14253612 -14592989 -16784718 -14962972 -15982266 -16525063 -15683631 -16838499 -13777799 -13048113
-1971 -13048113 -12695736 -15043743 -14592867 -16291917 -15268224 -14127305 -15151221 -16544648 -14498743
-1980a4498743j710622Q18856J177209k41545p12006J86846J18286p82189p05415q44977
-1990a7194300K660974o86053j058862j814310K566775k19307m21951j602734K104118
-1999a5665650J871516k241084M37140p80694n99686K017805m01765J728565l28599n56141
-2009a4518593n63646J644470j429529o00906l15310l69420J825999K00934O4518J89948
-2019a3871535j314052o54501L05275j441336N65204J312293J44829j026782M79024j03508
-2029a5605089j819162J765680J035541k362286k48223J159151j071824r49660J180476
-2038a6915396l18344P55988J649702Q36479N93908k46516q09993l814011J112278K85284
-2048a6870621K433989j597588L59596R71705L0466k77125j259622O58030o51233J206605
$$ plain form
-1980 -14498743 -16209365 -15390509 -14213300 -14454845 -15166851 -14980005 -14861719 -15643908 -16349323 -17194300
-1990 -17194300 -14533326 -15219379 -16278241 -18092551 -15525776 -15745083 -16167034 -17769768 -15665650
-1999 -15665650 -13794134 -16035218 -15598078 -16378772 -16978458 -14960653 -15362418 -13633853 -13962452 -14518593
-2009 -14518593 -15082239 -13437769 -14867298 -15468204 -15783514 -16152934 -14326935 -14126001 -14061483 -13871535
-2019 -13871535 -15185587 -15840088 -15534813 -16976149 -16410945 -15098652 -14953823 -15980605 -15501581 -15605089
-2029 -15605089 -17424251 -15658571 -14623030 -16985316 -17233539 -16074388 -17146212 -18095872 -16915396
-2038 -16915396 -17233740 -16477752 -14828050 -13991571 -13397663 -13644179 -14454172 -18268183 -17155905 -16870621
-2048 -16870621 -14436632 -16034220 -15674624 -14702919 -14672453 -14949578 -16209200 -15551170 -16202403 -14995798
-2058a4995798M69068J443639j034185l387687K723448J121814n83345k834664J550642
-2067a5527068K437949K72557j193826J430914j999295j026610m82254k68382R16060
-2076a5439955k17796K373858k76946N92266M06627l548495O23733r21756Q21429O96103
-2086a4890932r10943m41345K43198J812341k229844r84502n7918L57413R94085R90561
-2096a5117886k03195Q05875Q45235L8620m05898p18929o48106J277848m375497P48691
-2106a7753242K133404K43947P97859j008732j213579R10993j404227P00259N57536q71633
-2116a6907415J161522k208022J052401P63588k000938J167729l83477M45097J200744
-2125a5708771r21108l0666r18478m82173L283151q64367M04151K4893j884807M22452
$$ plain form
-2058 -14995798 -14526730 -13083091 -14117276 -17504963 -14781515 -13659701 -14243046 -17077710 -15527068
-2067 -15527068 -13089119 -12816562 -14010388 -12579474 -14578769 -15605379 -16087633 -16356015 -15439955
-2076 -15439955 -15657751 -13283893 -13560839 -12968573 -12561946 -16110441 -15486708 -16408464 -15587035 -14890932
-2086 -14890932 -15801875 -16243220 -16000022 -14187681 -16417525 -17402027 -17459945 -17102532 -16108447 -15117886
-2096 -15117886 -15321081 -14515206 -13669971 -13631351 -14037249 -14756178 -15404284 -14126436 -18501933 -17753242
-2106 -17753242 -15619838 -15375891 -14578032 -15586764 -16800343 -15889350 -17293577 -16593318 -16035782 -16907415
-2116 -16907415 -15745893 -17953915 -16901514 -16137926 -18138864 -16971135 -17354612 -16909515 -15708771
-2125 -15708771 -16629879 -16660545 -17579023 -18061196 -14778045 -15642412 -15238261 -15213368 -17098175 -16675723
-2135a6675723K83248o36611J923153N15645j619146K235988j726968j77570J549641
-2144a4328343N25195r91098j619487Q60407j486746J275354m3612J561041k019227M55196
-2154a5811320J035489m09329J235185N3755m969408K973478l58169l70525J99279k214769
-2164a8636334K705964P8455j07361K895523j977868j736367K401824J686888l432669
-2173a6121945p98069K030244j439602o7104J486942m48150j823835J567873r08696
-2182a6522342J485937k87706m29441j059606J42822j529621J853719J364601j054942
-2191a6036579K32373N68579n95105j80190j434058J428431P15275j421002j349421
-2200a8071697K474859j020556N4338o5781P98292l06458n87807J799957k9312k332109
$$ plain form
-2135 -16675723 -16392475 -17029086 -15105933 -14590288 -16209434 -13973446 -15700414 -15877984 -14328343
-2144 -14328343 -13803148 -14794246 -16413733 -15553326 -17040072 -15764718 -15808330 -14247289 -16266516 -15811320
-2154 -15811320 -14775831 -15185160 -13949975 -13896220 -18865628 -15892150 -16250319 -16620844 -16421565 -18636334
-2164 -18636334 -15930370 -15851915 -15959276 -13063753 -15041621 -16777988 -14376164 -12689276 -16121945
-2173 -16121945 -16920014 -14889770 -16329372 -16396476 -14909534 -15357684 -17181519 -15613646 -16522342
-2182 -16522342 -15036405 -15324111 -15753552 -16813158 -16670336 -18199957 -16346238 -14981637 -16036579
-2191 -16036579 -15804206 -15235627 -15830732 -16010922 -17444980 -16016549 -15301274 -16722276 -18071697
-2200 -18071697 -15596838 -16617394 -16563056 -16628837 -15830545 -16137003 -16724810 -14924853 -14954165 -17286274
-2210a7286274L76402O41181r6975K25586l43346j229759j168500J049372K137449J472550
-2220a4222314l063500K49756K061378j283036N91392n82115J051685M09068o98824
-2229a5486510J849288j807956k155320m3678J356635J059143p41046k197003j18238
-2238a8284685K072200o81353J587584J018057O4453K52092j537486j276542m11505
-2247a7197185J349961R25752r64786K390600j604278O57837n65742j666565J41305P20153
-2257a5812948N64905L28284N69856j215123K736336l688658M516100m097626R42937
-2266a5155937j627137j932575O32324J324672J078469j621004Q47746R41424p4827o13977
-2276a6200822K105331k805352Q95333K41524o34337o66445J512647j831351J239019
$$ plain form
-2210 -17286274 -16909872 -16268691 -16365666 -16140080 -16483426 -17713185 -18881685 -17832313 -15694864 -14222314
-2220 -14222314 -17285814 -17036058 -14974680 -16257716 -15666324 -16248439 -15196754 -14787686 -15486510
-2229 -15486510 -13637222 -15445178 -17600498 -17644176 -16287541 -15228398 -15969444 -18166447 -18284685
-2238 -18284685 -16212485 -16893838 -15306254 -14288197 -14223744 -13971652 -15509138 -16785680 -17197185
-2247 -17197185 -15847224 -14921472 -15886258 -13495658 -15099936 -14442099 -15007841 -16674406 -16533101 -15812948
-2257 -15812948 -15248043 -14919759 -14349903 -15565026 -12828690 -16517348 -12001248 -16098874 -15155937
-2266 -15155937 -16783074 -18715649 -18083325 -16758653 -15680184 -17301188 -16453442 -15512018 -15586845 -16200822
-2276 -16200822 -14095491 -16900843 -16005510 -15763986 -16398323 -17064768 -15552121 -17383472 -16144453
-2285a6144453J667085j058283j87194R13073n89179k293217K008387l8737l201421
-2294a8923939K305566O65557k569548N07950K204481K375938j495814r9210k12892Q72085
-2304a4369826o53817M17742k80690j157997O77907J715408k509968j029452K050625
-2313a5140068l62843j3513K333886j022423m596903J786005N43995M33873k030561
-2322a8068552L199682J664109k293837K968165q852143L029659Q47041n55835k86495
-2331a8348206J357603j1310J620112J212907k758084p38899N80888J864855j783853N1618
-2341a6952369J720545j324880j034288O07240P55743j499682j162792J080027O664862
-2350a1145594k251443o42131r10245l48118K380597o72617n14247l40264n3970l31180
$$ plain form
-2285 -16144453 -14477368 -15535651 -15722845 -14809772 -15398951 -17692168 -15683781 -15722518 -18923939
-2294 -18923939 -16618373 -15952816 -18522364 -18014414 -15809933 -13433995 -14929809 -15029019 -15241911 -14369826
-2304 -14369826 -15023643 -14605901 -14886591 -16044588 -15366681 -13651273 -16161241 -17190693 -15140068
-2313 -15140068 -15502911 -15516424 -13182538 -14204961 -18801864 -17015859 -16471864 -16037991 -18068552
-2322 -18068552 -14868870 -13204761 -15498598 -12530433 -21382576 -18352917 -17505876 -18061711 -18348206
-2331 -18348206 -16990603 -17001913 -15381801 -14168894 -16926978 -17665877 -17084989 -15220134 -17003987 -16952369
-2341 -16952369 -15231824 -16556704 -17590992 -16983752 -16228009 -17727691 -18890483 -17810456 -11145594
-2350 -11145594 -13397037 -14039168 -14949413 -15297531 -12916934 -13589551 -14103798 -14444062 -14498032 -14829212
-2360a4829212k33179j324362J163172k91019R18944j919893K18438L60591J911496
-2369a4025024j050346K885475n372132K9606O79048L66971o85695J031201M39839j473295
-2379a7174352J840355R955q22967J36991q4256J74138k161371Q13855J287400n93169
-2389a6573421M45218J010365k162325K88360J142055J291518j717532J085516M37756
-2398a4752490j433098j621053P53006J496385L225744m486921N47714q64644L14517
-2407a6820840J914865k036077k5141L731217k560517p75871k97774l90627o82812O71441
-2417a7272136K036537J539962j229006o41142J69645j64420L42382R31292j293904
-2426a5580790j407526J888076l43732r95778L38361Q89624j768561P00594J781747
$$ plain form
-2360 -14829212 -15062391 -16386753 -15223581 -15514600 -14595656 -16515549 -16297111 -15936520 -14025024
-2369 -14025024 -15075370 -12189895 -17562027 -17532421 -16853373 -16486402 -17172097 -16140896 -15701057 -17174352
-2379 -17174352 -15333997 -15324042 -16147009 -16010018 -16094274 -15920136 -18081507 -17267652 -15980252 -16573421
-2389 -16573421 -16128203 -15117838 -17280163 -16991803 -15849748 -14558230 -16275762 -15190246 -14752490
-2398 -14752490 -16185588 -17806641 -17053635 -15557250 -12331506 -16818427 -16270713 -17135357 -16820840
-2407 -16820840 -14905975 -16942052 -16967193 -13235976 -15796493 -16572364 -16870138 -17260765 -17943577 -17272136
-2417 -17272136 -15235599 -13695637 -14924643 -15565785 -15396140 -15560560 -15218178 -14286886 -15580790
-2426 -15580790 -16988316 -15100240 -15443972 -16439750 -16101389 -15211765 -16980326 -16279732 -14497985
-2435a4497985j272562k389472K117678k425812J230323P39082J452540O06419j16445
-2444a4556234l756814J369580j539881K093002J380219o19462L5638K35110q67188n2857
-2454a6278887j181767N48072l44633J63520M35787K10332q81505R72957l026740M104969
-2464a5277895j204748p46441J404561k313171J880768J91251Q04965L216279j688042
-2473a3732473m72697j42055k425603M48128J17523j331767P75580L64877K24117o5196
-2483a6239566j156589J431870o34355J575348n00179L01993k055629K335190k038220
-2492a6980137J875301p96404L025059k055464j061474m24651O87545R00589r57300m00562
-2502a6187498m4918j603012J239579k39112J654351k390755j16433j817308L272595r4005
$$ plain form
-2435 -14497985 -15770547 -18160019 -16042341 -18468153 -17237830 -16498748 -15046208 -14439789 -14556234
-2444 -14556234 -18313048 -16943468 -18483349 -16390347 -15010128 -15629590 -15593952 -15358842 -16226030 -16278887
-2454 -16278887 -17460654 -16912582 -17257215 -17093695 -16657908 -16447576 -17329081 -16356124 -19382864 -15277895
-2464 -15277895 -16482643 -17229084 -15824523 -18137694 -16256926 -16065675 -15260710 -12044431 -13732473
-2473 -13732473 -14205170 -14347225 -16772828 -16324700 -16207177 -17538944 -16763364 -16398487 -16174370 -16239566
-2483 -16239566 -17396155 -15964285 -16598640 -15023292 -15523471 -15221478 -17277107 -14941917 -16980137
-2492 -16980137 -15104836 -15901240 -12876181 -14931645 -15993119 -16417770 -15730225 -14829636 -15786936 -16187498
-2502 -16187498 -16232416 -17835428 -16595849 -16834961 -15180610 -17571365 -17687798 -19505106 -16232511 -16326516
-2512a6326516K906616m15231M74402j609637k04260P5459J808343r54220m24412l643460
-2522a8312916J19672K504302j48458j79033L28166J141864l33532j831088m33856J982010
-2532a5162869j510019Q48752j71649k37736P13122J556973N26641l933790Q10606l1293
-2542a6591262J8498j115400R87882J842039m86366l195860J566564Q02901J385975l95933
-2552a5180962J01695k044814J970189N74838k494553L82597L45578M36214M47034l63734
-2562a5825918r97522L5706L556036k382752q46889Q59978o90839k95615Q6751J844277
-2572a4656787j32547j229679J414680l137753L722250j341047O40054k57565K022698
-2581a2955696k782656q21199O04738o96991O33412r2715k792l22065J975182j752276
$$ plain form
-2512 -16326516 -13419900 -13835131 -13360729 -14970366 -15174626 -15099167 -13290824 -14245044 -14669456 -18312916
-2522 -18312916 -18193244 -15688942 -15837400 -16016433 -15688267 -14546403 -14879935 -16711023 -17144879 -15162869
-2532 -15162869 -16672888 -15824136 -15995785 -16233521 -15520399 -13963426 -13436785 -17370575 -16559969 -16591262
-2542 -16591262 -16572764 -17688164 -16700282 -14858243 -15344609 -18540469 -16973905 -16171004 -14785029 -15180962
-2552 -15180962 -15079267 -17124081 -15153892 -14579054 -17073607 -16691010 -16345432 -15909218 -15462184 -15825918
-2562 -15825918 -16823440 -16787734 -13231698 -15614450 -16461339 -15601361 -16292200 -16587815 -16501064 -14656787
-2572 -14656787 -14789334 -16019013 -14604333 -17742086 -14019836 -15360883 -14720829 -14978394 -12955696
-2581 -12955696 -15738352 -16559551 -15954813 -16651804 -16018392 -16111107 -16113899 -16435964 -14460782 -16213058
-2591a6213058J241849j138217Q52782j222054j950377M143805k119283m07474N61633
-2600a6250394r97289N88604q88112K015198p30146J908351q74411J222148M66031j696863
-2610a5236883R19546j630951Q97559j334238m86493J827236j102620N65486J152093
-2619a4429265O87883q71977j587166J548940k045331j621759K243912j090927k128004
-2628a9293694L118347O69464O85144j166971j185128J518852J663084J087928l095171
-2637a5998145J726920j818481K45996J385644o28425J70693N09669j173102Q71367M0463
-2647a4667401p99024Q68977q87753L37102j51016k653195N63197J443572J045936j467970
-2657a6367575J57074j246220L780300j694328Q17119p1277j627569J990089N90122
$$ plain form
-2591 -16213058 -14971209 -16109426 -15256644 -16478698 -18429075 -14285270 -16404553 -16812027 -16250394
-2600 -16250394 -17247683 -16659079 -17547191 -15531993 -16262139 -14353788 -15228199 -14006051 -13540020 -15236883
-2610 -15236883 -14317337 -15948288 -15050729 -16384967 -16871460 -15044224 -16146844 -15581358 -14429265
-2619 -14429265 -13741382 -14613359 -16200525 -14651585 -16696916 -18318675 -16074763 -17165690 -19293694
-2628 -19293694 -16175347 -15505883 -14820739 -15987710 -17172838 -15653986 -13990902 -12902974 -15998145
-2637 -15998145 -14271225 -16089706 -15843710 -14458066 -15086491 -14915798 -14406129 -15579231 -14707864 -14667401
-2647 -14667401 -15466425 -14597448 -15485201 -15148099 -15299115 -17952310 -17389113 -15945541 -14899605 -16367575
-2657 -16367575 -16210501 -17456721 -13676421 -15370749 -14553630 -14624907 -16252476 -14262387 -13672265
-2666a3672265j410086j182261k177552J014507p48081J197243l36451N11655j348861
-2675a8152152J203504l71363N91258r4982j120850O89028P43903J208637n41707L73671
-2685a5471053N71958R44195k137959K73994j212646L92612K152478l208136L545910
-2694a4148647k335742M97601J60748J19311L880592j614965k330051J32317k05470
-2703a5844306K727959o23154j683743j053835Q81253R04915j146657J437932j688536
-2712a6088172j94224j27023K879545q06323Q22130n239075m49693J368407L091036
-2721a4743392j588868R7152k18300N61368n53963j003114N64128J33462K177507
$$ plain form
-2666 -13672265 -15082351 -16264612 -18442164 -17427657 -18175738 -16978495 -17314946 -16803291 -18152152
-2675 -18152152 -16948648 -17320011 -16728753 -16823735 -17944585 -17255557 -16511654 -15303017 -15844724 -15471053
-2685 -15471053 -14899095 -13954900 -16092859 -15818865 -17031511 -16638899 -14486421 -17694557 -14148647
-2694 -14148647 -16484389 -15986788 -15826040 -15706729 -11826137 -13441102 -15771153 -15638836 -15844306
-2703 -15844306 -13116347 -13739501 -15423244 -16477079 -15595826 -14690911 -15837568 -14399636 -16088172
-2712 -16088172 -16282396 -16409419 -13529874 -14336197 -13514067 -18753142 -19202835 -17834428 -14743392
-2721 -14743392 -16332260 -16235108 -16453408 -15892040 -16446003 -17449117 -16884989 -16751527 -14574020
-2730a4574020  $$ checkpoint
##PAGE= N=2
##DATA TABLE=(X++(I..I)), XYDATA
13653a4817657M26779K305413m93093O61884k868615J288195k312299r7412K207724P94302
13643a2904779j363004j79631k20602N216298j000624k101716O70903k529463n32124
13634a4944742N40305J518639k048264K995690O5545k213527Q59841j534239P11495
13625a4049257J844186Q7547k313506j539405J701220L05314J184503l133251J290599
13616a4622050J284979n09499O28231P6953j090225l96238m3448J252628L10587J96156
13606a2911926j746355m44943J307391J245486r34846o46704l2158J818626n99236k089353
13596a5034018J491485J827408k399243K130545j001383k793381J309107J516331j883933
13587a4837082N62804J311427O40671j214364p71601J648253j168016J674875q28537
$$ plain form
13653 -14817657 -14390878 -12085465 -12578558 -11916674 -14785289 -13497094 -15809393 -15906805 -13699081 -12904779
13643 -12904779 -14267783 -14447414 -14668016 -9451718 -10452342 -12554058 -11883155 -14412618 -14944742
13634 -14944742 -14404437 -12885798 -14934062 -11938372 -11872827 -14086354 -13226513 -14760752 -14049257
13625 -14049257 -12205071 -12117524 -14431030 -15970435 -14269215 -13963901 -12779398 -15912649 -14622050
13616 -14622050 -13337071 -13846570 -13218339 -13141386 -14231611 -14627849 -14671297 -13418669 -13108082 -12911926
13606 -12911926 -14658281 -15103224 -13795833 -12550347 -13485193 -14131897 -14164055 -12345429 -12944665 -15034018
13596 -15034018 -13542533 -11715125 -14114368 -11983823 -12985206 -15778587 -14469480 -12953149 -14837082
13587 -14837082 -14274278 -12962851 -12322180 -13536544 -14308145 -12659892 -13827908 -12153033 -12981570
13578a2981570m90588L705994p73601l050982J370857o76295L0691R8046k39331m84953
13568a3491732q59436K133680L96566j324739O46230j719019k010457J406046K666600
13559a2156261m30342K67513K66062r96365j7331j826092K745708p44107K29323Q81868
13549a1780024j3343k111427R39156R5315K74835m95199q89677Q18310M76335L33626
$$ plain form
13578 -12981570 -13472158 -9766164 -10539765 -13590747 -12219890 -12896185 -12865494 -12767448 -13006779 -13491732
13568 -13491732 -14351168 -12217488 -11820922 -13145661 -12499431 -14218450 -16228907 -14822861 -12156261
13559 -12156261 -12586603 -12319090 -12053028 -13049393 -13066724 -14892816 -12147108 -12891215 -12661892 -11780024
13549 -11780024 -11793367 -13904794 -12965638 -12870323 -12595488 -13090687 -13980364 -13162054 -12685719 -12352093
$$ [...]
-2730a6414483  $$ checkpoint
##END NTUPLES=
##END=
