##TITLE= S#332543
##JCAMP-DX= 5.00 $$ JEOL NMR v1.10
##DATA TYPE= NMR SPECTRUM
##DATA CLASS= NTUPLES
##NUM DIM= 1
##ORIGIN= DELTA_NMR
##OWNER= organic
##SPECTROMETER/DATA SYSTEM= DELTA_NMR
##.OBSERVE FREQUENCY= 3.00529655924288E+02
##.OBSERVE NUCLEUS= ^1H
##.DELAY= (2.194E+02,2.194E+02)
##.ACQUISITION MODE= SIMULTANEOUS
##.FIELD= 7.0586013
##.FILTER WIDTH= 1.81675738660864
##.ACQUISITION TIME= 3.6339712
##.SPINNING RATE= 10
##.OBSERVE 90= 9.6
##NTUPLES= NMR SPECTRUM
##VAR NAME= FREQUENCY,    SPECTRUM/REAL, SPECTRUM/IMAG, PAGE NUMBER
##SYMBOL=   X,            R,             I,             N
##VAR TYPE= INDEPENDENT,  DEPENDENT,     DEPENDENT,     PAGE
##VAR FORM= AFFN,         ASDF,          ASDF,          AFFN
##VAR DIM=  16384, 16384, 16384, 2
##UNITS= PPM,     ARBITRARY UNITS, ARBITRARY UNITS, 
##FIRST=  1.2501033903057E+01, -3.52780429827347, -2.80619171129811, 1
##LAST=  -2.50011824950436, -2.86841463724973, -3.22527207310845, 2
##FACTOR=  9.1565355261926E-04, 5.15772210230853E-04, 5.15772210230853E-04, 1
##PAGE= N=1
##DATA TABLE=(X++(R..R)), XYDATA
$$ [...]
5181a2056825m26261L00431N84408j265932L82072O06286r02992l35981J074471k43152
5171a2283475r12908p6712P31240j6364O879J059150l80026r83668L78056j160987J679624
5160a1959191p76348N11442J73596K84381n07672k44326P43209p73510L80964O79830
5150a1487625j949191K86390J495478N31033j77234k02491j600188M80810r06988K252675
5140a1277331k24897Q51977r42156q04075p24989J286588n08443m25747P8284J387447
5130a1303342k92657K77123j081875j895191N72908J098660J002452m6964q05660m13827
5120a2888373K98796r1815j090267k11584J447522J383253m89765l09564l79515l7349
5110a2368661M2846n1528P57177K921422m362835J226280J04989o35733K83500P11780
$$ y = [-12056825, -12483086, -12182655, -11598247, -12864179, -12482107, -11875821, -12778813, -13114794, -12040323, -12283475, -13196383, -13273095, -12541855, -12558219, -12551340, -11492190, -11872216, -12855884, -12477828, -13638815, -11959191, -12735539, -12224097, -12050501, -11766120, -12273792, -12518118, -11774909, -12548419, -12167455, -11487625, -13436816, -13150426, -11654948, -11123915, -11301149, -11503640, -13103828, -12623018, -13530006, -11277331, -11502228, -10650251, -11592407, -12396482, -13121471, -11834883, -12343326, -12769073, -12690789, -11303342, -11595999, -11318876, -12400751, -14295942, -13723034, -12624374, -11621922, -11668886, -12474546, -12888373, -12589577, -12681392, -13771659, -13983243, -12535721, -11152468, -11642233, -11951797, -12331312, -12368661, -12325815, -12377343, -11620166, -8698744, -13061579, -11835299, -11730310, -12366043, -12082543, -11370763]
5100a1370763j60975L41079j692379K74071j31455J129864M01041j502583o2501J092517
5090a1682084q20589Q02030j71597k18561L43411M40161n03394j531369Q99699l52114
5080a2794407L25697p69970L79114M90904O37246n34977N91133m1666r83912Q11189L00908
5069a1588741K76841O53628m37739j715785N84336n757K67231J83886q6342j454570
5059a3323012J045389m28013R22855J01106o21490J54949N26476j033413R38363r59830
5049a2676620k44327P16268l62254J192715k29094q17705p57477J860226j131135R2806
5039a2356597L27286m08380L33651N28936l50835j15579m31639o73927N16794J29911
5029a2500379M21618L27136o39333m57830Q02302J118269j916573M55810M56741q23526
$$ y = [-11370763, -11531738, -11190659, -12883038, -12608967, -12740422, -11610558, -11209517, -12712100, -12774601, -11682084, -12502673, -11700643, -11872240, -12090801, -11747390, -11307229, -11810623, -13341992, -12442293, -12794407, -12468710, -13238680, -12859566, -12368662, -11731416, -12266393, -11675260, -11716926, -12700838, -11889649, -11588741, -11311900, -10658272, -11096011, -12811796, -12227460, -12233217, -11965986, -11782100, -11868442, -13323012, -12277623, -12705636, -11782781, -11681675, -12303165, -12148216, -11621740, -12655153, -11716790, -12676620, -12920947, -12204679, -12566933, -11374218, -11603312, -12421017, -13178494, -11318268, -12449403, -12356597, -12029311, -12437691, -12104040, -11575104, -11925939, -12041518, -12473157, -13147084, -12630290, -12500379, -12078761, -11751625, -12390958, -12848788, -12046486, -10928217, -12844790, -12388980, -11932239, -12755765]
5019a2755765j393389N64402M89591J446192p86785r73579l3197j89872J718624q8443
5009a2002221N19533P06689n52474j376663K6461l75953N15623k82003j006462K440262
4999a1387208M09706r01544J5175M3356J60201r15416J445358l66768J41606L39427
4989a1016107j009163M83618l33077l19063M1779J438358M14486k659595n92790K24761
4979a3326793L32262J320824n05429K40973j543575m05831R03200k17312Q16093R40953
4969a1444635O43195j051652Q76504k25222j210063L98304n56718Q25498K168410j959587
4959a1535966k9244m98880j62320k12449J16358q74060q6856J567531L34211K73156q27489
4948a1936008m09763L40742n26120J46218o5006Q56134N89301q85067k87772j530996
$$ y = [-12755765, -14149154, -13584752, -13095161, -11648969, -12435754, -13409333, -13442530, -13632402, -11913778, -12002221, -11482688, -10775999, -11328473, -12705136, -12678675, -13054628, -12539005, -12821008, -13827470, -11387208, -10977502, -11879046, -11863871, -11820515, -11660314, -12575730, -11130372, -11497140, -11355534, -11016107, -12025270, -11541652, -11874729, -12193792, -12152013, -10713655, -10299169, -12958764, -13551554, -13326793, -12994531, -11673707, -12179136, -11938163, -13481738, -13887569, -12984369, -13201681, -12385588, -11444635, -10801440, -11853092, -10976588, -11201810, -12411873, -12013569, -12570287, -11744789, -9576379, -11535966, -11565210, -12064090, -12226410, -12438859, -12322501, -13196561, -13283417, -11715886, -11381675, -11108519, -11936008, -12345771, -12005029, -12531149, -12384931, -12449937, -11593803, -11004502, -11889569, -12177341, -13708337]
4938a3708337J730015q9624n50163P70955L46023p42718J32826n31443J011097j032688
4928a2664057J909693k17177m37198j142426k91473J13093Q87570R9564P46441j793070
4918a2789040J439451j224929k28497P18021l86942k39284J603172j136106j200182k8808
4908a3473144M12761N01690J30345n61850R1477M87696K20866r9739j005879J092681
4898a2203096O99755p11644l23393J500564o62328k47073m54516Q88008q06579k47760
4888a2568062J61838J036395L61518o90252p02322M48698j71541Q64624r44655N8823
4878a2144936N45991O99255k021951O05435Q43289J61285K57902n98096p92867R59594
4868a1485099P42171o00951l83409j700761j97600J044455Q62251K57556j363831Q87943
$$ y = [-13708337, -11978322, -12067946, -12618109, -11847154, -11501131, -12243849, -12111023, -12642466, -11631369, -12664057, -10754364, -10971541, -11408739, -12551165, -12842638, -12729545, -11841975, -11742411, -10995970, -12789040, -11349589, -12574518, -12803015, -12084994, -12471936, -12711220, -11108048, -12244154, -13444336, -13473144, -13060383, -12558693, -12428348, -12990198, -12898721, -12411025, -12190159, -12289898, -13295777, -12203096, -11503341, -12214985, -12538378, -11037814, -11700142, -11947215, -12401731, -11513723, -12320302, -12568062, -12406224, -11369829, -11008311, -11698563, -12400885, -11952187, -12123728, -11259104, -12203759, -12144936, -11598945, -10899690, -12921641, -12316206, -11472917, -11311632, -11053730, -11651826, -12444693, -11485099, -10742928, -11343879, -11727288, -13428049, -13625649, -12581194, -11718943, -11461387, -12825218, -11937275]
4858a1937275j28300j027799O72073L45391m83614K17557M76145K49510m28890Q72272
4848a1172930m81515j27205j78683J98843m50799Q76270o56569L54536j01545l98388
4838a2137985j699732J441560J28423m60997R42926o96585k09124J010137q4100K08770
4828a1556707n795N59513o88983Q881K11311Q06244j044828q17555R48907j48368Q96766
4817a0830614J72736R2076O54856j504j37837J755080J650809J1584O464035P55516
4807E86737k5867184N963027K929760q61500K364586L98285P89503J34421m61561j58896
4797a4182822O68330J279895K75522J913567k207153j83682j681099P86682k22409K04999
4787a3348170K02087j23291J69995J39619O96238P86048o44230J94985p72368l00383
$$ y = [-11937275, -12065575, -13093374, -12421301, -12075910, -12559524, -12341967, -11865822, -11616312, -12045202, -11172930, -11654445, -11781650, -11960333, -11761490, -12212289, -11336019, -11992588, -11638052, -11739597, -12137985, -13837717, -12396157, -12267734, -12728731, -11785805, -12482390, -12691514, -11681377, -11765477, -11556707, -11562502, -11002989, -11691972, -11683091, -11471780, -10665536, -11710364, -12527919, -11579012, -11727380, -10830614, -10657878, -10565802, -9910946, -9912450, -10050287, -8295207, -6644398, -6632814, -168779, 586737, -25280447, -19317420, -16387660, -17249160, -14884574, -14486289, -13696786, -13562365, -14023926, -14182822, -13514492, -12234597, -11959075, -10045508, -12252661, -12436343, -14117442, -13330760, -13553169, -13348170, -13146083, -13269374, -13099379, -12959760, -12263522, -11477474, -12121704, -11926719, -12699087, -12999470]
4777a2999470O22049J13076O99408m511294L170751K216J68164o0736K08885j88231J75750
4766a2599432R1022K41503J56889j117534L51165K36280l08689J052262o01648K85481
4756a2212701r66710J805362j16454o5134J7332m2059O6331j708413J3881L55226M66818
4745a2386521N44575j844629P36496M01084J44241J01929q09759l52592J566504j65651
4735a2064323n60497k76257O38999l03658P51678K64876M59855M59726j945622o81604
4725a3256827L247653j329508j249077n7337O90690K12369j167844P01582O43801j61991
4715a1726489j925627J427094j95645J010944k130146M32427L25674m06835O19905j948218
4705a4516916L665028j410810K32901M22881L83830o91846O95940j188197K85292n68244
$$ y = [-12999470, -12377421, -12264345, -11564937, -16076231, -12905480, -12903264, -12735100, -12795836, -12586951, -12775182, -12599432, -12508410, -12266907, -12110018, -13227552, -12876387, -12640107, -12948796, -11896534, -12498182, -12212701, -13179411, -11374049, -11490503, -11555637, -11538305, -11580364, -11514033, -13222446, -13208565, -12853339, -12386521, -11841946, -13686575, -12950079, -12548995, -12404754, -12302825, -13112584, -13465176, -11898672, -12064323, -12624820, -12901077, -12262078, -12565736, -11814058, -11549182, -11089327, -10629601, -12575223, -13256827, -10009174, -11338682, -12587759, -12645096, -11954406, -11742037, -12909881, -12208299, -11564498, -11726489, -13652116, -12225022, -12420667, -11409723, -13539869, -13107442, -12781768, -13188603, -12568698, -14516916, -10851888, -12262698, -12029797, -11606916, -11223086, -11914932, -11218992, -12407189, -12121897, -12690141]
4695a2690141n15031O31474L03502M1539p21757J30913K51123l3423q53960P87777N65247
4684a2102737k52540p34471J099871J54101j171126J219592m36781j176884J318238J74577
4674a1908160m25119Q92197j434440j9006J173323l45564P32135k57097j061458j128759
4664a3781948m33787K034760R12713q4767n42377K02733j607415J114006j193927j86652
4654a3566661K90813k85582J548441k58559j689558P13356M19747P11607J231303j009537
4644a1894630j71509J92660m78557r74543k269P38805O77289m19435l33660J287496j8569
4633a1396922j040392L97036J45126m6720j576704R18758M20822l47887R94088k01492
4623a1734287j225830K60846Q46788o69222k84324m17592J107285k75109p68450K92850
$$ y = [-12690141, -13205172, -12573698, -12270196, -12228657, -12950414, -12819501, -12568378, -12601801, -13455761, -12667984, -12102737, -12355277, -13089748, -11989877, -11835776, -13006902, -11787310, -12224091, -13400975, -12082737, -11908160, -12333279, -11441082, -12875522, -12894528, -11721205, -12066769, -11334634, -11591731, -12653189, -13781948, -14215735, -12180975, -11268262, -11353029, -11895406, -11692673, -13300088, -12186082, -13380009, -13566661, -13275848, -13561430, -12012989, -12271548, -13961106, -13247750, -12828003, -12116396, -10885093, -11894630, -12066139, -11873479, -12352036, -13326579, -13328848, -12590043, -11912754, -12332189, -12665849, -11378353, -11396922, -12437314, -12040278, -11895152, -11941872, -13518576, -12599818, -12178996, -12526883, -11532795, -11734287, -12960117, -12699271, -11852483, -12521705, -12806029, -13223621, -12116336, -12391445, -13159895, -12867045]
4613a2867045K9475L10036o2630j34290j011917N81007K82503P46671R7535k07641r88205
4602a3224501N72667o68216M95287M35573n09969J09267n78907R04555J151366j174630
4592a2487508K1540k74429p14091J515767o82765n23565P97300m30712K95231l65780
4582a2849012K66523k54411j49922p5868M5215j65725L37282l66768M75215N09492l14710
4571a2542689m90787J41292J450527k70948j348486n08154M89351Q36482N45139j058596
4561a2756869L20861m66215R93362L93591j000092q50350J573092j012389M15676J85976
4551a2203357M51768j101189J42237O05699J199419l10790r01645j94486l2505l60327
4541a2705176p2964j51193J305608j25199J259790j776096o82005Q75246L80510n28032
$$ y = [-12867045, -12837570, -12527534, -12590164, -12724454, -13736371, -13155364, -12872861, -12126190, -12028655, -12236296, -13224501, -12651834, -13320050, -12824763, -12389190, -12899159, -12789892, -13368799, -12464244, -11312878, -12487508, -12465968, -12740397, -13454488, -11938721, -12621486, -13145051, -12347751, -12778463, -12483232, -12849012, -12582489, -12836900, -12986822, -13062690, -13017475, -13183200, -12845918, -13212686, -12737471, -12227979, -12542689, -13033476, -12892184, -11441657, -11712605, -13061091, -13569245, -13079894, -12243412, -11698273, -12756869, -12436008, -12902223, -11908861, -11515270, -12515362, -13365712, -11792620, -12805009, -12389333, -12203357, -11751589, -12852778, -12710541, -12104842, -10905423, -11216213, -12117858, -12312344, -12344849, -12705176, -12778140, -12929333, -11623725, -11748924, -10489134, -12265230, -12947235, -12071989, -11691479, -12219511]
4531a2219511L95937k64685N58519k94398J59752m37012l09421K8611Q47918K669879
4521h864411m646408k32636P38543k79055J934082j129055P08190k88342q62581n35965
4511a3457638M73972m82293P29059L95286J199608J70632k923042p8008o6654J375073
4501a2664005o48480n85384J150241J85071k00270N79618R45874l370456K467660N18248
4491a1621883r87515p01672p67374Q57920J857165j01310l014987J595945Q10994q20858
4481a2893575N40230R20777l23000L64637j76171o95016j70700n54842l78600R81517
4471a2384743q78149j72854J080325o82911P7030p76473R81128p61696O65576k65949R7061
4460a3021655P78118p52870J246642m36759j473654k78908N95818L79322r04675P08411
$$ y = [-12219511, -11823574, -12088259, -11529740, -11824138, -11664386, -12101398, -12410819, -12382208, -11534290, -8864411, -13510819, -13743455, -13004912, -13283967, -11349885, -12478940, -11770750, -12059092, -12921673, -13457638, -12983666, -13465959, -12736900, -12341614, -11142006, -10971374, -13894416, -13972424, -14039078, -12664005, -13312485, -13897869, -12747628, -12562557, -12762827, -12183209, -11237335, -14607791, -12140131, -11621883, -12609398, -13311070, -14078444, -13220524, -11363359, -11464669, -14479656, -12883711, -12072717, -12893575, -12353345, -11432568, -11755568, -11390931, -11567102, -12262118, -12432818, -12987660, -13366260, -12384743, -13262892, -13435746, -12355421, -13038332, -12961302, -13737775, -12756647, -13518343, -12852767, -13118716, -13021655, -12243537, -12996407, -11749765, -12186524, -13660178, -13939086, -13343268, -12963946, -13868621, -13160210]
4450a3160210N59588K71054k07673K02880q98765Q49247j736610J681551N06714k07063
4440a2139287l69380k89289M33723o969q25469J291855J137134j746347m17118k21033
4430a3152180o04813O90721o66337J49728L80829m85473m03986O89333N66780K76792
4420a2558606M89791J13721j265550L06692M77352l538k00825j12313J55779l39235o21803
4409a3558535J071860j542730J974464j03800r01689J128388K98827K6911r46746r34393
4399a3487443R70792m23908J76278n9606o0194l22214N26777J039949k484905J249383
4389a2875091O85228o20777j167804J937311n11115K040604j438196n34778J071478Q53807
4379a0559333p78960k40841L06775M68853l18445K198366q75217k1596551Q300643O034904
$$ y = [-13160210, -12600622, -12329568, -12537241, -12334361, -13233126, -12383879, -14120489, -12438938, -11932224, -12139287, -12508667, -12797956, -12364233, -12371202, -13196671, -11904816, -10767682, -12514029, -12931147, -13152180, -13756993, -13066272, -13732609, -13582881, -13202052, -13687525, -14091511, -13402178, -12835398, -12558606, -12068815, -11955094, -13220644, -12913952, -12436600, -12440138, -12640963, -12753276, -12597497, -12936732, -13558535, -12486675, -14029405, -12054941, -12158741, -13060430, -11932042, -11633215, -11606304, -12553050, -13487443, -12516651, -12940559, -12764281, -12823887, -12884081, -13206295, -12679518, -11639569, -14124474, -12875091, -12189863, -12810640, -13978444, -12041133, -12552248, -10511644, -11949840, -12484618, -11413140, -10559333, -11338293, -11579134, -11272359, -10803506, -11121951, -8923585, -9798802, -31395353, -23094710, -17059806]
4369a7059806J441347K08729k4251j134256K520428J50176j5080P35950r01842J095010
4359a2983595n41958J22148j346056J88642R41767Q52692J076196j366854o0100O3291
4349a3053827j099509R63487J505862k813351J843171j005670J57731Q6557K30463o44273
4339a3829359J957123j935885J074478N10151j318521m19010r41744J412188Q19865n72202
4329a3242916J82718l31220J501394q90767K85476m900Q41643N4444m58361j510735L89380
4318a3183844R71905P81815j696205P51510J021846j947452J767488l68200k32540k22167
4308a2355844k56002m24643M63995J211420m6551r43512P4713O53122J105650j731617
4298a2249269k15092M45746k32626K74150O05593o12450J01308q2696K9786K44518j92927
$$ y = [-17059806, -15618459, -15409730, -15433981, -16568237, -14047809, -13897633, -13912713, -13176763, -14078605, -12983595, -13525553, -13403405, -14749461, -14560819, -13619052, -12766360, -11690164, -13057018, -13117118, -13053827, -14153336, -13189849, -11683987, -14497338, -12654167, -13659837, -13502106, -13415549, -13185086, -13829359, -11872236, -13808121, -12733643, -12223492, -13542013, -13961023, -14902767, -13490579, -12670714, -13242916, -13060198, -13391418, -11890024, -12780791, -12495315, -12500215, -11658572, -11604128, -12062489, -13573224, -13183844, -12211939, -11430124, -13126329, -12374819, -11352973, -13300425, -11532937, -11901137, -12133677, -12355844, -12611846, -13036489, -12572494, -11361074, -11407625, -12351137, -12276424, -11623302, -10517652, -12249269, -12464361, -12018615, -12251241, -11977091, -11371498, -11983948, -11882640, -11965336, -11935550, -11691032, -11883959]
4287a1883959p09876O12122k32229l31408j44667J10905q32741k379641L137964J435458
4277a1218072K22686K5719K68830l500867K211767n77135Q76980O29807n04066K09818
4267a1354533j87455J627224j038771p50069J48553l96025M13480M64686O00095M83117
4257i989698L36676L96568k81784n04660n25056L86641o01918J85586K39232q15611l93325
4246a1567349o96231P18201O0947K77531j152667P82563Q69450Q16008r72035M49040
4236a0414542k71706j11301M12198J410055j182755m07699l3358J669106R3581j902040
4226a0738461N43619l25119j357049k82457N70359p8351j516045K043307j051212K57096
4216a1934313K87836R38397N11790K30721J35688O19206k41991Q68150l12306J395775
$$ y = [-11883959, -12593835, -11981713, -12213942, -12545350, -12690017, -12579112, -13411853, -15791494, -12653530, -11218072, -10995386, -10969667, -10700837, -14201704, -11989937, -12567072, -11690092, -11060285, -11564351, -11354533, -11541988, -9914764, -10953535, -11703604, -11555051, -11951076, -11537596, -11072910, -10472815, -9989698, -9653022, -9256454, -9538238, -10042898, -10567954, -10181313, -10783231, -10597645, -10358413, -11174024, -11567349, -12263580, -11545379, -11484432, -11206901, -12359568, -11577005, -10707555, -9891547, -10863582, -10414542, -10686248, -10797549, -10385351, -8975296, -10158051, -10565750, -10599108, -8930002, -8836421, -10738461, -10194842, -10519961, -11877010, -12159467, -11589108, -11667459, -13183504, -11140197, -12191409, -11934313, -11646477, -10708080, -10196290, -9965569, -9829881, -9210675, -9452666, -8584516, -8896822, -7501047]
4206g501047o5008L89958n49156n07389n54204j02614r8658j68409j056823M64837O13315
4195i135198J88564O78804m49876P05806j109696M06363k40432J277667q7899R8433k5777
4184g693241M33027J15678N5119L82928n92033R79625K40318L43516o85119p71422K04507
4173f987097N00291o79039O3784J99759K97792J651677P59271m84950l23424o33585O33314
4162e002207M59533J27335k44152O65709O32144r80032K4946K81141M39144p06432l90563
4151d693434r39327N87433J94803J44439N56409J086530q00914n84512K07743L88261Q158
4140c844411l41517o02017J510827j11460J001353K92724O55145m62757J157088M34197
4130c10828k53750m07025l9570J94085j071465M31522P26959m82908J73380j14299P25179
$$ y = [-7501047, -7566055, -7176097, -7725253, -8232642, -8786846, -8889460, -8988118, -9156527, -10213350, -9748513, -9135198, -8946634, -8267830, -8717706, -8011900, -9121596, -8715233, -8955665, -7677998, -7765897, -7667464, -7693241, -7260214, -7144536, -7089417, -6706489, -7298522, -6318897, -6078579, -5735063, -6420182, -7191604, -6987097, -6486806, -7165845, -7102061, -6902302, -6604510, -4952833, -4193562, -4678512, -5001936, -5635521, -5002207, -4542674, -4415339, -4659491, -3993782, -3361638, -4341670, -4316724, -4035583, -3596439, -4302871, -4693434, -5632761, -5045328, -4850525, -4706086, -4149677, -3063147, -3864061, -4448573, -4240830, -3852569, -3844411, -4185928, -4787945, -3277118, -3388578, -2387225, -2094501, -1439356, -1902113, -745025, -310828, -564578, -971603, -1011173, -817088, -1888553, -1457031, -730072, -1212980, -1039600, -1153899, -428720]
4119d28720P5618r95461J071623q13765J030946j893909P69240R83568J049104l09707
4109E38537l03284N56159J113050Q86606J819090J829799L19699L10860j289226L13653
4099F094943K91837j55314k75220o24991K71738M18220J134231M7429M54397k447000
4089E210270K71755l19849M225445Q49799o81525m81717n15198J856389L134092M149489
4079A7698950L375729Q2153J482186J228282J154605K486175K095657J590660N22470
4070C1716867R94423R45917J349738K345134J063964j25407r42362K956497J872261R46647
4060D3123679J867009R95188L034429J602189M142874M181241M463506L614465J777396
4051F8801976J982472M433130M035756L883690N483016L735369K731586K334201Q88105
$$ y = [-428720, -353102, -1348563, -276940, -1090705, -59759, -1953668, -1184428, -200860, 848244, 538537, 235253, 791412, 1904462, 2791068, 4610158, 6439957, 6759656, 7070516, 5781290, 6094943, 6386780, 6231466, 5956246, 5331255, 5602993, 6021213, 7155444, 7202873, 7657270, 5210270, 5482025, 5162176, 9387621, 10237420, 9555895, 9074178, 8558980, 10415369, 13549461, 17698950, 21074679, 21156832, 22639018, 23867300, 25021905, 27508080, 29603737, 31194397, 31716867, 32711290, 33657207, 35006945, 37352079, 38416043, 38290636, 37348274, 40304771, 42177032, 43123679, 44990688, 45985876, 49020305, 50622494, 54765368, 58946609, 63410115, 67024580, 68801976, 70784448, 75217578, 79253334, 83137024, 88620040, 92355409, 95086995, 97421196, 98309301]
4042I8309301R84091M150044K519656J376730q15601J66436m274911O66114J940751
4033A05022611M600438L989339L895742L719976N550317N365224K012967M278652L392716
4024A41827982O733224O911068J0232368P810474L096064J193768K940094O046490
4016A86791532J1761700J3903067J2460121N610404j367552k276236O446830J3417023
4008B46746889K4899014L0739218K7885943J5847133O076593n187191j4242043l711788
4000C29053768J2191622O575722m84373k2210118m8778826n2933387k8689168o362296
3992A88362944M902300J8807413K8510387K9987286J4370581K923997P741572K1645543
3984C17252023K5873526L6659693N9037803N0020150K3605734j203518j8754228l4568396
$$ y = [98309301, 99293392, 103443436, 105963092, 107339822, 106524221, 106690657, 102415746, 103081860, 105022611, 109623049, 113612388, 117508130, 121228106, 126778423, 132143647, 134156614, 138435266, 141827982, 148561206, 155472274, 165704642, 173515116, 176611180, 177804948, 180745042, 186791532, 198553232, 212456299, 224916420, 230526824, 229159272, 226883036, 233329866, 246746889, 271645903, 302385121, 330271064, 346118197, 352194790, 347007599, 332765556, 329053768, 341245390, 347821112, 347336739, 325126621, 276347795, 223414408, 194725240, 188362944, 193265244, 212072657, 240583044, 270570330, 284940911, 287864908, 295606480, 317252023, 343125549, 379785242, 438823045, 488843195, 512448929, 511245411, 492491183, 457922787]
3976D57922787j2688336J8165049J0177034j4637024n9207656j10521944j13103348
3969A76106562o1953093k1770702p683828O636449K3532721K5684241Q946905R39070
3961A50438325O786796J6393154J3834315J6434249L0130229K7383658M545122j0209461
3953B55736387j5923149k0439073j0182200O838470Q518135m953238k9156529n9176828
3945A31261975n9990949l3774521j5659504j2955961m694640J0748534Q364031J841590
3937B5140555n917844m933369J3413538P99193J893633J993607N72199m870323j3679649
3928A4411540j0037776j196666k097563j887832M270474M332474L918430J150829o33546
3919A2230364J839986k246704m348974j910366K600469k9463J73813k103383o013201
$$ y = [457922787, 445234451, 463399500, 473576534, 458939510, 399731854, 289209910, 176106562, 114153469, 92382767, 84698939, 91335388, 114868109, 140552350, 149499255, 150438325, 157225121, 173618275, 187452590, 203886839, 234017068, 261400726, 265945848, 255736387, 239813238, 219374165, 209191965, 216030435, 224548570, 219595332, 190438803, 131261975, 71271026, 37496505, 21837001, 8881040, 4186400, 14934934, 23298965, 25140555, 19222711, 14289342, 27702880, 28502073, 30395706, 32389313, 32961512, 28091189, 14411540, 4373764, 3177098, 1079535, -808297, 3462177, 7794651, 11713081, 12863910, 12230364, 14070350, 11823646, 7474672, 5564306, 8164775, 8135312, 8309125, 6205742, 192541]
3910A92541j377798M653968K851690K542130J793513j761846m794033k884806J22661
3901A338020J284068j572308L622407J388185N65793Q47402j85925J905052L89227K58316
3891I840237k80085q60180k241960l045108J59924Q87901Q8605J512116J227390k034533
3881E254307J092770Q63869J095617Q52453J041212J675594J153769J865661K737599
3872A7632851J407642j751175m5996M74988J103945Q26943J065185j702285m378489
3863A4633609n391981l04643J172512K404682O50357q88406K010625J680331K36160
3854A6203246J977776M10335J986352N45056L36957L336661K977020K869402L95243K52778
3844C1290826o81212K216177M674183L445673M043374K187649j975097l80540n91493
$$ y = [192541, -1185257, 3468711, 6320401, 8862531, 10656044, 8894198, 4100165, 1215359, 1338020, 2622088, 1049780, 4672187, 6060372, 6626165, 7473567, 7287642, 9192694, 9581921, 9840237, 9560152, 8699972, 6458012, 3412904, 3572828, 4460729, 4549334, 6061450, 7288840, 5254307, 6347077, 7210946, 8306563, 9159016, 10200228, 11875822, 13029591, 14895252, 17632851, 19040493, 17289318, 17243322, 17718310, 18822255, 19649198, 20714383, 19012098, 14633609, 9241628, 8936985, 10109497, 12514179, 13164536, 12276130, 14286755, 15967086, 16203246, 18181022, 18591357, 20577709, 21122765, 21459722, 24796383, 27773403, 30642805, 31038048, 31290826, 30609614, 32825791, 37499974, 40945647, 44989021, 47176670, 45201573, 44821033, 44229540]
3835D4229540l84755J346967N18381Q9112q54091m145601p072259m315992J32253N29445
3825C0073000J451597K17416K447602L147261J586986L438993M490945M228873K565777
3816E3648450K77239P75319j212793j35881J923094J498026R31555j044673n478877
3807E1181459o525906n64492K765153L678762N452343R296106Q430572K976742P8167
3798G6768906j084329j677632m37525L654488P61562k222668p140431j3953537j4133751
3789D0535083l494844R11964m81040r47957O014311N290981L662299M666856R481347
3780F5639000P821455M157687J447368n86202m691688l311994J72448J729552p81165
3771G1596461p907225j2669234j6961919q714647j960447k055242o44893J796885K353694
$$ y = [44229540, 43844785, 45191752, 45710133, 45799245, 44945154, 40799553, 33727294, 29411302, 29543555, 30073000, 31524597, 31742013, 34189615, 37336876, 38923862, 42362855, 46853800, 51082673, 53648450, 53925689, 54701008, 53488215, 53352334, 55275428, 56773454, 57705009, 56660336, 51181459, 44655553, 44091061, 46856214, 50534976, 55987319, 65283425, 73713997, 76690739, 76768906, 75684577, 74006945, 73569420, 77223908, 77985470, 75762802, 68622371, 54668834, 40535083, 37040239, 37952203, 37471163, 36523206, 42537517, 47828498, 51490797, 56157653, 65639000, 73460455, 77618142, 79065510, 78479308, 73787620, 70475626, 70648074, 72377626, 71596461, 63689236, 51020002, 34058083, 25343436, 23382989, 21327747, 20682854, 22479739, 24833433]
3762B4833433Q99687o83565J616299K133949Q78194o93040M54203J410528J409450q79590
3752C1379548J274796m49732K36559m62653N71295M621102L925046K780097K178196
3743D6054254J637354j272587J431909M057969M379248Q060009Q604511L830424R92434
3734G7775525n91146l051463l692927M324508L076252j520912l849000j1169427j7333568
3725D3967842j0287139j238045m08449J413752K110420M059280L020277J668560K446703
3716D6753201O238907O100931P261454M483025L053805j696291l234496m429858J67318
3707F4697996K396749j198588l527980r409247j2982402j0659397m217691J380384K100735
3698B8580559P08355K898083K528219j349506l475091P74292M261021k175253k635037
$$ y = [24833433, 25733120, 25049555, 26665854, 28799803, 29677997, 28984957, 29439160, 30849688, 32259138, 31379548, 32654344, 32204612, 32441171, 31978518, 32549813, 37170915, 41095961, 43876058, 46054254, 47691608, 46419021, 47850930, 51908899, 56288147, 64348156, 72952667, 76783091, 77775525, 77184379, 74132916, 70439989, 74764497, 77840749, 76319837, 72470837, 61301410, 43967842, 33680703, 32442658, 32034209, 33447961, 35558381, 39617661, 42637938, 44306498, 46753201, 52992108, 59093039, 66354493, 70837518, 73891323, 72195032, 68960536, 64530678, 64697996, 67094745, 65896157, 62368177, 52958930, 39976528, 29317131, 25099440, 26479824, 28580559, 29288914, 32186997, 34715216, 33365710, 29890619, 30664911, 34925932, 32750679, 30115642]
3689C0115642n109725o937181o639255l450814r87671j602530L34060J360741J879773
3680H963040J30122L365082L101021K798734L110737J708412R05640J009132j536274
3671B3555646k680809j559882o9473j291225j498391l558280m976626o475360l283069
3662a837469k731245l403745j305683P74510M60052m17521Q64768r16M91062r57890l9169
3651h103246j016312M268794j401489j847797l64197o54248m07082J202650k93728M08102
3641h208553J083070n34379q85586n82057k19306n3145Q44895r8385j49241q34216J405748
3630h231155P43639Q23363n71414q82551N05693N22135n32221j67048k645951L85462
3620a0050048o74452N74117j132328l91005k82509J005990Q42884N58382J229602k518646
$$ y = [30115642, 25005917, 18068736, 11429481, 7978667, 6990996, 5388466, 5722526, 7083267, 8963040, 9093162, 12458244, 15559265, 18357999, 21468736, 23177148, 24082788, 25091920, 23555646, 20874837, 19314955, 19245482, 17954257, 16455866, 12897586, 7920960, 1445600, -1837469, -4568714, -7972459, -9278142, -8503632, -8043580, -8461101, -7596333, -7597249, -7106187, -8064077, -8103246, -9119558, -4850764, -6252253, -8100050, -8464247, -9118495, -9525577, -8322927, -8616655, -8208553, -7125483, -7659862, -8545448, -9127505, -9346811, -9399956, -8555061, -8653446, -8802687, -9636903, -8231155, -7487516, -6664153, -7235567, -8118118, -7612425, -7090290, -7622511, -7789559, -10435510, -10050048, -10724500, -10150383, -11282711, -11673716, -11956225, -10950235, -10107351, -9548969, -8319367, -10838013]
3610a0838013Q44197m73616J356882j713085N45319J451301j655424N04577K373975
3601g603887j270144j230230J326726M88613j793399j05280n89039K59629p82957Q1536
3591a1218432N46746M45387k26497m17746R55761q84048J93776K52113K48435j386220
3581a1490725J00217K49338J71222m68698m19733O89590k41051L17783j25885M23052
3571a0794890L85218J4421j110503J251001N63920j035357n9475O77969L69318N1573
3561i686805L42939k74568j134314J28949k57147N62468j370615j41591m53352J685366
3551a0598670j21596L90264k14745o27369K25496R10690l33015Q34787j178456L1613k286
3540a0683287m25635R14772O99127j176847P11272r97682l52056o52608L93093L48850
$$ y = [-10838013, -9993816, -10467432, -9110550, -10823635, -10278316, -8827015, -10482439, -9977862, -7603887, -8874031, -10104261, -8777535, -8288922, -10082321, -10187601, -10776640, -10517011, -11299968, -11218432, -10671686, -10226299, -10452796, -10870542, -9914781, -10798829, -10605053, -10352940, -10104505, -11490725, -11390508, -11141170, -10969948, -11438646, -11858379, -11168789, -11409840, -11092057, -11217942, -10794890, -10409672, -10395251, -11505754, -10254753, -9690833, -10726190, -10785665, -10107696, -9738378, -9686805, -9343866, -9618434, -10752748, -10623799, -10880946, -10318478, -11689093, -11830684, -12284036, -10598670, -10720266, -10330002, -10544747, -11172116, -10946620, -10035930, -10368945, -9534158, -10712614, -10681001, -10683287, -11108922, -10194150, -9495023, -10671870, -9960598, -10958280, -11310336, -11962944, -11569851, -11221001]
3530a1221001o56213N36457L4530m34186Q21553m28154M0107n53955M26281N49780n08278
3519a1393079K107797n23527q69682K073275q75762J461401j457633j590463n83552Q67046
3509a0784179o13431L05093o98405P01895m35688j70199J601014m32607J58953N366155
3499e001399n723467k63871m45374l14274J680633J13027m56641j39936m30313q87211
3489a1868826J22644J012455R27569j229360j145990P03469l45293M91598k49615R600
3479a1571749N7909l55556J265104l41149l67290n4432o46356R75948k88170J417984
3469i907757n77839m18630M93061J028860r21934j021867M50172K91076j321235M40178
3459a1465915p5101J84010Q29044n72925M69925q04826k42073M14305J97195j561725
$$ y = [-11221001, -11877214, -11340757, -11306227, -11740413, -10918860, -11347014, -11306907, -11860862, -11434581, -10884801, -11393079, -9285282, -9808809, -10678491, -8605216, -9480978, -8019577, -9477210, -11067673, -11651225, -10784179, -11397610, -11092517, -11790922, -11089027, -11524715, -11694914, -10093900, -10526507, -10367554, -5001399, -10724866, -10988737, -11434111, -11748385, -10067752, -9954725, -10411366, -10551302, -10981615, -11868826, -11746182, -10733727, -9806158, -11035518, -12181508, -11478039, -11823332, -11331734, -11581349, -11571749, -11513840, -11869396, -10604292, -10945441, -11312731, -11367163, -12013519, -11037571, -11325741, -9907757, -10485596, -10904226, -10411165, -9382305, -10304239, -11326106, -10875934, -10584858, -11906093, -11465915, -11541016, -11357006, -10527962, -11100887, -10630962, -11435788, -11677861, -11263556, -11066361, -12628086]
3449a2628086J299873n35101o3315J43706n44554K89643J734104J2634o16906n99148
3439a1507150r84282J56300O89053k63100Q57115j320954R07175j754169n8739J380630
3429a1898121N09295j11713j072158k00934K199482p2850j85974J018065k057460N26994
3419a1345374j87739m81669N51940l34345o91035K64492m25501n17211k46862J729463
3409a1683841j113795l9171N31921N59591K56319l78113j598640K592558q84043k61213
3399a2018427o60971n11930L78868q3726n77595R42528r95405N31779J180931K45416
3389a1568532J21589K85953l56235j35268o02006r7806n32559L83793L68468l2521K56570
3378a1908554R08250j323195L69016L62739r94832K71042o8083k79965k0677Q07179P23165
$$ y = [-12628086, -11328213, -11863314, -11926629, -11782923, -12327477, -12037834, -10303730, -10291096, -10908002, -11507150, -12491432, -12335132, -11646079, -11909179, -11052064, -12373018, -11465843, -13220012, -13278751, -11898121, -11388826, -11500539, -12572697, -12773631, -10574149, -10646999, -10832973, -9814908, -11872368, -11345374, -11533113, -12014782, -11462842, -11797187, -12488222, -12223730, -12649231, -13166442, -13413304, -11683841, -12797636, -12836807, -12304886, -11745295, -11488976, -11867089, -13465729, -10873171, -11757214, -12018427, -12679398, -13191328, -12812460, -12896186, -13473781, -12531253, -13526658, -12994879, -11813948, -11568532, -11446943, -11160990, -11517225, -11652493, -12254499, -12352305, -12884864, -12501071, -12132603, -12165124, -11908554, -11000304, -12323499, -11954483, -11591744, -12586576, -12315534, -12383617, -12663582, -12684259, -11877080, -11153915]
3367a1153915q64084n10213L137727k670798q1953q12713L92974L91859J090161j382073
3357a2463028Q92156K2350o45177m7155P93113K32544k60096o43931n61019R37586m01398
3346a2144055j131925J376029k44598O00937j593101p91652L37178n87408N23432J470427
3336a2184736k54516k40764L82569J91528R4893q17408o05200L36530Q32586N46024j75173
3325a1893667m41160j26990J71749J90076N75694r37500M43525M43466n04538p85046
3315a2864391j23579O69298K13604j467529N46041p42228M58749N20113o17348J06863
3305a3300407J076455q53893O16023N95106j132932Q32823l78861K48825M30093j153902
3295a3020670M28953N77923l3375j415858K89003k13400M61850k96221J57823Q84204
$$ y = [-11153915, -12017999, -12528212, -9390485, -12061283, -12143236, -12955949, -12562975, -12171116, -11080955, -12463028, -11570872, -11548522, -12193699, -12240854, -11447741, -11215197, -11475293, -12119224, -12680243, -11742657, -12144055, -13275980, -11899951, -12144549, -11543612, -13136713, -13928365, -13591187, -14178595, -13655163, -12184736, -12439252, -12680016, -12297447, -12105919, -12011026, -12828434, -13433634, -13097104, -12264518, -11718494, -11893667, -12334827, -12461817, -12290068, -12099992, -11524298, -12461798, -12018273, -11574807, -12079345, -12864391, -12987970, -12318672, -12105068, -13572597, -13026556, -13768784, -13310035, -12789922, -13407270, -13300407, -12223952, -13077845, -12461822, -11866716, -12999648, -12166825, -12545686, -12296861, -11866768, -13020670, -12591717, -12013794, -12047169, -13463027, -13174024, -13387424, -12925574, -13221795, -13063972, -12179768]
3285a2179768J273365j147277p04889K40992k83554Q15761n39573m23981r2245j75369
3275a3216538K827808k277688J178160r2631l17196m89973K90975p14224P32270J498200
3265a0580837j313630K08820l59885l98649K89113L63340r7454r45089L57747P01596
3255a1774928o03184M58477j2906k67889M43284l18415R58119p58809J146259j192866
3245a1922858n05478j272629Q03654O35851j060871J131111J557054j848600J067683K7461
3235a1387622P04844O93287l749493J181890K13513k00926r35883J068647q12203j017438
3225a4241384M833533j290313j046762j63792j69934o47879J759825J78684j505872M9076
3215a2244818j160308j191688K244200j45080N62253l42221J376952j990276Q58836J54019
$$ y = [-12179768, -10906403, -12053680, -12758569, -12517577, -12801131, -11985370, -12524943, -12948924, -13041169, -13216538, -10388730, -12666418, -11488258, -11580889, -11898085, -12388058, -12097083, -12811307, -12079037, -10580837, -11894467, -11685647, -12045532, -12444181, -12155068, -11791728, -11889182, -12834271, -12476524, -11774928, -12378112, -11919635, -11932541, -12200430, -11757146, -12075561, -11117442, -11876251, -10729992, -11922858, -12428336, -13700965, -12897311, -12261460, -13322331, -12191220, -10634166, -12482766, -11415083, -11387622, -10682778, -9989491, -13738984, -12557094, -12343581, -12544507, -13480390, -12411743, -13223946, -14241384, -9407851, -10698164, -11744926, -11908718, -12078652, -12726531, -10966706, -10788022, -12293894, -12244818, -13405126, -14596814, -12352614, -12497694, -11935441, -12277662, -10900710, -12890986, -12032150, -11878131]
3205a1878131n12709l71340o81465J695302o74742Q14014n89179p34125O27734l1821
3195a2336462n09069K157871k266398P29778P03663j886834M11783O69123P24684P73930
3185a0827931j659674M62017q91198P14841n7026O03322p31525q18173j60449J053526
3175a2312270m86445K76534J30570q63477O03805Q59473J24188j247271Q03719R34350
3165a1176824k83580l1894q38928L69009J40146j072389l52151L33484o69334R68460
3155a2614001k14489P4787L24850n47662J412515r03294n66871O97366j6098L59299k69450
3144a2263048k63712m32502M91591J33510K17287j576476J069799J084231n04800o33122
3134a2677242J47381l69903M59728N2528m1491o02066l352P8066P44199k76509Q65680
$$ y = [-11878131, -12390840, -12762180, -13443645, -11748343, -12423085, -11609071, -12198250, -12932375, -12304641, -12336462, -12845531, -10687660, -12954058, -12224280, -11520617, -13407451, -12995668, -12326545, -11601861, -10827931, -12487605, -12025588, -12916786, -12201945, -12258971, -11655649, -12387174, -13205347, -13365796, -12312270, -12798715, -12522181, -12391611, -13255088, -12651283, -11791810, -11667622, -12914893, -12111174, -11176824, -11460404, -11492298, -12331226, -11962217, -11822071, -12894460, -13246611, -12913127, -13582461, -12614001, -12828490, -12753703, -12428853, -12976515, -11564000, -12467294, -13034165, -12336799, -12352897, -11993598, -12263048, -12526760, -12959262, -12467671, -12334161, -12116874, -13693350, -12623551, -11539320, -12044120, -12677242, -12529861, -12899764, -12440036, -12387508, -12428999, -13031065, -13034417, -12956351, -12212152, -12488661, -11622981]
3123a1622981l16703o83017L5896J3225J51478l45293p50804r9794L03731j44781K77788
3112a3181255k0118m86459l37181J045341j36804J757725j056294j89504M0334M03519
3102a2160696m7499m95288j09379J380077o17464j098642o92675M29050j670R13125m66367
3091a2967428j02696n79494L12354K148017j009530l31435l77067P04991o93537J78717
3081a2717108K89003N64609O6125j128100R41885q71257N27785q65442J025446r82296
3071a3149350K40391K91426J614102j731926J133894j318120J97365r12843k653261
3062a6288322K098890r8427J357335K31071Q35235j412469N9652O85995J527844j998837
3052a3002033O53681n63624L23761M69148j077866j47094J162135m25177J64469n44928
$$ y = [-11622981, -11939684, -12622701, -12586805, -12573580, -12422102, -12767395, -13518199, -13617993, -13314262, -13459043, -13181255, -13201373, -13687832, -14025013, -12979672, -13116476, -11358751, -12415045, -12604549, -12564215, -12160696, -12208195, -12703483, -12812862, -11432785, -12050249, -13148891, -13841566, -13412516, -13414186, -12501061, -12967428, -13070124, -13649618, -13337264, -11189247, -12198777, -12530212, -12907279, -12202288, -12895825, -12717108, -12428105, -11863496, -11797371, -12925471, -11983586, -12854843, -12327058, -13192500, -12167054, -13149350, -12908959, -12617533, -11003431, -12735357, -11601463, -12919583, -12722218, -13635061, -16288322, -14189432, -14287859, -12930524, -12699453, -11864218, -13276687, -13217035, -12531040, -11003196, -13002033, -12348352, -12911976, -12588215, -12119067, -13196933, -13344027, -12181892, -12607069, -12442600, -12987528]
3042a2987528J52964p36841M79946J205257j226685P5172m83509J011060M75445J65411
3032a1869308o57848N0705L98116k41990O64290l44818k90861j459651p83339J593108
3022a2941596q74038N75958P531j820994J149052K54014p1524N82769n42384P04100K16556
3011a2760556K68941Q9806L85196j035120J513507j604317Q81928m91760j65125j2420
3001a2929920P16370j086002O74656k64380K01003k35960j518510M32852l750r77863
2991a4991504K297850k10007K7439L02386L63037J113038j147588j495712J280929l21585
2981a2781717N75641K0595j56825L05298j101561J421344m23073o49873m93665o05765
2971a3889601M08296M28448j39637J88241J547q26549n61012J702058o00869K68003l22312
$$ y = [-12987528, -12834564, -13571405, -13091459, -11886202, -13112887, -13037715, -13521224, -12510164, -12034719, -11869308, -12527156, -12476451, -12078335, -12320325, -11656035, -12000853, -12291714, -13751365, -14534704, -12941596, -13815634, -13239676, -13232145, -15053139, -13904087, -13650073, -13721597, -13138828, -13681212, -12977112, -12760556, -12491615, -12401809, -12016613, -13051733, -11538226, -13142543, -12260615, -12752375, -12917500, -12929920, -12213550, -13299552, -12624896, -12889276, -12688273, -12924233, -14442743, -14009891, -14013641, -14991504, -12693654, -12903661, -12876222, -12573836, -12210799, -11097761, -12245349, -13741061, -12460132, -12781717, -12206076, -12185481, -12342306, -12037008, -13138569, -11717225, -12140298, -12790171, -13283836, -13889601, -13481305, -13052857, -13192494, -13004253, -13002706, -13829255, -14390267, -12688209, -13289078, -13021075, -13343387]
2960a3343387Q73816j21406p54039M71210m06236P56074j51689L86402l24608j559126
2950a4172989P9346L81224N11041j366224J041206J32566O61319n77106k77974K69246
2940a3318345n90141Q68780M33649O80712j843215J265314K13911j567774J263621N46893
2930a2046595p58045k34230O42083r59706l42899L47859J234083K22832j252378N32926
2920a2614070j189792q0519M18206L60004j488122J939101r21446L6340O0827q11401
2910a4290872O97237J195434o57894j77010N43463q80338L03085j10566P97191j151790
2900a3732060J15000J053466p16711L44820l41485j24612j23318J54921Q98671r40087
2890a3411395J402484j244171Q65262k32863k99187n76718O73743O2864M29723k00265
$$ y = [-13343387, -12469571, -12590977, -13345016, -12873806, -13280042, -12523968, -12675657, -12289255, -12613863, -14172989, -14093643, -13712419, -13201378, -14567602, -13526396, -13393830, -12732511, -13309617, -13587591, -13318345, -13908486, -13039706, -12606057, -11925345, -13768560, -12503246, -12289335, -13857109, -12593488, -12046595, -12804640, -13038870, -12396787, -13356493, -13699392, -13351533, -12117450, -11894618, -13146996, -12614070, -13803862, -13884381, -13466175, -13106171, -14594293, -12655192, -13576638, -13540298, -13479471, -14290872, -13593635, -12398201, -13056095, -13233105, -12689642, -13569980, -13266895, -13377461, -12580270, -13732060, -13617060, -12563594, -13280305, -12935485, -13276970, -13401582, -13524900, -13369979, -12471308, -13411395, -12008911, -13253082, -12387820, -12620683, -12919870, -13496588, -12822845, -12759981, -12330258, -12530523]
2880a2530523n98174j099293o1035P92649m93848J407507Q82642r54148q98679O73199
2870a2879703p16832P58357P44218j502809R51752l45386q8663p39564k84362k091777
2860a6194769L373577n02907k23942M03361n04918K40754R36839K87265p47220O7873
2850a2864087N63864l83010n05620Q86585M02079r20657M7647n40985l02352J383602
2840a2232934M89490j104935R73872J182199j782793k16509m9681M8141k006797j48946
2830a4848893J734503r1212l55452N28362J34082m89360l3401K46565K47858j77194P10854
2819a2393288J73K59814n395875K480870J056227O09766N45119j469606O48891j103863
2809a4761772J825686K116649k308817R0045K68015j654563M72826L42520K25926q91782
$$ y = [-12530523, -13128697, -14227990, -14289025, -13496376, -13990224, -12582717, -11700075, -12654223, -13552902, -12879703, -13596535, -12838178, -12093960, -13596769, -12645017, -12990403, -13079066, -13818630, -14102992, -16194769, -12821192, -13324099, -13548041, -13144680, -13649598, -13408844, -12472005, -12184740, -12931960, -12864087, -12300223, -12683233, -13188853, -12302268, -11900189, -12820846, -12773199, -13314184, -13616536, -12232934, -11743444, -12848379, -11874507, -10692308, -12475101, -12691610, -12741291, -12693150, -14699947, -14848893, -13114390, -13205602, -13561054, -13032692, -12898610, -13387970, -13421371, -13174806, -12926948, -13104142, -12393288, -12393115, -12133301, -17529176, -15048306, -13992079, -13382313, -12837194, -14306800, -13657909, -14761772, -12936086, -10819437, -13128254, -13038209, -12770194, -14424757, -13951931, -13609411, -13383485, -14275267]
2799a4275267j04601P94772j01858Q36027o13422J029905n17849r30208j03951J598047
2789a2388405K36493n054229K986609M28386Q14387o71281M69428M06078L89353q93413
2779a3276594r07421J428297o6186J46586p41674P11355j065551Q68716L36607M15048
2769a2150817J188786k476682P91295j100157P71286N20717l81327k44443P0470K99156
2759a2711716K1129j345570k77241K00471n09897O46787J285617M4190j418658l34248
2749a4399136R57521k20426K59026j38105J223795j347814L34438P78988j28411q3363
2739a2763487K24992j284193r27934J231716J388702l51380j023774k84905P93502k56563
2729a3253324j00757O16674L56362J55531J630345j510275j234094l19658j24595J428934
$$ y = [-14275267, -14379868, -13585096, -13686954, -12850927, -13464349, -12434444, -12952293, -13882501, -13986452, -12388405, -12151912, -17206141, -14219532, -13791146, -12976759, -13648040, -13178612, -12772534, -12383181, -13276594, -14184015, -12755718, -12821904, -12675318, -13416992, -12705637, -13771188, -12902472, -12565865, -12150817, -10962031, -13438713, -12647418, -13747575, -12976289, -12455572, -12836899, -13081342, -13010872, -12711716, -12690587, -14036157, -14313398, -14112927, -14622824, -13976037, -12690420, -12646230, -14064888, -14399136, -13441615, -13662041, -13403015, -13541120, -12317325, -13665139, -13330701, -12551713, -12680124, -12763487, -12538495, -13822688, -14750622, -13518906, -12130204, -12481584, -13505358, -13790263, -12996761, -13253324, -13354081, -12737407, -12381045, -12225514, -10595169, -12105444, -13339538, -13659196, -13783791, -12354857]
2719a2354857j129357M29704J73024M246j412936N05816J313512n69140l41691Q43481
2709a2538198P04589j406156N00279p79104J0040K15761O67078j88587n62522K06989
2699a3169831J06886O97743l26827Q00565j062278j072074j65778O90346N08073K73700
2689a2719475l93197L70096m21380N52720Q05457q71486l36823N92378p83645r2174
2679a3297529J000742k89958j29925m08831j67866m86377K02418L724987j918114m22987
2669a2193440M70911j644624P82124l62177m56479l50393O64872L6623R7007o37144k54125
2658a3846845L09856L48202o1912q70590J155343o82850N63060j014003N85488m17860
2648a3932111n43482L25832J595869j188161n46324N65582n7219k31526l74324M9333r9685
$$ y = [-12354857, -13484214, -13054510, -12881486, -12877240, -14290176, -13784360, -12470848, -13039988, -13381679, -12538198, -11833609, -13239765, -12739486, -13518590, -13508550, -13292789, -12625711, -12814298, -13376820, -13169831, -13062945, -12365202, -12692029, -11891464, -12953742, -14025816, -14191594, -13501248, -12993175, -12719475, -13112672, -12742576, -13163956, -12611236, -11805779, -12677265, -13014088, -12421710, -13205355, -13297529, -12296787, -12586745, -12716670, -13125501, -13293367, -13779744, -13577326, -9852339, -11770453, -12193440, -11722529, -13367153, -12585029, -12947206, -13403685, -13754078, -13089206, -13052583, -12955576, -13592720, -13846845, -13536989, -13188787, -13250699, -14121289, -12965946, -13648796, -13085736, -14099739, -13514251, -13932111, -14475593, -14149761, -12553892, -13742053, -14288377, -13722795, -13780014, -14011540, -14385864, -14336531, -14436216]
2637a4436216O72517p67057m79359N36903m51069k45768K88364j77857j98472k238502
2627a7496516M310482j06567r81869K4654O01991M40171K83686j462239Q56916L82118
2617a3147173N00353q57554n62774N95768m79917j010267j986059N250709j577506J10649
2607a3163771l52669O98523n7455J090060j497018k001275K074008q3407q3281o21052
2597a3997337J16874L32474J467470O24622j104054p64493o04073Q76742P25630l77938
2587a2704083p80507O75739p33559p3021N31027J81922L1015q79886M54217J091252
2577a2205884j128087M50405R1002N03880n63441m88870J34590N19243o74988P09477k4662
2566a2677335p20577k52087M82050J52457r7291r28890M5412O25024P24939o45253j01112
$$ y = [-14436216, -13763699, -14530756, -15010115, -14473212, -14924281, -15170049, -14881685, -15059542, -15258014, -17496516, -13186034, -13292601, -14274470, -14249816, -13647825, -13207654, -12923968, -14386207, -13529291, -13147173, -12646820, -13504374, -14067148, -13471380, -13951297, -14961564, -16947623, -11696914, -13274420, -13163771, -13516440, -12817917, -12875372, -11785312, -13282330, -15283605, -13209597, -13293004, -13376285, -13997337, -13880463, -13547989, -12080519, -11455897, -12559951, -13324444, -13928517, -13051775, -12326145, -12704083, -13484590, -12808851, -13542410, -13615431, -13084404, -12902482, -12871467, -13751353, -13297136, -12205884, -13333971, -12883566, -12792564, -12288684, -12852125, -13340995, -13206405, -12687162, -13362150, -12652673, -12677335, -13397912, -13649999, -13167949, -13015492, -13112783, -14041673, -13996261, -13371237, -12646298, -13291551, -13392663]
2555a3392663l97804j1257L87870k64531J11637J256879R1138j275112N70745n12858
2545a3435956O03781K53501o81135l86331L82589l88083O57113O28706Q38964k935817
2535a4462668P06698j66950M14429Q93460j83729k128110J017155l66394L19953l25770
2525a4281926p30333J67916J254810r20111n46331Q53890k84278Q58655L55926l53429
2515a3625211o02983J052115j092132n501N12393j80119M19666j639683K219760m5115
2505a2986810j520426N9566O44759N22681n49598K69721k63377k92881n93106M91678
2495a4217793N88360o87496K63530L88373j37839P3367L02033L6614J47163j1302j174332
2484a4429322M36375J04119j60419k05745j5021P68602m44840M57504K6888n90769O91826
$$ y = [-13392663, -13790467, -13801724, -13413854, -13678385, -13566748, -12309869, -12218731, -13493843, -12923098, -13435956, -12832175, -12578674, -13259809, -13646140, -13263551, -13651634, -12994521, -12365815, -11526851, -14462668, -13755970, -13922920, -13508491, -12615031, -12798760, -14926870, -13909715, -14276109, -13956156, -14281926, -15012259, -14844343, -13589533, -14509644, -15055975, -14202085, -14486363, -13627708, -13271782, -13625211, -14228194, -13176079, -14268211, -14273712, -13761319, -13941438, -13521772, -15161455, -12941695, -12986810, -14507236, -14447670, -13802911, -13280230, -13829828, -13560107, -13823484, -14116365, -14709471, -14217793, -13629433, -14316929, -14053399, -13665026, -13802865, -13729498, -13427465, -13390851, -13243688, -13254990, -14429322, -13992947, -13888828, -14049247, -14254992, -14270013, -13501411, -13946251, -13488747, -13461859, -14052628, -13360802]
2473a3360802J058158j450826l79050j456336K87147P59541J35083n32321M47641M39909
2463a4051856q90673L5096q7798N65334o6718M2752R56510k156133J778068J51552l59796
2452a4083662J152448l95315o34142L30384L63589j038881m50069l47075M44551L82551
2442a4275621j87813j307531J165659j439042J686064N9338k55711M76844n42980O77041
2432a3943752O06773m92426K62454k5109K51297j359463M52157P68931j29039R27743L7140
2421a2643294n11043j107234K35929K25144N67837l20140k13559k16272J82269J93265
2411a3607098r20715N5818j15823L25488j62538O9083m15750r67864K430240N03905l66831
2400a3172085j03255j550198J093268L73831j458662J038415n29707p99698J66193J709572
$$ y = [-13360802, -12302644, -13753470, -14132520, -15588856, -15301709, -14542168, -14407085, -14939406, -14491765, -14051856, -14942529, -14907433, -14995231, -14429897, -14496615, -14453863, -13497353, -15653486, -13875418, -13723866, -14083662, -12931214, -13326529, -13960671, -13630287, -13266698, -14305579, -14755648, -15102723, -14658172, -14275621, -14463434, -15770965, -14605306, -16044348, -14358284, -14298946, -14554657, -14077813, -14620793, -13943752, -13336979, -13829405, -13566951, -13592060, -13340763, -14700226, -14248069, -13479138, -13608177, -12680434, -12643294, -13154337, -14261571, -14025642, -13800498, -13232661, -13552801, -13766360, -13982632, -13800363, -13607098, -14527813, -14471995, -14587818, -14262330, -14424868, -14355785, -14771535, -15739399, -13309159, -12805254, -13172085, -13275340, -14825538, -13732270, -13358439, -14817101, -13778686, -14308393, -15108091, -14941898, -13232326]
2390a3232326P4882r67664j77938l6024J72614q03504k69904K567539q67711L99521p18111
2379a3858626q93223L64855q2687J75944O19131K31388j035376L995617l402204K34555
2369a3650626k20442M11417J133446j767822Q93211k15899r24250k22681n99681K26484
2359a4936843J568164k8087o38065R24873m12569O78307M04310m315584J954505P54161
2349a4046828O23720l19379m01729M20986m55032J07433k97857J34186J660397q36209
2339a3410312n41854J38958M96368K2555N27827m37013q03976R76340r59696o74323
2329a4665126J132975j004412J295709r44685R07303l05886k6961l161264Q48061K72382
2319a5651904K201279M64257o64934K01581k16100j06178o63528M20940L90745q93066
$$ y = [-13232326, -13157444, -14125108, -14303046, -14339070, -14166456, -14969960, -15239864, -12672325, -13540036, -13140515, -13858626, -14751849, -14386994, -14469681, -14293737, -13674606, -13443218, -14478594, -10482977, -13885181, -13650626, -13871068, -13459651, -12326205, -14094027, -13200816, -13416715, -14340965, -14563646, -15163327, -14936843, -13368679, -13396766, -14034831, -13109958, -13522527, -12844220, -12439910, -16755494, -14800989, -14046828, -13423108, -13742487, -14144216, -13723230, -14178262, -14070829, -14368686, -14234500, -12574103, -13410312, -13952166, -13813208, -13316840, -13294285, -12766458, -13203471, -14007447, -13031107, -13990803, -14665126, -13532151, -14536563, -13240854, -14185539, -13278236, -13584122, -13611083, -16772347, -15924286, -15651904, -13450625, -12986368, -13651302, -13449721, -13665821, -13771999, -14435527, -14014587, -13623842, -14516908]
2309a4516908L77772J258633p57945m98453o2777p89017Q00306r0160m8755P68075j826254
2298a5385483P22846j52886m26911J601493P57802j332935m83684j146299K23626P76201
2288a4846230k00942K46646n26360J343370j144026k15296M70258j039359J265905l00920
2278a4946954N61288l7709r37333P79741L78559m5916j91812r48848L70436Q49900j247368
2267a5416016R83325r9447O86418j5098p20010L06601P35620K66946n58923k91531j496661
2256a5618776M60443O41651m83003O73396J4278M08740j866734N26177k23317j42306P7893
2245a5531558L95034o22158P23921m31512l18610p50656L63908k27232J166476J73090
2235a5059297m38824l397o45J005525Q69741J67538o08582M81478L33079j120129P37142
$$ y = [-14516908, -14139136, -12880503, -13638448, -14136901, -14199678, -14988695, -14188389, -14278549, -14327304, -13559229, -15385483, -14662637, -14815523, -15242434, -13640941, -12883139, -14216074, -14699758, -15846057, -15622431, -14846230, -15047172, -14800526, -15326886, -13983516, -15127542, -15342838, -14872580, -15911939, -14646034, -14946954, -14385666, -14423375, -15360708, -14580967, -14202408, -14248324, -14440136, -15388984, -15018548, -14168648, -15416016, -14432691, -14532138, -13845720, -13860818, -14580828, -14274227, -13538607, -13271661, -13830584, -14122115, -15618776, -15158333, -14516682, -14999685, -14326289, -14312011, -13903271, -15770005, -15243828, -15467145, -15609451, -15531558, -15136524, -15758682, -15034761, -15466273, -15784883, -16535539, -16171631, -16398863, -15232387, -15059297, -15498121, -15501518, -15502163, -14496638, -13626897, -13459359, -14067941, -13586463, -13253384, -14373513, -13636371]
2224a3636371N70263l94802j085513K650826k81315K36213l80077j06317n62759P26708
2214a2263144r72635J650280q96946K94742j282834P92711p01080l00351K038851j160366
2204a2800772Q18907r61504k74405M33645O03093O00187j119028o2817K443090j589292
2194a1908896R55274o52627k44258K382225r17492O26599j26221l12503p418K57263K13257
2183i734797l69792R38356k613837J333372m47839l84610j064871J676227k4712q73229
2173a1565732N98763J041491j308436K50126q56456J033736j108712j087347J386727Q5161
2163a1530679m20218K10129p14560N26112J493298Q39144q68345O13251n16764K021543
2153h347089q32429M13565J110223q5057P92791R62028N7813k71562j538282K43845q94166
$$ y = [-13636371, -13066108, -13460910, -14546423, -11895597, -12176912, -11940699, -12320776, -12427093, -12989852, -12263144, -13235779, -11585499, -12482445, -12187703, -13470537, -12677826, -13378906, -13679257, -11640406, -12800772, -11981865, -12943369, -13217774, -12784129, -12181036, -11580849, -12699877, -12762694, -10319604, -11908896, -10953622, -11606249, -11850507, -9468282, -10385774, -9759175, -9885396, -10197899, -10205317, -9948054, -9734797, -10104589, -9166233, -11780070, -10446698, -10894537, -11279147, -12344018, -10667791, -10692503, -11565732, -10966969, -9925478, -11233914, -10983788, -11840244, -10806508, -11915220, -13002567, -11615840, -11530679, -11950897, -11740768, -12455328, -11929216, -10435918, -9596774, -10465119, -9851868, -10368632, -8347089, -9179518, -8765953, -7655730, -7740787, -6947996, -5985968, -5928155, -6199717, -7737999, -7494154, -8388320]
2142h388320N82084j32805M43210o50367J430126K64447j282030O00076R03956n81997
2132f811620K5429J541963L00303j347097J825276l85916p00842J501869K90212J754654
2122b005769j893623J354969j692844K592358m98549q65021J19096J095815O87539R16319
2112a89710J138420p07005K09649R86809R62798K198050k25445L43387J057183J580653
2102G354789P23097J540958K369672L220261J724064J622040K048272K937525P87998
2093B4328676J549345M079889P62661J665917R37966P45210Q02828J647966K29623K083150
2083C8833231J728571N55681J709743J577489J772927J618989K129386J715350J398279
2074E3039646K094697M216233K128476J12781J775106J635026J958841L683213J823547
$$ y = [-8388320, -7806236, -7939041, -7495831, -8146198, -6716072, -6451625, -7733655, -7133579, -6229623, -6811620, -6786191, -5244228, -4943925, -6291022, -4465746, -4851662, -5552504, -4050635, -3760423, -2005769, -3899392, -2544423, -4237267, -1644909, -2143458, -3008479, -2889383, -1793568, -1106029, -189710, 948710, 241705, 451354, 1438163, 2400961, 4599011, 4373566, 4716953, 5774136, 7354789, 8077886, 9618844, 11988516, 15208777, 16932841, 18554881, 20603153, 23540678, 24328676, 25878021, 29957910, 30720571, 32386488, 33324454, 34069664, 34872492, 36520458, 36750081, 38833231, 40561802, 41117483, 42827226, 44404715, 46177642, 47796631, 49926017, 51641367, 53039646, 55134343, 59350576, 61479052, 61591833, 63366939, 65001965, 66960806, 70644019, 72467566]
2065G2467566J709156K386852J278758R44855J250203J380576K402214K361950N31671
2056H6713801M560418K947763L741554K779987N417166M519598N488494L792831O768975
2047A26730587L708345M452525M565414K149744L643776L960569M965251M801454M914438
2038A63892103O884499N656311N311521O360930N759318M311514N851513Q31209j439906
2029B03419012p453489r082307r107310n736291l951397k217784K62070P33975L127742
2020A69994221M088092N859210L361899O005152N998483R338542Q790292R295141R411655
2011B32142687J2302039J3024615J6521308J6102529J6787000K0151080K1450291K1515103
2003C69996652K3087478K1052610J9307234J7852781J5235985J2018077O536127p514264
$$ y = [72467566, 74176722, 76563574, 77842332, 78787187, 80037390, 81417966, 83820180, 86182130, 86713801, 91274219, 94221982, 97963536, 100743523, 106160689, 110680287, 116168781, 119961612, 126730587, 130438932, 134891457, 139456871, 141606615, 145250391, 149210960, 154176211, 158977665, 163892103, 170776602, 176432913, 181744434, 188105364, 193864682, 198176196, 204027709, 204858918, 203419012, 195965523, 186883216, 177775906, 172039615, 168088218, 165870434, 166132504, 166866479, 169994221, 174082313, 179941523, 183303422, 189308574, 195307057, 204645599, 213435891, 222731032, 232142687, 244444726, 257469341, 273990649, 290093178, 306880178, 327031258, 348481549, 369996652, 393084130, 414136740, 433443974, 451296755, 466532740, 478550817, 485086944, 477572680]
1995D77572680k2111769k8222155l5465685l8489762m3765322m4811455m2584686m0190079
1987A81931767k9775617k7462526k2387930j7651936j5533649j4306220j1088953o345493
1979C7379443j390051k212982j491323o56175l103895p50628j707083n8874J23761j628901
1969B4503292r50325l13729K214613o4739j705831p12141j24019r36539N45187L50433
1959B2806202J227356K84523o9219O67560r01452n14616K97803J544337l59004l78690
1949B4604800l53826j785743M72159N13866j879046l25607n8148r81713k24762j176747
1939A8805233J94578K4940J149823j019654K015972J166725n929J899295J839370J220202
1929B7290555l33296l15874J050703K389432J423753J296308K987417K443084J323755
$$ y = [477572680, 455460911, 427238756, 391773071, 353283309, 309517987, 264706532, 222121846, 181931767, 152156150, 124693624, 102305694, 84653758, 69120109, 54813889, 43724936, 37379443, 35989392, 33776410, 32285087, 31628912, 28525017, 27774389, 26067306, 26008432, 26132193, 24503292, 23552967, 23239238, 25453851, 25389112, 23683281, 22971140, 22847121, 21910582, 22455769, 22806202, 24033558, 24318081, 24248862, 24916422, 24014970, 23500354, 23798157, 25342494, 24983490, 24604800, 24250974, 22465231, 22937390, 23451256, 21572210, 21246603, 21188455, 20206742, 19981980, 18805233, 18999811, 19024751, 20174574, 19154920, 21170892, 22337617, 22331688, 24230983, 26070353, 27290555, 26957259, 26641385, 27692088, 30081520, 31505273, 32801581, 35788998, 38232082, 39555837]
1920C9555837J199656L22538K791152K05363P77354K671022J42133J080422k76921j46459
1910D8322097L8053J87089J426504K299237L117189m18253J603851P32289K267167M805624
1900F4380847K820228N638154N079385L311753L880540n37696J575635J704507M77189
1891H8330542J372392R14934j247084n463804n067594m530689k483829o99250L139083
1882G4264701K024747K441546K289102K252125L996772M718036O765157O210204P747176
1873A12709566O825426M183123J216279j319902j122124m80685n96486j516929n011157
1864A14887111r699444j1072319j2198998o530546l583761K794101K217309L311489
1856H0124942O118390M512280M474459M975764Q943454R670501J0670935R309985O220800
$$ y = [39555837, 40755493, 41078031, 43869183, 44074546, 44851900, 47522922, 47665055, 48745477, 48468556, 48322097, 48360150, 48547239, 49973743, 52272980, 55390169, 54971916, 56575767, 57308056, 59575223, 64380847, 67201075, 72839229, 77918614, 81230367, 85110907, 84573211, 86148846, 87853353, 88330542, 89702934, 90617868, 89370784, 83906980, 78839386, 74308697, 71824868, 71125618, 74264701, 76289448, 78730994, 81020096, 83272221, 87268993, 91987029, 98752186, 104962390, 112709566, 119534992, 123718115, 124934394, 123614492, 122492368, 122011683, 121415197, 119898268, 114887111, 105187667, 94115348, 81916350, 75385804, 71802043, 74596144, 76813453, 80124942, 86243332, 90755612, 95230071, 100205835, 109149289, 118819790, 129490725, 138800710, 145021510]
1847A45021510O03501k175340k683523k578996j895627k355691o891822j1958247j5820192
1838I9265573j5632715j2902594p577524k344071K847167M994966L861107K508482L344301
1829G8364692M676743O920750P110457O963522Q684037L418228K732509j719950m126683
1820A13024305l252585m640549k810202l707129r269906j2689298j4064188j3935072
1812D8655376r790503m812827J55308Q75054N594453J555977K341318J039679L930019
1803D9543854L143797N098083M956587K550039J726030M84049l761895l334997k955209
1794E7450338k766814m71546m044159n392741p670913j0569884n573478l160192j375745
1785A6424866N54154L338592Q18500o77473J697338R80711J58130K509542J339533P32624
$$ y = [145021510, 145625011, 143449671, 140766148, 138187152, 136291525, 133935834, 127044012, 115085765, 99265573, 83632858, 70730264, 63152740, 60808669, 63655836, 68650802, 72511909, 75020391, 78364692, 83041435, 89962185, 97072642, 104036164, 112720201, 116138429, 118870938, 117150988, 113024305, 109771720, 105131171, 102320969, 98613840, 89343934, 76654636, 62590448, 48655376, 38864873, 34052046, 34207354, 35082408, 40676861, 42232838, 44574156, 45613835, 49543854, 52687651, 57785734, 62742321, 65292360, 67018390, 67502439, 63740544, 60405547, 57450338, 54683524, 54211978, 50167819, 44775078, 37104165, 26534281, 20960803, 17800611, 16424866, 16979020, 20317612, 21136112, 20458639, 22155977, 23136688, 23294818, 25804360, 27143893, 27876517]
1775B7876517L27171J079666k701079q44697K30801j458116j646388P0362j911242n06643
1765B0516352k566186k657225j863612R0936J203638k265580J637344M80743m32952m19495
1755A3723963Q41602k61191m86023J519587J002306q10722J77321M82559J05322N24830
1745A6819554j21722j59090M38470J718319J27250Q0104J250209k89387K28024k53205
1735A9838526N8996j449361J511415p83662L14431m23080J003858J563273n9209K46108
1725B1821295J147448J359070o04628J090297J313036K366889R73879M82206j543213
1716B8406279L987129Q78703J121047J729941R40330L15044M61482j609084M85819Q06495
1706C7523185j77905j75657J038731J373574L58659K581128K413377J283182M43518Q08624
$$ y = [27876517, 28203688, 29283354, 26582275, 25737578, 25968379, 24510263, 22863875, 22934237, 21022995, 20516352, 17950166, 15292941, 13429329, 13520265, 14723903, 12458323, 14095667, 14576410, 14143458, 13723963, 14565565, 14304374, 13818351, 15337938, 16340244, 15529522, 15706843, 16189402, 16294724, 16819554, 16697832, 16538742, 16977212, 18695531, 18822781, 18902885, 20153094, 19863707, 20091731, 19838526, 19897522, 18448161, 19959576, 19175914, 19490345, 19067265, 20071123, 21634396, 21575187, 21821295, 22968743, 24327813, 23723185, 24813482, 26126518, 28493407, 29467286, 29949492, 28406279, 32393408, 33272111, 34393158, 36123099, 37063429, 37378473, 37839955, 36230871, 36716690, 37523185, 37345280, 37169623, 38208354, 39581928, 39940587, 42521715, 44935092, 46218274, 46661792, 47470416]
1696D7470416L295592L538996P76166O92543J7632J019997k64529K084950K491070J224401
1686F2347234K13760k236212K75729K134740K561277l83904J556247K527188M854953
1677G3851012L789059K234456M443860K896375O46314J046543K785856K567976P22727
1668I4984178K72390o65354q68175j475852K347733K559194J195478n27929M79147K338933
1658A00639743K099033L156872N629948O184903N071458N615593L352964L232086M725000
1649A39707600L780374M305391J286749J62769j179982k457271m89837o21864J217589
1640A45711518q17542K064546J21552K131035K409754K417824L723947N740396P981652
1631A71484682Q175087J0962065N484555M963787L911853M028547N340208P432331Q563773
$$ y = [47470416, 50766008, 54305004, 55081170, 55773713, 55791345, 56811342, 56546813, 58631763, 61122833, 62347234, 62560994, 60324782, 60600511, 62735251, 65296528, 64912624, 66468871, 68996059, 73851012, 77640071, 79874527, 84318387, 87214762, 87861076, 88907619, 91693475, 94261451, 94984178, 95256568, 94591214, 93723039, 92247187, 94594920, 97154114, 98349592, 97821663, 98300810, 100639743, 102738776, 105895648, 111525596, 117710499, 122781957, 128397550, 131750514, 134982600, 139707600, 143487974, 147793365, 149080114, 149242883, 148062901, 145605630, 145115793, 144493929, 145711518, 144893976, 146958522, 147080074, 149211109, 151620863, 154038687, 157762634, 163503030, 171484682, 179659769, 190621834, 196106389, 201070176, 204982029, 209010576, 214350784, 221783115, 230346888]
1622B30346888O367408J194865m021959k317307K009190P800369J5131314K0183418
1614B76694186J7223976R282366K694108l453490l689956J771971R777936Q378356L932380
1605C22611833r996211k6358232k7421317j7210965j729369N441724J5484682K1492574
1597B82314719J9229480P216016j514491P708381J3996887J8053944M1395944N0212265
1589D38613145L8857693J6599014n568049j9380521k5781625N15838J4978072L275356
1581D62108923r176867m6337560q7808505q4910861l5305770j1191686o441361R761217
1573A90697530L2263223K4454155L766011J474414J1645904J6813349K2224981K9963443
1565C33303010M8492895L4673997O682861j2047222k3839185k1027467p461497Q274271
$$ y = [230346888, 236714296, 237909161, 233887202, 231569895, 233579085, 241379454, 256510768, 276694186, 293918162, 303200528, 305894636, 302441146, 298751190, 300523161, 310301097, 318679453, 322611833, 312615622, 286257390, 258836073, 241625108, 239895739, 245337463, 260822145, 282314719, 301544199, 308760215, 307245724, 314954105, 328950992, 347004936, 388400880, 438613145, 477470838, 494069852, 488501803, 469121282, 443339657, 443855495, 458833567, 462108923, 452932056, 406594496, 318785991, 233875130, 198569360, 187377674, 180936313, 190697530, 222960753, 247414908, 251180919, 252655333, 264301237, 281114586, 303339567, 333303010, 381795905, 416469902, 423152763, 411105541, 387266356, 366238889, 358777392, 367051663]
1557C67051663L949976j5145154m8446847q0621767p6528145m3502377j7150227r936556
1549G9670566M911694J6791656J6276265N127807k431681J162032O118086Q435818
1541A36062243J1194899J9609826J2236843k544710j2788844j8191763j0696390q578918
1533A26303186J057289L051309L0017j4168218k5813692k7351781j9664870j1621109
1525C1822131n295178o06561N680360N670256m66084j706851j017108M05879K322127
1516C6808971K550434K548326l37401m332308o731341n258488n149018k750418j867877
1507A5480880j782992J391863J710857j78849k66944N22575l407691l665469l32719k79569
1497I191942p56707j850101j241685j109348o9593J963763J038223R29054n99261q24440
$$ y = [367051663, 371001639, 355856485, 307409638, 226787871, 150259726, 106757349, 89607122, 79670566, 84582260, 101373916, 117650181, 122777988, 120346307, 121508339, 127626425, 136062243, 147257142, 166866968, 179103811, 176559101, 163770257, 145578494, 134882104, 126303186, 127360475, 130411784, 130441801, 116273583, 90459891, 63108110, 43443240, 31822131, 26526953, 25920392, 31600752, 37271008, 36804924, 35098073, 34080965, 34486844, 36808971, 39359405, 41907731, 41570330, 37238022, 30506681, 25248193, 20099175, 17348757, 15480880, 13697888, 15089751, 16800608, 16621759, 16354815, 16877390, 13469699, 9804230, 9471511, 9191942, 8435235, 6585134, 5343449, 4234101, 4164508, 6128271, 7166494, 8095548, 7496287, 6671847]
1487F671847k032030l72907r35559j14202r1986O31864K85132r9243r10918l86930L37141
1476B982209N01840J459825j868608k069407k854770m427123j554585L73801J012905
1467f443913m87883q63528l53997J072686M28991j06670j48315L526875j575065O71604
1457d279215J431385K218396j599617o6957j549641m47155Q11599J384651o25229j606576
1447d328359l677838k933823k193290Q90607J106907r56R2779J09909J62519K735426
1437h036119j330127P1273O1869p84106R72682R74001O39353p76705m57939n23411p66358
1426i955587O57332N61494Q65223j19991j150486j398033q94578k4377K67707K54489
1416a0936807Q93265r46815J539728k65658N48378j841362M56526k08965P63489L65099
$$ y = [6671847, 4639817, 4266910, 3331351, 3217149, 3125163, 3757027, 4042159, 3942916, 3031998, 2645068, 2982209, 3484049, 4943874, 3075266, 1005859, -1848911, -6276034, -7830619, -7456818, -6443913, -6931796, -7795324, -8149321, -7076635, -6647644, -6754314, -6902629, -3375754, -4950819, -4279215, -2847830, -629434, -2229051, -2296008, -3845649, -4292804, -3481205, -2096554, -2721783, -4328359, -8006197, -10940020, -13133310, -12242703, -11135796, -11136752, -11043973, -10934064, -10771545, -8036119, -9366246, -9294973, -9233104, -10017210, -9044528, -8070527, -7431174, -8207879, -8665818, -9189229, -9955587, -9298255, -8736761, -7871538, -7991529, -9142015, -10540048, -11434626, -11459003, -11191296, -10936807, -10043542, -10990357, -9450629, -9716287, -9167909, -11009271, -10552745, -10761710, -9998221, -9633122]
1406i633122J65721j55123o43878j44422j7202n10670N86935J573547L87298Q52092N11825
1395g026999K19008o54542p17099J34356L45032P16251K21982k13526J177188j563324
1385g361673l0233K96902n83971k71122k56222J192003j38407Q26983j41201j90476O73670
1374e983747k1007Q56547P1036L80431M74813j083j310125K88607J107746O57473p65925
1363d245234k620892J633074J590387r05429L98142J195207k463212J4852K024705l98898
1353c777298K33324k83404p0966k19501P21724L85891Q10342r2668L02866K514251l655300
1342c130739q88943k14764J025J325970N28353R35688o65350Q77448M9599P23785J51492
1331c06436k78429j05595L56163O0204k63069M7269M39824K65007M39178j78391j52779
$$ y = [-9633122, -9467401, -9622524, -10266402, -10410824, -10428026, -10938696, -10351761, -8778214, -8390916, -7538824, -7026999, -6807991, -7462533, -8179632, -8045276, -7700244, -6983993, -6762011, -6975537, -5798349, -7361673, -7391906, -7095004, -7678975, -7950097, -8206319, -7014316, -7152723, -6325740, -6466941, -6657417, -5983747, -6004754, -5148207, -5077171, -4696740, -4221927, -4223010, -5533135, -5244528, -4136782, -3479309, -4245234, -6866126, -5233052, -3642665, -4548094, -4149952, -2954745, -5417957, -5403105, -3378400, -3777298, -3543974, -3827378, -3898344, -4117845, -3396121, -3010230, -2199888, -2292556, -1989690, 524561, -3130739, -4019682, -4234446, -4233421, -2907451, -2379098, -1443410, -2108760, -1231312, -1181713, -457928, -306436, -584865, -690460, -334297, -274093, -537162, -489893, -50069, 214938, 654116, 475725, 322946]
1320C22946J490471j803978J279195J55631l14882L37774J74103j8424L419643o03004
1310D439475K914730o03754N75400K5598R93794K67351j013109P97658O29965q53682
1300H173426p87919J982092J64102P840J797031j222720p55821K170046M40972M31954
1290A2401003J521893J30939J24080J690814j66540o29656J870359Q03296N07735Q76981
1280A9130904J6790M42332p162J503490K282643L35919J707150K548123r21475K664102
1270B9702816L23826j11131n81875J102958J97358o99775j236001k688850l355528p07637
1260B1946161J015318k4801J048648J569701K085454J476535K130291L511176K600624
1251C7359107O49547K117967R25280J050669K863980K455486J455085n21269p64711
$$ y = [322946, 1813417, 9439, 1288634, 1444265, 1129383, 1467157, 1641260, 1622836, 5042479, 4439475, 7354205, 6750451, 7325851, 7351449, 8345243, 8612594, 7599485, 8397143, 9027108, 8173426, 7385507, 9367599, 9531701, 9539541, 11336572, 10113852, 9358031, 11528077, 11969049, 12401003, 13922896, 14053835, 14177915, 15868729, 15702189, 15072533, 16942892, 17746188, 18253923, 19130904, 19147694, 19590026, 19582864, 21086354, 23368997, 23704916, 25412066, 27960189, 27038714, 29702816, 30026642, 29915511, 29333636, 30436594, 30633952, 29934177, 28698176, 26009326, 22653798, 21946161, 22961479, 22936678, 23985326, 25555027, 27640481, 29117016, 31247307, 34758483, 37359107, 38008654, 40126621, 41051901, 42102570, 44966550, 47422036, 48877121, 48355852, 47591141]
1242D7591141k768855j540598j152479m02190l039959j934002l127769o651371k719290
1233B4254628J03024J69724M25383K171225K566379M339003J03184J335382L035750
1224C8503682K300261J345729K387049J185516J532837J214197M81668R47293m5787
1215D9852445k612191j772453m84482J427039k235397k756901k957479k034041j908240
1206C4518300j807498J275089M13091r7628r51854J17579J519468O01736L559110J800143
1196D0947536K201461p4352Q28135m35409J349285J183418J600043J24823k178292l826683
1186D1719965k055633j905202j729681j742776k377626M13397J051458j891505j444331
1177C0038066Q61452J884695J505565Q16741K688820L219622J112249P08031O20587N00236
$$ y = [47591141, 44822286, 43281688, 42129209, 41727019, 38687060, 36753058, 33625289, 26973918, 24254628, 24357652, 24527376, 24952759, 27123984, 29690363, 34029366, 34132550, 35467932, 38503682, 40803943, 42149672, 44536721, 45722237, 47255074, 48469271, 48950939, 49898232, 49852445, 47240254, 45467801, 44983319, 46410358, 44174961, 41418060, 38460581, 36426540, 34518300, 32710802, 33985891, 34398982, 34301354, 33349500, 33467079, 34986547, 35588283, 39147393, 40947536, 43148997, 43074645, 43902780, 43467371, 44816656, 46000074, 47600117, 47724940, 45546648, 41719965, 39664332, 37759130, 36029449, 34286673, 31909047, 32322444, 33373902, 31482397, 30038066, 30899518, 32784213, 34289778, 35106519, 37795339, 41014961, 42127210, 42835241, 43455828, 43956064]
1167D3956064j022684k714190k70332j376389l295742m242160l591462j374823k914635
1158B3153647k924635O0260K9953K8609N60096K078068J772962J306989J425211J997818
1148B9488978J956979j78911J148634J700329J21287N65690k328885K64161J162232O74809
1138C4575303j180194k332876j79714j246480j162500j00996O10767q0061O82792l42179
1128B9243862j370635K116128k11727o3752O63384K473270O30304Q14724K429465J37572
1118C6862595J31794J640864m66075K647108L6869M09241J055261R01545R59518j980870
1108D2197850J335130M15535j746190k176498j337776J391005J86623j964198n06928
1099C7794553J475206l094279l887782K048845M532589N269225o51498o68176L74236
$$ y = [43956064, 42933380, 40219190, 39948858, 38572469, 35276727, 31034567, 27443105, 26068282, 23153647, 20229012, 20289272, 20319225, 20347834, 20907930, 22985998, 24758960, 26065949, 27491160, 29488978, 31445957, 31267046, 32415680, 34116009, 34237296, 34802986, 32474101, 32738262, 33900494, 34575303, 33395109, 31062233, 30882519, 29636039, 28473539, 28372543, 28983310, 28903249, 29586041, 29243862, 27873227, 29989355, 29777628, 29713876, 30377260, 32850530, 33480834, 34295558, 36725023, 36862595, 36994389, 38635253, 38169178, 40816286, 40853155, 41262396, 42317657, 43219202, 44178720, 42197850, 43532980, 43948515, 42202325, 40025827, 38688051, 40079056, 40265679, 38301481, 37794553, 39269759, 36175480, 32287698, 34336543, 38869132, 44138357, 43486859, 42818683, 43192919]
1090D3192919k23191M148094Q538854J2256029N552157l101456k328595O194750P085221
1081H1314782J236350m476091l49620M417026L075649O22172L942490P11430o440525
1072H4053663j886635O152160J0563496N308107L233521O336412J985940M713202P775153
1063A28235019J9357504J6922164K990431J001074R481851J3683739J1798245P777795
1055B11247822J0809436J2192625J1972840Q887565R902418P331309Q359383R605031
1047B90308429J0544897N194602P929817J0726916J1597467Q770501J0064236J4309460
1039C69446325J8142506J3598712J5300552J3239973J6478314K0172928J6789258K1159183
1031E04327751J7546762K3707816K7551804J1415800Q865170N302291O805310J2314827
$$ y = [43192919, 42969728, 47117822, 55656676, 67912705, 73464862, 70363406, 68034811, 74229561, 81314782, 82551132, 78075041, 77725421, 82142447, 85218096, 85840268, 89782758, 90494188, 84053663, 82167028, 88319188, 98882684, 104190791, 107424312, 113760724, 115746664, 120459866, 128235019, 147592523, 164514687, 167505118, 168506192, 177988043, 191671782, 203470027, 211247822, 222057258, 234249883, 246222723, 255110288, 265012706, 272344015, 280703398, 290308429, 300853326, 306047928, 313977745, 324704661, 336302128, 345072629, 355136865, 369446325, 387588831, 401187543, 416488095, 429728068, 446206382, 466379310, 483168568, 504327751, 521874513, 545582329, 573134133, 584549933, 593415103, 598717394, 605522704, 617837531]
1023F17837531J4952658J1796456P367093n813605j2923733j3451163K939465J4801097
1015F37505799J7147628J3281451J2648481J8356750K4517419K4207079J0922907J3140250
1007G71727764K2274153M3796481M8867139L5295390L7904802J0238057O383741L3703468
999A010190995O4070287J03575579Q8208138O7942476J2075464N635690O4674723N9200053
991A475573405J04724095K05959639J96062351J35412310K9751847n8843735j04178423
984A984461489p3663469O7094077Q2848816o105308p2506348k58699349l99851060
977A323578848k90046481l8066807j4455326j5640257O685617R5376467N6137129J9168636
969A142737826P5829925R9688322J11423679J51955215J46290852J53183356O1497948
$$ y = [617837531, 632790189, 644586645, 651953738, 646140133, 633216400, 619765237, 622704702, 637505799, 654653427, 667934878, 680583359, 698940109, 723457528, 747664607, 758587514, 771727764, 794001917, 837798398, 886665537, 921960927, 959865729, 970103786, 976487527, 1010190995, 1074261282, 1177836861, 1266044999, 1333987475, 1346062939, 1351698629, 1416373352, 1475573405, 1580297500, 1786257139, 1982319490, 2117731800, 2147483647, 2088639912, 1984461489, 1910798020, 1977892097, 2060740913, 2054635605, 1982129257, 1723429908, 1323578848, 1033532367, 995465560, 981010234, 965369977, 972055594, 1067432061, 1123569190, 1142737826, 1218567751, 1318256073, 1429679752, 1581634967, 1727925819, 1881109175, 1942607123]
962A942607123o2947692j07335150r1664800j3794428j9376929n6765152q2706193
955A508016779k47768819l87583456l00388388p5971080o5998524j05896016o9044015
948B55366481L4342451K9382498k1445047k3785248J0303468J9767466q053641p974000
940B87904428K7617661P154972l5371709m4831354l5025279j8359940k5486767k0369234
932A43232778p868311M964732p85461j4992527o880591p587552j5875061r449395J275126
923H6033738J1159019P555931p218542j9616774j2027677j839815N316024J0495172
915G9857076P541196K94956j7464787k8831809j4032846K726961J22205o639032J92790
906B3766710L308000j122106k085937L167512L980532L152995m315085M34186j475700
$$ y = [1942607123, 1879659431, 1772324281, 1680659481, 1666865053, 1647488124, 1590722972, 1508016779, 1260247960, 872664504, 572276116, 496305036, 430306512, 324410496, 255366481, 289708932, 319091430, 297646383, 273861135, 284164603, 303932069, 295878428, 287904428, 315522089, 322677061, 287305352, 242473998, 207448719, 189088779, 163602012, 143232778, 135364467, 140329199, 139543738, 124551211, 117670620, 110083068, 94208007, 84758612, 86033738, 97192757, 104748688, 97530146, 77913372, 65885695, 64045880, 69361904, 79857076, 87398272, 87693228, 70228441, 41396632, 27363786, 30090747, 30212952, 23573920, 23766710, 27074710, 25952604, 23866667, 27034179, 31014711, 34167706, 29852621, 30286807, 28811107]
897B8811107n12347n16033j679262k491838k724851j835311j76749L539915K125730
888B4540361k763630k377007L763239L469958l17178L387892J1199658R222072P136
879E0132501l787258k564919Q15840O29775K865452J646707m208419j1485581j6977119
870A7066979j4789065j703252R783005J479462m249784l310366p0002M568357O001170
861A4776504J125521r14931J757178L848270O172138M625566J362178j710902q451455
852B2590067m244527L359223J1499k812401q466840j0383876j0456785n456175M766143
843a1093672j66900J780493m368136N92131N708876L220128j684334k594754K385509o8121
833f288780j628358R20590K379814L674491k168114j635535m23246J261594j27016J659698
$$ y = [28811107, 28298760, 27782727, 26103465, 23611627, 20886776, 19051465, 18874716, 22414631, 24540361, 21776731, 19399724, 23162963, 26632921, 26315743, 29703635, 40903293, 50125365, 50132501, 46345243, 43780324, 44596164, 45225939, 48091391, 49738098, 45529679, 34044098, 17066979, 2277914, 574662, 10357667, 11837129, 7587345, 4276979, 4206977, 8775334, 14776504, 15902025, 14987094, 16744272, 20592542, 26764680, 31390246, 32752424, 31041522, 22590067, 18345540, 21704763, 21716262, 18903861, 10437021, 53145, -10403640, -15859815, -11093672, -11260572, -9480079, -13848215, -13256084, -7547208, -4327080, -6011414, -8606168, -6220659, -6288780, -7917138, -6996548, -4616734, -942243, -3110357, -4745892, -5169138, -3907544, -4034560, -2374862]
823b374862J158121m02979j319957j184512q29779M8135r72029J373417o34504k05593
813e344542k78383o11670J05302O57917J523990N32639L73470J82738K390865n95288
803a062962k56966M96014N05060L37945J97612Q61536M57122q05802j307367l73544N26177
792d25175Q17962j126103l49532j349926k93626Q7107R5382J507864P60869k422417O21452
781b076143K281520J417140r56298J44708J10604N11243K01863O40501j28537J205467
771C352068L220158R59467p26915k16316j66496J49512K432841J752595N02377R94762
761A2254053K40249l1659J431392o14095j909294q1633J11888K593887J572566J97368
751A5764722j957099q20311j937000Q26342K450241J873314N55874j86519r84521k368141
$$ y = [-2374862, -1216741, -1619720, -2939677, -4124189, -4953968, -4905833, -5877862, -4504445, -5138949, -5344542, -5622925, -6234595, -6129293, -5471376, -3947386, -3414747, -3041277, -2858539, -467674, -1062962, -1319928, -823914, -318854, 19091, 216703, 1078239, 1535361, 729559, -577808, -951352, -425175, 392787, -733316, -1082848, -2432774, -2726400, -2639293, -2543911, -1036047, -275178, -2697595, -2076143, 205377, 1622517, 666219, 810927, 921531, 1432774, 1634637, 2275138, 2146601, 3352068, 6572226, 7531693, 6804778, 6588462, 6421966, 6571478, 9004319, 10756914, 11259291, 12254053, 12494302, 12462643, 13894035, 13279940, 11370646, 11289013, 11400901, 13994788, 15567354, 15764722, 13807623, 12987312, 11050312, 11876654, 14326895, 16200209, 16756083, 16569564, 15585043, 13216902]
741A3216902q2230J303725q89842k11922j97985J132238p38861r01457l41787j769746
731A0519035m97213O3868q56348N79504o25891p03290l171215k50758j465558J118206
721D710340R10229m10823j105031P0343l69382k094439M20465k073002q70590J651546
711H39656Q56939j596882M05156j374870J063479j829141K5422p59469M52249K50579
701a666882n99165J465049k042115J462944k6269j061432O65691j378788o85104Q06869
691c059202r29562m01713J839841j218341q05993R4833o72258l97037P72752j330633
681f107313J249381N26145J115334j089922R74779o45613K28661j404423J379798O15178
671c157995M71788j496430r0063N42316r87642K6201J32742K14132m2490j834838L26740
$$ y = [13216902, 13134672, 14438397, 13548555, 13336633, 13138648, 14270886, 13532025, 12630568, 12288781, 10519035, 10021822, 10085690, 9229342, 9808846, 9182955, 8479665, 5308450, 5057692, 3592134, 4710340, 5620569, 5209746, 4104715, 4175058, 3805676, 1711237, 2131702, 58700, -811890, 839656, 1696595, 99713, 504869, -870001, 193478, -1635663, -1610241, -2369710, -1917461, -1666882, -2266047, -800998, -2843113, -1380169, -1406438, -2467870, -1802179, -3180967, -3866071, -3059202, -3988764, -4390477, -2550636, -3768977, -4574970, -4480137, -5152395, -5549432, -4776680, -6107313, -4857932, -4331787, -3216453, -4306375, -3331596, -3977209, -3748548, -5152971, -3773173, -3157995, -2686207, -4182637, -4272700, -3730384, -4718026, -4691825, -4559083, -4344951, -4387441, -6222279, -5895539]
660e895539L85429K65619J11604m31775N88917j029854J00756M9607q77696R89438J75606
649e567888K76535P20135l33265j351150L97809J93789J072136j500340K79519J049005
639d763715N49017j422804l78342J331942L9696o73999N71661Q27695r29227M07204n87292
628e028164K55730m07369J017429j532962J174760j05498j415131l97344k70293Q52992
618e855850Q93313k051844N95850K049916m47866m55950n8303J298992m17970N05554
608c944158r01683o29815p77862Q14734J79995K25917l51464l09308J403964k003046
598f292726j92398N12291P8212l07351r31954j47094M80018L17348L43960j171715J160739
587f150670N76417J55443j050166k64854J599718j92698k0358M75208o9785n00925O42440
$$ y = [-5895539, -5510110, -5244491, -5132887, -5564662, -4975745, -6005599, -5904843, -5855236, -6732932, -5743494, -5567888, -5291353, -4571218, -4904483, -6255633, -5857824, -5664035, -4591899, -6092239, -5812720, -4763715, -4214698, -5637502, -6015844, -4683902, -4644206, -5318205, -4746544, -3918849, -4848076, -4440872, -5028164, -4772434, -5179803, -4162374, -5695336, -4520576, -4626074, -6041205, -6438549, -6708842, -5855850, -4962537, -7014381, -6418531, -4368615, -4816481, -5272431, -5330734, -4031742, -4449712, -3944158, -4845841, -5475656, -6253518, -5438784, -5258789, -5032872, -5384336, -5693644, -4289680, -6292726, -6485124, -5972833, -5894621, -6201972, -7133926, -7281020, -6801002, -6483654, -6139694, -7311409, -6150670, -5574253, -5418810, -6468976, -6733830, -5134112, -5326810, -5347168, -4871960, -4941745, -5442670, -4800230]
576d800230p31322j08319j195185o54075J641930o87778m98563Q90264R44023k91344
566e490599j08217j058986M4330J095411q37693M19898M66287j17416k987985K060993
556f513977M94526j035147L79540O6740K041555r84789n16064L85936L6467J049487
546d595726j710966j43435J088518J536485j549335j5026o33405o13524p06620Q02568
536f540466L25735N68820k94637n31768J153026j966964O17994R63883L71183M82285
526d850909j279084J035178p05547q70178l91515o1048J308778l35028j38056l52558
516f639967J55223o0206p75425p40375K44699o12787L92369Q51269l91021K12889O72358
505f690974n67751j361974O14674n84375L44477N30011M91274j37715m54735M74091m70496
$$ y = [-4800230, -5531552, -5639871, -6835056, -7489131, -5847201, -6534979, -7033542, -6143278, -5199255, -5490599, -5598816, -6657802, -6613472, -5518061, -6355754, -5935856, -5469569, -5586985, -8574970, -6513977, -6019451, -7054598, -6675058, -6608318, -4566763, -5551552, -6067616, -5681680, -5645213, -4595726, -6306692, -6450127, -5361609, -3825124, -5374459, -5389485, -6022890, -6636414, -7343034, -6540466, -6214731, -5645911, -5940548, -6472316, -5319290, -7286254, -6668260, -5704377, -5333194, -4850909, -6129993, -5094815, -5800362, -6670540, -7062055, -7123103, -5814325, -6149353, -6287409, -6639967, -6484744, -6544950, -7320375, -8060750, -7816051, -8428838, -8036469, -7185200, -7576221, -7363332, -6690974, -7258725, -8620699, -8006025, -8590400, -8245923, -7715912, -7224638, -7362353, -7817088, -7342997, -7813493]
494g813493j53110M09649m51319k09501n11715Q76776q49810l47722L93928R54738j87435
483g889014m06192j008119j560881J837941J16665M26144q22455M32467K35582P35688
473g902174Q50798l07814n27719M24810O17194j120142r9165J09379p31088J204120p99495
462h281296K38196J82755J329M3633Q70568j685622P39384n25453O20071j002679j400149
451a0199263J137096K53958J53154o51129O21230l84239k87461q95799J495225O45264
441h111964j464273K5428l96177J163896j30045M1810K97599N75540r11238P6898J557926
430g274600J64039r14298q86946k69426N95182M42073o69729m28916R15038j50685q35764
419i314032k69273O65091J172360N11846k502536K705508M33015k669991N90221J116979
$$ y = [-7813493, -7966603, -7556954, -8008273, -8217774, -8729489, -7852713, -8702523, -9050245, -8656317, -7701579, -7889014, -8295206, -9303325, -10864206, -9026265, -8909600, -8483456, -9305911, -8873444, -8637862, -7902174, -7051376, -7359190, -7886909, -7462099, -6844905, -7965047, -8064212, -7954833, -8685921, -7481801, -8281296, -8043100, -7860345, -7859016, -7815383, -6944815, -8630437, -7891053, -8416506, -7796435, -8799114, -10199263, -9062167, -8808209, -8655055, -9306184, -8684954, -9069193, -9356654, -10252453, -8757228, -8111964, -9576237, -9550809, -9946986, -8783090, -8913135, -8871325, -8573726, -7998186, -8909424, -8832526, -7274600, -7110561, -8024859, -8911805, -9181231, -8586049, -8143976, -8813705, -9242621, -8327583, -8478268, -9314032, -9583305, -8918214, -7745854, -7234008, -9736544, -7031036, -6598021, -9268012, -8677791, -7560812]
409g560812J485682k608142J55500j66108p35537M63148M43856O21053o38033k131664
399a0671057J332435K53852L54554r65584N40475J77872j80503O90563K09351l94103Q6025
388h566120k32698k15950P108J127664r31367o80354o26760j62915J439189J346373K8294
377g467536j668883K10062J28734O98230r20201K53049O34767p99480l86587K64818
367i053027J268330j232976J384045k64179k31457N67675J12905j503638L50990n04407
357i105739R71880O0487o07384P08508j121303J364210r38995o88199P75393l42887
347h924029J101379m7750J30292L7560j583737P15294l57127l24155L38162J92319L19913
336h401879n65111j260728O06759j09860j52898M91708K86949k7461O79015R0423r92042
$$ y = [-7560812, -6075130, -8683272, -8527772, -8693880, -9429417, -8966269, -8522413, -7901360, -8539393, -10671057, -9338622, -9084770, -8730216, -9695800, -9155325, -8977453, -9157956, -8467393, -8258042, -8652145, -8566120, -8798818, -9014768, -9007660, -7879996, -8811363, -9491717, -10118477, -10281392, -8842203, -7495830, -7467536, -9136419, -8926357, -8797623, -8099393, -9019594, -8766545, -8131778, -8931258, -9317845, -9053027, -7784697, -9017673, -7633628, -7897807, -8129264, -7561589, -7448684, -8952322, -8601332, -9105739, -8133859, -8073372, -8680756, -7972248, -9093551, -7729341, -8668336, -9356535, -8581142, -8924029, -7822650, -7870400, -7740108, -7702548, -9286285, -8570991, -8928118, -9252273, -8914111, -8721792, -8401879, -8966990, -10227718, -9620959, -9730819, -9883717, -9392009, -9105060, -9132521, -8453506, -8363083, -9355125]
325i355125j68817M3149j143245J981901j776543R59572O0943o3040L088810m033688
315a0406083N37227N13192K48793J09660J99699p62454N22284k80356n08271P75875n12461
304i562895l19190j373116J742509p06583m11926n92814K688284n79996J05632k134906
294a1145001J75562J162227J250996j073528k37051J10689J83223N66147j908263Q02838
284a0112161J84177q557l94210k51219K16405o35218L92542J172911k34402m4592j079170
273a0793494j73644O69005O70298N43645k597806J416572q35509J692158m92382j54932
263a0056089m19954M15856m320r3676J3995N61150p71609o46949J132947m35064K28356
252a0075357N01324O80633J079205j641007J08550o47841n26946J357672M14250k48676
$$ y = [-9355125, -9523942, -9480793, -10624038, -8642137, -10418680, -9459108, -9398165, -9461205, -6372395, -10406083, -9868856, -9355664, -9106871, -8997211, -8797512, -9559966, -9037682, -9318038, -9826309, -9050434, -9562895, -9882085, -11255201, -9512692, -10219275, -10631201, -11224015, -8535731, -9115727, -9010095, -11145001, -10969439, -9807212, -8556216, -9629744, -9866795, -9756106, -9572883, -9006736, -10914999, -10112161, -9927984, -9936541, -10330751, -10581970, -10365565, -11000783, -10608241, -9435330, -9669732, -9714324, -10793494, -10967138, -10298133, -9627835, -9084190, -11681996, -10265424, -11100933, -9408775, -9901157, -10056089, -10476043, -10060187, -10064507, -10158183, -10144188, -9583038, -10354647, -11001596, -9868649, -10303713, -10075357, -9574033, -8893400, -7814195, -9455202, -9346652, -9994493, -10521439, -9163767, -8749517, -8998193]
242h998193m06318l07255k71998P2113k4885P7954L10738l85144L71488l51821J66795
231i746526l2090J005327n84312J347713j172178k00186K08069K88895k04146l81514
221i470948n16203O80305q39204J536935p94466m72474Q27550j30931j55662J57153
211i177945J077805j062270L77532K98021n23608p46644Q94812o18049j11319Q74246
201h717419J460605k713285M96803J92588j011662P77475j044598J319697L26382k22715
191i136129M75498k82380j140364N56934J1161L77152N5692K67429o32463n96456j581513
180a1625439K980426j48380l50882m44011J247123j501162o2425L77750Q03178j669037
170a0392859k77839M53822J031596j418238L48275R28348j35022L25604j213533J291512
$$ y = [-8998193, -9404511, -9711766, -9983764, -9911651, -9936536, -9858582, -9547844, -9932988, -9561500, -9913321, -9746526, -9778616, -8773289, -9357601, -8009888, -9182066, -9382252, -9174183, -8885288, -9089434, -9470948, -9987151, -9306846, -10146050, -8609115, -9403581, -9876055, -9048505, -9179436, -9335098, -9177945, -8100140, -9162410, -8784878, -8486857, -9010465, -9757109, -8862297, -9480346, -9591665, -8717419, -7256814, -9970099, -9473296, -9280708, -10292370, -9514895, -10559493, -9239796, -8913414, -9136129, -8660631, -8943011, -10083375, -9526441, -9515280, -9138128, -9082436, -8815007, -9447470, -10043926, -11625439, -8645013, -8793393, -9144275, -9588286, -8341163, -9842325, -9904750, -9527000, -8723822, -10392859, -10670698, -10216876, -9185280, -10603518, -10255243, -9326895, -9461917, -9136313, -10349846, -9058334]
160i058334j021889j2043Q59559n62920N14127p94489O43013J099108r10146O27134k12576
149h829456l62227m57571J54787m61679l37413P84201J67309o00787p03616J24004P05840
138i816608j604798J040813L8020j12111q2792M95524q0951O74382K32413M49079j660969
127a0427998J758666j376087Q99100O1967p06054K508579j670550j070830j39358L71852
117i790713l79253j21263m59711J489545j3652o08949K9580M73778M61661N05335o62150
106i075792n13839K74115J75105P27608j282641j21489k08433J10349J045426m4687
96h914278j465590J079707j19824k01715K76549k6774O83189j15726k16318r23682R87583
85h956879o79100M87910M11019q10799o04719r13945J497953J076805n9836P98148r50716
$$ y = [-9058334, -10080223, -10092266, -9232707, -9795627, -9281500, -10075989, -9432976, -8333868, -9244014, -8616880, -8829456, -9191683, -9649254, -9494467, -9956146, -10293559, -9509358, -9342049, -9942836, -10646452, -10522448, -9816608, -11421406, -10380593, -10342573, -10454684, -10537476, -10041952, -10122903, -9448521, -9216108, -8767029, -10427998, -8669332, -10045419, -9146319, -9084352, -9790406, -7281827, -8952377, -10023207, -10162565, -9790713, -10169966, -10291229, -10750940, -9261395, -9275047, -9883996, -9854416, -9380638, -8918977, -8413642, -9075792, -9589631, -9315516, -9140411, -8412803, -9695444, -9816933, -10025366, -9915017, -8869591, -8914278, -10379868, -9300161, -9419985, -9621700, -9345151, -9371925, -8688736, -8804462, -9020780, -9944462, -8956879, -9635979, -9148069, -8737050, -9547849, -10152568, -11066513, -9568560, -8491755, -8551591, -7753443, -8704159]
74h704159o36783J69771o73678J31881l79899n28444K305513p61014j290076J34239q77843
63a1110492R80784N84577j82521N43105J54263n67079J78655M06379q43677M60816q76402
52a0271592P64599k01922J391642j807554l87788k33555M02097L11847l61121k2990j23476
41a0539813k55815J404559r50563J267217r44754R7834m99231K56313Q13970j015879
31a0366162o61140K144965p20291q73145K47132M17991q2344p43332R27795J177623
21h530908j709753m40435J389325o19989n49513J338190O79099j642870N94054P29133
11h763667j084324o0377L62540j68716M03560p43468j2854j095914q67125J646326r43072
0a1327091J115653j65240R91234J311900j407090M70493l85257l46519n93917q35304
$$ y = [-8704159, -9340942, -9171171, -9844849, -9712968, -10092867, -10621311, -8315798, -9076812, -10366888, -10232649, -11110492, -10129708, -9545131, -9727652, -9184547, -9030284, -9597363, -9418708, -9012329, -9856006, -9395190, -10271592, -9506993, -9708915, -8317273, -10124827, -10512615, -10746170, -10344073, -10032226, -10393347, -10416337, -10539813, -10795628, -9391069, -10341632, -9074415, -10019169, -9921335, -10420566, -10164253, -9350283, -10366162, -11027302, -8882337, -9602628, -10475773, -10228641, -9810650, -9892994, -10636326, -9708531, -8530908, -10240661, -10681096, -9291771, -9911760, -10461273, -9123083, -8443984, -10086854, -9492800, -8763667, -9847991, -9908368, -9545828, -9714544, -9310984, -10054452, -10067306, -11163220, -12030345, -10384019, -11327091, -10211438, -10376678, -9385444, -8073544, -9480634, -9010141, -9395398, -9741917, -10335834, -11171138]
-10a1171138P99511M00960J496316k62654j23529o54080k343982K055532l34828j38471
-20a0276363k01107K64537R08135m50764j522893J22801J567725m25508o74843J367715
-30i320565n81931K20984L69308L85609j566010j18932R0684o46155l58592Q62398J468481
-41i194721n51033j348808R49699L87740L35902k72792Q8252k00431j09020O3139q45930
-52a0698003N58010r45361J398315J18443n09747J4420K22737j37555Q69290L64088
-62h745363j569278J084138l05179J69916Q65433j148519k2980k99384q88224P88090Q4259
-73i987091l93262L10893j20234m05452J036368o38044J41015r31645n51692J378459
-83a0160685p83940J690056j628979J76875M11979j048966Q72807K14192k26249J248729
$$ y = [-11171138, -10371627, -9970667, -8474351, -8737005, -8860534, -9514614, -11858596, -9803064, -10137892, -10276363, -10477470, -10212933, -9304798, -9755562, -11278455, -11155654, -9587929, -10013437, -10688280, -9320565, -9902496, -9681512, -9312204, -8926595, -10492605, -10611537, -10520853, -11167008, -11525600, -10663202, -9194721, -9745754, -11094562, -10144863, -9757123, -9421221, -9694013, -9605761, -9806192, -9915212, -9852073, -10698003, -10139993, -11085354, -9687039, -9568596, -10078343, -10063923, -9841186, -9978741, -9109451, -8745363, -10314641, -9230503, -9535682, -9365766, -8500333, -9648852, -9671832, -9971216, -10859440, -10071350, -9987091, -10380353, -10069460, -10189694, -10595146, -9558778, -10196822, -10055807, -10987452, -11539144, -10160685, -10944625, -9254569, -10883548, -10706673, -10294694, -11343660, -10470853, -10256661, -10482910, -9234181]
-93i234181N60510j752489N2102j78695P5907j032971j663561L931835k36574o72996
-103a0151113l42011j86075L00537J149705R7142K23429j870048n99726L84166R40661
-113a0053333n68986N96223P1983n94622k85478K49473N88596K43935j989148L67081L9639
-124a1334637J527963N35204m82035P2546Q77017l148742K111153R51340p68962k32946
-134i892099J219390j693042k195115L564489j647345J416141k231034l76746J583497
-143a0251864J807059J37201j389588r31094Q36139n05584K59063n64067j035495Q8339
-153a1549891J937702j118764J087472j97548j108519J40041Q45379m77845M61396L11287
-163i669290J59550p20511L66621k84012P28959K91799m37657L80913M17211j197263
$$ y = [-9234181, -8673671, -10426160, -10374058, -10552753, -10476846, -11509817, -13173378, -9241543, -9478117, -10151113, -10493124, -10679199, -10378662, -9228957, -9131815, -8908386, -10778434, -11378160, -10993994, -10053333, -10622319, -10026096, -9954113, -10548735, -10834213, -10584740, -9996144, -9752209, -11741357, -11374276, -11334637, -9806674, -9271470, -9753505, -9680959, -8803942, -11952684, -9841531, -8890191, -9659153, -9892099, -8672709, -10365751, -12560866, -8996377, -10643722, -9227581, -11458615, -11835361, -10251864, -8444805, -8307604, -9697192, -10628286, -9792147, -10297731, -10038668, -10602735, -11638230, -11549891, -9612189, -10730953, -9643481, -9841029, -10949548, -10809507, -9964128, -10441973, -9980577, -9669290, -9509740, -10230251, -9863630, -10147642, -9418683, -9126884, -9564541, -9183628, -8766417, -9963680]
-173i963680r25644J446304l74799Q81936j705457n97268J126999K53383R50743m99037
-183i406520j717739k403713J914194k44105m68074P42294M25767P05051O93478j904616
-193a1663983q0805P94222k06686J050566r06731l76629n37418J712382J36821K36282
-203i841979j510692R08916p13075P68693J14564J2108N918k56194J59088J9318k61756
-214a0595091J22463j82103m69704L42438l51729n82580j638656J074650J263088N81778
-224a0435446J25137J009304n76391j283471L55754N94983l16678K01045K89410k6483
-234a0062836M73778o30739L97817l27170j086812M61390N37285j071439J236309q09493
-244a0881910J356721n6665j386470j62366J152418O65090P09047j061366q71826n29931
$$ y = [-9963680, -10889324, -9443020, -9817819, -8935883, -10641340, -11238608, -10111609, -9858226, -8907483, -9406520, -11124259, -13527972, -11613778, -11857883, -12325957, -11583663, -11157896, -10452845, -9759367, -11663983, -11744788, -10950566, -11157252, -10106686, -11013417, -11390046, -11927464, -10215082, -10078261, -9841979, -11352671, -10443755, -11156830, -10388137, -10273573, -10261465, -10255547, -10511741, -10352653, -10333335, -10595091, -10472628, -10654731, -11124435, -10781997, -11133726, -11716306, -13354962, -12280312, -11017224, -10435446, -10310309, -9301005, -9877396, -11160867, -10805113, -10210130, -10526808, -10325763, -10036353, -10062836, -9589058, -10219797, -9821980, -10149150, -11235962, -10774572, -10237287, -11308726, -10072417, -10881910, -9525189, -9581854, -10968324, -11130690, -9978272, -9313182, -8604135, -9665501, -10537327, -11067258]
-254a1067258L53534Q19452k57439M99392n13354K52016L50131P48448j116601o40850
-264a0572529l09557n34369q3654k23279j23320J87431j8211O23476p77303M38924r8744
-275a1491135Q45865J83060J51674p22541K44060J013899M15652K15042R7548k39357
-285i286233m30778l79569l04774p03048j32527O09489j126567K106404J35951n56675
-295a0068327j625831J205810k79426J69279n34837k13876P11214o68411J050205j08367
-305a0362567n57935m72374O42203M04301j152371L81205J96900L93092m2162O52443
-315i917265m68441K57862r91019P45033k56535M54370m39329m15902r84819J05559j12575
-326a2023061O27706p00380M87528L010110j77356m58824j061071l02438J38511p27202
$$ y = [-11067258, -10713724, -9894272, -10151711, -9652319, -10165673, -9913657, -9563526, -8815078, -9931679, -10572529, -10882086, -11416455, -11500109, -11723388, -11846708, -11659277, -11677488, -11054012, -11831315, -11392391, -11491135, -10645270, -10462210, -10310536, -11033077, -10789017, -9775118, -9359466, -9144424, -9046876, -9286233, -9717011, -10096580, -10401354, -11104402, -11236929, -10627440, -11754007, -9647603, -9511652, -10068327, -11694158, -10488348, -10767774, -10598495, -11133332, -11347208, -10635994, -11304405, -10254200, -10362567, -10920502, -11392876, -10750673, -10346372, -11498743, -11117538, -10920638, -10527546, -10569708, -9917265, -10385706, -10127844, -11118863, -10373830, -10630365, -10175995, -10615324, -11031226, -12016045, -11910486, -12023061, -11395355, -12095735, -11608207, -8598097, -8775453, -9234277, -10295348, -10597786, -10459275, -11186477]
-336a1186477N47711N70519n47044k53343P42901M89061q2903j949653m6856N39736o8029
-347a1244377P08768q17278R93790P33183j858294J575074p52006j485547M67001R98436
-357a0681250p1898j337300J050756J444545l91296j810940j20724N40752K91628j712751
-367a2798478M96838J024980p70785O72120Q57201L98468m80322Q9222j432085K64914
-377a1677927O22860j12570l20442K223119k078565P91247p46117p15383N69697P90348
-387a0653733j019198R34110P16461q69533M98475q04001J53338P19647o85552n5579
-397a1065565P91295m72589L206Q23655O58295j734898P3182j50240p48697J823506
-407i998850j100267J238270o45459K07992M98919j051496m41249k4301k75309L75840
$$ y = [-11186477, -10638766, -10068247, -10615291, -10868634, -10125733, -9636672, -9719575, -11669228, -11716084, -11176348, -11244377, -10535609, -11352887, -10359097, -9625914, -11484208, -9909134, -10661140, -12146687, -11679686, -10681250, -10753148, -12090448, -11039692, -9595147, -9986443, -11797383, -11918107, -11377355, -11085727, -12798478, -12301640, -11276660, -12047445, -11375325, -10518124, -10119656, -10599978, -10510756, -11942841, -11677927, -11055067, -11167637, -11488079, -9264960, -11343525, -10552278, -11298395, -12013778, -11444081, -10653733, -11672931, -10738821, -10022360, -10891893, -10393418, -11197419, -11044081, -10324434, -11009986, -11065565, -10274270, -10746859, -10743653, -9919998, -9261703, -10996601, -10923419, -11073659, -11822356, -9998850, -11099117, -9860847, -10506306, -10298314, -9799395, -10850891, -11292140, -11316441, -11591750, -11215910]
-417a1215910J654517j184840J85241L72674l0072K71298q29709n57950o02359k33101
-427a2170211J595030l10401O74112k02643q90887m85315P81991M56454o58561P70509
-437a0439922o51360r79307J011921O35547K84474q83549J09548O17077j028378L05378
-447a1018571p29540J327999P44247r05974n62981Q2810O09588l74471j17033j95237
-457a1139163O33881J15784K5324l11661N86798J21617j085614J138296j76722n047r1000
-468a0187507j137777M67382O1399K15949K24053R47064m60635j223974o42760r2192K1148
-479a1807850J591597j225744J1187Q66975J09727o620q46021Q27142m17581q23832
-489a1721020J431528p01054O86030q29020R43471M68151J11305j242189p9823j11011
$$ y = [-11215910, -9561393, -10746233, -10560992, -10188318, -10218390, -9947092, -10776801, -11334751, -11937110, -12170211, -10575181, -10885582, -10211470, -10414113, -11305000, -11790315, -11008324, -10551870, -11210431, -10439922, -11091282, -12070589, -11058668, -10423121, -10138647, -11022196, -10912648, -10295571, -11323949, -11018571, -11748111, -10420112, -9675865, -10581839, -11144820, -11062010, -10452422, -10826893, -10943926, -11139163, -10505282, -10389498, -10364174, -10675835, -10089037, -9967420, -11053034, -9914738, -10091460, -10096507, -10187507, -11325284, -10857902, -10796503, -10580554, -10356501, -9409437, -9870072, -11094046, -11736806, -11828998, -11807850, -10216253, -11441997, -11430810, -10563835, -10454108, -10460728, -11306749, -10479607, -10897188, -11721020, -10289492, -10990546, -10304516, -11133536, -10190065, -9721914, -9610609, -10852798, -10932621, -11043632]
-499a1043632M47816N79944j58699j001726n29793j28750J151798O86622j069667P95135
-509a0270952m68658M9635r56620R11973n59655L07742L39838L15069Q56888j019887
-519a0494627m86297M51930l95868m60696l23252K38437q27893J388675J2090k69120L4449
-530a1132172j146454Q78956O67035k1391L4603J197581j092879Q40650j344171R706
-540a1108536m49847k53827J541184l21880k63111k37138q99586m79001J122034r39942
-550a2289650J083617J607966K90624n01920J012831o32869j89425j728545p6701Q00475
-560a0623597J97582J19026j240981J088881Q47516j901247R68656J4189q8348P17299
-570i901024j47734j203361k85916M95080o32790K513730j597466n6178r77646q6064
$$ y = [-11043632, -10595816, -10015872, -10174571, -11176297, -11706090, -11834840, -10683042, -9996420, -11066087, -10270952, -10739610, -10689975, -11646595, -10734622, -11294277, -10986535, -10646697, -10331628, -9474740, -10494627, -10980924, -10528994, -10924862, -11385558, -11708810, -11470373, -12298266, -10909591, -10897501, -11166621, -11132172, -12278626, -11399670, -10732635, -10754026, -10719423, -9521842, -10614721, -9774071, -11118242, -11108536, -11558383, -11812210, -10271026, -10592906, -10856017, -11093155, -11992741, -12471742, -11349708, -12289650, -11206033, -9598067, -9307443, -9809363, -8796532, -9429401, -9618826, -11347371, -11424072, -10623597, -10426015, -10306989, -11547970, -10459089, -9611573, -11512820, -10544164, -10529975, -10618323, -9901024, -10048758, -11252119, -11538035, -11042955, -11675745, -9162015, -10759481, -10815659, -11793305, -11879369]
-580a1879369L066734j424219j237756m15755J071107l83572K9673j39292J418663Q5183
-590i808603o45854j21341J45238r73683r90068K488443k73388K455923l861759j145555
-600a2730647J075837R6232K32328q5721j04505M15684J92366M61205m11188n02483J09897
-611a1250995l3983k90162J0749j3268J116075J129537j653259J62777l04880N85265
-621a0542144o61156k204136M35058K060600o09542Q90580n87877L59440O95297l82995
-631a0546875l83694J8822l06096p7807n01685m49741O78306K94458O8773k68686j39311
-642a1613536J766324m22869j599884o81442K009635j302734j45270p15688Q09933l81258
-652a2276789J199794P38759Q69760J81635j225769L105800j201873n02927n41990r1233
$$ y = [-11879369, -8812635, -10236854, -11474610, -11890365, -10819258, -11202830, -11173157, -11312449, -9893786, -9808603, -10454457, -10575798, -10430560, -11404243, -12394311, -9905868, -10179256, -7723333, -11585092, -12730647, -11654810, -11558578, -11326250, -11411971, -11516476, -11100792, -10908426, -10447221, -10858409, -11360892, -11250995, -11284978, -11575140, -11564391, -11577659, -10461584, -9332047, -10985306, -10822529, -11127409, -10542144, -11203300, -13407436, -12972378, -10911778, -11521320, -10630740, -11218617, -10859177, -10163880, -10546875, -10930569, -10911747, -11217843, -11295650, -11797335, -12247076, -11568770, -11274312, -11205539, -11474225, -11613536, -9847212, -10270081, -11869965, -12551407, -10541772, -11844506, -11989776, -12705464, -11895531, -12276789, -11076995, -10338236, -9468476, -9286841, -10512610, -7406810, -8608683, -9111610, -9653600, -9744833]
-662i744833J320243j126925P72548k057854l7307J26324O70307k43569q40937l21399
-672a1483402J151675j74928K41831p29153O21837M98806p67528k40230m63578o4745
-682a1409415P07200L60766m04036l1245P03041l14963K3989k23165k66047J141738n54744
-693a0266881k30128r51871j74163O49692p03261N05603L91619m09623P65864N18812
-703i904337K16826r86952j150628J117900r35270Q56469L81454j402032O19361N24284
-713a0662925o35446J16529j22998L61696j59121j04660K94762L63851p59565K056360
-723i251517j184501j20119l82649k40409Q37580L16497K96331p38805n56320L1214k26380
-734a1219078k22409K81476N47527o22324J2333k87510j48224K037635r92950k12452
$$ y = [-9744833, -8424590, -9551515, -8778967, -10836821, -10874128, -10747804, -10077497, -10321066, -11162003, -11483402, -10331727, -10506655, -10264824, -10993977, -10372140, -9873334, -10640862, -10881092, -11344670, -11409415, -10702215, -10341449, -10745485, -10776730, -10073689, -10388652, -10364663, -10587828, -10853875, -9712137, -10266881, -10497009, -11448880, -11623043, -10973351, -11676612, -11171009, -10779390, -11189013, -10423149, -9904337, -9687511, -10674463, -11825091, -10707191, -11642461, -10785992, -10404538, -11806570, -11187209, -10662925, -11298371, -11181842, -11304840, -10943144, -11102265, -11206925, -10912163, -10548312, -11307877, -9251517, -10436018, -10556137, -10938786, -11179195, -10341615, -10025118, -9728787, -10467592, -11023912, -10992698, -11219078, -11441487, -11160011, -10612484, -11234808, -11222475, -11509985, -11658209, -9620574, -10613524, -10825976]
-744a0825976p00894J459477K79931j277312j141960O52070L76786K49148R59530j285742
-754a1254942l87367o11035J208203j136295N12767K48354O8729p60419J498383R79753
-764i633869k618281K040537l98525l57606p01483j75498N96408m85497K99090N43071
-774a0891653j569151J612603l39771p6005M24157j681287J231736R16031o66905Q25342
-784a0214903q32981n21921M50775O32060l62424j86664Q00907l00537p55242k43211
-794a1534141M76743L24765m22143M61184j69183l90088L73059L06487l00241M99964
-804a0373594m34507k59904K27216R13969p05203r71543j214613N50120K155014o73366
-814a0786411R96397k512982J901109O98512k321707Q63551R5370q27737J749234q53249
$$ y = [-10825976, -11526870, -10067393, -9787462, -11064774, -12206734, -11554664, -11177878, -10928730, -9969200, -11254942, -11642309, -12253344, -11045141, -12181436, -11668669, -11420315, -11351586, -12112005, -10613622, -9633869, -12252150, -10211613, -10610138, -10967744, -11669227, -11844725, -11248317, -11733814, -11434724, -10891653, -12460804, -10848201, -11187972, -11263977, -10839820, -12521107, -11289371, -10373340, -11040245, -10214903, -11047884, -11569805, -11119030, -10486970, -10849394, -11036058, -10235151, -10535688, -11290930, -11534141, -11057398, -10732633, -11154776, -10693592, -10862775, -11252863, -10879804, -10573317, -10873558, -10373594, -10808101, -11068005, -10840789, -9926820, -10632023, -11603566, -12818179, -12268059, -10113045, -10786411, -9790014, -12302996, -10401887, -9703375, -12025082, -11161531, -11066161, -11893898, -10144664, -10997913]
-824a0997913j231023O85773l39593l77461P31031J198667k01497q3338J487224r42084
-834a0070214j499784N20408q31149J52571L90186J45869Q12973l60305R17675n15902
-844a0337672o52673J8197m97513J51657O09592J39580j287152P08682M0723L23217q95689
-855a1679051Q13920k181813M94508J085405j434751J268465J209584l30535k19447n2868
-865a1026583L75114K3928R8689Q90694j761404p47919k62910Q16283J455224L0409
-875a0108475j513719o07612R07459p3319o43982L79605J031193j234066l980L04533
-885a1562363m67833N10314O50453n74668J14813k91972J050624j032844L07579l67869
-895a1663766M5830J493409j150731n73745J149232J691390k49772k45190q35899k60424
$$ y = [-10997913, -12228936, -11543163, -11882756, -12260217, -11529186, -10330519, -10532016, -10615354, -9128130, -10070214, -11569998, -11049590, -11880739, -11728168, -11337982, -11192113, -10379140, -10739445, -9821770, -10337672, -10990345, -10972148, -11469661, -11318004, -10708412, -10568832, -11855984, -11147302, -11106579, -10783362, -11679051, -10865131, -13046944, -12552436, -11467031, -12901782, -11633317, -10423733, -10754268, -10973715, -11026583, -10651469, -10627541, -10528852, -9638158, -11399562, -12147481, -12410391, -11594108, -10138884, -10108475, -11622194, -12229806, -11322347, -11395666, -12039648, -11660043, -10628850, -11862916, -11866896, -11562363, -12030196, -11519882, -10869429, -11444097, -11329284, -11621256, -10570632, -11603476, -11295897, -11663766, -11617936, -10124527, -11275258, -11849003, -10699771, -9008381, -9258153, -9503343, -10339242, -10599666]
-905a0599666n00108Q34673m14041P64345l2647M78613p68725j428790k04266Q59203
-915a1011409K86282p9485N34538l90109n25894j46152n2558J526596m30032K33866m84645
-926a0539002K47640j12971P64813j183212l61009k28171j71294M55992n99129J245852
-936a0480491q91303K41434J369629o48587j218108O60058N37j201509J40642P21356
-946a1306342O52152p98332R80604q31087J125714j70292o29942M88166o87859l435
-956a1180653j198375m16439O05050P35144M27875l37348p17804R07322J060954N12539
-966i601735N78537j139117r13688N26034j320637R20825j019139K09229J534569q63113
-976a1088235n46923K58591M71296o73098K85494O0945J116098n58467m58496M05398L9124
$$ y = [-10599666, -11099774, -10265101, -10679142, -9914797, -9947444, -9468831, -10237556, -11666346, -11870612, -11011409, -10725127, -10804612, -10270074, -10660183, -11186077, -11332229, -11384787, -9858191, -10288223, -10054357, -10539002, -10291362, -10404333, -9639520, -10822732, -11183741, -11411912, -11583206, -11127214, -11726343, -10480491, -11371794, -11130360, -9760731, -10409318, -11627426, -10967368, -10966831, -12168340, -12027698, -11306342, -10654190, -11452522, -10471918, -11303005, -10177291, -10347583, -10977525, -10489359, -11177218, -11180653, -12379028, -12795467, -12190417, -11455273, -11027398, -11364746, -12082550, -11175228, -10114274, -9601735, -9023198, -10162315, -11076003, -10549969, -11870606, -10949781, -11968920, -11759691, -10225122, -11088235, -11635158, -11376567, -10905271, -11578369, -11292875, -11231930, -10115832, -10674299, -11132795, -10727397, -10688273]
-987a0688273K52973r22186Q70777j108706k185836M081223r21904J8923q68211P06048
-997a0765172j00670M04611K75884n35437l00912J94559j42861m47869J500088L97j643773
-1008a1561155J411377J674951K27643k681135j468156J041090p02176j216879J078743
-1017a2195697N86525N91450J09425P65447J77603j432956Q48684R05142L45875p43898
-1027a0042400j267564o08136M11495J458830o42508J041089l5204j650913M39381p40196
-1037a1636126q01949L29605m23986R40381J196871P8336m48583N61447q2122O39568
-1047i646558j547998J81191j107534Q55357M17999K63340p70255q28597P13558J196384
-1057a0273113P6555m41630k077019P9804K27676K68010N33968J300810p14917N07459
$$ y = [-10688273, -10435300, -11357486, -10486709, -11595415, -13781251, -9700028, -10621932, -10603009, -11471220, -10765172, -10865842, -10461231, -10185347, -10720784, -11021696, -10827137, -10969998, -11417867, -9917779, -9917382, -11561155, -10149778, -8474827, -8247184, -10928319, -12396475, -11355385, -12057561, -13274440, -12195697, -11609172, -11017722, -10908297, -10142850, -9965247, -11398203, -10549519, -9644377, -9298502, -10042400, -11309964, -11918100, -11506605, -10047775, -10690283, -9649194, -9684398, -11335311, -10895930, -11636126, -12438075, -12108470, -12532456, -11592075, -10395204, -10316868, -10765451, -10204004, -10286126, -9646558, -11194556, -11013365, -12120899, -11265542, -10847543, -10584203, -11354458, -12183055, -11469497, -10273113, -10196558, -10638188, -12715207, -12635403, -12407727, -12139717, -11605749, -10304939, -11019856, -10512397]
-1067a0512397m22778j626359K04088N71104J73835l00512J46775o22505J225589J78689
-1077a0984471m99764N10836m39210j45336O34851k90112K87686K26185q29584L1223
-1087a1497696K46946K373152j115083l50934r19645O51895J079481N0580j104573n62667
-1097a1148544O87227j609541J141832R05936r45855j42580M99133j173418J440725q98552
-1107a1243637n81170K246573m75098M56859r57696j624773J916170j113422J039683
-1116a0336511K63355j171265L93193K38851j290152J110579M94803r98503n86260J096435
-1126a0785475O53724o69552P11238q8384O70617j051843N03869j338569M19465P74584
-1136a0200326J270321k152109l42996o5298J026862j059438j99554J77748M10414Q4016
$$ y = [-10512397, -10935175, -12561534, -12357446, -11786342, -11612507, -11913019, -11766244, -12388749, -11163160, -10984471, -11484235, -10973399, -11412609, -11557945, -10923094, -11213206, -10925520, -10699335, -11528919, -11497696, -11250750, -8877598, -9992681, -10343615, -11263260, -10611365, -9531884, -9481304, -10585877, -11148544, -10461317, -12070858, -10929026, -10023090, -10968945, -11111525, -10612392, -11785810, -10345085, -11243637, -11824807, -9578234, -10053332, -9596473, -10554169, -12178942, -10262772, -11376194, -10336511, -10073156, -11244421, -10851228, -10612377, -11902529, -10791950, -10297147, -11295650, -11881910, -10785475, -10131751, -10801303, -10090065, -10178449, -9507832, -10559675, -10055806, -11394375, -10974910, -10200326, -8930005, -11082114, -11425110, -11490408, -10463546, -11522984, -11722538, -11544790, -11134376, -11050360]
-1146a1050360k72463M60957q53936P02327M34717j163921N59855P66507n61276q15467
-1156a1793060R76690r3109j68952k2844R544j9812L90262r68077K038049k34820j407643
-1167a1293772n22768K455218j760493N45970K65655j623874N93034n8915k73611O76584
-1177a0996972j31918j251158J367143K886275k142479Q74860J25793n93093n09430
-1186a0370979j241320j033409R4082J017312Q30138o35638J438725m11764j078405R00355
-1196a0490903L99402o64601m49530k2604j071180J320145j066154L74251J42456p56522
-1206a2285240m42604J155286l27708J376538l230j59555o25304J63291k82811j46993
-1216a1578330p7220l35943k7140k74026J226058j35266l65070L76926m88271N63185
$$ y = [-11050360, -11322823, -10861866, -11715802, -11013475, -10578758, -11742679, -11182824, -10416317, -10977593, -11793060, -10816370, -10909479, -11078431, -11101275, -11091731, -11111543, -10721281, -11689358, -9651309, -9886129, -11293772, -11816540, -9361322, -11121815, -10575845, -10310190, -11934064, -11341030, -11399945, -11673556, -10996972, -11128890, -12380048, -11012905, -8126630, -10269109, -9394249, -9268456, -9861549, -10370979, -11612299, -12645708, -12551626, -11534314, -10704176, -11339814, -9901089, -10312853, -11391258, -10490903, -10091501, -10756102, -11205632, -11228236, -12299416, -10979271, -12045425, -11671174, -11528718, -12285240, -12727844, -11572558, -11900266, -10523728, -10526958, -10686513, -11311817, -11148526, -11431337, -11578330, -11655550, -11991493, -12018633, -12292659, -11066601, -11201867, -11566937, -11190011, -11678282, -11115097]
-1226a1115097N53119o46034J537177j821488K81329j61123l64736J145351j128256M73769
-1236a1245989o74033Q35583N8109m60891P53083j758033J547497m42645O5358n45160
-1246a1867121K80109n71679N08318K80293n91700j486805L888615q00090o35430j32482
-1256a1127972o26387k8105o7739j087547J971357K63863m11054N32728k39018p68719
-1266a1588593N06134L86907q51467K93409l24001J57026J35049l52744l55082P05263
-1276a1288099J354670j558282L25887n59090R15074j32677N6187k86044O96137p9038
-1286a0555275p14006K66746L22254j210462j93149R40610n4238J376225k62509p21703
-1296a0805507j351045J632014j023937O12661l35572m93796n83789Q57375l76097L27675
$$ y = [-11115097, -10561978, -11208012, -9670835, -11492323, -11210994, -11372117, -11736853, -10591502, -11719758, -11245989, -11920022, -11084439, -11026330, -11487221, -10734138, -12492171, -10944674, -11387319, -11321961, -11867121, -11587012, -12158691, -11650373, -11370080, -11961780, -13448585, -9559970, -10360060, -10995490, -11127972, -11754359, -11782464, -11850203, -12937750, -10966393, -10702530, -11113584, -10580856, -10819874, -11588593, -11082459, -10695552, -11547019, -11253610, -11577611, -11420585, -11285536, -11638280, -11993362, -11288099, -9933429, -11491711, -11165824, -11724914, -10809840, -10942517, -10886330, -11172374, -10476237, -10555275, -11269281, -11002535, -10680281, -11890743, -12083892, -11143282, -11197520, -9821295, -10083804, -10805507, -12156552, -10524538, -11548475, -10935814, -11271386, -11765182, -12348971, -11491596, -11867693, -11540018]
-1306a1540018R17739r3384k36960k25334j496247K411727p3320j57102j556692N05595
-1316a1543996O1377J01382Q41095k058690K36388Q74881L14803K118263j228682j101909
-1326a1385088J9276L75903m10761R73769n25744m23662K06154n56008N42523k50882
-1336a1434520J119701p57778j008949O01381N71130o12854J548779j303870L14678K89048
-1346a0673254K25517r29798k46098r63978R44832O8332j5465L65980J334922J05150
-1356i783860j670882J129874k060307L39352K90607K41313l83011L18053n56971J587139
-1366a0548693J57638j406943Q87296J52151p3848r02039o39411J389233p55642M78158
-1376a1262100k30546J364596k5806m56171k83106N25436j547767k34959J803739j46204
$$ y = [-11540018, -10622279, -10715663, -10952623, -11177957, -12674204, -10262477, -10335797, -10492899, -12049591, -11543996, -11482619, -11381237, -10540142, -12598832, -12362444, -11487563, -11172760, -9054497, -10283179, -11385088, -11365812, -10989909, -11400670, -10426901, -10952645, -11376307, -11170153, -11726161, -11183638, -11434520, -10314819, -11072597, -12081546, -11480165, -10909035, -11521889, -9973110, -11276980, -10962302, -10673254, -10447737, -11377535, -11623633, -12587611, -11642779, -11574447, -11589912, -11223932, -9889010, -9783860, -11454742, -10324868, -12385175, -12045823, -11755216, -11513903, -11896914, -11578861, -12135832, -10548693, -10391055, -11797998, -10910702, -10758551, -10832399, -11734438, -12373849, -10984616, -11740258, -11262100, -11492646, -10128050, -10153856, -10610027, -10893133, -10367697, -11915464, -12150423, -10346684, -10492888]
-1386a0492888j012127O07366o78142Q21946l16265q47523J594978j128771M40484L83330
-1396a0627612k9955P80632j757391J047876O60642j568480R85010M79743j01331r77335
-1406a1108201J08176P01026k825457K726015n47969j035623N67664J62184O07771n1029
-1416a0695443J502411J6086j896957L7509m61419J139365l93613L52670m32474P01781
-1426a0130084q19066K72657K0437k51425j315928J847239r64668L45539R23122l75559
-1436a0447736J165891k067686q0581k99133M54606j065096N00556O53925L34184k58380
-1446a1109450k33797Q84296j627309K91472O09522K0760Q30594l21103J16298l94670
-1456a0933387J537791L54590k075157J31013p69393p67549P29000P36408J84141Q2442
$$ y = [-10492888, -11505015, -10897649, -11575791, -10753845, -11070110, -11917633, -10322655, -11451426, -11010942, -10627612, -10657567, -9876935, -11634326, -10586450, -9925808, -11494288, -10509278, -10029535, -10130866, -11108201, -11000025, -10298999, -13124456, -10398441, -10946410, -11982033, -11414369, -11252185, -10644414, -10695443, -9193032, -9176946, -11073903, -11036394, -11497813, -10358448, -10752061, -10399391, -10831865, -10130084, -10949150, -10676493, -10656056, -10907481, -12223409, -10376170, -11340838, -10995299, -10072177, -10447736, -9281845, -11349531, -11430112, -11729245, -11274639, -12339735, -11839179, -11185254, -10851070, -11109450, -11343247, -10458951, -12086260, -11794788, -11185266, -11164506, -10333912, -10655015, -10538717, -10933387, -9395596, -9041006, -11116163, -10985150, -11754543, -12522092, -11793092, -11056684, -10872543, -10790101]
-1466a0790101K391869j416560J365536k24386k547415M91309r62427o68686K967206
-1475i393655p40448q161p12495j060600j039939L067866k71004k261327K874562p3861
-1485i619062O45478l428438N7195M30499m2842O74562k7885p1494L65193R3782L79888
-1496a0543124j201510m19982J163832L30699j56805J138p10103k90782L49083J082480
-1506a0395074j713593q3987O76317J8647O03618n63653J91614k61394O00235r00200
-1516a1827470J200183j217601R18782k86722N82649j332273L67888l35098O34743n18535
-1526a1813454J446823q69621N59678m48371r6154m13948k191j016616M98068J404924
-1536a0750862m16063j7338j05047K64659p45805M98061Q73452l08173n02656n53447
$$ y = [-10790101, -8398232, -9814792, -8449256, -8673642, -11221057, -10729748, -11692175, -12360861, -9393655, -10134103, -10142264, -10854759, -11915359, -12955298, -9887432, -10158436, -12419763, -9545201, -9619062, -8973584, -12402022, -12344827, -11914328, -11957170, -11282608, -11310493, -11381987, -11016794, -10923012, -10543124, -11744634, -12164616, -11000784, -10670085, -10826890, -10825752, -11535855, -11826637, -11477554, -10395074, -12108667, -12192654, -11516337, -11497690, -10894072, -11457725, -11266111, -11527505, -10927270, -11827470, -10627287, -11844888, -10926106, -11212828, -10630179, -11962452, -11594564, -11929662, -11294919, -11813454, -10366631, -11236252, -10676574, -11124945, -11221099, -11635047, -11637238, -12653854, -12155786, -10750862, -11166925, -11184263, -11289310, -11024651, -11770456, -11272395, -10398943, -10707116, -11209772, -11763219]
-1546a1763219K47715R95442j04716o95777J57134M45030J918061m243888K41265k36915
-1556a3039868R91568K31379L61635Q14436k48687m01100N38467m90635M84634J15919
-1566a0642252l91026m07200P02800n40879j93740n031k6808L96679o79447M38780P78307
-1577a0569817r94342l12046J099534m52834k10701K18221l41187p12312O68642L37556
-1587a1269286o14500N61523n69157j61583J6714L64939M23800O96229j062532O65513
-1597a0948340j855578K320758q51763Q73556o8294p72735m336J182309n02258j731514
-1607a2358195J791935J255045m956556J656151q75082L21642J429846k64580O80524
-1616a1319270M59902N64389q54118m07395j185195J858967q38180O64701N02175l46248
$$ y = [-11763219, -11515504, -10520062, -10624778, -11320555, -11163421, -10718391, -8800330, -13044218, -12802953, -13039868, -12048300, -11816921, -11455286, -10640850, -10889537, -11290637, -10752170, -11242805, -10758171, -10642252, -11033278, -11440478, -10737678, -11278557, -11472297, -11477328, -11504136, -11107457, -11786904, -11348124, -10569817, -11564159, -11876205, -10776671, -11229505, -11440206, -11221985, -11563172, -12275484, -11606842, -11269286, -11883786, -11322263, -11891420, -12053003, -12036289, -11671350, -11247550, -10551321, -11613853, -10948340, -12803918, -10483160, -11334923, -10461367, -10529661, -11302396, -11306732, -10124423, -10626681, -12358195, -10566260, -9311215, -14267771, -12611620, -13486702, -13165060, -11735214, -11999794, -11319270, -10859368, -10294979, -11149097, -11556492, -12741687, -10882720, -11720900, -11056199, -10554024, -10900272]
-1626a0900272j324215n31664J591914J64124m89669M70281j038657k00293n119J35944
-1636a2127626m7113N02078n83631L02611j95878o75287P83844O54449j058133J291972
-1646a1152714J07840l51545j29566M67798n31029J474525L31756j407653m11298N47966
-1656a1053920j91077q06636N11318L22891O92309n33062q93183K21582K212547K7172
-1666i490059k041686M89822m67785p39454Q47132N08092N2509L19720j050969k138132
-1676a3710810J419658p45321R29281R1154l9708N68678l4373l27033Q10300o88752m50860
-1687a2177786N69073J381415j442858j061162L86928L15879J034539m81073J503637
-1696i971408m14681k004782J962881K48743n32284L903J5641M89778r07233N39557l39286
$$ y = [-10900272, -12224487, -12756151, -11164237, -11000113, -11489782, -11019501, -12058158, -12258451, -12263570, -12127626, -12174739, -11672661, -12256292, -11953681, -12149559, -12824846, -12041002, -11386553, -12444686, -11152714, -11044874, -11396419, -11525985, -11058187, -11589216, -10114691, -9782935, -11190588, -11601886, -11053920, -11244997, -12051633, -11540315, -11217424, -10525115, -11058177, -11951360, -11729778, -9517231, -9490059, -11531745, -11041923, -11509708, -12249162, -11402030, -10893938, -10841429, -10521709, -11572678, -13710810, -12291152, -13036473, -12107192, -12016038, -12055746, -11487068, -11521441, -11848474, -11038174, -11726926, -12177786, -11608713, -10227298, -11670156, -12731318, -12344390, -12028511, -10993972, -11475045, -9971408, -10386089, -12390871, -10427990, -10179247, -10711531, -10707628, -10691987, -10202209, -11109442, -10569885, -10909171]
-1707a0909171n20798K12066j213354O58429M17450L84802q82239L89681N40103P38011
-1717a0185020k45547j09407K73541j112965N55888J007789o40046j181326n0927J052286
-1727a0635734k8653p76125l4264k1993K53273J58486J78290J06275r74559N83342p74
-1738a1192436Q39582j5706p61810k44695k5396l55827K31915M14807j677135J769869
-1748a1016832l33140l37715k0684K21349J05929N10430m39482m75335K497066j166738
-1758a0455152j96486r36748J97406M02843k14831M75742K155m92970p09064j96321
-1768a2123426J178974o39552j11261O0863j41476L43423j533580K106549k48336Q53486
-1778a0254336j458687R67548M83139j154449M63017K11909r20410K30005o42849Q43575
$$ y = [-10909171, -11429969, -11217903, -12431257, -11772828, -11355378, -10970576, -11852815, -11463134, -10923031, -10185020, -10430567, -10539974, -10266433, -11379398, -10823510, -9815721, -10455767, -11637093, -11688020, -10635734, -10664387, -11440512, -11474776, -11496769, -11243496, -11085010, -10906720, -10800445, -11775004, -11191662, -11192436, -10352854, -10368560, -11130370, -11375065, -11400461, -11756288, -11524373, -11109566, -12786701, -11016832, -11349972, -11687687, -11708371, -11487022, -11381093, -10870663, -11310145, -11785480, -9288414, -10455152, -10651638, -11588386, -11390980, -10988137, -11202968, -10727226, -10725071, -11218041, -11927105, -12123426, -10944452, -11584004, -11695265, -11634402, -11775878, -11432455, -12966035, -10859486, -11107822, -10254336, -11713023, -10745475, -10262336, -11416785, -10953768, -10741859, -11662269, -11432264, -12075113, -11231538]
-1788a1231538p20043Q04751J243273l20765r53783k40106M81681o13174m6173J585905
-1798a0009972p89467j82971J081624j230458J88472K83284L40169j849594L6753p1302
-1808a2203462P04029J173631j349219j15767j72697k13277N93053M41658r31224P08730
-1818a1364545o36584O9817L01803j05328N07046M0161o10384J255934o27104P49111
-1828a0420073j702888R5376m60118K41405N71598l39975P97365l92842l0640J51689
-1838a1489103P03874O18839j135603m66614P03793p10293r7814N84033J147202p8667
-1848a0220353j43883N1265q04990K66469j439162K904668j513905q0730R83089j640298
-1858a1637830L71430K87624J302765o84834q77726N1667P1673n84489M49056M18906
$$ y = [-11231538, -11951581, -11146830, -9903557, -10224322, -11178105, -11418211, -10936530, -11549704, -11595877, -10009972, -10799439, -10982410, -9900786, -11131244, -10942772, -10659488, -10319319, -12168913, -12132160, -12203462, -11499433, -10325802, -11675021, -11790788, -11963485, -12176762, -11583709, -11142051, -12073275, -11364545, -12001129, -11931312, -11629509, -11734837, -11227791, -11187630, -11798014, -10542080, -11169184, -10420073, -12122961, -12027585, -12487703, -12246298, -11674700, -12014675, -11217310, -11610152, -11640792, -11489103, -10785229, -10166390, -11301993, -11768607, -11064814, -11775107, -11872921, -11288888, -10141686, -10220353, -10364236, -10312971, -11117961, -10851492, -12290654, -9385986, -10899891, -10980621, -9997532, -11637830, -11266400, -10978776, -9676011, -10360845, -11238571, -11186904, -11115231, -11699720, -11250664, -10831758]
-1868a0831758l80818l8495L21576l26055j57368n07525M98414j06838N91349k66363
-1878a1203881j019507L90621N42703l44574P78361J227625j197687o07781L61807m50254
-1888a1522567J248541k30576l21499j817680J416462R99334m81393k233011J751883r0612
-1898a1281118m09019m17056q10733P8142L814795j851504P50502M74422Q33670j674897
-1908a0492796m2502L01436o67363r85305P93778k424781K408283o5681j52026j80361
-1918a1507318J264226q73832L15224O27158j03394J49790n68862j309295j244301M68667
-1928a2781937J433161j02563j510301P7787J734880j071078J29902o25555O58170N41520
-1938a1516014L02077R4656q69948N37054L30260m46796R84848l33677j025675J278444
$$ y = [-10831758, -11212576, -11251071, -10929495, -11255550, -11412918, -11920443, -11422029, -11528867, -10937518, -11203881, -12223388, -11832767, -11290064, -11634638, -10856277, -9628652, -10826339, -11434120, -11072313, -11522567, -10274026, -10504602, -10826101, -12643781, -11227319, -10227985, -10709378, -12942389, -11190506, -11281118, -11690137, -12107193, -12917926, -12839784, -9024989, -10876493, -10125991, -9651569, -8817899, -10492796, -10535298, -10233862, -10901225, -11886530, -11092752, -13517533, -11109250, -11174931, -11326957, -11507318, -10243092, -11116924, -10801700, -10174542, -10277936, -10128146, -10697008, -12006303, -13250604, -12781937, -11348776, -11451339, -12961640, -12883853, -11148973, -12220051, -12090149, -12715704, -12057534, -11516014, -11213937, -11119281, -11989229, -11452175, -11121915, -11568711, -10583863, -10917540, -11943215, -10664771]
-1948a0664771k03147L47502n56316l83411q49983J13311J275536j734391J424030q01305
-1958a2032945n65102q8074N96133j04891R44869l29435L91514Q5327l39442M6962K20835
-1969a1174249K95740l653287K646548M15851P60971j236196M47249M21899l81364o98863
-1979a2155701J65381P1088j78575K47824K035011m19416j157440L52951j945635J226802
-1989a1757710n82235N85652P30193j058986M92696P62796L23157j79713M36596j143526
-1999a1391080j323499o98285J407535k49330R92310O69951m95307j83564K46858n04689
-2009a1529100j51655k31474o64221J721754M87358j124084j57473o17221J248769q88360
-2019a1905707J096468M7533j493676r01435K040386K18783j95662K98042r03659L37371
$$ y = [-10664771, -10867918, -10520416, -11076732, -11460143, -12310126, -12196815, -10921279, -12655670, -11231640, -12032945, -12598047, -12686121, -12089988, -12194879, -11250010, -11579445, -11187931, -11102604, -11442046, -11395084, -11174249, -10878509, -14531796, -11885248, -11469397, -10708426, -11944622, -11497373, -11075474, -11456838, -12155701, -11990320, -11919232, -12097807, -11849983, -9814972, -10234388, -11391828, -11038877, -12984512, -11757710, -12339945, -11754293, -11024100, -12083086, -11590390, -10827594, -10504437, -10684150, -10247554, -11391080, -12714579, -13412864, -12005329, -12254659, -11262349, -10592398, -11087705, -11271269, -11024411, -11529100, -11680755, -11912229, -12576450, -10854696, -10367338, -11491422, -11648895, -12266116, -11017347, -11905707, -10809239, -10761706, -12255382, -13156817, -11116431, -10897648, -11093310, -10795268, -11698927, -11361556]
-2029a1361556o22858J66738Q23677j287936R31012r98361j62726J045643Q54517p63003
-2039a1374853k23843j44304j22843j25064Q90680O26153M87316j709216l72392N2011
-2049a2016355J257159q85604N97529q03458L4729R10301K53686p77591o99455M82228
-2059a1646831n80837M17461P56940j293572J054581r02859l38R75290J41179j15120M3348
-2070a1150758K58862k338j52981k70659P5559P57616j622539R18755j42397p93593J69293
-2081a1955180m67417P22186m8069m57706L8157Q70011q36646p9868Q03431j000888M34392
-2092a1977597J229965n78747k74543m49581K17520j38663j8882Q37644l58335m98549
-2102a2009768k88467J00253J524333J013756j855368M53404J0146k75493q51353R47544
$$ y = [-11361556, -11984414, -11817676, -10993999, -12281935, -11350923, -12349284, -12512010, -11466367, -10611850, -11374853, -11598696, -11743000, -11865843, -11990907, -11100227, -10474074, -9986758, -11695974, -12068366, -12016355, -10759196, -11644800, -11047271, -11850729, -11816000, -10905699, -10652013, -11429604, -12129059, -11646831, -12227668, -11810207, -11053267, -12346839, -11292258, -12195117, -12195455, -11220165, -11078986, -11194106, -11150758, -10891896, -10894234, -11047215, -11317874, -11242315, -10484699, -12107238, -11188483, -11330880, -12124473, -11955180, -12422597, -11700411, -11748480, -12206186, -12168029, -11298018, -12134664, -12214532, -11411101, -12411989, -11977597, -10747632, -11326379, -11600922, -12050503, -11832983, -11971646, -11990528, -11152884, -11511219, -12009768, -12298235, -12197982, -10673649, -9659893, -11515261, -11061857, -11051711, -11327204, -12178557, -11231013]
-2112a1231013m79141J393967k06673P38540m11585j003611m38337j430263O30632J169792
-2122a1267692K60136m73386K04952k7995p64531O04432O41259l07113k67986j004438
-2132a2402362Q40465o99668K50542q91098m34606Q71654R47757q9604L47357K36524
-2142a1023039q06839m85676J036975j28980k04716p29431j77010P88743O86052j082988
-2152a2126909k30988R16695K0890J266976q10598n24103K019274j91579m16577j098142
-2162a1175061Q95833j59485r73555L31043k3136l8028O8855j092115l70774R27239o36992
-2173a2246176R04380k72626m76898J289051m26906o79498p56562K53574J174224m8911
-2183a1286348Q46848j630881R54517Q64353j533446P41169q4514M73899k9731m03163
$$ y = [-11231013, -11710154, -10316187, -10522860, -9784320, -10195905, -11199516, -11637853, -13068116, -12437484, -11267692, -11007556, -11480942, -11275990, -11303985, -12068516, -11464084, -10822825, -11129938, -11397924, -12402362, -11561897, -12261565, -12011023, -12902121, -13336727, -12465073, -11517316, -11606920, -11259563, -11023039, -11829878, -12315554, -11278579, -11407559, -11612275, -12341706, -12518716, -11729973, -11043921, -12126909, -12357897, -11441202, -11420312, -10153336, -10963934, -11488037, -9468763, -9660342, -10076919, -11175061, -10279228, -10438713, -11412268, -11081225, -11104361, -11142389, -11073534, -12165649, -12536423, -11609184, -12246176, -11341796, -11614422, -12091320, -10802269, -11229175, -11908673, -12665235, -12411661, -11237437, -11286348, -10439500, -12070381, -11115864, -10251511, -11784957, -11043788, -11128302, -10654403, -10684134, -11087297]
-2193a1087297l48039M61492l80411r50034J224501q74887L29322p62361J443730q39803
-2203a1783787k39946J056252q19555j31571J136710l78670p26193j205434J077152q1826
-2213a2096868J032505J12601l07061L00668k63266J210760j320401J125088r20139J07108
-2223a1019005J154476k758091O51146Q14814L10661j384673P15020r91011J461382L1448
-2233a1013833o52254j02063q33703K535176J62699j092900l24008l81440R0313Q02620
-2243a0809393M30561j214690o24480Q74571J551207j248945R87183j010384r47918N16586
-2253a1495702O76948L00713l33357j922304K75032R90001P13167P93170p34755Q64081
-2263i873006n76359m73468J195543o32197j04397j080142L86182l46214M70208l07498
$$ y = [-11087297, -11435336, -10973844, -11354255, -12304289, -11079788, -11954675, -11625353, -12387714, -10943984, -11783787, -12023733, -10967481, -11787036, -11918607, -10781897, -11160567, -11886760, -13092194, -12015042, -12096868, -11064363, -10951762, -11258823, -10958155, -11221421, -10010661, -11331062, -10205974, -11126113, -11019005, -9864529, -12622620, -11971474, -11156660, -10845999, -12230672, -11515652, -12506663, -11045281, -11013833, -11666087, -11768150, -12601853, -10066677, -9903978, -10996878, -11320886, -11702326, -11612013, -10809393, -10378832, -11593522, -12218002, -11343431, -9792224, -11041169, -10053986, -11064370, -12012288, -11495702, -10818754, -10518041, -10851398, -12773702, -12498670, -11508669, -10795502, -10002332, -10737087, -9873006, -10449365, -10922833, -9727290, -10359487, -10463884, -11544026, -11157844, -11504058, -11033850, -11341348]
-2273a1341348m19891j031815J271695j028971J126661L81869r35012M89739M36991l78994
-2283a1429076n33664J475618q17268J85180j117958O91207j35166l94746O5636J35203
-2293a1875034L49416j14574M35940J56700p17654K55278j093144K718350j414547J293791
-2303a0005478l58379Q19162j235759K83417r24863K66649l15523n50894J289998l93985
-2313a1125655m82799K08498Q7837J718783k561172j51985J237449N56688q05513J580580
-2323i737289j299201n61403j280469J603524Q87323l34258k4557L47053M31885j511019
-2333a1478411o74829N89042L41605J53927R39829q02206q86642L01093J93855K60017
-2343a1062720m76971j923p9708O25591q65158K03138L10100j459766J918331M96257
$$ y = [-11341348, -11761239, -12793054, -11521359, -12550330, -11423669, -11041800, -11976812, -11487073, -11050082, -11429076, -11962740, -10487122, -11304390, -11119210, -12237168, -11545961, -11681127, -12075873, -12010237, -11875034, -11525618, -11640192, -11204252, -11047552, -11765206, -11509928, -12603072, -9884722, -11299269, -10005478, -10363857, -9544695, -10780454, -10497037, -11421900, -11155251, -11470774, -12021668, -10731670, -11125655, -11608454, -11399956, -11312119, -9593336, -12154508, -12306493, -11069044, -10512356, -11317869, -9737289, -11036490, -11597893, -12878362, -11274838, -10387515, -10721773, -10746330, -10399277, -9967392, -11478411, -12153240, -11564198, -11222593, -11068666, -10128837, -10931043, -11817685, -11516592, -11322737, -11062720, -11539691, -11541614, -11621322, -10995731, -11860889, -11657751, -11347651, -12807417, -10889086, -10392829]
-2353a0392829k166249M31421J362472j8885k07914j430521Q49039R4584J126615j365447
-2363a1717714l5709J070974P42852n06644o68460p69357j286690Q51854R59284k155836
-2373a3515446J302837j82672J144399J271330n33034j118519J259143j56701j314525
-2382a1843188M95481O54743l29374n51810J446676l69999m32224P74457p51358J086557
-2392i820039j757073p46489M628J603448n19157q87347L31107k91498Q29076O43747
-2402a0609597p19287r89159J45377J273639j622458R27749J0892k75714n37912J389539
-2412a1006931j01279j83520N99856p00264q03293J508805j233890J062680j588126R77386
-2422a1468576L60937j71037K50949k87217n05302R54030j080869O46143n4306p66233
$$ y = [-10392829, -12559078, -12127657, -10765185, -10784070, -10991984, -12422505, -11573466, -11478882, -10352267, -11717714, -11753423, -10682449, -9939597, -10446241, -11114701, -11884058, -13170748, -12318894, -11359610, -13515446, -12212609, -12395281, -11250882, -9979552, -10512586, -11631105, -10371962, -10528663, -11843188, -11347707, -10692964, -11022338, -11574148, -10127472, -10497471, -10929695, -10155238, -10906596, -9820039, -11577112, -12323601, -12318973, -10715525, -11234682, -12122029, -11790922, -12082420, -11253344, -10609597, -11328884, -12318043, -12172666, -10899027, -12521485, -11593736, -11582844, -11858558, -12396470, -11006931, -11108210, -11291730, -10691874, -11392138, -12195431, -10686626, -11920516, -10857836, -12445962, -11468576, -11107639, -11278676, -11027727, -11314944, -11820246, -10866216, -11947085, -11300942, -11355248, -12121481]
-2432a2121481J086404M8328j0639P80995k962897J379252O14243Q32378p53783J39296
-2442a0967904R66355j672014l51084N27086M37476P6721j268951O68030m9515K80446
-2452a1353354n10761O24608m26187N03574l39886o9522J44960m25237M16265j62383
-2462a1597923J37928O69291j66040l33260P15186j152205P02076j163555J109178K77792
-2472a0801532q75065p6376n00445L64399N13855n94378J13173O24190j236113n07920
-2482a2976212L87951L49299L77664O84270n30059Q49572j835864J713588k55793R3337
-2492a1142247O3750j19186M50599K347427l773841J048935j66683k2495k19873J15454
-2502a1418160J128132m35502J36513l54361o18667l3969j777091J188251L85537M01294
$$ y = [-12121481, -11035077, -10986749, -10997388, -10216393, -13179290, -11800038, -11185795, -10353417, -11107200, -10967904, -10001549, -11673563, -12024647, -11497561, -11060085, -10983364, -12252315, -11584285, -11633800, -11353354, -11864115, -11239507, -11665694, -11162120, -11502006, -11571528, -11426568, -11851805, -11435540, -11597923, -11459995, -10790704, -10956744, -11290004, -10574818, -11727023, -11024947, -12188502, -11079324, -10801532, -11676597, -11752973, -12253418, -11889019, -11375164, -11969542, -11856369, -11232179, -12468292, -12976212, -12588261, -12238962, -11861298, -11177028, -11707087, -10857515, -12693379, -10979791, -11235584, -11142247, -11078497, -11197683, -10747084, -8399657, -12173498, -11124563, -11291246, -11313741, -11533614, -11418160, -10290028, -10725530, -10589017, -10943378, -11562045, -11596014, -13373105, -12184854, -11799317, -11398023]
-2512a1398023l63825o06759N09638j90323K49162l982J063399O7128l93980j054322
-2522a2121887Q65315L71826j134682O47992J46852o36763n23943J349148l62630o88359
-2532a2087131Q70016j30595l7516k36875k59431K67577P19046q9995k79617p84029
-2542a2048550J112690m08874L35247n2126J6323o94852q72620P58571l9487O46676m87026
-2553a1734028L67631l5584M31147J20345k14584Q61824q62743L86312L18788j082936
-2563a1443828j294700J642029j038791j26348R27114P971m40456N17129j59573K42338
-2573a1167115O58047L22125r33916N31178O45045J5759j535595j09454M56727j45211
-2583a1262410p30833M70747M90216j647438R89485M57710j228284p908k56261P60507
$$ y = [-11398023, -11761848, -12368607, -11858969, -12049292, -11800130, -11804112, -10740713, -10673585, -11067565, -12121887, -11256572, -10884746, -12019428, -11371436, -11224584, -11861347, -12385290, -11036142, -11398772, -12087131, -11217115, -11347710, -11385226, -11622101, -11881532, -11613955, -10894909, -10984904, -11264521, -12048550, -10935860, -11344734, -11009487, -11061613, -11045290, -11740142, -12612762, -11854191, -11893678, -11247002, -11734028, -11366397, -11401981, -10970834, -10850489, -11065073, -10203249, -11065992, -10679680, -10360892, -11443828, -12738528, -11096499, -12135290, -12261638, -11334524, -11326553, -11767009, -11249880, -11409453, -11167115, -10509068, -10186943, -11120859, -10589681, -9944636, -9928877, -11464472, -11573926, -11117199, -11262410, -11993243, -11522496, -11032280, -12679718, -11690233, -11232523, -12460807, -12468715, -12724976, -11964469]
-2593a1964469j540385R41179q0227J561945J197972j817954R59368N06443j087856M21323
-2603a0902661n57848L38103J82311k31351M93743j388980O47258Q59599o80742J34904
-2613a1105664l85758K69075O23470m3998p67875o5368j91170J3393M6212l11612j66981
-2624a2086276P56489k98105j44303l80733J025999J31329m78096N97614p91607L13020
-2634a1354669j230640K82776Q21746M84770k156367K550448o40677o11270J271188
-2643a0582695k046128J452969o3026o41075K765884m65110j277597N38455j085046
-2652a1403369J176528m60885j012547p17276J236742R9223j330410O56667o49718N73737
-2662a1831308N20055l4686n17837R84974j291589J955007p36024o15333R64052O67584
$$ y = [-11964469, -13504854, -12563675, -12643902, -11081957, -9883985, -11701939, -10742571, -10236128, -11323984, -10902661, -11460509, -11122406, -10940095, -11171446, -10677703, -12066683, -11419425, -10559826, -11240568, -11105664, -11491422, -11222347, -10598877, -10642875, -11410750, -11476118, -11667288, -11653895, -11607683, -11919295, -12086276, -11329787, -11627892, -11772195, -12152928, -11126929, -10995600, -11473696, -10876082, -11667689, -11354669, -12585309, -12302533, -11480787, -10996017, -13152384, -10601936, -11242613, -11853883, -10582695, -12628823, -11175854, -11238880, -11879955, -9114071, -9579181, -10856778, -10318323, -11403369, -10226841, -10687726, -11700273, -12417549, -11180807, -11081584, -12411994, -11755327, -12405045, -11831308, -11311253, -11345939, -11863776, -10878802, -12170391, -10215384, -10951408, -11566741, -10602689, -9935105]
-2672i935105k108289j04956J271596l6387M57464n16436m97087k73412m86468Q56527
-2682a1372553j92997J636929j521323l45966J129254l29695l01990J38712K11170M91403
-2692a0457056o23662o55316m86620R58853O51126L28981j13542K13364J004441j384183
-2702a0563614R9917K33212j448639J070281l86378m31N12018l91407k43803l43114Q919
-2713a1453039m14559j67159J287203l594455K739357R15438j005455M18816m59883R59636
-2723a0774100J34725m17005J144453j613660K28484j22966O37405
$$ y = [-9935105, -12043394, -12148350, -10876754, -10913141, -10455677, -10972113, -11469200, -11742612, -12229080, -11372553, -11565550, -9928621, -11449944, -11795910, -10666656, -10996351, -11298341, -11159629, -10948459, -10457056, -11080718, -11736034, -12222654, -11263801, -10612675, -10283694, -10397236, -10183872, -9179431, -10563614, -10463697, -10230485, -11679124, -10608843, -10995221, -10995652, -10483634, -10875041, -11118844, -11461958, -11453039, -11867598, -12034757, -10747554, -14342009, -11602652, -10687214, -11692669, -11273853, -11733736, -10774100, -10639375, -11056380, -9911927, -11525587, -11297103, -11420069, -10782664]
-2730a0782664  $$ checkpoint
##PAGE= N=2
##DATA TABLE=(X++(I..I)), XYDATA
13653a0548761P99958q37739L27065K20824N16867j1424q15878J49241K84336n76876
13643a0492387P98991j617232l13416j140856L942665j569802L89897J703469j7765K0783
13633h295653j555517j23630P5555K58995Q2036P2078o7404j397185P92322m87533J96308
13622a0449628L5898o2432j271483J111324m39847N71175o02262J847569m0278M16316
13612h883648q75563l06846L5572J605250j71714n18767P97924j759494L28449R19454
13602h829383n84162q73784N60576M9087p2638J064043j589594q26510J183827j230537
13592a1149075P07333Q34879J582048q26211j228686L15458L91525k91946n73221L25798
13582i912098l57417J003899q92300O25675p79654n93863J467527N73018j015984L27462
$$ y = [-10548761, -9748803, -10586542, -10259477, -10038653, -9521786, -9533210, -10349088, -10199847, -9915511, -10492387, -9693396, -11310628, -11624044, -12764900, -8822235, -10392037, -10002140, -8298671, -8316436, -8295653, -9851170, -9974800, -9899245, -9640250, -9558214, -9486136, -9553540, -10950725, -10158403, -10645936, -10449628, -10413730, -10476162, -11747645, -10636321, -11076168, -10504993, -11107255, -9259686, -9299964, -8883648, -9759211, -10066057, -10030485, -8425235, -8596949, -9115716, -8317792, -10077286, -9748837, -8829383, -9413545, -10287329, -9726753, -9677666, -9750304, -8686261, -10275855, -11102365, -9918538, -11149075, -10441742, -9606863, -8024815, -8851026, -10079712, -9764254, -9372729, -9664675, -10237896, -9912098, -10269515, -9265616, -10157916, -9532241, -10311895, -10905758, -9438231, -8865213, -9881197, -9553735]
13572i553735k44111L19465m8998L42489O85615o31909m21935n4897R72529j452837m38484
13561a0526808J243500M19079L02495j9340m99377q43758J55839l87235J646448n0181
13551h559338M36825j892954O28069p26314r9000Q27161m01727L86665q02873J072409
13541i131077l10510R49906p53778K31932j091035P13421Q02134l99785L13853n34368
13531i209307R17296r88475J089617j27085K57416N90746j224503q33542K550244j424250
13521h401843q30578K18249J151992K209988k409583J61019l12601k59635j00209l02702
13511h875903k67944J216297n71692m22887N15375j57625P79962n01413N2150o30265
13501h863945Q66179j134392k85599Q91348j503482k876J537671K26330j678231J129580
$$ y = [-9553735, -9797846, -9478381, -9527379, -9184890, -8499275, -9131184, -9553119, -9608016, -8635487, -10088324, -10526808, -9283308, -8864229, -8561734, -8581074, -9080451, -9924209, -9768370, -10155605, -8509157, -8559338, -8122513, -10015467, -9387398, -10113712, -10212712, -9385551, -9787278, -9400613, -10203486, -9131077, -9441587, -8491681, -9245459, -9013527, -10104562, -9391141, -8589007, -8988792, -8674939, -9209307, -8292011, -9280486, -8190869, -8317954, -8060538, -7469792, -8694295, -9527837, -6977593, -8401843, -9232421, -9014172, -7862180, -5652192, -8061775, -7900756, -8213357, -8472992, -8573201, -8875903, -9143847, -7927550, -8499242, -8922129, -8406754, -8564379, -7784417, -8285830, -8233680, -8863945, -7997766, -9132158, -9417757, -8526409, -10029891, -10032767, -8495096, -8268766, -9946997, -8817417]
13491h817417K94234J6467k35833L70987k6350m30159n68896L49292L81001j031807P79549
13480h918932L41945j281828J8248N79512Q28276j016957J349500r17705q39183Q00943
13470i056181k40279L59959M25886P372j81675L32023j413521O58303j379528J853993
13460h633648r02976j207240Q60646o99586K95081J707156l71556J043270m09760M84313
13450g834300n61191n76462J349875n55542N21728l65561k443774R69451N5016p29998
13440a0170758M17506J249591j21004K84133r60631R50803l5765n1479q16680K826404
13430f427880m73902j266220j033214M19541K75904Q98576k15253O61133o68605j253987
13420i083907j776085P67515R30104l44955K75269K98719k5214N63215J00495n49062
$$ y = [-8817417, -8523183, -8506716, -8742549, -8371562, -8397912, -8828071, -9396967, -9047675, -8666674, -9698481, -8918932, -8576987, -9858815, -9840567, -9261055, -8432779, -9449736, -8100236, -9017941, -9857124, -9056181, -9296460, -8936501, -8510615, -8503243, -8684918, -8352895, -9766416, -9108113, -10487641, -8633648, -9536624, -10743864, -9883218, -10582804, -10287723, -8580567, -8952123, -7908853, -8318613, -7834300, -8395491, -8971953, -7622078, -8177620, -7655892, -8021453, -10465227, -9495776, -9440760, -10170758, -9753252, -8503661, -8624665, -8340532, -9301163, -8350360, -8386125, -8437604, -9254284, -6427880, -6901782, -8168002, -9201216, -8781675, -8505771, -7607195, -7822448, -7161315, -7829920, -9083907, -10859992, -10092477, -9162373, -9507328, -9232059, -8933340, -8958554, -8395339, -8294844, -8843906]
13410h843906J324419M11292p37075j643554O15711K15499j188657n47623j43436J085040
13400i452290P03308r57335J307508p72967k67191M71013J234048P53610j398318m9624
13390h428238P03349l38645k911642K081410J61515K93841J83048l75320q8826K09079
13380h510429j165036J92507O27408J887387j396327K59304j57152l94866J115251Q230
13370g533723j54025L92014j777619M67606Q87178r31548N84715M51847N4353m55509r8631
13359h113342k078243K265523o19535M22772n7318o8050r42406P4090J080055n45973
13349h582427K96100J242965j209298L32353l91551r19182R69606j16905Q0433j83454
13339h481360M0931J68541j116703O36780J459279n5498n00914p12650k7590J768998
$$ y = [-8843906, -7519487, -7108195, -7845270, -9488824, -8873113, -8657614, -9846271, -10393894, -10537330, -9452290, -8748982, -9706317, -8398809, -9171776, -9438967, -8967954, -7733906, -6980296, -8378614, -8428238, -7724889, -8063534, -10975176, -8893766, -8732251, -8438410, -8255362, -8630682, -8719508, -8510429, -9675465, -9482958, -8855550, -6968163, -8364490, -8105186, -8262338, -8657204, -7541953, -7533723, -7687748, -7295734, -9073353, -8605747, -7718569, -8650117, -8065402, -7613555, -7559202, -8014711, -8113342, -10191585, -7926062, -8545597, -8122825, -8180143, -8248193, -9190599, -9116509, -8036454, -8582427, -8286327, -7043362, -8252660, -7920307, -8311858, -9231040, -8261434, -8378339, -8297906, -8481360, -8440429, -8271888, -9388591, -8751811, -7292532, -7348030, -7848944, -8561594, -8589184, -6820186]
13329f820186k621278N42372P51889n45773R08023K71478q7492p42067p05190n49652
13319i597876K58777J633588p62084p05275M40404O82328J66912J22741L70891j23245
13309g512839n73240n34017k4779R03106Q1905N33907K40100l43073M39782k205392
13299h994540J059993K52549K08450Q66966j164069r61924j109953L070330L082j056785
13289g825901R284P60604j464501M88669J632796j70497k380713K14465N08100J44413
13279h083281R66525M48968j53099n91252P8599l80009p92200R3153j49042J696343K28360
13268f636935j875884P35187n8813k74043K21059L48848m16690k61382K02463K90466
13258g725724n43945k16232J759108K78851k4849j398776k0630J210371o17953m08043
$$ y = [-6820186, -9441464, -8899092, -8147203, -8692976, -7784953, -7513475, -7600967, -8343034, -9048224, -9597876, -9339099, -7705511, -8467595, -9172870, -8732466, -8050138, -7883226, -7760485, -7389594, -7512839, -8086079, -8620096, -8644875, -7741769, -7659864, -7125957, -6885857, -7228930, -6789148, -8994540, -7934547, -7681998, -7473548, -6606582, -7770651, -8732575, -9842528, -6772198, -6769116, -7825901, -7816617, -7056013, -8520514, -8031845, -6399049, -6569546, -8950259, -8735794, -8227694, -8083281, -7116756, -6667788, -6820887, -7412139, -7333540, -7713549, -8505749, -8412596, -8561638, -6865295, -6636935, -8512819, -7777632, -7836445, -8110488, -7889429, -7540581, -7957271, -8218653, -8016190, -7725724, -8269669, -8485901, -6726793, -6447942, -6472791, -7871567, -7892197, -6681826, -7299779, -7707822]
13248g707822j298566J607122q02276k24707m37234K22192J591476k56558O78500j25248
13238f753121n32153m21982K09765L09580r3052L49190M31458j550535Q46456j368285
13228h572679K77451R31844k03251J30034J278073m565758K745904K75318p11212O25661
13218g788615k71147J404816l38325n31408L51907j892950J137344j05371Q05707n32330
13208g760372M61622M40233O5511o76642r33958R15572q75010k39540J068375l51433m0017
13197g925659N72135j07970P68373K68938j014518N1458J16630j515294P08890J260775
13187f816242j177011J35163N60338m41499n29013M67426J150167l45964K09661L39912
13177f447062o47078O74144q75995j817346K06976K39049L88980j6189J021677L19093
$$ y = [-7707822, -9006388, -7399266, -8201542, -8426249, -8863483, -8641291, -7049815, -7306373, -6627873, -6753121, -7285274, -7707256, -7497491, -7187911, -7280963, -6931773, -6500315, -8050850, -7204394, -8572679, -8295228, -7363384, -7566635, -7436601, -6158528, -10724286, -7978382, -7703064, -8414276, -7788615, -8059762, -6654946, -6993271, -7524679, -7172772, -9065722, -7928378, -8033749, -7228042, -7760372, -7298750, -6858517, -6793006, -7469648, -8403606, -7488034, -8363044, -8602584, -7534209, -7885642, -7925659, -7353524, -7461494, -6693121, -6424183, -7438701, -7387243, -7270613, -8785907, -8077017, -6816242, -7993253, -7858090, -7297752, -7739251, -8268264, -7800838, -6650671, -6996635, -6786974, -6447062, -7094140, -6419996, -7295991, -9113337, -8906361, -8667312, -8278332, -8294521, -7272844, -6953751]
13167f953751K79829j259107J68261O21715o5178q93029m48525j383406K378224M54499
13157g100468L01398j447669P18429O90560j55435m55476O21684l48688j098690J344473
13147f929882p0074L96932J91406n27344j151371L76657O91518L2048j71347N43432j25071
13136f743096j045303K215583l69910k168933J59931J246424m40242o47757R79477l00838
13126g114664k42718Q88793k97741M36289L1939m20005n33471J88791o31594Q07685O01228
13115f285468p51887N3477l15715M19545o36723N00353P89450r92114L17423R06130
13105e995529j115001Q09438N3662r51297l09768J088251K34545m20438P81978n64460
13095f388619n99571q77142K52625J835581j265852N4455J100362r38998k29179L31720
$$ y = [-6953751, -6673922, -7933029, -7764768, -7143053, -7208231, -8101260, -8549785, -9933191, -7554967, -7100468, -6799070, -8246739, -7528310, -6837750, -6993185, -7448661, -6826977, -7175665, -8274355, -6929882, -6999956, -6603024, -6411618, -6938962, -8090333, -7713676, -7022158, -6990110, -7161457, -6618025, -6743096, -7788399, -5572816, -5942726, -8111659, -7951728, -6705304, -7145546, -7793303, -6813826, -7114664, -7357382, -6468589, -6766330, -6330041, -6298102, -6718107, -7251578, -7062787, -7694381, -6886696, -6285468, -7037355, -6983878, -7299593, -6880048, -7516771, -7016418, -6226968, -7219082, -6901659, -5995529, -7110530, -6301092, -6247430, -7198727, -7508495, -6420244, -6185699, -6606137, -5824159, -6388619, -6988190, -7865332, -7612707, -5777126, -7042978, -6988523, -5888161, -6827159, -7056338, -6724618]
13085f724618j11225j184235p4996Q65328k71798R77049L86591L55738L1819q11210q01225
13074g362782k82900J327690Q47475m63125j297288J332284n5108j79951J306391k11916
13064e039230k120389M97302n89813J306153k8688q57050J69876l81492l93292J74626
$$ y = [-6724618, -6835843, -8020078, -8095074, -7229746, -7501544, -6524495, -6137904, -5782166, -5750347, -6561557, -7362782, -7645682, -6317992, -5470517, -5933642, -7230930, -5898646, -5953754, -6133705, -4827314, -5039230, -7159619, -6662317, -7252130, -5945977, -5974665, -6831715, -6661839, -7043331, -7436623, -7261997]
$$ [...]
-2730a2124127  $$ checkpoint
##END NTUPLES=
##END=
