##TITLE=Unknown
##JCAMP-DX= 5.00 $$From Command Line Converter 1.0
##DATA TYPE= NMR Spectrum
##DATA CLASS=  XYDATA

##ORIGIN= Exported from Command Line Converter 1.0
##OWNER= SVB
##$URL= http://wwwchem.uwimona.edu.jm:1104/software/jcampdx.html
##SPECTROMETER/DATA SYSTEM= NUTS EXPORT
##.OBSERVE FREQUENCY= 75.480980
##.OBSERVE NUCLEUS= 13C
##INSTRUMENTAL PARAMETERS= 13C
##XUNITS= PPM
##YUNITS= ARBITRARY UNITS
##XFACTOR= 0.0002649675
##YFACTOR= 11.4425740000
##FIRSTX= -17.968720
##FIRSTY= -40160.000000
##LASTX= 246.998700
##NPOINTS= 16384
##MAXY= 11222793.000000
##MINY= -219781.000000
##DELTAX=   0.016173
##XYDATA= (X++(Y..Y))
-67815c510P893m23J071J754k371k096n31l116k320L45L893k620k498n15p82M04
$$ -3510 4383 3960 5031 6785 4414 2318 1787 -1329 -3649 -3304 589 -2031 -4529 -5044 -5826 -5422
-66839e422k8o457R17J488N515K258k220j160J505K06M331N101M577q625p758
$$ -5422 -5450 -11907 -10990 -9502 -3987 -1729 -3949 -5109 -3604 -3398 933 6034 10611 1986 -5772
-65923e772M311J53o256l508K175N880K325J444j631j141N073O35J61m816Q29
$$ -5772 -1461 -1308 -7564 -11072 -8897 -3017 -692 752 -879 -2020 3053 3688 3849 -967 -138
-65008a38M577o650o959j065L658K625M113N89P496l430o395k152j983j471L143
$$ -138 4439 -2211 -9170 -10235 -6577 -3952 161 750 8246 4816 -1579 -3731 -5714 -7185 -4042
-64092d042j339l388P254L69J726L09j90K913j541J440l570o553Q073k35j2476
$$ -4042 -5381 -8769 -1515 -1146 580 889 699 3612 2071 3511 -59 -6612 1461 1226 -11250
-63176a1250N195N454o148k118N552j698R73K782r38j046N781M33l663J591P571
$$ -11250 -6055 -601 -6749 -8867 -3315 -5013 -4040 -1258 -2196 -3242 2539 2972 -691 900 8471
-62261H471k856J79M81K972k361k626k437M09J280J240k171j279J561j739J683
$$ 8471 5615 5794 6275 9247 6886 4260 1823 2232 3512 4752 2581 1302 2863 1124 2807
-61345B807O364q880r090k764l532Q067O999K875O79p908n444M686O181l77Q4
$$ 2807 9171 291 -8799 -11563 -15095 -7028 -29 2846 3525 -4383 -9827 -5141 1040 663 747
-60430G47j31m733k780m414L072J905m829j080J0698P82L560K963j7K260j0827
$$ 747 616 -4117 -6897 -11311 -8239 -6334 -11163 -12243 -1545 -763 2797 5760 5743 8003 -2824
-59514b824j446N920m338m265o750n88M254N132P964j529p131m492Q2M497N871
$$ -2824 -4270 1650 -2688 -6953 -13703 -14291 -10037 -4905 3059 1530 -5601 -10093 -10011 -5514 357
-58598C57N190q62l137r62L627n935m92j08R85O098L665o428N34k549l158k676
$$ 357 5547 4685 1548 586 4213 -1722 -2214 -2322 -1337 4761 8426 1998 2532 -17 -3175 -5851
-57622e851k100l995o64L288j965j9R64j367M751P72m988J679O033N853n62J756
$$ -5851 -7951 -11946 -12610 -9322 -11287 -11306 -10342 -11709 -6958 -6186 -11174 -9495 -3462 2391 1829 3585
-56645C585k687m336J327K350j438J032O16L638M541l354m322q777n337N928P411
$$ 3585 898 -3438 -2111 239 -1199 -167 449 4087 8628 5274 952 -7825 -13162 -7234 177
-55730A77k400M79l549k56q68J520L466o086q140J0259P982j94o358j747m241
$$ 177 -2223 -1744 -5293 -5549 -6417 -4897 -1431 -7517 -15657 -5398 2584 2390 -3968 -5715 -9956
-54814i956N394O958j774j422o85J534R49j071n72R091L313k340n169m940p36
$$ -9956 -4562 2396 622 -800 -1485 49 998 -73 -645 8446 11759 9419 4250 -690 -1426
-53899a426r81J509j695j26j008p370L26L453L738k096q31j147N710N403m246
$$ -1426 -2407 -898 -2593 -2719 -3727 -11097 -10771 -7318 -3580 -5676 -6507 -7654 -1944 3459 -787
-52983g87p073j322K147j25L576o6k680n049Q119O857q94N21o280l323J947O78
$$ -787 -7860 -9182 -7035 -7160 -3584 -3650 -6330 -11379 -3260 3597 2703 3224 -3056 -6379 -4432 -3754
-52006c754J715J090o667n550l18O822l071J271J2672L628j114r11o152K323P83
$$ -3754 -2039 -949 -7616 -13166 -13484 -6662 -9733 -8462 4210 7838 6724 5813 -339 1984 2767
-51091B767j710k205L017K876P31j172l777n820l66j361N64p88L186J205N546
$$ 2767 1057 -1148 1869 4745 5476 4304 527 -5293 -5659 -7020 -6456 -7244 -4058 -2853 2693
-50175B693J374l051q81R25N26j612L62k612o45p87N438m960L344K897m166k856
$$ 2693 4067 1016 135 1060 1586 -26 336 -2276 -2921 -3708 1730 -3230 114 3011 -1155 -4011
-49199d011K806L165m830p67q86j481o30K994J00O108P460m833r707P86M293k784
$$ -4011 -1205 1960 -2870 -3637 -4523 -6004 -6634 -3640 -3540 2568 10028 5195 -4512 -3726 567 -2217
-48222b217r74l063K16o089K763j13J502K216n088m941P124Q570m176n040m213
$$ -2217 -3191 -6254 -6038 -12127 -9364 -9477 -7975 -5759 -10847 -15788 -8664 -94 -4270 -9310 -13523
-47306a3523L943P589M425L729j000J318n047k095j716n790l092o91O680R88l730
$$ -13523 -9580 -1991 2434 6163 5163 6481 1434 -661 -2377 -8167 -11259 -11950 -5270 -4282 -8012
-46391h012o14M74J382N139K17R53K051k132j345Q23j482o65j655M862P696j423
$$ -8012 -8626 -8152 -6770 -1631 -1414 -461 1590 -542 -1887 -1064 -2546 -3211 -4866 -4 7692 6269
-45414F269l301N36M083j934n235n550M027M405L991Q19L03n313l579j934k990
$$ 6269 2968 3504 7587 5653 418 -5132 -1105 3300 7291 8110 8413 3100 -479 -2413 -5403
-44499e403j630L835O583m240q986L376N055L79M829K100l81j601j161m356J889
$$ -5403 -7033 -3198 3385 -855 -9841 -6465 -1410 -1031 3798 5898 5517 3916 2755 -1601 288
-43583B88N225n332l982J729L216p77p3N855o645k711L63M978j190R347K352r971
$$ 288 5513 181 -3801 -2072 1144 367 294 6149 -496 -3207 -2844 2134 944 10291 12643 2672
-42606B672m847n37l063M509J1626M885l571o194n911k890Q12l06R95n837k243
$$ 2672 -2175 -2712 -5775 -1266 10360 15245 11674 5480 -431 -3321 -2509 -2815 -1820 -7657 -9900
-41691i900q2O601L213P10J771k823K225r46k706m284q78O092O096j134m880J100
$$ -9900 -9982 -3381 -168 542 2313 -510 1715 769 -1937 -6221 -7099 -1007 5089 3955 -925 175
-40714A75j16k161m465N710K881n034O86K926k601J313k666P159J300L192q138
$$ 175 59 -2102 -6567 -857 2024 -3010 -2324 602 -1999 -686 -3352 3807 5107 8299 161
-39799A61o44q29m649n444P874M055k412m152K651M516j093N266j762J28k72O04
$$ 161 -483 -1312 -5961 -11405 -3531 524 -1888 -6040 -3389 1127 34 5300 3538 3666 3394 3998
-38822C998J890J480j897n321n968Ln68k351J3742O215m801m156m651k060M253
$$ 3998 5888 7368 5471 150 -5818 -5815 -6383 -8734 5008 11223 6422 2266 -2385 -4445 -192
-37907a92j384K362j732o953k302J864j665n52L581N77k196L008L595N162j507
$$ -192 -1576 786 -946 -7899 -10201 -8337 -10002 -10554 -6973 -6396 -8592 -5584 -1989 3173 1666
-36991A666j71m386n186N236M976n777j470m509p26O055N849M197n420l151k038
$$ 1666 1495 -2891 -8077 -2841 2135 -3642 -5112 -9621 -10347 -4292 1557 5754 334 -2817 -4855
-36075d855o49k773k039K710M863M296l458j137J349q85O316Q93j873j969r01
$$ -4855 -5504 -8277 -10316 -7606 -2743 1553 -1905 -3042 -1693 -2578 3738 4631 2758 789 -112
-35160a12j477L584q57J933k309J357K121k031R59j580K474k785o333o036p612
$$ -112 -1589 1995 1138 3071 762 2119 4240 2209 3168 1588 4062 1277 -5056 -11092 -18704
-34244a8704N858P480N273j736N54L271K253K10j828o135K234J355M51k481k406
$$ -18704 -12846 -5366 -93 -1829 -1275 1996 4249 4459 2631 -3504 -1270 85 536 -1945 -4351
-33329d351O309o582J091k554k81k69J936Q479P900k522j070m561l074o96N762
$$ -4351 1958 -4624 -3533 -6087 -6368 -6637 -4701 3778 11678 9156 8086 3525 451 -245 5517
-32413E517M897p796p251n861O542O493J67j264j942J2701J179j405q102q53N112
$$ 5517 10414 2618 -4633 -10494 -3952 2541 2708 1444 -498 12203 13382 11977 3875 3022 8134
-31497H134k528o258n783O05P599R22r32k590l304J654M000L110r0L427O03Q67
$$ 8134 5606 -652 -6435 -5830 1769 2691 1759 -831 -4135 -2481 1519 4629 4539 7966 8569 9436
-30521I436p52o270N55L425j166l137p980J886P669J287J076J521l421m150Q49
$$ 9436 8684 2414 2969 6394 5228 2091 -5889 -4003 3666 4953 6029 7550 4129 -21 828
-29605H28J411L008J637n095k011r66O486K495m000n492j93k596J022R23k50j113
$$ 828 2239 5247 6884 1789 -222 -1188 5298 7793 3793 -1699 -1892 -4488 -3466 -2543 -2793 -3906
-28629c906O438M83k405n067j990M48q48k105M608J20j18K306j831L405O964l461
$$ -3906 2532 3015 610 -4457 -6447 -5999 -6847 -8952 -4344 -4224 -4342 -2036 -3867 -462 6502 3041
-27652C041l296n584L508j501n129L810P903m518n14j841J166l042p33K996O741
$$ 3041 -255 -5839 -2331 -3832 -8961 -5151 2752 -1766 -2280 -4121 -2955 -5997 -6730 -3734 3007
-26736C007k682l44O832j558l704k950J240O393j166m343l688L639k036k90N330
$$ 3007 325 -19 6813 5255 1551 -1399 -159 6234 5068 725 -2963 676 -1360 -1650 3680
-25821C680l384l740n62o25m428R91L950k65K955N513o300n911J666l167J891
$$ 3680 296 -3444 -4006 -4631 -9059 -8068 -4118 -4383 -1428 4085 -2215 -8126 -6460 -9627 -7736
-24905g736Q172m032l776J293j40p85L469k230p417K853J887J155M689k836k11
$$ -7736 436 -3596 -7372 -6079 -6219 -7004 -3535 -5765 -13182 -10329 -8442 -7287 -2598 -5434 -5645
-23989e645p95L614N371J079n378n09o33k492l76K565m182K982N911l913p928
$$ -5645 -6440 -2826 2545 3624 -1754 -2263 -2896 -5388 -5764 -3199 -7381 -4399 1512 -2401 -10329
-23074a0329j451K786O601j568J119r59o245J19R97n244R383L891j649j993L55
$$ -10329 -11780 -8994 -2393 -3961 -2842 -3801 -10046 -9927 -8930 -14174 -4791 -900 -2549 -4542 -4187
-22158d187N73m239L624j029j606j784N97M464N409J489O84n42j274o387k135
$$ -4187 -3614 -7853 -4229 -5258 -6864 -8648 -8051 -3587 1822 3311 3995 3453 2179 -4208 -6343
-21243f343M289l025l85l97j700J1360l356l787N339j253L330O32k765l612P61
$$ -6343 -2054 -5079 -5464 -5861 -7561 3799 443 -3344 1995 742 4072 4704 1939 -1673 -912
-20327i12L126j09J852J139l806n980M314l96J119m00M592K447m612l801n19k937
$$ -912 2214 2105 3957 5096 1290 -4690 -376 -772 347 -53 4539 6986 2374 -1427 -1946 -4883
-19351d883n69k346o121J618R480k231L585M399m389m208k347p7q64J566L639
$$ -4883 -5452 -7798 -13919 -12301 -2821 -5052 -1467 2932 -1457 -5665 -8012 -8089 -8953 -7387 -3748
-18435c748J721l064J860k048k594q406k929L995R312O290K220k945o209O6k724
$$ -3748 -2027 -5091 -3231 -5279 -7873 -16279 -19208 -15213 -5901 389 2609 -336 -6545 -6479 -9203
-17520i203J902O497L395j857p808K283M32l095P328n12k257N362J709m038k505
$$ -9203 -7301 -804 2591 734 -7074 -4791 -4359 -7454 -126 -638 -2895 2467 4176 138 -2367
-16604b367J800j660m684J862K038J108N454K784m117l950j282J146K693K446
$$ -2367 -567 -2227 -6911 -5049 -3011 -1903 3551 6335 2218 -1732 -3014 -1868 825 3271
-15749C271M302n437n621M073N611j742l377q89p867K651J683j693J183j637l036
$$ 3271 7573 2136 -3485 588 6199 4457 1080 191 -7676 -5025 -3342 -5035 -3852 -5489 -8525
-14834h525j055O191N785K20K68J579O73k114K140k20q640k080K414M085M295
$$ -8525 -9580 -3389 2396 2616 2884 4463 5136 3022 5162 4942 -3698 -5778 -3364 721 5016
-13918E016K86k803K780l760L72K233m452q491j731M504o75M321P027p378n5K028
$$ 5016 5302 2499 5279 1519 1891 4124 -328 -8819 -10550 -6046 -6721 -2400 4627 -2751 -2806 -778
-12941g78n2k110N134k80n630l5K729k308p84j382M059k578l928o75P029O602
$$ -778 -830 -2940 2194 1914 -3716 -3751 -1022 -3330 -4114 -5496 -1437 -4015 -7943 -8618 -1589 5013
-11965E013J800n637p16M087j261m969n201K94P746O81m540l157K414k140k072
$$ 5013 6813 1176 460 4547 3286 -1683 -6884 -6590 1156 1837 -2703 -5860 -3446 -5586 -7658
-11049g658P291N211J443j167k530Q37l397n562l197O308l287n827K833j318L563
$$ -7658 -367 4844 6287 5120 2590 3427 30 -5532 -8729 -2421 -5708 -11535 -8702 -10020 -6457
-10134f457m0J786M547L139K550l795l89p45k276j838l111l244O858K928m897
$$ -6457 -6497 -4711 -164 2975 5525 1730 1341 596 -1680 -3518 -6629 -9873 -3015 -87 -4984
-9218d984k603K185J870m49K139R48J871K771R581j671r928k659Q97K358Q521
$$ -4984 -7587 -5402 -3532 -3981 -1842 -894 977 3748 13329 11658 1730 -929 -32 2326 10847
-8303A0847k497o253n845P345P844L71j546p075m22m084m364J943J663o613L225
$$ 10847 8350 2097 -3748 3597 11441 11812 10266 3191 2769 -1315 -5679 -3736 -2073 -8686 -5461
-7387e461m212L694P675K093L583O705j0667m364m722O666J1442o964p260n240
$$ -5461 -9673 -5979 1696 3789 7372 14077 3410 -954 -5676 990 12432 5468 -1792 -7032
-6533g032J728P81k756M098j047k158K135k98m097K625M080p38m535l494K790
$$ -7032 -5304 -4523 -7279 -3181 -4228 -6386 -4251 -4549 -8646 -6021 -1941 -2679 -7214 -10708 -7918
-5617g918N98L619J411m205n3K221N686J160K70o577n217k945M661O653M451
$$ -7918 -7320 -3701 -2290 -6495 -6548 -4327 1359 2519 2789 -3788 -9005 -11950 -7289 -636 3815
-4701C815j203m368k676L30K736L583l284r25L957Q6n518L097N349j020j917
$$ 3815 2612 -1756 -4432 -4102 -1366 2217 -1067 -1992 1965 2051 -3467 -370 4979 3959 2042
-3786B042L322k576J626l15k987m266n16O098k002n728r62p6M311L385l716L062
$$ 2042 5364 2788 4414 4099 1112 -3154 -3670 2428 426 -5302 -6264 -6340 -2029 1356 -2360 702
-2809G02O961n591n454j761M362m03L246j567q76j316J254J047l281K169O059
$$ 702 7663 2072 -3382 -5143 -781 -1184 2062 495 -381 -1697 -443 604 -2677 -508 5551
-1894E551q253j462k81J532k470L355q27J012L918L489o623o235L633O588K374
$$ 5551 -2702 -4164 -4445 -2913 -5383 -2028 -2855 -1843 2075 5564 -1059 -7294 -3661 2927 5301
-978E301j137L761J608l033q484j148L509j802N433l249K892k728L137j498
$$ 5301 4164 7925 9533 6500 -1984 -3132 377 -1425 4008 759 3651 923 4060 2562
-124B562l531L340K07p485J323K264N292l980o043L78N389P751p473p129K322
$$ 2562 -969 2371 2578 -4907 -3584 -1320 3972 -8 -6051 -5673 -284 7467 -6 -7135 -4813
792d813k128L124R369Q138l402k654j972l551J316m307P76m360J905O486n661
$$ -4813 -6941 -3817 5552 13690 10288 7634 5662 2111 3427 -880 -104 -4464 -2559 3927 -1734
1708a734k024L005Q58K875M775k0o280O051J61n704j726n367L534L377p599
$$ -1734 -3758 -753 105 2980 7755 7735 1455 7506 7667 1963 237 -5130 -1596 1781 -5818
2623e818L450J206J290o821O399M354J341Q56n682l771J378K933o028n640N642
$$ -5818 -2368 -1162 128 -6693 -294 4060 5401 6257 575 -3196 -1818 1115 -4913 -10553 -4911
3539d911L886N675N940j4549o08O196k840q397j520N179j035K561K092J005
$$ -4911 -1025 4650 10590 -3959 -4567 1629 -1211 -9608 -11128 -5949 -6984 -4423 -2331 -1326
4393a326Q37n484j315P676L893l279l821K642K148j929j884K93k885M323N477
$$ -1326 -489 -5973 -7288 388 4281 1002 -2819 -177 1971 42 -1842 -1549 -4434 -111 5366
5309E366j666l967L256l735J565Q005O96q292j0791L066J851j125J207K477
$$ 5366 3700 -267 2989 -746 819 8824 9520 1228 -9563 -6497 -4646 -5771 -4564 -2087
6164b087m070K141l108J58k734M503L460M398M198n057j347R352k467m774o431
$$ -2087 -6157 -4016 -7124 -6966 -9700 -5197 -1737 2661 6859 1802 455 9807 7340 2566 -3865
7079c865m300J217Q8r50J681J989r64J070M180P19m630p11J384L729l449M33
$$ -3865 -8165 -6948 -6860 -7810 -6129 -4140 -5104 -4034 146 865 -3765 -4476 -3092 637 -2812 -2379
8056b379P612p816J155K873rM230k310l539k53j382M809M332K412j044Q01M20
$$ -2379 5233 -2583 -1428 1445 1436 5666 3356 -183 -436 -1818 2991 7323 9735 8691 9492 9912
9032I912l387q403O17l643K035J600r20k689M406P639j507N67R35j520m09j61
$$ 9912 6525 -1878 -1261 -4904 -2869 -1269 -2189 -4878 -472 7167 5660 6227 7162 5642 5233 5072
10009E072L195o506l472n862J474M264M66M418L719n486l159M951L249k06q985
$$ 5072 8267 1761 -1711 -7573 -6099 -1835 -1369 3049 6768 1282 -1877 3074 6323 6117 -2868
10925b868j066M812J888n65m446l404Q076Q01J098M834Q20q042p956j454L931
$$ -2868 -3934 878 2766 2201 -2245 -5649 2427 3228 4326 9160 9980 1938 -6018 -7472 -3541
11840c541P246k692R28J587M700o362n576L848K186n910L82L915L927J0125j455
$$ -3541 3705 1013 1941 3528 8228 1866 -3710 138 2324 -3586 -3204 711 4638 14763 13308
12756A3308k648p894k086L379m916K918N70p575r430K662R940J853K903J664
$$ 13308 10660 2766 680 4059 -857 2061 2631 -4944 -14374 -11712 -1772 81 2984 4648
13610D648k950j127l442K681L015k622J772j079J159K855K77j404o493l175J670
$$ 4648 1698 571 -2871 -190 2825 203 1975 896 2055 4910 5187 3783 -2710 -5885 -4215
14526d215m033o56P331R09j171L528J032k365k529J624L683L583p595n671k657
$$ -4215 -8248 -8904 -1573 -664 -1835 1693 2725 360 -2169 -545 3138 6721 -874 -6545 -9202
15441i202l811j305N216K273J204P782j663k689q702r25J653N187J919M08P690
$$ -9202 -13013 -14318 -9102 -6829 -5625 2157 494 -2195 -10897 -11822 -10169 -4982 -3063 -2655 5035
16357E035k913l30k546q987L325J141N366k902m00J497K590k351q21J198O867
$$ 5035 2122 1792 -754 -9741 -6416 -5275 91 -2811 -3211 -1714 876 -1475 -2296 -1098 5769
17273E769n483J014J951M096k498M307J256J706l040q546l261j567j920N779
$$ 5769 286 1300 3251 7347 4849 9156 10412 12118 9078 532 -2729 -4296 -6216 -437
18127d37L552L110q630l446N202M079j253o57K512o700o384L165Q724J577k844
$$ -437 3115 6225 -2405 -5851 -649 3430 2177 1520 4032 -2668 -9052 -5887 2837 4414 1570
19043A570N745o673m517m8j084L726J531M008q89m256K297r89m719N27j197l399
$$ 1570 7315 642 -3875 -3923 -5007 -1281 250 4258 3369 -887 1410 421 -4298 -3771 -4968 -8367
20019h367P285M979L621k95l02o592p899r82k57M202J453K552n260J039j76Q09
$$ -8367 -1082 3897 7518 7223 6921 329 -7570 -8552 -8809 -4607 -3154 -602 -5862 -4823 -4999 -4190
20996d190j365O87M830J64L833l075J927N13k104k973p05q66j217M50o96m777
$$ -4190 -5555 -4868 -38 126 3959 884 2811 3324 1220 -1753 -2458 -3324 -4541 -4091 -4787 -9564
21973i564K032l657J187P272M319J419q919O40M114J236K232J904L410K130j2157
$$ -9564 -7532 -11189 -10002 -2730 1589 3008 -5911 -5271 -1157 79 2311 4215 7625 9755 -2402
22888b402j643O862K099L328N13m537L480m306n642k340j520l252m659J75N677
$$ -2402 -4045 2817 4916 8244 8757 4220 7700 3394 -2248 -4588 -6108 -9360 -14019 -13844 -8167
23804h167P842L768m962K637j83k299o577q352M744P937k575L311P801p046k290
$$ -8167 -325 3443 -1519 1118 935 -1364 -7941 -16293 -11549 -3612 -6187 -2876 4925 -2121 -4411
24720d411N872J984l903j487j905K488M46j76j300n987J220J923m788R30L176
$$ -4411 1461 3445 -458 -1945 -3850 -1362 -916 -1092 -2392 -8379 -7159 -5236 -10024 -9094 -5918
25635e918O819O033K462L177n665J237l290k171R060n146n155O61l382j1272
$$ -5918 901 6934 9396 12573 6908 8145 4855 2684 11744 6598 1443 2104 -1278 -12550
26490a2550J691R123P473l50J020j312j030k086k268M723k148m645K325M750
$$ -12550 -10859 -1736 5737 5387 6407 5095 4065 1979 -289 4434 2286 -2359 -34 4716
27344D716m775m474N994K646O00p47L26l255N687L022j744m76J695o834q428
$$ 4716 -59 -4533 1461 4107 4707 3960 4286 1031 6718 9740 7996 7520 9215 2381 -6047
28260f047k087L073L862N517L529k526j227M830j972P69K993J09l697p719k966
$$ -6047 -8134 -5061 -1199 4318 7847 5321 4094 8924 6952 7721 10714 10823 7126 -593 -3559
29175c559P454L026j4j1534J20P275K778k849o69n066O078K267j949N399j955
$$ -3559 3895 6921 6907 -4627 -4507 2768 5546 2697 2028 -3038 3040 5307 3358 8757 6802
30091F802k407m026m50M222O197L22m550l875o294m799M898J538J835m37l685
$$ 6802 4395 369 -81 4141 10338 10660 6110 2235 -4059 -8858 -3960 -2422 -587 -1024 -4709
31006d709J984N393k685m618L190K165j220N427K644n21k524P3l859o2K854K197
$$ -4709 -2725 2668 -17 -4635 -1445 720 -500 4927 7571 7050 4526 4599 740 678 3532 5729
31983E729K235l093k271j63L351j514J82O07J512K370K373n268k404j118Q38
$$ 5729 7964 4871 2600 2437 5788 4274 4456 5063 6575 8945 11318 6050 3646 2528 3366
32899C366K97J796j286r614M143O856l40q882m161L966K152j994l615k288K786
$$ 3366 3663 5459 4173 -5441 -1298 5558 5218 -3664 -7825 -3859 -1707 -3701 -7316 -9604 -6818
33814f818Q218N435o901p166j021N938M639N120m878j241P075L69J229p543m78
$$ -6818 1400 6835 -66 -7232 -8253 -2315 2324 7444 2566 1325 8400 8769 9998 2455 1977
34730A977n181n417L085L041j882j570N016J429K2l43k513J027K072M928J715
$$ 1977 -3204 -8621 -5536 -2495 -4377 -5947 -931 498 520 177 -2336 -1309 763 5691 7406
35645G406k936n713j117O473n20p122k120L166M751Q91J480l297j0603r16N641
$$ 7406 4470 -1243 -2360 4113 3593 -3529 -5649 -2483 2268 3159 4639 1342 -9261 -10177 -4536
36561d536k275K679L011K427j45m781n088j717K596M687O252l60m097P328p96
$$ -4536 -6811 -4132 -1121 1306 1161 -3620 -8708 -10425 -7829 -3142 3110 2750 -1347 5981 5185
37477E185OK309o346o42N944n644m373N912R13l933J305l926R44J905k076M781
$$ 5185 5191 7500 1154 512 6456 812 -3561 2351 3264 -669 636 -3290 -2346 -441 -2517 2264
38453B264M888P608k800o555r830j532N455L266N59q99j855k701L637Q993k963
$$ 2264 7152 14760 11960 5405 -4425 -5957 -502 2764 3323 2424 569 -2132 1505 10498 7535
39369G535m574l887j0515j628Q859Q014j371l873q5L518j827K631q345l244P123
$$ 7535 2961 -926 -11441 -13069 -4210 3804 2433 -1440 -1525 1993 166 2797 -5548 -8792 -1669
40284a669P405J575j887J782k247k982R04Mj38j261O227L649p117R17j762j493
$$ -1669 5736 7311 5424 7206 4959 1977 2881 2885 2747 1486 7713 11362 4245 5162 3400 1907
41261A907M605o04l937o748k126N061O717M870o777k885NM66j267L250j395m26
$$ 1907 6512 5908 1971 -4777 -6903 -1842 4875 9745 2968 83 88 554 -713 2537 1142 716
42238G16K366k390R24k699k552l729K792J775m466P14O741k19L91N534m928n060
$$ 716 3082 692 1616 -1083 -3635 -7364 -4572 -2797 -7263 -6549 192 -27 364 5898 970 -4090
43214d090K466O45P291n592M166L393K79n789j423L74M034N669n935q90N616
$$ -4090 -1624 -979 6312 720 4886 8279 8558 2769 1346 1720 5754 11423 5488 4598 10214
44130A0214K270k653K046j785o571k559k390M47N532Q560R60l955q48J597M186
$$ 10214 12484 9831 11877 10092 3521 962 -1428 -981 4551 13111 14071 10116 9268 10865 15051
45046A5051l605n206Q15L339n91J105n913l246K194M498J036n763k657J162P77
$$ 15051 11446 6240 7055 10394 9803 10908 4995 1749 3943 8441 9477 3714 1057 2219 2996
45961B996O97O29M326j551m123n194M953L53l58k161J275j433L126P597P324
$$ 2996 3693 4322 8648 7097 2974 -2220 2733 3086 2728 567 1842 409 3535 11132 18456
46877A8456j647n041K642n700r47O019m75j163l247J59m671J845k414K448p372
$$ 18456 16809 11768 14410 8710 7763 13782 13307 12144 8897 9056 4385 6230 3816 6264 -1108
47792a108k934J944O091M082K131O50j429L154J51m406j795j631J059K267o891
$$ -1108 -4042 -2098 3993 8075 10206 10856 9427 12581 12732 8326 6531 4900 5959 8226 1335
48708A335N791J319n734j096M992K634l149j306l932P682J4j641k58N78M44n239
$$ 1335 7126 8445 2711 1615 6607 9241 6092 4786 854 8536 8550 6909 6651 7229 7673 2434
49684B434j131J071k34n867k785L458N781L944j929n391Q961R30J665M470L311
$$ 2434 1303 2374 2140 -3727 -6512 -3054 2727 6671 4742 -649 8312 9242 10907 15377 18688
50600A8688l078K182L537M354O084j649l47q176k826L552M451N263J809L142
$$ 18688 15610 17792 21329 25683 31767 30118 29771 21595 18769 22321 26772 32035 33844 36986
51455C6986O380J0860J3467K4657N6174J53103M22646N6185l14893j42761r5039
$$ 36986 43366 54226 67693 92350 148524 301627 724273 780458 465565 322804 227765
52126B27765p5373m2969k9246l0670k1328n343r449q591m557J273l821J576p494
$$ 227765 152392 109423 80177 49507 28179 22836 13387 4796 239 1512 -2309 -733 -8227
52919h227J207p92m698J897M400K034L018p94J063l802l775K766K479O298j365
$$ -8227 -7020 -7812 -12510 -10613 -6213 -4179 -1161 -1955 -892 -4694 -8469 -5703 -3224 3074 1709
53835A709L501O562r94r58k219k201n69N089l860q278k289j249K143J458R89
$$ 1709 5210 11772 10778 9820 7601 5400 4831 9920 6060 -2218 -4507 -5756 -3613 -2155 -1166
54750a166r20N165o90L749L891Q16l495L364l040q866J688n151O926J077j892
$$ -1166 -2086 3079 2389 6138 10029 10845 7350 10714 7674 -1192 496 -4655 2271 3348 1456
55666A456J940o265L76J575L527Q64k410n213j711L359J66k151m47R079L955
$$ 1456 3396 -2869 -2493 -918 2609 3473 1063 -4150 -5861 -2502 -2336 -4487 -4934 4145 8100
56582H100o796k794L41J710J989O329r10k359l419n616r13L647p94n282K946
$$ 8100 1304 -1490 -1149 561 2550 8879 7969 5610 2191 -3425 -4338 -691 -1485 -6767 -3821
57497c821j002J643L936l040m267P783O151K163o372J45l73n677k552l019M5
$$ -3821 -4823 -3180 756 -2284 -6551 1232 7383 9546 3174 3319 2946 -2731 -5283 -8302 -8257
58413h257N885j99N309J17k415k815j500M727N32j184m964K082N7n699k47N54
$$ -8257 -2372 -2571 2738 2855 440 -2375 -3875 852 1384 200 -4764 -2682 -2625 -8324 -8571 -8017
59390h017K895l589L028J914M907J148Q59l218n236k267L690J264k796k161J253
$$ -8017 -5122 -8711 -5683 -3769 1138 2286 3145 -73 -5309 -7576 -3886 -2622 -5418 -7579 -6326
60305f326L80L259O12N76K75n51n412P747K667r192l48L465M861K430j977l317
$$ -6326 -5946 -2687 -2075 -1499 -1224 -1775 -7187 560 3227 -5965 -6313 -2848 2013 4443 2466 -851
61282h51K129R56M468o052m043j306J877N253J519K775Q34m218m934j205K369
$$ -851 1278 2234 6702 650 -3393 -4699 -2822 2431 3950 6725 7559 3341 -1593 -2798 -429
62197d29N70l82p342n0J137R61j528K527j924n301K712Q811K03k614j833K766
$$ -429 141 -241 -7583 -7633 -6496 -5535 -7063 -4536 -6460 -11761 -9049 -238 -35 -2649 -4482 -1716
63174a716M842J652j0596r34n85L302J605l445J351j242l025J576O916J269j538
$$ -1716 3126 4778 -5818 -6752 -7337 -4035 -2430 -5875 -4524 -5766 -8791 -7215 -299 970 -568
64089e68k038k921M42l84J379N437K781j1822p2K163P359M588k15l004m141j335
$$ -568 -2606 -5527 -5085 -5469 -4090 1347 4128 -7694 -7766 -5603 1756 6344 6129 3125 -1016 -2351
65066b351J314K469K983n166n555J815N881p88L18L87n217j079K49P394J754
$$ -2351 -1037 1432 4415 -751 -6306 -4491 1390 602 920 1307 -3910 -4989 -4740 2654 4408
65982D408r02J538l889J745K032j88l517j137L61m30n198M104N730r68K968k817
$$ 4408 3506 5044 1155 2900 4932 4744 1227 90 451 21 -5177 -1073 4657 3689 6657 3840
66958C840J307n005k43J125k925Q89M13K839j393j083j118l193J134L860O891
$$ 3840 5147 142 -101 1024 -1901 -1012 -599 2240 847 -236 -1354 -4547 -3413 447 7338
67874G338k178m190P484k924M74j82p557j794O391k35j860j496M029J779k942
$$ 7338 5160 970 8454 5530 6004 5822 -1735 -3529 2862 2627 767 -729 3300 5079 2137
68789B137j898l250j462M637j871O101L418P39l03k366l590K376Q30j982n187
$$ 2137 239 -3011 -4473 164 -1707 4394 7812 8551 8248 5882 2292 4668 5498 3516 -1671
69705a671n053L72L376M622k404R87K767L82J849j677J119n721l556L911M425
$$ -1671 -6724 -6352 -2976 1646 -758 229 2996 3378 5227 3550 4669 -1052 -4608 -697 3728
70621C728r05J732J794J248J963m937j253K841m898k701k097K894K600l084M710
$$ 3728 2823 4555 6349 7597 9560 4623 3370 6211 1313 -1388 -3485 -591 2009 -1075 3635
71536C635M279L651l896j206m62o082J676N755L629l149o80j818P618K788r561
$$ 3635 7914 11565 7669 6463 6001 -81 1595 7350 10979 7830 7150 5332 12950 15738 6177
72452F177l81J583m988o97L907p270j054M694M244K575L00o006m467M518N087
$$ 6177 5796 7379 2391 1694 5601 -1669 -2723 1971 6215 8790 9090 3084 -1383 3135 8222
73367H222p88p878k846J178N707J723p851k319Q049j842o16o228L256K552M650
$$ 8222 7434 -444 -3290 -2112 3595 5318 -2533 -4852 3197 1355 739 -5489 -2233 319 4969
74283D969k905m19k063j529K030K82m213L763m89J82L218m022j780N439j58j055
$$ 4969 2064 1645 -418 -1947 83 365 -3848 -85 -574 -392 2826 -1196 -2976 2463 2305 1250
75260A250P843o193r317P59P233j71J386j321p655j457J611P546k814L63j357
$$ 1250 9093 2900 -6417 -5658 1575 1404 2790 1469 -6186 -7643 -6032 1514 -1300 -937 -2294
76175b294O530L337o149L48O143l031k480K295k429k899q41n42l863J968j929
$$ -2294 4236 7573 1424 1772 7915 4884 2404 4699 2270 -629 -1470 -2012 -5875 -3907 -5836
77091e836P227l864M283L212r52O68n498K339L795m176J547R04l43P404m480
$$ -5836 1391 -2473 1810 5022 4070 4738 -760 1579 5374 1198 2745 3649 3306 10710 6230
78006F230p144J188M84J790M333p704J421q24J13j113p8p67K963M696L851k249
$$ 6230 -914 274 758 2548 6881 -823 598 -226 -113 -1226 -1304 -2071 892 5588 9439 7190
78983G190m579L861m77n453K360R474o891j775L295k040n678M71K185j77L045
$$ 7190 2611 6472 5995 542 2902 12376 5485 3710 7005 4965 -713 -242 1943 1766 4811
79898D811p717l625k643r42O348p70l8M914o88k291P355N632j605k526k574J410
$$ 4811 -2906 -6531 -9174 -10116 -3768 -4538 -4576 338 -350 -2641 4714 10346 8741 6215 3641 5051
80875E051K304j595n955J217o88m924P561L755m573k210K289N134l68q09j081
$$ 5051 7355 5760 -195 1022 334 -4590 2971 6726 2153 -57 2232 7366 6998 6189 5108
81791E108K400j068O510j666k601K08n9j935l235J345k406J530L8J0048M739
$$ 5108 7508 6440 12950 11284 8683 8891 8832 6897 3662 5007 2601 4131 4169 14217 18956
82707A8956J912K249L662J691j722k501K170J693k633n77m862J407J417K096
$$ 18956 20868 23117 26779 28470 26748 24247 26417 28110 25477 24900 20038 21445 22862 24958
83561B4958J1946J4418L3836P3841K12989M62313k81985k19351j02622p3782
$$ 24958 36904 51322 85158 158999 371988 834301 552316 332965 230343 156561
84171A56561n3792k8070k1644j8767j7679j1145M82M036O28K411m008L84K605
$$ 156561 102769 74699 53055 34288 16609 5464 5946 9982 10610 13021 9013 9397 12002
84965A2002N688o289O014p805o381n401j773L23o756o608L985K619J0354J69
$$ 12002 17690 11401 17415 9610 3229 -2172 -3945 -3622 -10378 -16986 -13001 -10382 -28 141
85819A41j675r01L307K747k411k183m668N17O41r54j367o34Q608L602K288L778
$$ 141 -1534 -2435 872 3619 1208 -975 -5643 -5126 -4485 -5439 -6806 -7440 1168 4770 7058 10836
86796A0836k151l794j462J293J065r1L448j764o951O457J775r551K572L282m613
$$ 10836 8685 4891 3429 4722 5787 5696 9144 7380 429 6886 8661 -890 1682 4964 351
87712C51J083J074j743P82k142R57M358L266m355l315K383l064J23k792L210
$$ 351 1434 2508 765 1547 -595 362 4720 7986 3631 316 2699 -365 -242 -3034 176
88627A76K277q52o448L690J704m526m453j602k156Q664N125l867l53M898L546
$$ 176 2453 1601 -4847 -1157 547 -3979 -8432 -10034 -12190 -3526 1599 -2268 -2621 2277 5823
89543E823k493k511l382j891K022j928K215k568k239m171J141L238Q529m605
$$ 5823 3330 819 -2563 -4454 -2432 -4360 -2145 -4713 -6952 -11123 -9982 -6744 1785 -2820
90397b820o293M931Q186M197p173k641j920N107J974K996o453q797L345J601
$$ -2820 -9113 -4182 4004 8201 1028 -1613 -3533 1574 3548 6544 91 -8706 -5361 -3760
91252c760N812R042j067l5r09o263l425k984J349J0004J852n205l876k038M74
$$ -3760 2052 11094 10027 9992 9083 2820 -605 -3589 -2240 7764 9616 4411 535 -1503 -1029
92167a029J994k675j746O994k233J001J899m146o025L236N411L381P37l006k768
$$ -1029 965 -1710 -3456 3538 1305 2306 4205 59 -5966 -2730 2681 6062 6799 3793 1025
93083A025l852j630J904J655J641l39K109M75m727K787N01o198N235o53J298
$$ 1025 -2827 -4457 -2553 -898 743 404 2513 2988 -1739 1048 1549 -4649 586 -67 1231
93999A231k768P543j639j820m465J510J175J188k913M584l720p480N627L542
$$ 1231 -1537 6006 4367 2547 -1918 -408 767 1955 -958 3626 -94 -7574 -1947 1595
94853A595L760N427k150m701o504N085M184k761L903j72l07j974P07l910k312
$$ 1595 5355 10782 8632 3931 -2573 2512 6696 3935 7838 7666 7359 5385 6092 2182 -130
95769a30j2m376Q47N159J04J739l199o284j945N162N852J1420K645n636J883
$$ -130 -142 -4518 -3671 1488 1592 3331 132 -6152 -8097 -2935 2917 14337 16982 11346 13229
96684A3229j60N599N463k187n14m517j0098J325K677q8L494Q715O782J1450J8537
$$ 13229 13069 18668 24131 21944 21430 16913 6815 8140 10817 10729 14223 22938 29720 41170 59707
97600E9707L6281P9715K55946N49143l59839k50983j25019p3529m2257l4312
$$ 59707 95988 175703 431649 980792 620953 369970 244951 171422 129165 94853
98210I4853l1349k3668j3011j2509J013j908j350K50K084n098l448j156n757
$$ 94853 63504 39836 26825 14316 15329 13421 12071 12321 14405 9307 5859 4703 -1054
99004a054j509N115O976P89l711p9J774p626q70l068l2O354M266p202j521K349
$$ -1054 -2563 2552 9528 10317 6606 6527 8301 675 -195 -3263 -3295 3059 7325 123 -1398 951
99980I51k102j346J430l875j540p22N281K137r12P54k193J855Q44R23M862J28
$$ 951 -1151 -2497 -1067 -4942 -6482 -7204 -1923 214 -698 56 -2137 -282 562 1485 6347 6475
100957F475k63N107o251k254L49k149L967K964N641k664r190l021k339j398J809
$$ 6475 6212 11319 5068 2814 3163 1014 4981 7945 13586 10922 1732 -1289 -3628 -5026 -3217
101872c217q19j083K933J68P790J891k942k083l914J966m786m656p489Q984Q072
$$ -3217 -4036 -5119 -2186 -2018 5772 7663 4721 2638 -1276 690 -4096 -8752 -16241 -7257 815
102788H15P60l263l411k326L965K923J230K967p09j522K629m9j883j025j91p943
$$ 815 1575 -1688 -5099 -7425 -3460 -537 693 3660 2951 1429 4058 4009 2126 1101 910 -7033
103765g033j150K562L453J99n29m35j196M951L765L85j385o552n15Q89N594m230
$$ -7033 -8183 -5621 -2168 -1969 -2498 -2933 -4129 822 4587 4972 3587 -2965 -3480 -2591 3003 -1227
104742a227n237K545m080J567L830L752J900K90n1K256j720o992j292j616k558
$$ -1227 -6464 -3919 -7999 -6432 -2602 1150 3050 3340 3289 5545 3825 -3167 -4459 -6075 -8633
105657h633m295O376J0130K813Rl568k912K490p82M103k730m816q639J007k58
$$ -8633 -12928 -6552 3578 6391 6400 2832 -80 2410 1628 5731 3001 -1815 -10454 -9447 -9705
106573i705L708l48L93L647K80L291J046J274k364j320k651j647m505k011Q849
$$ -9705 -5997 -6345 -5952 -2305 -2025 1266 2312 3586 1222 -98 -2749 -4396 -8901 -10912 -2063
107488b063l544K400n85n907K112N647Q563q33m382n630L228K298o362O89M359
$$ -2063 -5607 -3207 -3792 -9699 -7587 -1940 6623 5790 1408 -4222 -994 1304 -5058 -4369 -10
108404a0j343l5J875m519K3k348N821P087K315l141l950K066O68k915J141o90
$$ -10 -1353 -1388 487 -4032 -4009 -6357 -536 6551 8866 5725 1775 3841 4509 1594 2735 2045
109380B045K31k898k179L415J959l90n436J69M597R52j468m728J82N84M602k497
$$ 2045 2276 -622 -2801 614 2573 2183 -3253 -3084 1513 2465 997 -3731 -3549 -2965 1637 -860
110357h60O570o961l059L899L460r53j466N6L25j735L719M889K787J534Q02O77
$$ -860 5710 -1251 -4310 -411 3049 2096 630 686 1011 -724 2995 7884 10671 12205 13007 13684
111334A3684k889M386l522J584j294j451L693O729O141Q418K1300L3595R1399
$$ 13684 10795 15181 11659 13243 11949 10498 14191 20920 27061 35479 56779 90374 181773
112127A81773K52165n9615j40005o3113m0652k7504k2820k1251k6672j2883m824
$$ 181773 433938 374323 234318 171205 130553 103049 80229 58978 32306 19423 14599
112798A4599q246k547M571m630M81m559L836k181r97Q68n509R05o868m727N875
$$ 14599 6353 3806 8377 3747 4228 -331 3505 1324 327 1195 -4314 -3409 -10277 -15004 -9129
113714i129R362k935p94p56R88j717L01k329Q27P320m443L155K531L052j899L24
$$ -9129 233 -2702 -3496 -4252 -3264 -4981 -4680 -7009 -6182 1138 -3305 -150 2381 5433 3534 3858
114691C858J056j323R630m680r546l790q16p78L600M611K006l767M903j620j862
$$ 3858 4914 3591 13221 8541 -1005 -4795 -5611 -6389 -2789 1822 3828 61 4964 3344 1482
115607A482O355j132o629k237O216k771l105N696K544k342K838k350L510m424
$$ 1482 7837 6705 76 -2161 4055 1284 -1821 3875 6419 4077 6915 4565 8075 3651
116461C651j1327m900k307P223P712M273J298o894l201n4J827L590o75J475N467
$$ 3651 -7676 -12576 -14883 -7660 52 4325 5623 -1271 -4472 -4526 -2699 891 216 1691 7158
117377G158j173J866n349l3L015M3o545k216K792N582M952p866o678P698J275
$$ 7158 5985 7851 2502 2469 5484 5527 -1018 -3234 -442 5140 10092 2226 -4452 3246 4521
118292D521j333J802m703N331L195j0972K916j86l4L611k114L500M212j747m193
$$ 4521 3188 4990 287 5618 8813 -2159 757 571 537 4148 2034 5534 9746 7999 3806
119208C806J628k826J551j783K136L04m786p920p688J333Q309K056K514O95J213
$$ 3806 5434 2608 4159 2376 4512 4816 30 -7890 -15578 -14245 -5936 -3880 -1366 -671 542
120123E42l448M814M099k593q723J942l318m273K729M456J832m020n764L381M862
$$ 542 -2906 1908 6007 3414 -5309 -3367 -6685 -10958 -8229 -3773 -1941 -5961 -11725 -8344 -3482
121039c482Q072K961k19j439m359r486J387N073J617M034n606j025J983n419M548
$$ -3482 4590 7551 7332 5893 1534 -7952 -6565 -1492 125 4159 -1447 -2472 -489 -5908 -1360
121954a360K030M047j052K72j094m025m432j675M924l060p3l078M1J078k58p52
$$ -1360 670 4717 3665 3937 2843 -1182 -5614 -7289 -2365 -5425 -5498 -8576 -8535 -7457 -7715 -8467
122931h467L542J518l31J061J656K296j635j262K276k242p931M620M954J402K726
$$ -8467 -4925 -3407 -3738 -2677 -1021 1275 -360 -1622 654 -1588 -9519 -4899 55 1457 4183
123846D183l119J009K063q79q739n493K29N382O834N189m483m608J114k541M171
$$ 4183 1064 2073 4136 3257 -5482 -10975 -10746 -5364 1470 6659 2176 -2432 -1318 -3859 312
124762C12K752L296o468n623j570J751R00M157M150O137q748q654J509M800j339
$$ 312 3064 6360 -108 -5731 -7301 -5550 -4650 -493 3657 9794 1046 -7608 -6099 -1299 -2638
125678b638R071l246n627n593R24O339O89m264M248L561O97o147o12O625k08l482
$$ -2638 6433 3187 -2440 -8033 -7109 -770 -81 -4345 -97 3464 4161 -1986 -2598 4027 3819 337
126654C37R55K666J628K280l380q522k895l139Q264r88m133M622q77l403R8M227
$$ 337 1292 3958 5586 7866 4486 -4036 -6931 -10070 -1806 -2794 -6927 -2305 -3182 -6585 -6487 -2260
127631b260M625Q85k265M470K010K899M02j700p372m894k081j382j749N431Q11
$$ -2260 2365 3250 985 5455 7465 10364 10766 9066 1694 -3200 -5281 -6663 -8412 -2981 -2170
128546b170n460L944J954o09q29K056L826l293r695P44K69j360L654N068K636
$$ -2170 -7630 -3686 -1732 -2341 -3170 -1114 2712 -581 -10276 -9532 -9263 -10623 -6969 -1901 735
129462G35l032M245K135j178Q656n369q614M056M04j128R40p23m963n01M798M255
$$ 735 -2297 1948 4083 2905 11561 6192 -2422 1634 2038 910 1850 1127 -3836 -4337 461 4716
130439D716J263q61J288q816k907J239M321O66J0671J795m170j369o200n36L60
$$ 4716 5979 5118 6406 -2410 -5317 -4078 243 909 11580 13375 9205 7836 1636 1100 1460
131355A460j643m042k777j64o217j189J726Q369M182l669K531J953J83m664L397
$$ 1460 -183 -4225 -7002 -7166 -13383 -14572 -12846 -4477 -295 -3964 -1433 520 703 -3961 -564
132270e64M624j3215K388K941O037K988K082n118j0645p17R071k506k332J430
$$ -564 4060 -9155 -6767 -3826 2211 5199 7281 2163 -8482 -9199 -128 -2634 -4966 -3536
133125c536J556l567j434J831L771j651P873m18J362k823K857j562J882l80q913
$$ -3536 -1980 -5547 -6981 -5150 -1379 -3030 4843 4425 5787 2964 5821 4259 6141 5761 -3152
134040c152N78l532p659M242N630k047K009j118J195L895M950K59m893m999k384
$$ -3152 -2574 -6106 -13765 -9523 -3893 -5940 -3931 -5049 -3854 41 4991 5250 357 -4642 -7026
134956g026l577N866L200m057n512k023J276J788O038N623j039j953L285N586
$$ -7026 -10603 -4737 -1537 -5594 -11106 -13129 -11853 -10065 -4027 1596 557 -1396 1889 7475
135810G475L027n014k473j011l307m2j662k103J982M338j312m713M273K208K201
$$ 7475 10502 5488 3015 2004 -1303 -1345 -3007 -5110 -3128 1210 -102 -4815 -542 1666 3867
136726C867j85L352l529n89n824N034J935l607q061p56K430N414R362l128l867
$$ 3867 3682 7034 3505 2916 -2908 2126 4061 454 -7607 -8363 -5933 -519 8843 5715 1848
137641A848J020m058q39k942J927L727K008K720o533N150j973m442l466J757L915
$$ 1848 2868 -1190 -2029 -4971 -3044 683 2691 5411 -1122 4028 2055 -2387 -5853 -4096 -181
138557a81j032J0138p66l987j137j758o311J511Q53j227j988N512J78j3658P78
$$ -181 -1213 8925 8159 4172 3035 1277 -5034 -3523 -2670 -3897 -5885 -373 -195 -13853 -13075
139472a3075O188N914l133l23K299K593k848K56L39J186K155q837k052M387J314
$$ -13075 -6887 -973 -4106 -4429 -2130 463 -2385 -2129 -1790 -604 1551 -7286 -9338 -4951 -3637
140388c637J120N312k723m592m355l531M556J0279K060j226o11n608l302P975
$$ -3637 -2517 2795 72 -4520 -8875 -12406 -7850 2429 4489 3263 2652 -2956 -6258 1717
141243A717N511k441l062j190j925M104l62J501j278o409M031N360k305o642j153
$$ 1717 7228 4787 1725 535 -1390 2714 2352 3853 2575 -3834 197 5557 3252 -3390 -4543
142158d543O187M195m197q25l603N518l642O307M611O789n917q157J741l894k136
$$ -4543 1644 5839 1642 817 -2786 2732 -910 5397 10008 16797 10880 2723 4464 570 -1566
143074a566l056K416J272J95P47P211k358n883J411M565k01m352O70O766J11o204
$$ -1566 -4622 -2206 -934 -739 8 7219 4861 -1022 389 4954 4753 401 1071 7837 7948 1744
144050A744m475J422q11J804j122N464L278q10j267j194n732n275N617j760p15
$$ 1744 -2731 -1309 -2120 -316 -1438 4026 7304 6494 5227 4033 -1699 -6974 -1357 -3117 -3832
144966c832r38n925o236N03J0117R404l256O416M63q378L072M739J347l791n36
$$ -3832 -4770 -10695 -16931 -16428 -6311 3093 -163 6253 6716 -1662 1410 6149 7496 3705 3169
145882C169k474l723m539O815M851o262L284j870n989J828n787O45P66l522R504
$$ 3169 695 -3028 -7567 -752 4099 -2163 1121 -749 -6738 -4910 -10697 -10052 -9286 -12808 -3304
146797c304M351m462k870K798L114q04J546k011P88k584k852J487L525L65L577
$$ -3304 1047 -3415 -6285 -3487 -373 -1177 369 -1642 -854 -3438 -6290 -4803 -1278 -913 2664
147713B664K435o200j396J280K574K977M150m179l92n239m550K127L243J608n971
$$ 2664 5099 -1101 -2497 -1217 1357 4334 8484 4305 3913 -1326 -5876 -3749 -506 1102 -4869
148628d869L105K69l928L352M837N003l610k330N912L195r002L869J529r063j553
$$ -4869 -1764 -1495 -5423 -2071 2766 7769 4159 1829 7741 10936 1934 5803 7332 -1731 -3284
149544c284J694l564N287K809k555L354K246j610K509m917k162j264p13J611k821
$$ -3284 -1590 -5154 133 2942 387 3741 5987 4377 6886 1969 -193 -1457 -2170 -559 -3380
150459c380j838L702L431R13k096J445O84l041N236j526N74k619k155K203K229
$$ -3380 -5218 -1516 1915 2828 732 2177 2861 -180 5056 3530 4104 1485 -670 1533 3762
151375C762K273O394J62q394q852O193Q717q540M85K535J351k170K746m324l412
$$ 3762 6035 12429 12591 4197 -4655 1538 10255 1715 2200 4735 6086 3916 6662 2338 -1074
152291a074N517j114p371O414lm88L461O834l367n616m894n035M713M657q921
$$ -1074 4443 3329 -4042 2372 2369 1881 5342 12176 8809 3193 -1701 -6736 -2023 2634 -6287
153206f287O04R31M861k372k370j894P086L524o126l218N859L009j172j143l802
$$ -6287 -5683 -4752 109 -2263 -4633 -6527 559 4083 -2043 -5261 598 3607 2435 1292 -2510
154122b510K720J780J843k300O275l243n184K919L620k269K243j202k062j677
$$ -2510 210 1990 3833 1533 7808 4565 -619 2300 5920 3651 5894 4692 2630 953
154976I53k526m050K533K754P190o507j162L89N701k88l077j004j699r20K757
$$ 953 -1573 -5623 -3090 -336 6854 347 -815 -426 5275 4987 1910 906 -793 -1713 1044
155892A044j118o252j347j29j758R781K578o543K769P368K909K298j1401J18O138
$$ 1044 -74 -6326 -7673 -7802 -9560 221 2799 -3744 -975 6393 9302 11600 199 317 6455
156808F455m070k835J401O54J503P109J537m285L259L917m595j096k134m249n935
$$ 6455 2385 -450 951 1605 3108 10217 11754 7469 10728 14645 10050 8954 6820 2571 -3364
157723c364m935K553J4176m16k07M535m985m318l452j1046P998L170q21J427m730
$$ -3364 -8299 -5746 8430 8014 7807 12342 7357 3039 -413 -11459 -3461 -291 -1112 315 -4415
158639d415K736K606K469n503m456N874J2874m023n692m59O256M361n528o183
$$ -4415 -1679 927 3396 -2107 -6563 -689 12185 8162 2470 2011 8267 12628 7100 917
159493I17L501k82R11J038O75R67J802q32K161L39Q9J528o278p922K158k056j456
$$ 917 4418 4136 5047 6085 6760 7727 9529 8697 10858 11197 11286 12814 6536 -1386 772 -1284 -2740
160531b740k317L557l323K133K542L000k817L932K411r80q296N5j747j545M088
$$ -2740 -5057 -1500 -4823 -2690 -148 2852 35 3967 6378 5398 -2898 -2843 -4590 -6135 -2047
161446b047L613O714J540K806l780p834l83k524J85N523N26l041K447L914j714
$$ -2047 1566 8280 9820 12626 8846 1012 629 -1895 -1710 3813 4339 1298 3745 7659 5945
162362E945j68K644o941L502P321n704O329N878K425R53J571J214l151o68m796
$$ 5945 5777 8421 1480 4982 12303 6599 12928 18806 21231 22184 23755 24969 21818 21150 16354
163278A6354O901L375K888M782Q423J6258J8748L7269J12530L27968L61915l76027
$$ 16354 23255 26630 29518 34300 42723 58981 77729 114998 227528 555496 917411 541384
164010E41384j82814j06037p8191m4959l3919l5452k2463j4444j2764m725j345
$$ 541384 358570 252533 174342 129383 95464 60012 37549 23105 10341 5616 4271
164682D271j292R543n099l012K60J268K881j656m059m450j670j188N811L115l298
$$ 4271 2979 12522 7423 4411 4671 5939 8820 7164 3105 -1345 -3015 -4203 1608 4723 1425
165597A425J36k047j419L366l422L064N760K921p895k84M825J61j499m107K400
$$ 1425 1561 -486 -1905 1461 -1961 1103 6863 9784 1889 1605 6430 6591 5092 985 3385
166513C385p11L898N123k111K886p520l618o792n127l04Q02J724N029L59p14j083
$$ 3385 2674 6572 11695 9584 12470 4950 1332 -5460 -10587 -10891 -10089 -8365 -3336 -2977 -3691 -4774
167489d774k700M801k170M7P2k41p08j638J686L459k170J477L304J190M528K791
$$ -4774 -7474 -2673 -4843 -4796 -4724 -4965 -5673 -7311 -5625 -2166 -4336 -2859 445 1635 6163 8954
168466H954M068l576j1409O008L932j238l938j31p85p18m504K714J967n527J303
$$ 8954 13022 9446 -1963 4045 7977 6739 2801 2670 1885 1167 -3337 -623 1344 -4183 -2880
169382b880j911l214K573Q476Q06q24j367p80l695M11K555O603K0K638j066q1
$$ -2880 -4791 -8005 -5432 3044 3850 3026 1659 879 -2816 -2405 150 6753 6773 9411 8345 8264
170358H264k964n623m180j623M056J540J526k650q315K939J915L044O553J794
$$ 8264 5300 -323 -4503 -6126 -2070 -530 996 -1654 -9969 -7030 -5115 -2071 4482 6276
171213F276m700J019l182J101m276j848L865N477N551l95n754k273K043M296n216
$$ 6276 1576 2595 -587 514 -3762 -5610 -1745 3732 9283 8888 3134 861 2904 7200 1984
172128A984k443k483j932N041Q950n124r459J89M00J0878j004j0299n078K431
$$ 1984 -459 -2942 -4874 167 9117 3993 -5466 -5277 -4877 6001 4997 -5302 -10380 -7949
172983g949O010J368M71J429K668m651L07k054J710M279l946K809O111p064l899
$$ -7949 -1939 -571 -100 1329 3997 -654 -347 -2401 -691 3588 -358 2451 8562 1498 -2401
173898b401M814M041q028J624L642J233k586J418R54n255l763K100L281p4m239
$$ -2401 2413 6454 -1574 50 3692 4925 2339 3757 4711 -544 -4307 -2207 1074 1000 -3239
174814c239M382K744J862R69n004N67L264q252p300J940Q905N732l925l556l803
$$ -3239 1143 3887 5749 6718 1714 2281 5545 -2707 -10007 -8067 838 6570 2645 -911 -4714
175730d714Q348k22r20l119l892k44K259K344J133l297N147J290K666l098j634
$$ -4714 3634 3412 2492 -627 -4519 -4763 -2504 -160 973 -2324 2823 4113 6779 3681 2047
176645B047J303K365n938J625j003m76L773K263L235p423j210L467n273k407j794
$$ 2047 3350 5715 -223 1402 399 -77 3696 5959 9194 1771 561 4028 -1245 -3652 -5446
177561e446m164j58M310O677P41k303M102J202n129M528p52n618N753j460n338
$$ -5446 -9610 -9768 -5458 1219 1960 -343 3759 4961 -168 4360 3608 -2010 3743 2283 -3055
178476c055J756J19m746J167P436k547m002m217R27j790P798K079k960K905J765
$$ -3055 -1299 -1180 -5926 -4759 2677 130 -3872 -8089 -7162 -8952 -1154 925 -2035 870 2635
179392B635j870j309l275l945n52P079M900J205k695m934L263K190M070j190m083
$$ 2635 765 -544 -3819 -7764 -8316 -1237 3663 4868 2173 -2761 502 2692 6762 5572 1489
180308A489p911M355R41l320L477k754q631m11M828J544j149J765L901N539L456
$$ 1489 -6422 -2067 -1126 -4446 -969 -3723 -12354 -12765 -7937 -6393 -7542 -5777 -1876 3663 7119
181223G119m111k811J398k356M219k586o57l094j095l609O52N690L965K661l780
$$ 7119 3008 197 1595 -761 3458 872 215 -2879 -3974 -7583 -6931 -1241 2724 5385 1605
182139A605n811J845Q14l597K464m029M921K614O215J56o94k043k144M554M84
$$ 1605 -4206 -2361 -1547 -5144 -2680 -6709 -1788 826 7041 7197 6503 4460 2316 6870 7354
183054G354J288r82n264K860m918o6j483N567L333l041m800q355M809O047J084
$$ 7354 8642 7660 2396 5256 338 272 -1211 4356 7689 4648 -152 -8507 -3698 2349 3433
183970C433O02J048N046J946q428r13m55j505L867r61K223L005n587o622p375
$$ 3433 4035 5083 10129 12075 3647 2734 2279 774 4641 3680 5903 8908 3321 -3301 -10676
184885a0676O534k604K003K856J598k743M43J637L793m256N83R531K082q59m969
$$ -10676 -4142 -6746 -4743 -1887 -289 -3032 -2589 -952 2841 -1415 -832 8699 10781 9922 4953
185801D953l445l140n391O148m26K976J537k10l119j778N63O15J972j756J614
$$ 4953 1508 -1632 -7023 -875 -1301 1675 3212 3002 -117 -1895 -1332 -717 1255 -501 1113
186717A113n226j195k79L602M591k389n18Q82l300m365j162p33O020k553L309
$$ 1113 -4113 -5308 -5587 -1985 2606 217 -301 581 -2719 -7084 -8246 -8979 -2959 -5512 -2203
187632b203R40l199J934j678M38k415J066j368j665l542N234K311q989O398N321
$$ -2203 -1263 -4462 -2528 -4206 -3768 -6183 -5117 -6485 -8150 -11692 -6458 -4147 -13136 -6738 -1417
188548a417k183l052l251L758k28n658K38J1166L596L81k153m490N030j328o11
$$ -1417 -3600 -6652 -9903 -6145 -6373 -12031 -11793 -627 2969 3350 1197 -3293 1737 409 -202
189463b02K360j712k470M372L090j22k835R63k122k897n91j406M144l578k749
$$ -202 2158 446 -2024 2348 5438 5316 2481 3444 1322 -1575 -2166 -3572 572 -3006 -5755
190379e755J956J0779n38m605l569L765L429Q295j008o111k417l866L474N531
$$ -5755 -3799 6980 6442 1837 -1732 2033 5462 13757 12749 6638 4221 355 3829 9360
191234I360l826j432K233Q61j720m58m656p478O00K205l04j807K270L995M147
$$ 9360 5534 4102 6335 7196 5476 5018 362 -7116 -6516 -4311 -4615 -6422 -4152 -157 3990
192149C990o684K287q06n26N817L011r0l527m694K362K342q245P343J992k491
$$ 3990 -2694 -407 -1213 -1739 4078 7089 6999 3472 -1222 1140 3482 -4763 2580 4572 2081
193065B081P205K716k222J682n660m034M147q32n594K70K605m507l046k65M046
$$ 2081 9286 12002 9780 11462 5802 1768 5915 5083 -511 -241 2364 -2143 -5189 -5454 -1408
193980a408R02N204o501m712K854L785j33j235n46j916m416R22L919j745O553
$$ -1408 -506 4698 -1803 -6515 -3661 124 -9 -1244 -1790 -3706 -8122 -7200 -3281 -5026 1527
194896A527k03N64p840K022L327J2657M280r440r310j073K194K41K112j859q48
$$ 1527 1324 1888 -5952 -3930 -603 12054 16334 6894 -2416 -3489 -1295 -1054 1058 -801 -1649
195811a649J959O731k328l931K209L408j321k03K936l858p300K059L778o28j538
$$ -1649 310 7041 4713 782 2991 6399 5078 4875 7811 3953 -3347 -1288 2490 1862 324
196727C24j892j274o300M613J27N53M018J799M782J772m272O4O275o241o364J338
$$ 324 -1568 -2842 -9142 -4529 -4402 -3849 169 1968 6750 8522 4250 4314 10589 4348 -2016 -678
197704f78j047j605J035l810L817R250K810r697m92J603p11R20M459q990l798
$$ -678 -1725 -3330 -2295 -6105 -2288 6962 9772 75 -417 1186 475 1395 5854 -3136 -6934
198619f934Q80O28M462K328l778q095j026J038J616J572K217k557L739K853j912
$$ -6934 -6054 -5426 -964 1364 -2414 -10509 -11535 -10497 -8881 -7309 -5092 -7649 -3910 -1057 -2969
199535b969P168M999m077M975l142k262p559M14J958L56R34M035l376M975K45
$$ -2969 4199 9198 5121 10096 6954 4692 -2867 -2453 -495 -139 795 4830 1454 6429 6674
200450F674R55l72j493q30l701J938J514m765M949K291n948J570M539k232J145
$$ 6674 7629 7257 5764 4934 1233 3171 4685 -80 4869 7160 1212 2782 7321 5089 6234
201366F234N48j039k32L012M370k721n627l107L700K037l575k896K351p94r046
$$ 6234 6782 5743 5511 8523 12893 10172 4545 1438 5138 7175 3600 704 3055 2261 -6785
202282f785m234M938o109J509Q627L040m504K047L798m906K416M257n235k160
$$ -6785 -11019 -6081 -12190 -10681 -2054 986 -3518 -1471 2327 -2579 -163 4094 -1141 -3301
203136c301j37K315J150k174O86o17J535K67K969l030L289P137l753n110J183
$$ -3301 -3438 -1123 27 -2147 -1461 -2078 -543 -276 2693 -337 2952 10089 6336 1226 2409
204052B409J196O07k063n913n45k249K097M74M503L75m924j87L244J906P26k495
$$ 2409 3605 4212 2149 -3764 -4309 -6558 -4461 -3987 516 891 -4033 -4220 -976 930 1656 -839
205028h39K850m42k416P474M163L481j717J536o478j0155o326M61J094J333J980
$$ -839 2011 1569 -847 6627 10790 14271 12554 14090 7612 -2543 -8869 -8408 -7314 -5981 -4001
205944d001o09O046L623J769K553o978m675J260l033k147K133J326K886L226L211
$$ -4001 -4610 1436 5059 6828 9381 2403 -2272 -1012 -4045 -6192 -4059 -2733 153 3379 6590
206860F590j568J507p34M83m518n353M123p50n76J172L043Q770k580m223N16L212
$$ 6590 5022 6529 5795 6278 1760 -3593 530 -220 -796 376 3419 12189 9609 5386 5902 9114
207836I114p01j350n863l721J901M309M428k882l665M034m015m452N526N089k016
$$ 9114 8413 7063 1200 -2521 -620 3689 8117 5235 1570 5604 1589 -2863 2663 7752 5736
208752E736O139M016j857k396J570k28k666L182m404J770n039n293L431j403L400
$$ 5736 11875 15891 14034 11638 13208 12980 10314 13496 9092 10862 5823 530 3961 2558 5958
209667E958l046q310j840O464M989l127J354N43J805K509m422n679r1J819O977
$$ 5958 2912 -5398 -7238 -774 4215 1088 2442 2985 4790 7299 2877 -2802 -2893 -1074 5903
210583E903k295k610J341J062M126L160m869m610l98j328j354k905M108L364L509
$$ 5903 3608 998 2339 3401 7527 10687 5818 1208 810 -518 -1872 -4777 -669 2695 6204
211498F204n64j092l032j332N19M189P163m78k891m691k779O825n81j383q98j721
$$ 6204 5640 4548 1516 184 703 4892 12055 11577 8686 3995 1216 8041 7460 6077 5179 3458
212475C458k444l285L01M77p47k760J587O560Q119m742K004L083k34j876j380
$$ 3458 1014 -2271 -1970 -1493 -2240 -5000 -3413 3147 11266 6524 8528 11611 11377 9501 8121
213391H121k568L604q848J170J974l496m255O939J55l039k536k700J380k164R443
$$ 8121 5553 9157 309 1479 3453 -43 -4298 2641 2796 -243 -2779 -5479 -4099 -6263 3180
214306C180N158r546p912M873O452j398M12K483Q026K040r263n200L871L327k981
$$ 3180 8338 -1208 -9120 -4247 2205 807 1219 3702 11728 13768 4505 -695 3176 6503 3522
215222C522k930%M602N326J663j743j1461k53L791l718k198k14J515N502n18K208
$$ 3522 592 592 5194 10520 12183 10440 -1021 -1274 2517 -1201 -3399 -3613 -2098 3404 2886 5094
216198E094k27k456k772J234j615n577m238M476P84N35Q14j870M665K109J341
$$ 5094 4867 2411 -361 873 -742 -6319 -10557 -6081 -5297 -4762 -3948 -5818 -1153 956 2297
217114B297O926l461o270n424K533N87Q5n00N971n607l814L640n53l705K667K513
$$ 2297 9223 5762 -508 -5932 -3399 -2812 -2727 -3227 2744 -2863 -6677 -3037 -3590 -7295 -4628 -2115
218091b115j719J138O357P872n69k495m890N48K023k099O039m988p407q15P12
$$ -2115 -3834 -2696 3661 11533 10964 8469 3579 4127 6150 4051 10090 5102 -2305 -3120 -2408
219006b408j227j947L514L595Q464N534l468q238k755J47l552M182k556m004M072
$$ -2408 -3635 -5582 -2068 1527 9991 15525 12057 3819 1064 1211 -2341 1841 -715 -4719 -647
219922f47k321j253l18R765j728k727J788j929o696N465k2R105o636l261m236
$$ -647 -2968 -4221 -4539 5226 3498 771 2559 630 -6066 -601 -623 8482 1846 -1415 -5651
220837e651N48P308L761N06n121r32n099R10j080k800m225M763J821K527K36j873
$$ -5651 -5103 2205 5966 6472 1351 419 -4680 -3770 -4850 -7650 -11875 -7112 -5291 -2764 -2528 -4401
221814d401j112M496K035J289J028l591l494j460N066J98L44L383N30k23k480
$$ -4401 -5513 -1017 1018 2307 3335 -256 -3750 -5210 -144 54 398 3781 4311 4088 1608
222730A608j8l782J564M345q12K148k239j681j189J505l85k852j642k917P162
$$ 1608 1590 -2192 -628 3717 2905 5053 2814 1133 -56 1449 1064 -1788 -3430 -6347 815
223645H15K971j165j985m067J609M13J900J64k073K435K063K071k946K053J158
$$ 815 3786 2621 636 -3431 -1822 -1409 491 655 -1418 1017 3080 5151 2205 4258 5416
224561E416K55j155l423p022m998N761K505q15m09L847L646M552k00q329n409
$$ 5416 5671 4516 1093 -5929 -10927 -5166 -2661 -3476 -3885 -38 3608 8160 7960 -369 -5778
225476e778j889K876k402n99R463J52N854R26j840n6r559k306k436J707o80R784
$$ -5778 -7667 -4791 -7193 -7792 1671 1823 7677 8603 6763 6707 -2852 -5158 -7594 -5887 -6567 3217
226453C217k213k326j448K971L226R03n9p737q919Q188R347q30J172k863l197
$$ 3217 1004 -1322 -2770 201 3427 4330 4271 -3466 -12385 -4197 5150 4320 5492 2629 -568
227368e68m232j296j798R37k231R29P395K492L52m051J783k014j421K532M096
$$ -568 -4800 -6096 -7894 -6957 -9188 -8259 -864 1628 1980 -2071 -288 -2302 -3723 -1191 2905
228284B905k066l86K09k620Q35J491k270n125P319L033j901L137j933r9m283j764
$$ 2905 839 453 662 -1958 -1123 368 -1902 -7027 292 3325 1424 4561 2628 2529 -1754 -3518
229261c518J01L45n04K378M538m704n214K805J27j026L603o882K687N46J399K483
$$ -3518 -3417 -3072 -3576 -1198 3340 -1364 -6578 -3773 -3646 -4672 -1069 -7951 -5264 -4718 -3319 -836
230237h36J165k839o98M476J551J112K55j155p675m783j599M412r20J034O922
$$ -836 329 -2510 -3208 1268 2819 3931 4186 3031 -4644 -9427 -11026 -6614 -7534 -6500 422
231153D22N990N394J08m618m35k033j91k928L569k383M157n453l364k742L087
$$ 422 6412 11806 11914 7296 6861 4828 4637 1709 5278 2895 7052 1599 -1765 -4507 -1420
232068a420J440J313k89J063o966J898k200k811P63K017L074J491K183J723K214
$$ -1420 20 1333 1044 2107 -4859 -2961 -5161 -7972 -7209 -5192 -2118 -627 1556 3279 5493
232984E493J290l118l315P572J617l453J226k462k293J411m484o834j443M358
$$ 5493 6783 3665 350 7922 9539 6086 7312 4850 2557 3968 -516 -7350 -8793 -4435
233838d435K60K434M634M737j447l533m495o86k210N847J0155l946o059k862l396
$$ -4435 -4175 -1741 2893 7630 6183 2650 -1845 -2531 -4741 1106 11261 7315 1256 -1606 -5002
234754e002K044M724K269K901M74k468L099K075L41K360P10L688o404n588O08
$$ -5002 -2958 1766 4035 6936 7410 4942 8041 10116 10457 12817 13527 17215 10811 5223 5831
235670E831J415K73l38n123M41k60J264N09Q390j605p969r238L883N224J754L93
$$ 5831 7246 7519 7181 2058 2499 2239 3503 4012 12402 10797 2828 -6410 -2527 2697 4451 4844
236646D844N73K307J646L00j317k394O09k569n773Q345K953k424j144j663J020
$$ 4844 5417 7724 9370 9670 8353 5959 6568 3999 -1774 6571 9524 7100 5956 4293 5313
237562E313m698k365k222K692R20K88j300Q616J253p680n91m474N210l02J440
$$ 5313 615 -1750 -3972 -1280 -360 -72 -1372 7244 8497 817 226 -4248 962 660 2100
238478B100J675K076j588q48J570j718M195j856q1n939J442N44K898k93o88M3
$$ 2100 3775 5851 4263 3415 4985 3267 7462 5606 5525 -414 1028 1572 4470 4177 3489 3532
239454C532N079L174o752j29j129P67o73J585k314l232K936O102M24M244m972
$$ 3532 8611 11785 5033 4904 3775 4542 3869 5454 3140 -92 2844 8946 9370 13614 8642
240370H642l502m555l160k243O00J251J543m307m699O77K792M610K447k810n048
$$ 8642 5140 585 -2575 -4818 -4218 -2967 -1424 -5731 -10430 -9753 -6961 -2351 96 -2714 -7762
241285g762P594J849L15j124k271J762n11J484j497L159n729m71k18l011J795
$$ -7762 -168 1681 1996 872 -1399 363 -148 1336 -161 2998 -2731 -3202 -3420 -6431 -4636
242201d636k617K749R65L460p841j537M825j972L18J597J733m707k516J0418J0767
$$ -4636 -7253 -4504 -3539 -79 -7920 -9457 -4632 -6604 -6286 -4689 -2956 -7663 -10179 239 11006
243116A1006l423n759L003O6K128n950o89K860Q931J241N804n065n489l375n82
$$ 11006 7583 1824 4827 4893 7021 1071 382 3242 12173 13414 19218 14153 8664 5289 4707
244032D707o258L45N229K555n940n3J71J029R71J5P178p333n25K6J373j264J923
$$ 4707 -1551 -1206 4023 6578 638 585 756 1785 2756 2771 9949 2616 2091 2117 3490 2226 4149
245070D149K098L943K76m604J35K057k164k472l333K436L918L92l219j938j921
$$ 4149 6247 10190 10466 5862 5997 8054 5890 3418 85 2521 6439 6831 3612 1674 -247
245986b47l790l910k20O144J324J08L807p10L233k991J33k181Q90j915r25m053
$$ -247 -4037 -7947 -8167 -2023 -699 -591 3216 2506 5739 2748 2881 700 1590 -325 -1250 -5303
246962e303J982J434J793M803J190k949p195J975L037K239n132j994M280o41R65
$$ -5303 -3321 -1887 -94 4709 5899 2950 -4245 -2270 767 3006 -2126 -4120 160 -481 484
247877D84K064L824N478r737r897J348k795P079Q525K975q82M96k700J221l350
$$ 484 2548 6372 11850 2113 -7784 -6436 -9231 -2152 6373 9348 8466 8962 6262 7483 4133
248793D133N18J874J487j359m734n907K144L773o56N94K931K580j432l588j840
$$ 4133 4651 6525 8012 6653 1919 -3988 -1844 1929 1273 1867 4798 7378 5946 2358 518
249709E18k141K20O619J476n464K378k34m466Q20j920l454j468K240p94K094L99
$$ 518 -1623 -1403 5216 6692 1228 3606 3372 -1094 -274 -2194 -5648 -7116 -4876 -5670 -3576 -3177
250685c177q195K222N190L712k750m987o53L958P0L556q22J813l750n101L479
$$ -3177 -11372 -9150 -3960 -248 -2998 -7985 -8638 -4680 -4610 -1054 -1876 -63 -3813 -8914 -5435
251601e435N303L854n182l095p68K29M201O34r32l738m5O468m54k433J695r91
$$ -5435 -132 3722 -1460 -4555 -5323 -5094 -893 -259 -1191 -4929 -4974 1494 1040 -1393 302 -689
252578f89M170K071N3o857J039p05l450L5K355m969P914P038O576q660o225m284
$$ -689 3481 5552 5605 -1252 -213 -918 -4368 -4333 -1978 -6947 967 8005 14581 5921 -304 -4588
253554d588m901k190L575P73O560J301j711j361M494K074M447n575p084m491N120
$$ -4588 -9489 -11679 -8104 -7331 -771 530 -1181 -2542 1952 4026 8473 2898 -4186 -8677 -3557
254470c557N144K158l046J543l621K677K586J6p640k907L645K306q96K460l762
$$ -3557 1587 3745 699 2242 -1379 1298 3884 3900 -3740 -6647 -3002 -696 -1592 868 -2894
255385b894M491P055j028l565J50M912L108O812p700m822n417Q29l80K928m702
$$ -2894 1597 8652 7624 4059 4209 9121 12229 19041 11341 6519 1102 1931 1551 4479 -223
256301b23M187M342J569l68Q9J056l0m187k17J438M40j839K080K61l094j370j398
$$ -223 3964 8306 9875 9507 9596 10652 10622 6435 6218 7656 8096 6257 8337 8598 5504 4134 2736
257339B736L191j860O24J358l680m098K238M237J870m704M82L061m59L724k237
$$ 2736 5927 4067 4691 6049 2369 -1729 509 4746 6616 1912 2394 5455 4996 8720 6483
258254F483q76J962k133Q66J272n176n068p46N615q62k297L59p7K512n392j153
$$ 6483 5607 7569 5436 6302 7574 2398 -2670 -3416 2199 1337 -960 -601 -678 1834 -3558 -4711
259231d711J210J838L750L468O861o099n402N137J220M59l020j335p869n449j296
$$ -4711 -3501 -1663 2087 5555 12416 6317 915 6052 7272 7731 4711 3376 -4493 -9942 -11238
260146a1238J0841K256l293m11o8j734N683J312r764K791L561N999k83j223l665
$$ -11238 -397 1859 -1434 -1845 -1913 -3647 2036 3348 -6416 -3625 -64 5935 5652 4429 764
261062G64n018P300N546n817q15k149k101J317o22K389m427m779P003M790j469
$$ 764 -4254 3046 8592 2775 1960 -189 -2290 -973 -1595 794 -3633 -8412 -1409 3381 1912
261978A912j292N255J938m246n381J3M09n595J415K552K075P600J1392n056m139
$$ 1912 620 5875 7813 3567 -1814 -1801 -1392 -6987 -5572 -3020 -945 6655 18047 12991 8852
262893H852k077n361p52l485o686l211K957j581N389L388N6m70M548P88L262J975
$$ 8852 6775 1414 662 -2823 -9509 -12720 -9763 -11344 -5955 -2567 -2511 -2981 1567 2355 5617 7592
263870G592j574j353n314p270j27Q932L359J591j605m62J541j189j712j309J918
$$ 7592 6018 4665 -649 -7919 -8046 886 4245 5836 4231 3769 5310 4121 2409 1100 3018
264785C018l53l207J853P433K486M87p736p225k095l65N224J577J992k73J224
$$ 3018 2665 -542 1311 8744 11230 11717 3981 -3244 -5339 -5704 -480 1097 3089 2816 4040
265701D040l578k853k170j544P264J647L8q00O44o578n600O400K857j2713P235
$$ 4040 462 -2391 -4561 -6105 1159 2806 2844 2044 2688 -3890 -9490 -3090 -233 -12946 -5711
266617e711N786o488l289P952n838j936J037J999l448O255K501J600n41k280N204
$$ -5711 75 -6413 -9702 -1750 -7588 -9524 -8487 -6488 -9936 -3681 -1180 420 -121 -2401 2803
267532B803L13l184L289l367o924K045J066L159O456n391k320j505M860N469R73
$$ 2803 3116 -68 3221 -146 -7070 -5025 -3959 -800 5656 265 -2055 -3560 1300 6769 7742
268448G742r314o4l277J896R146L816k628K538l715m38o351q843O729K789L41
$$ 7742 -1572 -1636 -4913 -3017 6129 9945 7317 9855 6140 5702 -649 -9492 -2763 26 367
269363C67k439N7K798o32K03M471q49k843K878O069o982m132J409J280N313n36
$$ 367 -2072 -2015 783 151 354 4825 3976 1133 4011 10080 3098 -1034 375 1655 6968 6432
270340F432m182J229J118L141j452O85o033K481J280m360r997Q207P349q784m851
$$ 6432 2250 3479 4597 7738 6286 6971 938 3419 4699 339 -9658 -1451 5898 -2886 -7737
271255g737M810N881j731J05P527k567k941j0729j306N664J1050l512k979P056
$$ -7737 -2927 2954 1223 1328 8855 6288 3347 -7382 -8688 -3024 8026 4514 1535 8591
272110H591K674l397j673m947J862j283m227N488L465j646K297J067m916n879
$$ 8591 11265 7868 6195 1248 3110 1827 -2400 3088 6553 4907 7204 8271 3355 -2524
272965b524l422K206P287K857l282j188m003m14J87k557L059J719j408n505K443
$$ -2524 -5946 -3740 3547 6404 3122 1934 -2069 -2483 -2296 -4853 -1794 -75 -1483 -6988 -4545
273880d545l663k574P731N724l732n360K384k129n65J52p07L265L770J344M71
$$ -4545 -8208 -10782 -3051 2673 -1059 -6419 -4035 -6164 -6729 -6577 -7284 -4019 -249 1095 1566
274796A566q21L316J654J205l279n192j445n983j266J796k29M048M162O797j196
$$ 1566 745 4061 5715 6920 3641 -1551 -2996 -8979 -10245 -8449 -8678 -4630 -468 6329 5133
275711E133k228O9M803L935l733Q10k34k520l114J269O346o764l975r58n711M994
$$ 5133 2905 2974 7777 11712 7979 8789 8555 6035 2921 4190 10536 3772 -203 -1161 -6872 -1878
276688a878L858r29K926j432k609M712L479J036M355L433o965m148j498n115j555
$$ -1878 1980 1051 3977 2545 -64 4648 8127 9163 13518 16951 9986 5838 4340 -775 -2330
277604b330L99J924M382K485p57J873o300L691l669l70k576p392m792L246J0431
$$ -2330 -1931 -7 4375 6860 6103 7976 1676 5367 1698 1328 -1248 -8640 -13432 -10186 245
278519B45K97L68Q10O35o31K346l618n52O315j48m170J790K322m234J674j501
$$ 245 542 910 1720 2355 1724 4070 452 -100 6215 6067 1897 3687 6009 1775 3449 1948
279496A948k177m862p3l884n07J299K811k921L44K196N166K535r45k668m307J829
$$ 1948 -229 -5091 -5164 -9048 -9555 -8256 -5445 -8366 -8022 -5826 -660 1875 930 -1738 -6045 -4216
280472d216R904k210l079l416j13M784K705L978p292p474j349M822P117K950m421
$$ -4216 5688 3478 399 -3017 -3130 1654 4359 8337 1045 -6429 -7778 -2956 4161 7111 2690
281388B690o704L054L482P126L947l175l360O73n858o045j50J065R28k890k285
$$ 2690 -4014 -960 2522 9648 13595 10420 7060 7733 1875 -4170 -4320 -3255 -2327 -5217 -7502
282303g502P687M034N42p01k003j705j575r16J913J441j35k409N660M737N428
$$ -7502 185 4219 4761 4060 2057 352 -1223 -2139 -226 1215 1080 -1329 4331 9068 14496
283219A4496k238n516k643K904j297l192J466j834J428N922l152K889j514j197
$$ 14496 12258 6742 4099 7003 5706 2514 3980 2146 3574 9496 6344 9233 7719 6522
284074F522N431j600o850J897Q949p830j656M28j299l617M943M107M006l519l466
$$ 6522 11953 10353 3503 5400 14349 6519 4863 5291 3992 375 5318 9425 13431 9912 6446
284989F446M339m187P468J722n79j94J685k525m421p040L047J605j851r97K946
$$ 6446 10785 6598 14066 15788 15209 15015 16700 14175 9754 2714 5761 7366 5515 4518 7464
285905G464M258P047L164r661k653Q40K995j865n84o347j740O273l417m616p95
$$ 7464 11722 18769 21933 12272 9619 10459 13454 11589 11005 4658 2918 9191 5774 1158 363
286820C63J313J128j914M011L321k806n523J994N679J296L103j993j097j258O005
$$ 363 1676 2804 890 4901 8222 5416 -107 1887 7566 8862 11965 9972 8875 7617 13622
287736A3622j55N695o367j060K320k231j556q44J140N585J67L027N035j359k740
$$ 13622 13467 19162 12795 11735 14055 11824 10268 9424 10564 16149 16316 19343 24378 23019 20279
288652B0279j576P696P503J817Q795J9239N1158R2191L1744m5490l4887l5060
$$ 20279 18703 26399 33902 35719 44514 63753 114911 207102 238846 193356 158469 123409
289384A23409k2406j0051j1499j2643j6103r910q018k838O60l562o964k718l912
$$ 123409 101003 90952 79453 66810 50707 40797 32779 29941 30601 27039 20075 17357 13445
290177A3445n079P585K342K521P519J3999K0160M0113R0508O0592m3914l3942
$$ 13445 8366 15951 18293 20814 28333 42332 62492 102605 193113 253705 209791 175849
290910A75849l5073k6403j8130j1585r969j6497j6496p075J859j458p526k45p042
$$ 175849 140776 114373 96243 84658 74689 58192 41696 34621 36480 35022 27496 27251 20209
291703B0209p292L433O324N59j894l935P980J9771M0846Q0476P8479l4472m6457
$$ 20209 12917 16350 22674 23233 21339 17404 25384 45155 86001 166477 244956 210484 164027
292497A64027k9224k8360j9877j1797r764j5766r211r715j3011o461R474J451
$$ 164027 134803 106443 86566 74769 65005 49239 40028 30313 17302 10841 20315 21766
293229B1766j0955m100L61N04P495O333l570r204j773q98J475J973N339l916j339
$$ 21766 10811 6711 7072 7576 15071 21404 17834 8630 6857 5959 7434 9407 14746 10830 9491
294145I491k846q921j328L459M85J975O554j227K134k676R03L568R30m867k585
$$ 9491 6645 -2276 -3604 -145 340 2315 8869 7642 9776 7100 8003 11571 12501 7634 5049
295061E049N009m025j657k577o073L253J1785J351p33L066j0453k261l053m442
$$ 5049 10058 6033 4376 1799 -4274 -1021 10764 12115 11382 14448 3995 1734 -1319 -5761
295915e761M504J360J82K290K253l18l476q63m31j638N17K737l578j571P519k216
$$ -5761 -1257 103 285 2575 4828 4510 1034 171 -260 -1898 -1381 1356 -2222 -3793 3726 1510
296892A510j788k19M709J85N50k86P236o058p535M367K755j447J813R94Q15k034
$$ 1510 -278 -497 4212 4397 4947 4661 11897 5839 -1696 2671 5426 3979 5792 6786 7601 5567
297868E567k614j857n098L807k642k281k126N440M640k986k226O475l126K500
$$ 5567 2953 1096 -4002 -195 -2837 -5118 -7244 -1804 2836 -150 -2376 4099 973 3473
298723C473k850l130m246J570K214K893O724m08N390M186k105j1744l965J766
$$ 3473 623 -2507 -6753 -5183 -2969 -76 6648 6240 11630 15816 13711 1967 -1998 -232
299578b32R250J113R53n776l543M357k437m521N158j257l325M735q731q003K317
$$ -232 9018 10131 11084 5308 1765 6122 3685 -836 4322 3065 -260 4475 -4256 -12259 -9942
300493i942L837%L333k499Q64k665k49L796J434N58l061o27K543r429N79L402
$$ -9942 -6105 -6105 -2772 -5271 -4407 -7072 -7321 -3525 -2091 -1533 -4594 -5221 -2678 -12107 -11528 -8126
301470h126M07m09M496M901O316j401j594o63n550J258r61O273l708K063k127
$$ -8126 -7719 -8128 -3632 1269 7585 6184 4590 3927 -1623 -365 -1326 4947 1239 3302 1175
302385A175P30k252lQ51J604O079J641l453n249k541m516L131P297L423k331n655
$$ 1175 1905 -347 -350 501 2105 8184 9825 6372 1123 -1418 -5934 -2803 4494 7917 5586 -69
303362f9n41j485M897k009l121l28K343q199o380L990O311O447m010K085L456
$$ -69 -610 -2095 2802 793 -2328 -2656 -313 -8512 -14892 -10902 -4591 1856 -2154 -69 3387
304277C387K685p471N714l604j493K392l39l246J090j147k987J996K694K927j020
$$ 3387 6072 -1399 4315 711 -782 1610 1271 -1975 -885 -2032 -5019 -3023 -329 2598 1578
305193A578j548K946J242J428l065m501k654R168P925n449m135n926L589L81R75
$$ 1578 30 2976 4218 5646 2581 -1920 -4574 4594 12519 7070 2935 -2991 598 979 1954
306109A954M456N530k606j1196q090L592M573L131N435J985k825l018K449L697
$$ 1954 6410 11940 9334 -1862 -9952 -6360 -1787 1344 6779 8764 5939 2921 5370 9067
306963I067J056k741l671j2168n86O341P565M622k837j123n664o387m17M179M691
$$ 9067 10123 7382 3711 -8457 -9043 -2702 4863 9485 6648 5525 -139 -6526 -6943 -2764 1927
307879A927J013l916n157O275L255l632L35N537k384Q36k654k699P18j479m176
$$ 1927 2940 -976 -6133 142 3397 -235 100 5637 3253 4089 1435 -1264 -546 -2025 -6201
308794f201m058M557M802j951n433N798O193R861j764r234m313m022j111J040
$$ -6201 -10259 -5702 -900 -2851 -8284 -2486 3707 13568 11804 2570 -1743 -5765 -6876 -5836
309649e836K307L676K293K779n955R11N033J669J05P84R1M137l909p469J80KM174
$$ -5836 -3529 147 2440 5219 -736 175 5208 6877 6982 7766 7857 11994 8085 616 796 798 4972
310687D972N36L15q030J965J2246j066L8m890R16j0466j912M554N744K309P62
$$ 4972 5508 5823 -2207 -242 12004 10938 10976 6086 7002 -3464 -5376 -822 4922 7231 7993
311602G993m388o728l164O700J924m86l26L367K473r95l664l289K299R212m134
$$ 7993 3605 -3123 -6287 413 2337 1851 1525 4892 7365 6370 2706 -583 1716 10928 6794
312518F794o641j600Q434K478Q58k62L11J366o255n565k726p512K24L680j657
$$ 6794 153 -1447 6987 9465 10323 10061 10372 11738 5483 -82 -2808 -10320 -10096 -6416 -8073
313433h073K172l878O076N27j782R616J190J787q07q045K799P0o533k76J1519
$$ -8073 -5901 -9779 -3703 -3176 -4958 4658 5848 7635 6828 -1217 1582 1652 -4881 -5157 6362
314349F362M069o945m636L26M456k345m590K260L382N400p81o721L869k725N3
$$ 6362 10431 3486 -1150 -824 3632 1287 -3303 -1043 2339 7739 6958 237 4106 1381 1434
315265A434J433n226L687J006N779o53r031k148k398J37K504L476O464M316m109
$$ 1434 2867 -2359 1328 2334 8113 7460 -1571 -3719 -6117 -5980 -3476 0 6464 10780 6671
316180F671k507j823j024K812k754Q004K433m78m989r625k37Q085J517k996k028
$$ 6671 4164 2341 1317 4129 1375 9379 11812 11334 6345 -3280 -3517 4568 6085 3089 1061
317096A061M013l136J362j307l092K611j54n133J202m83N338K048J421L573o611
$$ 1061 5074 1938 3300 1993 -1099 1512 1358 -3775 -2573 -3056 2282 4330 5751 9324 2713
318011B713P54L135l16l723N102l764p477O10J791l283k589M189N225N47o311
$$ 2713 3467 6602 6286 2563 7665 3901 -3576 -2966 -1175 -4458 -7047 -2858 2367 2914 -3397
318927c397q33k624k91N316o01M93J228J093P696M311k82p827L81K999p90j458
$$ -3397 -4230 -6854 -7145 -1829 -2430 -1937 -709 384 8080 12391 12109 4282 4663 7662 6872 5414
319903E414K368J442K692k674q010r43l494j629R90M49P718n12p491K555j613
$$ 5414 7782 9224 11916 9242 1232 289 -3205 -4834 -3844 -3395 4323 3811 -3680 -1125 -2738
320819b738J607o01j678j794K715k507M811J1013m571q093j480m709k18j55o04
$$ -2738 -1131 -1732 -3410 -5204 -2489 -4996 -185 10828 6257 -1836 -3316 -8025 -8243 -8398 -9002
321735i002k300N167K194j420K065K094N450L307k433j0684l404M270L074J756
$$ -9002 -11302 -6135 -3941 -5361 -3296 -1202 4248 7555 5122 -5562 -8966 -4696 -1622 134
322589A34Q49l599j128M280J356j089N093J773J586P026m139r971k407M650j155
$$ 134 983 -2616 -3744 536 1892 803 5896 7669 9255 16281 12142 2171 -236 4414 3259
323505C259j227j643K005N187n980k340l893O627J184k044o756O955Q931n63q106
$$ 3259 2032 389 2394 7581 1601 -739 -4632 1995 3179 1135 -5621 1334 10265 9702 1596
324420A596p123J326q07q46k269k88M55K52L812j771L843j121N18N542m74L118
$$ 1596 -5527 -4201 -5008 -5854 -8123 -8411 -7956 -7704 -3892 -5663 -1820 -2941 -2423 3119 2645 5763
325397E763M936l453p383o57k407k955M962K335l908k555N746K666p115n656L147
$$ 5763 10699 7246 -137 -794 -3201 -6156 -1194 1141 -2767 -5322 424 3090 -4025 -9681 -6534
326313f534M952j636M344k955m647o68J696J662R783k20l491m031N877k910J571
$$ -6534 -1582 -3218 1126 -1829 -6476 -7144 -5448 -3786 5997 5777 2286 -1745 4132 1222 2793
327228B793J584j999o699o19L095K19l252q61O097p77K163l221J236K434k029
$$ 2793 4377 2378 -4321 -4940 -1845 -1626 -4878 -5739 358 -419 1744 -1477 -241 2193 164
328144A64M928m44k56l980K3k726j0841K257K626K351P476K239k853L018L83o957
$$ 164 5092 4648 4392 412 435 -2291 -13132 -10875 -8249 -5898 1578 3817 964 3982 4365 -2592
329120b592j707n26L079q32P301O623j083p823m912j266O704K449O307j982r224
$$ -2592 -4299 -4825 -1746 -2578 4723 11346 10263 2440 -2472 -3738 2966 5415 11722 9740 516
330036E16o829j009M426J3023O259m284o890m462j300p781p36P845M282l660K174
$$ 516 -6313 -7322 -2896 10127 16386 12102 5212 750 -550 -8331 -9067 -1222 3060 -600 1574
330951A574J186j806m680k3K300k168N603L035j556J686j538p175J188k890N010
$$ 1574 2760 954 -3726 -3749 -1449 -3617 1986 5021 3465 5151 3613 -3562 -2374 -5264 -254
331867b54l414n624M928J0660k036m093q91k885P37L43K639N196j369P441L108
$$ -254 -3668 -9292 -4364 6296 4260 167 -724 -3609 -2872 -2529 110 5306 3937 11378 14486
332783A4486m66k977L817r392Q93R327p725q909J914j208l066l404j82P607J904
$$ 14486 14020 11043 14860 5468 6361 15688 7963 -946 968 -240 -3306 -6710 -6892 715 2619
333698B619J278J054p512j738K960N766l748M90j241m816Q38L471q67o638Q429
$$ 2619 3897 4951 -2561 -4299 -1339 4427 679 1169 -72 -4888 -4050 -579 -1446 -8084 345
334614C45O785P899r458q073L924J687l623j47J4O625J435K900J07j2334K105
$$ 345 7130 15029 5571 -2502 1422 3109 -514 -661 -647 5978 7413 10313 10420 -1914 191
335529A91j694l292K536M607N699J82p303J927L567m864m473p36n22K72o45L655
$$ 191 -1503 -4795 -2259 2348 8047 8229 926 2853 6420 1556 -2917 -3653 -4175 -3903 -4548 -893
336506h93N45l661J67l963j750O0m42M065Q965L559Q11l883n376o712k069M432
$$ -893 -348 -4009 -3842 -7805 -9555 -9495 -9937 -5872 3093 6652 7463 3580 -1796 -8508 -10577 -6145
337483f145J22Q41L387K951M249p806J848M896j212m537K936M638j292O38J684
$$ -6145 -6023 -5182 -1795 1156 5405 -2401 -553 4343 3131 -1406 1530 6168 4876 5514 7198
338398G198K138J971j059p182n918M684M298l282j51Q78Q38l549m860N26L902
$$ 7198 9336 11307 10248 3066 -2852 1832 6130 2848 2697 3575 4413 864 -3996 -3470 432
339314D32J143k374j622O149N316N27o489m66M68j892J605o49o242R22P506J186
$$ 432 1575 -799 -2421 3728 9044 9571 3082 2616 3084 1192 2797 2148 -4094 -3172 4334 5520
340290E520m491J382L057o839o645K875Q148l898J372M236J598k026J901k366
$$ 5520 1029 2411 5468 -1371 -8016 -5141 3007 -891 481 4717 6315 4289 6190 3824
341145C824L540k008o569K182k057k102K926m949j409n78R51O749J528J544j0830
$$ 3824 7364 5356 -1213 969 -1088 -3190 -264 -5213 -6622 -7200 -6249 500 2028 3572 -7258
342061g258j520l958P517M976o824M29L613J753M316N431q18o431n498M83L417
$$ -7258 -8778 -12736 -5219 -243 -7067 -6638 -3025 -1272 3044 8475 7657 1226 -4272 -3789 -372
342976c72K155N605L364l447l735n00j778M607J50m133L346l388k95O368k938
$$ -372 1783 7388 10752 7305 3570 3070 1292 5899 6049 1916 5262 1874 1579 7947 5009
343892E009n344l89j238o613K475P135J50j881n597R662J551j204M569J826o430
$$ 5009 -335 -724 -1962 -8575 -6100 1035 1185 -696 -6293 3369 4920 3716 8285 10111 3681
344807C681l719l325o798J289J1190j069r37k559r16K741l26k855M394R535k980
$$ 3681 -38 -3363 -10161 -8872 2318 1249 312 -2247 -3163 -422 -748 -3603 791 10326 7346
345723G346o136j876l701m552j427Q432J706J698J911J126J253K80k692J093j361
$$ 7346 1210 -666 -4367 -8919 -10346 -1914 -208 1490 3401 4527 5780 6060 3368 4461 3100
346638C100P31Q76m500K531J724K677l24m298k381M115K535n279N62m317j872
$$ 3100 3831 4707 207 2738 4462 7139 6815 2517 136 4251 6786 1507 2069 -2248 -4120
347554d120N953j591l31R18k153J803Q06M80k354m739J586M715k456J211M389
$$ -4120 1833 242 -89 829 -1324 479 1285 1765 -589 -5328 -3742 973 -1483 -272 4117
348470D117j247o8l865P661J560p249o594J780j937J931j56K674L892k262O679
$$ 4117 2870 2802 -1063 6598 8158 909 -5685 -3905 -5842 -3911 -4067 -1393 2499 237 6916
349385F916M626j993l493L45n726M05m463r318o49L671N096M329L155L128L309
$$ 6916 11542 9549 6056 6401 675 1080 -3383 -12701 -13350 -9679 -4583 -254 2901 6029 9338
350301I338k697K371O157J499o114j509O01o117m840j968L741P597M31L138p651
$$ 9338 6641 9012 15169 16668 10554 9045 9646 3529 -1311 -3279 462 8059 8490 11628 3977
351216C977j0891J830P632J425k220M923J168K423k551j0639n47K375M880l011
$$ 3977 -6914 -5084 2548 3973 1753 6676 7844 10267 7716 -2923 -3470 -1095 3785 774
352071G74j450M184J7P501m685l014l872k284J41L304j703K117p19O42J0843j513
$$ 774 -676 3508 3525 11026 6341 3327 -545 -2829 -2688 616 -1087 1030 311 953 11796 10283
353048A0283j02O811j394o140j619L466j457k545p243k579m819j106J782M827
$$ 10283 10181 16992 15598 9458 7839 11305 9848 7303 60 -2519 -7338 -8444 -6662 -1835
353902a835L483j700n447M8K463j890K867J323k494l754o64qR885N014k346K131
$$ -1835 1648 -52 -5499 -5451 -2988 -4878 -2011 -688 -3182 -6936 -7600 -7608 2277 7291 4945 7076
354879G076m194l885m8J596N562K593m145r72l376Q38N881k261k113N309q89R25
$$ 7076 2882 -1003 -1051 545 6107 8700 4555 3583 207 1045 6926 4665 2552 7861 6972 7897
355855G897l009n386l322m55k089n12p92m107K537P419N957O275l048k102N26
$$ 7897 4888 -498 -3820 -4275 -6364 -6876 -7668 -11775 -9238 -1819 4138 10413 7365 5263 5789
356771E789m382l522l751n6L11K118r6k271k822P36M576M673j186j423R47L476
$$ 5789 1407 -2115 -5866 -5922 -5611 -3493 -3589 -5860 -8682 -7946 -3370 1303 117 -1306 -359 3117
357747C117J486j417k488k160j070K543J842j886l35j047M261K308k146m975J1333
$$ 3117 4603 3186 698 -1462 -2532 11 1853 -33 -368 -1415 2846 5154 3008 -1967 9366
358663I366n27n968m041M864k723j925K5J569L26K170q691n405L90P24O521L950
$$ 9366 8839 2871 -1170 3694 971 -954 -929 640 966 3136 -5555 -10960 -10570 -9846 -3325 625
359640F25l24J211J436n117n103j150M673M291j395k197p12N862N051m060L052
$$ 625 301 1512 2948 -2169 -7272 -8422 -3749 542 -853 -3050 -3762 2100 7151 3091 6143
360555F143k185n784m24j511M5M651k90k375K255K0j084O98P1l026O643Q26r91
$$ 6143 3958 -1826 -2250 -3761 -3716 935 645 -1730 525 545 -539 159 230 -2796 3847 4673 3682
361593C682N635l142k418j414l262P58Q66n14p649K871L945n213j947K143J317
$$ 3682 9317 6175 3757 2343 -919 -161 705 191 -7458 -4587 -642 -5855 -7802 -5659 -4342
362508d342P055J247j30l786J452k471O97O88o016L814L414P398k969k705l060
$$ -4342 2713 3960 3830 44 1496 -975 -278 410 -5606 -1792 1622 9020 6051 3346 286
363424B86n935J904P452M352m724l676K590q07j414l923m06l060J850J242k541
$$ 286 -5649 -3745 3707 8059 3335 -341 2249 1442 28 -3895 -4301 -7361 -5511 -4269 -6810
364340f810K260M860p05K312k393k235L458K486p080o18Q752M451J810K909J061
$$ -6810 -4550 310 -395 1917 -476 -2711 747 3233 -3847 -4465 4287 8738 10548 13457 14518
365255A4518p790o532j074K312M234j28l432o164l665j292P286o06j290n098o579
$$ 14518 6728 196 -878 1434 5668 5540 2108 -4056 -7721 -9013 -1727 -2333 -3623 -8721 -15300
366171a5300L444K885J449J717Q63n40M577j074l006p50L418K679q749p003L383
$$ -15300 -11856 -8971 -7522 -5805 -4942 -5482 -905 -1979 -4985 -5735 -2317 362 -8387 -15390 -12007
367086a2007Q425L959O026M70L559M528n166p817o137J492R64m026M340j226k72
$$ -12007 -3582 377 6403 6873 10432 14960 9794 1977 -4160 -2668 -1704 -5730 -1390 -2616 -2888
368002b888p570J564J331J313K545M351j097O623R55k214n727k60N644J880N09
$$ -2888 -10458 -8894 -7563 -6250 -3705 646 -451 6172 7127 4913 -814 -1074 4570 6450 6959
368918F959O527J753K219o489o661q483K41N26j594J970M749q63J122J934j900
$$ 6959 13486 15239 17458 10969 4308 -4175 -3934 -3408 -5002 -3032 1717 854 1976 3910 2010
369833B010n101L068M984M616p778L05J295L130r50J485l957m464j041J885P236
$$ 2010 -3091 -23 4961 9577 1799 2104 3399 6529 5579 7064 3107 -1357 -2398 -513 6723
370749F723J370m332k781L557N043J341p576l616K882N165k297j516m246J803
$$ 6723 8093 3761 980 4537 9580 10921 3345 -271 2611 7776 5479 3963 -283 1520
371603A520k256J166J338J775j24L164p029r397N6J461M166R66L596N254k120
$$ 1520 -736 430 1768 3543 3419 6583 -446 -9843 -9787 -8326 -4160 -3194 402 5656 3536
372519C536l582l373p0m611K68K4m28j817J011Q179J409n12J095M691N397K238
$$ 3536 -46 -3419 -3489 -8100 -7832 -7808 -8236 -10053 -9042 -863 546 34 1129 5820 11217 13455
373495A3455j288l319m025M337L232l976m223l214j463o04P471P806k45k15n537
$$ 13455 12167 8848 4823 9160 12392 8416 4193 979 -484 -1088 6383 14189 13944 13729 8192
374411H192q913n17J0033J1550l531p137r183J911J614j636m237m73p22l07p70
$$ 8192 -721 -1238 8795 20345 16814 9677 494 2405 4019 2383 -1854 -2327 -3049 -3356 -4126
375327d126J802n31R99J31m069O176M519k266p834K919J756n156O256J438n560
$$ -4126 -2324 -2855 -1856 -1725 -5794 382 4901 2635 -5199 -2280 -524 -5680 576 2014 -3546
376242c546J821k87J061q41n302N141J1349n168m792l835q64l18o56R448O10o90
$$ -3546 -1725 -2012 -951 -1792 -7094 -1953 9396 4228 -564 -4399 -5263 -5581 -6237 3211 3821 3131
377219C131N735q626l961P253k07j318N34q96q8o026q37L338K53L350n770K960
$$ 3131 8866 240 -3721 3532 3325 2007 2541 1645 1557 -4469 -5306 -1968 -1715 1635 -4135 -1175
378196a175k505J050O53n803M107m785K785N10N093N663n30L321N886n805l603
$$ -1175 -3680 -2630 -1977 -7780 -3673 -8458 -5673 -5163 -70 5593 5063 8384 14270 8465 4862
379111D862o022l878L130K31K660L974l41k74Q37l36k828o1K035n507o67n677
$$ 4862 -1160 -5038 -1908 -1677 983 4957 4616 4342 5179 4843 2015 1954 3989 -1518 -2185 -7862
380088g862J12k5j560R719K491j377Q416k096r00P18l125k926j091o286k365o5
$$ -7862 -7750 -7775 -9335 384 2875 1498 9914 7818 6918 7636 4511 1585 494 -5792 -8157 -8222
381064h222Q381M346j154k439M611J963j1136p71o10N56L766K686P502L88p984
$$ -8222 159 4505 3351 912 5523 7486 -3650 -4421 -5031 -4475 -709 1977 9479 9867 1883
381980A883n05j95l97K683l786k379l35k708J019K026J11J568N458J209p399n394
$$ 1883 1378 1183 786 3469 -317 -2696 -3031 -5739 -4720 -2694 -2583 -1015 4443 5652 -1747 -7141
382957g141N721J276o793j986J74o120Q977J0245m489n28j79p83q97O881N512
$$ -7141 -1420 -144 -6937 -8923 -8749 -14869 -5892 4353 -136 -664 -843 -1626 -2523 4358 9870
383872I870q575r89N531q7J152p30n42M128n45j974k030k029L918j016j0817j336
$$ 9870 1295 306 5837 5750 6902 6172 5630 9758 9213 7239 5209 3180 7098 6082 -4735 -6071
384849f071N7O938K011l595J099k783P513m21j249q31L3J995L47q77o684M216
$$ -6071 -6014 924 2935 -660 439 -2344 5169 4748 3499 2668 2701 4696 5043 4166 -2518 1698
385825A698J789j037j346K861K678O76K915P87q714j0286k098J606J373K186J661
$$ 1698 3487 2450 1104 3965 6643 7319 10234 11021 2307 -7979 -10077 -8471 -7098 -4912 -3251
386741c251l736O210j781l990L443J705o313N99O240J385M750n9j601O064o561
$$ -3251 -6987 -777 -2558 -6548 -3105 -1400 -7713 -7114 -874 511 5261 5202 3601 9665 3104
387657C104l147k389J249K927J487L556O183K088l290q08J39p29r021p975J989
$$ 3104 -43 -2432 -1183 1744 3231 6787 12970 15058 11768 10960 11099 10370 1349 -6626 -4637
388572d637N26j617N560j806o202O103K004L732L833n3o15N050l949j0158K606
$$ -4637 -4111 -5728 -168 -1974 -8176 -2073 -69 3663 7496 7443 6828 11878 7929 -2229 377
389488C77J826j351r35L019j566j273n524J301J837n320L631N562N050k410l254
$$ 377 2203 852 -83 2936 1370 97 -5427 -4126 -2289 -7609 -3978 1584 6634 4224 970
390403I70k035N178M365j835p914k936N30P976m663l517N252J464L190k309n879
$$ 970 -1065 4113 8478 6643 -1271 -4207 -3677 4299 -364 -3881 1371 2835 6025 3716 -2163
391319b163l373K631K111M75K372m650L367J89n226L466j042N628k85P48P671
$$ -2163 -5536 -2905 -794 -319 2053 -2597 770 959 -4267 -801 -1843 3785 3500 4248 11919
392235A1919M154n696r937k931J380L49N859k466J176R20J556n905nL938M819
$$ 11919 16073 10377 440 -2491 -1111 -762 5097 2631 3807 4727 6283 378 373 4311 9130
393150I130k136l675M05J440k672j068l394O90L533l110J224L166m860L296K355
$$ 9130 6994 3319 3724 5164 2492 1424 -1970 -1280 2253 -857 367 3533 -1327 1969 4324
394066D324k035M140N388o359k596j78k196K190O77n393j975N059M638M417o38
$$ 4324 2289 6429 11817 5458 2862 2684 488 2678 3355 -2038 -4013 1046 5684 10101 9463
394981I463k697M728o491J160j60K620Q82n499j631m136j683M206P244L31n775
$$ 9463 6766 11494 5003 6163 6003 8623 9505 4006 2375 -1761 -3444 762 8006 8337 2562
395897B562J696J289n62j96k58L972m845o391R97N221N940P24J35o612o899P301
$$ 2562 4258 5547 4985 4789 4531 8503 3658 -2733 -1736 3485 9425 10149 10284 3672 -3227 4074
396873D074K435k644j04j633J1388l137j0297k948K093l448K70J443j791k044
$$ 4074 6509 3865 3761 2128 13516 10379 82 -2866 -773 -4221 -3951 -2508 -4299 -6343
397728f343Q765j502l483O494M277q81j720L410j0081l323P362J62r67j186J930
$$ -6343 2422 920 -2563 3931 8208 7327 5607 9017 -1064 -4387 2975 3137 2170 984 2914
398644B914K036j57k610k602J522M957k278N52K011K389J722K869J988j750L123
$$ 2914 4950 4793 2183 -419 1103 6060 3782 4334 6345 8734 10456 13325 15313 13563 16686
399559A6686L455o684q724l393K764N805k23p386m562k445j420J490K164J065
$$ 16686 20141 13457 4733 1340 4104 9909 9686 2300 -2262 -4707 -6127 -4637 -2473 -1408
400414a408L423L69l917n502L896P617K354L848j0584j912K480l963m073L500
$$ -1408 2015 2384 -1533 -7035 -3139 4478 6832 10680 96 -1816 664 -3299 -7372 -3872
401268c872q39M211J126K969K686p40l700j634J974N563p11j869l882n84m130
$$ -3872 -4711 -500 626 3595 6281 5541 1841 207 2181 7744 7033 5164 1282 698 -3432
402184c432j871L760O549N898k033r39l258J00n202K34J292J0574P11p992j502
$$ -3432 -5303 -1543 5006 10904 8871 7932 4674 4774 -428 -194 1098 11672 12383 4391 2889
403100B889L584Q278l297j029k862K239l866m707k956k356L157j537o315m85J1681
$$ 2889 6473 14751 11454 10425 7563 9802 5936 1229 -1727 -4083 -926 -2463 -8778 -9263 2418
404015B418k9K601j139o153l450j336P292k566K907m599l940J572J49M280j225
$$ 2418 2389 4990 3851 -2302 -5752 -7088 204 -2362 545 -4054 -7994 -6422 -6273 -1993 -3218
404931c218L423j089K351O120L358k90p996j0286K064K37J032K896j322L373L5
$$ -3218 205 -884 1467 7587 10945 10655 2659 -7627 -5563 -5326 -4294 -1398 -2720 653 688
405846F88q238J417O762O767p78n451j828k6N294L893J445n608m426NR962m778
$$ 688 -7550 -6133 629 7396 6618 1167 -661 -687 4607 8500 9945 4337 -89 -84 9878 5100
406823E100m824J099K684l577L461Q028M178j2681p730N861L685n00j739m506
$$ 5100 276 1375 4059 482 3943 11971 16149 3468 -4262 1599 5284 4784 3045 -1461
407677a461J87j152K493n84K277k377M075J431l072p007K539J4360j425o927k325
$$ -1461 -1274 -2426 67 -517 1760 -617 3458 4889 1817 -5190 -2651 11709 10284 3357 1032
408593A032P71q092J035L561M921L938o190k414Q985J160l22J398J305l528p23
$$ 1032 1803 -6289 -5254 -1693 3228 7166 976 -1438 7547 8707 8385 9783 11088 7560 6837
409508F837L21N09l199k183N379J341o916J129l062J712r86l642r15Q05r45n6
$$ 6837 7158 7667 4468 2285 7664 9005 2089 3218 156 1868 882 -2760 -3675 -2870 -3815 -3871
410485c871L848K299L478J798N095n301p350o35j78L72l28Q697K129n372M454
$$ -3871 -23 2276 5754 7552 12647 7346 -4 -639 -817 -445 -773 7924 10053 4681 9135
411401I135q788l018M023N582m130j451M250k561k549K342l107J809K921k092
$$ 9135 347 -2671 1352 6934 2804 1353 5603 3042 493 2835 -272 1537 4458 2366
412255B366K372M115K313m068l265m050k033N279J909q564L924N064n071l243
$$ 2366 4738 8853 11166 7098 3833 -217 -2250 3029 4938 -3626 298 5362 291 -2952
413110b952j877N09k316M342L238l824M894K29J158K092L66J417Q42L821m400
$$ -2952 -4829 -4320 -6636 -2294 944 -2880 2014 2243 3401 5493 5859 7276 8118 11939 7539
414025G539J279L298l600n292L880M03l74o976m588J62J449R700K094l110n976
$$ 7539 8818 12116 8516 3224 7104 7507 7133 157 -4431 -4269 -2820 6880 8974 5864 -112
414941a12m481N645P414M17j937N52P498o776l647L206k285r81L441L645p445
$$ -112 -4593 1052 8466 8883 6946 7498 14996 8220 4573 7779 5494 4513 7954 11599 4154
415857D154M30N016n126l535j622N524J212J883m222K081m770n864M004J013M971
$$ 4154 4584 9600 4474 939 -683 4841 6053 7936 3714 5795 1025 -4839 -835 178 5149
416772E149o32p264J20O598J304q78O0l491M30k231K110M126o94L044l92j258
$$ 5149 4517 -2747 -2627 3971 5275 4397 4457 966 1396 -835 1275 5401 4707 7751 7359 6101
417749F101J927m822J721k258n014J305k450Q22J190l074K897N686k342j18l642
$$ 6101 8028 3206 4927 2669 -2345 -1040 -3490 -2668 -1478 -4552 -1655 4031 1689 1571 -2071
418664b071Q6L325j839k014m79j086n893L183P383k083J450M425k175J209l819
$$ -2071 -1985 1340 -499 -2513 -2992 -4078 -9971 -6788 595 -1488 -38 4387 2212 3421 -398
419580c98L010P446l510n851r102K130m60P227M500R04J492o272J027M391l970
$$ -398 2612 10058 6548 697 -8405 -6275 -6735 492 4992 5896 7388 1116 2143 6534 2564
420495B564J492L865m266r17n169O211J041m318j770K676n154P088n45j245QQ267
$$ 2564 4056 7921 3655 2738 -2431 3780 4821 503 -1267 1409 -3745 3343 2798 1553 1561 9828
421472I828J118N389n30o939k018J002p191p835O351l218j502J601P84j765J548
$$ 9828 10946 16335 15805 8866 6848 7850 659 -7176 -825 -4043 -5545 -3944 -3160 -4925 -3377
422388c377J1595O135m955J86j745j864l158n053K362O38j647o46P562L276j196
$$ -3377 8218 14353 9398 9584 7839 5975 2817 -2236 126 764 -883 -1529 6033 9309 8113
423303H113q513L837l390k534P983M021o376m441l900J864m058j148n94P359J336
$$ 8113 -400 3437 47 -2487 5496 9517 3141 -1300 -5200 -3336 -7394 -8542 -9136 -1777 -441
424219d41j37R93M923L118k568m356j120K922m130m06k852l290l081J135m77j309
$$ -441 -578 415 5338 8456 5888 1532 412 3334 -796 -1202 -4054 -7344 -10425 -9290 -9767 -11076
425196a1076N722J3316N325n457n22q28p704m201j11O55L811M789k655p088q30
$$ -11076 -5354 7962 13287 7830 7308 6480 -1224 -5425 -5536 -4881 -1070 3719 1064 -6024 -6854
426111f854R989J546k147N691q76m1k555k99M821L070l518l587n356r77R44j944
$$ -6854 3135 4681 2534 8225 7349 7308 4753 4454 9275 12345 8827 5240 -116 -1093 -149 -2093
427088b093K31K343J178k831l636O109M482o350M73K034N601j854J247k877L99
$$ -2093 -1862 481 1659 -1172 -4808 1301 5783 -567 -94 1940 7541 5687 6934 4057 4456
428003D456q90J056M06Q24L039k362l401l778J821L967j270o874k333O909Q3R009
$$ 4456 3566 4622 5028 5852 8891 6529 3128 -650 1171 5138 3868 -3006 -5339 1570 1653 10662
428980A0662J043k384q76K377l390j573R56p124k903P750N602m449L48l045m518
$$ 10662 11705 9321 8445 10822 7432 5859 6815 -309 -3212 4538 10140 5691 6039 2994 -1524
429896a524j787J397O33l330L429P081P126o06n813K44n25J099O615j386m746
$$ -1524 -3311 -1914 -1281 -4611 -1182 5899 13025 12419 6606 6850 6325 7424 14039 12653 7907
430811G907K016M057q675k433m783M41L375K476M888l224l971k235p3J448M241
$$ 7907 9923 13980 5305 2872 -1911 -1470 1905 4381 9269 6045 2074 -161 -234 1214 5455
431727E455l630K127N300k99r46q710j4700L035K957J241j482P236K723L659m613
$$ 5455 1825 3952 9252 8953 8007 -703 -15403 -12368 -9411 -8170 -9652 -2416 307 3966 -647
432642f47L02m559j920j029q12M40N962l60Q749K330o30j952j307Q72l223n279
$$ -647 -345 -4904 -6824 -7853 -8665 -8225 -2263 -2623 6126 8456 7826 5874 4567 5439 2216 -3063
433619c063L865O907l980m558J292k474p225O74L500L29K934m22p339J009j272
$$ -3063 802 7709 3729 -829 463 -2011 -9236 -8562 -5062 -4733 -1799 -2221 -9560 -8551 -9823
434534i823M791M042J739K957J755k865j315o85j613J501J829K074J702k078j814
$$ -9823 -5032 -990 749 3706 5461 2596 1281 596 -1017 484 2313 4387 6089 4011 2197
435450B197J394M612j115n114J490m906R03M459m112M844n004m567l940K404J671
$$ 2197 3591 8203 7088 1974 3464 -1442 -539 3920 -192 4652 -352 -4919 -8859 -6455 -4784
436366d784J310N812L062N17k410K094m004l675M9L039K997l107K620L17N974
$$ -4784 -3474 2338 5400 5917 3507 5601 1597 -2078 -2029 1010 4007 900 3520 3837 9811
437281I811J546L668J578q465o861N593j290m162m899L3p05L742k986l326P154
$$ 9811 11357 15025 16603 8138 1277 6870 5580 1418 -3481 -3448 -4153 -411 -3397 -6723 431
438197D31J531M005j572j755J611K808k782m434K540o180l07N640p071m996P643
$$ 431 1962 5967 4395 2640 4251 7059 4277 -157 2383 -3797 -4104 1536 -5535 -10531 -2888
439112b888P412L092l510o213k717j305M742l684m391k942N873j781R867k653
$$ -2888 4524 7616 4106 -2107 -4824 -6129 -1387 -5071 -9462 -12404 -6531 -8312 1555 -1098
439967a098J047J216R35N485l12m63k748k503M458M335J552p04j551j760k893
$$ -1098 -51 1165 2100 7585 7273 6810 4062 1559 6017 10352 11904 11200 9649 7889 4996
440883D996L450j221o030l035L32J036K779N453M73L01m325j90m222J431P678
$$ 4996 8446 7225 1195 -1840 -1508 -472 2307 7760 8233 8534 4209 4019 -203 1228 8906
441798H906N856o338n948J092M305q372q86O926N40l252j071r34j691O43K384
$$ 8906 14762 8424 2476 3568 7873 -499 -1385 5541 6081 2829 1758 824 -867 -224 2160
442714B160K190K72j311r31M893Q04n184k163m236k601O851L383j454r34j216
$$ 2160 4350 4622 3311 2380 7273 8077 2893 730 -3506 -6107 744 4127 2673 1739 523
443629E23n295K681K790L060K596n604k573l05L899K392o43K130j516j1060K004
$$ 523 -4772 -2091 699 3759 6355 751 -1822 -2127 1772 4164 3521 5651 4135 -6925 -4921
444545d921Q343J317n773j541m628q1J783R158N8L827L364j407R85p913l376K144
$$ -4921 3422 4739 -1034 -2575 -7203 -7284 -5501 3657 3715 7542 10906 9499 10484 2571 -805 1339
445521A339j712J566p48L72O79P630j847j477q00k825q6M73O752l160j022o493
$$ 1339 -373 1193 445 817 1496 9126 7279 5802 5002 2177 2091 2564 9316 6156 5134 -1359
446498a359m332o371J9P480k544J302P248K483p28l330o783j190k97N815N017
$$ -1359 -5691 -12062 -12043 -4563 -7107 -5805 1443 3926 3198 -132 -6915 -8105 -8402 -2587 2430
447414B430j022M405K90l038L883j122k597j1714JJ0135o30J483l904o377l044
$$ 2430 1408 5813 6103 3065 6948 5826 3229 -8485 -8484 1651 1021 2504 -1400 -7777 -10821
448329a0821J468M141j214o209k426J0440O894O563p569q54R121l061j131m99
$$ -10821 -9353 -5212 -6426 -12635 -15061 -4621 2273 8836 1267 413 9534 6473 5342 4843
449184D843p982J619M92k472R27l366j587j285N436L624Q99l529J107m784N096
$$ 4843 -3139 -1520 -1028 -3500 -2573 -5939 -7526 -8811 -3375 249 1148 -2381 -1274 -6058 -962
450099i62N480P711j813n859n594m195O860L065J774L965n07P94J36N33j097r28
$$ -962 4518 12229 10416 4557 -1037 -5232 1628 4693 6467 10432 9925 10719 10855 11388 10291 9363
451076I363l22k499k169r43j486m003j324L996L36O607k678j571N129k453p169
$$ 9363 9041 6542 4373 3430 1944 -2059 -3383 613 949 7556 4878 3307 8436 5983 -1186
451992a186M311K625j286K023N49j385l926N216M115j537k749o090M167Q316N491
$$ -1186 3125 5750 4464 6487 7036 5651 1725 6941 11056 9519 6770 680 4847 13163 18654
452907A8654p944l586M380j600j209k788R32p765p610J584P632l676m483K782
$$ 18654 10710 7124 11504 9904 8695 5907 6839 -926 -8536 -6952 680 -2996 -7479 -4697
453762d697p20J710K158P300m406J362l753j523K458L881j379j09N403K819m109
$$ -4697 -5417 -3707 -1549 5751 1345 2707 -1046 -2569 -111 3770 2391 2282 7685 10504 6395
454677F395j655l154L334K925q7m532l518j377J796J480L928M600m814n196R90
$$ 6395 4740 1586 4920 7845 7758 3226 -292 -1669 127 1607 5535 10135 5321 125 1115
455593A115P35N073K040k33n397J505J116J022o113J807l180P65n870J132M469
$$ 1115 1850 6923 8963 8730 3333 4838 5954 6976 863 2670 -510 255 -5615 -4483 -14
456508a4K124k072m64J227J201L48n759N83R571l603n161j777N415M866J924R54
$$ -14 2110 38 -426 801 2002 2350 -3409 -2826 6745 3142 -2019 -3796 1619 6485 8409 9363
457485I363k668K807j0342j504J227L485M568m45o690o580l184L835N410j78M272
$$ 9363 6695 9502 -840 -2344 -1117 2368 6936 6491 -199 -6779 -9963 -6128 -718 -896 3376
458401C376o28J420K728M057m843r076N58R89j67l756M553Q918L934l560n798
$$ 3376 2748 4168 6896 10953 6110 -2966 -2408 -1419 -1586 -5342 -789 8129 12063 8503 2705
459316B705J567L417o186n894o534p760L991R139r0j617K932L229K813R40p374
$$ 2705 4272 7689 1503 -4391 -10925 -18685 -14694 -5555 -5645 -7262 -4330 -1101 1712 2652 -4722
460232d722m701J355J3440N244K467N529j981j0436k223l170m022M986Q653k456
$$ -4722 -9423 -8068 5372 10616 13083 18612 16631 6195 3972 802 -3220 1766 10419 7963
461086G963m591o086o43l632N891K490R33Q44l731o01J797J534M428N343j2192
$$ 7963 3372 -2714 -3357 -6989 -1098 1392 2325 3169 -562 -1163 634 2168 6596 11939 -253
462002b53n25L813l041o848J271k852j890R361j459K745K253O278j497j0155q119
$$ -253 -778 3035 -6 -6854 -5583 -8435 -10325 -964 -2423 322 2575 8853 7356 -2799 -10918
462918a0918J164L582M671Q09K157k262o480N202o4l280J0267J264n722N72j494
$$ -10918 -9754 -6172 -1501 -692 1465 -797 -7277 -2075 -2139 -5419 4848 6112 390 962 -532
463833e32P88Q040n71k041o692O611k75J47M61Q76k573O578N63O04j540O88l141
$$ -532 256 8296 7725 5684 -1008 5603 5328 5475 5936 6812 4239 10817 11380 11984 10444 11132 7991
464871G991j314k273m074m871J081L491R82N108m767k51m54J0041K82j0533L178
$$ 7991 6677 4404 330 -4541 -3460 31 1013 6121 1354 1103 649 10690 10972 439 3617
465786C617K240m700L279K677L713k474p345l209m97L336O551l85p549J132M250
$$ 3617 5857 1157 4436 7113 10826 8352 1007 -2202 -2699 637 7188 6803 -746 386 4636
466702D636L835J916n325k506p69m458k024K457J753N677L237P01N621l745M45
$$ 4636 8471 10387 5062 2556 1787 -2671 -4695 -2238 -485 5192 8429 9130 14751 11006 11451
467618A1451j634J837n872J180R030J340Q18l313k711j1218r660K072R597P363
$$ 11451 9817 11654 5782 6962 15992 17332 18150 14837 12126 908 -8752 -6680 2917 10280
468472A0280L190k695l726J004o888L56m46N352J002j258L215M643m013o019n068
$$ 10280 13470 10775 7049 8053 1165 1521 1075 6427 7429 6171 9386 14029 10016 3997 -1071
469388a071N601P142p80o888k154j177R7J654R953j015l891p373J669N849j958
$$ -1071 4530 11672 10892 4004 1850 673 770 2424 12377 11362 7471 98 1767 7616 5658
470303E658J62o57J756L774J404j57j2543N664K873n938k19N189p33M662j361
$$ 5658 5820 5163 6919 10693 12097 11940 -603 5061 7934 1996 1777 6966 6233 10895 9534
471219I534l943j420n106J53R16k825l109L059k067L719J2502L04o512r48q64
$$ 9534 5591 4171 -935 -782 134 -2691 -5800 -2741 -4808 -1089 11413 11717 5205 4257 3393
472134C393p205q66N045m993k435K808Q177n708k031P718j22M028K12j344L332
$$ 3393 -3812 -4678 367 -4626 -7061 -4253 3924 -1784 -3815 3903 3781 7809 8021 6677 10009
473050A0009j372l706P08j254J505n28r473n72K188M092j312k34k754K129L094
$$ 10009 8637 4931 5639 4385 5890 5362 -4111 -4683 -2495 1597 285 51 -2703 -574 2520
473966B520m300K490M294j230j709Q58J245k857j085r59n99N109k559l45j620
$$ 2520 -1780 710 5004 3774 2065 2923 4168 1311 226 -733 -1332 3777 1218 873 -747
474881g47k117k051K61K414p96J195k173J15M613K132O926m895j132K007J530
$$ -747 -2864 -4915 -4654 -2240 -3036 -1841 -4014 -3899 714 2846 9772 4877 3745 5752 7282
475797G282r81q435l986N747N843j198m849K037o75J268n848K521P914N452l294
$$ 7282 6301 -2134 -6120 -373 5470 4272 -577 1460 785 2053 -3795 -1274 6640 12092 8798
476712H798M03o13k939l810J157j545K02O622j289K971l317k478r92o49j936K65
$$ 8798 9201 8588 5649 1839 2996 1451 1653 8275 6986 9957 6640 4162 3170 2521 585 850
477689H50K542k791k494k984L050L612N201j497r801O171j099l859J966N118J521
$$ 850 3392 601 -1893 -4877 -1827 1785 6986 5489 -4312 1859 760 -3099 -1133 3985 5506
478605E506M214m345m253J678n324J31j827m05K89L208K508q31m741J82M460L355
$$ 5506 9720 5375 1122 2800 -2524 -2393 -4220 -4625 -4336 -1128 1380 549 -4192 -4010 450 3805
479581C805j754M60m83L327M347J629M04k240j739J596K2n96k270K599n23k37
$$ 3805 2051 2511 2028 5355 9702 11331 11735 9495 7756 9352 9374 8778 6508 9107 8584 8347
480558H347k272O56k816N53M841n351m683K618K06N18n81L63K543N332qo35o251
$$ 8347 6075 6731 3915 4468 9309 3958 -725 1893 2099 2617 2036 2399 4942 10274 10266 9631 3380
481595C380J387j847j667K468j150R58n55J943k058j546l630J863m118K317L114
$$ 3380 4767 2920 1253 3721 2571 3529 2974 4917 2859 1313 -2317 -454 -4572 -2255 859
482511H59M420P425n000N059j162k714n18L950k636l001J963P9k921p229M211
$$ 859 5279 12704 7704 12763 11601 8887 8369 12319 9683 6682 8645 8724 5803 -1426 2785
483427B785l56J590P15p186K637K689R31m84j854M531M326K557J601n065l45q79
$$ 2785 2429 4019 4734 -2452 185 2874 3805 3321 1467 5998 10324 12881 14482 9417 9072 8193
484403H193p781l11k678J881O834J188k593o034k319O344j317O390k532M538l61
$$ 8193 412 101 -2577 -696 6138 7326 4733 -1301 -3620 2724 1407 7797 5265 9803 9442
485319I442K062k641k248k187K47M924k205m662m902L956P263L199P83k490o927
$$ 9442 11504 8863 6615 4428 4675 9599 7394 2732 -2170 1786 9049 12248 13031 10541 3614
486234C614N98K965K550o13M253m458l427m324j027O199P242K477m369o553L61
$$ 3614 4212 7177 9727 9114 13367 8909 5482 1158 131 6330 13572 16049 11680 5127 5488
487150E488n0r46O222L191m630m550k909N056q82j125l093n278P229N737k460
$$ 5488 5438 4492 10714 13905 9275 4725 1816 6872 5990 4865 1772 -3506 3723 9460 7000
488065G000q080j653q08K176o50k579M462r70j755L165k65K975N82L156J303j029
$$ 7000 -1080 -2733 -3541 -1365 -2015 -4594 -132 -1102 -2857 308 43 3018 3600 6756 8059 7030
489042G030R67q24m168k282n970N735K731k813P37o38m33p095k443M927k218Q391
$$ 7030 7997 7173 3005 723 -5247 488 3219 406 1143 505 72 -7023 -9466 -4539 -6757 1634
490019A634J998j957k804L248m671J747L946m70j618l842k148J628N623J105o20
$$ 1634 3632 1675 -1129 2119 -2552 -805 3141 2671 1053 -2789 -4937 -3309 2314 3419 2799
490934B799j566j565J062l478o725k070R705O338L595l098R3L320p912M431q7
$$ 2799 1233 -332 730 -2748 -9473 -11543 -1838 4500 8095 4997 5090 8410 498 4929 4842
491850D842r85O94L366M594j829k870n750J942N06K342k151M664n759l655j502
$$ 4842 3857 4551 7917 12511 10682 7812 2062 4004 4510 6852 4701 9365 3606 -49 -1551
492765a551L726k02o827L131K025K717J071n724j500L530k86K881Q03k450N108
$$ -1551 2175 1973 -4854 -1723 302 3019 4090 -1634 -3134 396 110 2991 3794 1344 6452
493681F452K261l907m688N38j861k027n488K701N275N748J072O94n38J850k329
$$ 6452 8713 4806 118 656 -1205 -3232 -8720 -6019 -744 5004 6076 6770 6232 8082 5753
494597E753j609Q519k851j1191L714K869m381K677R80O28L257j631l064j535j498
$$ 5753 4144 12663 9812 -1379 2335 5204 823 3500 4480 5108 8365 6734 3670 2135 637
495512F37j060L90K312M132k605K003p02k85K598j965j331N715l650k484P46n032
$$ 637 -423 -33 2279 6411 3806 5809 5107 4822 7420 5455 4124 9839 6189 3705 4451 -581
496489e81K542J984n491J82N961K160j030l285L279K553p966J729J460L326J75
$$ -581 1961 3945 -1546 -1364 4597 6757 5727 2442 5721 8274 308 2037 3497 6823 6998
497404F998L334r55l565p24J189j77j888J924K066N601L049n869m263q770M020
$$ 6998 10332 9377 5812 5088 6277 6100 4212 6136 8202 13803 16852 10983 6720 -2050 1970
498320A970L498k52J38j224J272o248J54K331k756P00l991J05N082J780o568K966
$$ 1970 5468 5216 5354 4130 5402 -846 -692 1639 -1117 -417 -4408 -4303 779 2559 -4009 -1043
499297a043J077J500Q45m336K096M595K537q602M007m32k127K870l031O3L439
$$ -1043 34 1534 2379 -1957 139 4734 7271 -1331 2676 2244 117 2987 -44 19 3458
500212C458J543l623k636p603M70M009K783L71L383k10m140j964K38K230O804
$$ 3458 5001 1378 -1258 -8861 -8391 -4382 -1599 -1228 2155 1945 -2195 -4159 -3921 -1691 5113
501128E113Q90J251m99l7k394p285o1O251K298l078N90o675j648l698o26P437
$$ 5113 6003 7254 6755 6718 4324 -2961 -3022 3229 5527 2449 3039 -3636 -5284 -8982 -9608 -2171
502104b171R302K078p892N16M190q772k04K649j967K1J218N017N41n42J17l106
$$ -2171 7131 9209 1317 1833 6023 -2749 -2953 -304 -2271 -2250 -1032 3985 4526 3984 4101 995
503081I95L038j22k29o72j876j211j010m7K005j232m224M839P765R96l236K573
$$ 995 4033 3911 3682 3010 1134 -77 -1087 -1134 871 -361 -4585 254 8019 9015 5779 8352
504058H352j435J257r332j562O918K827q117m430R001K328p83j005L931l59J605
$$ 8352 6917 8174 -1158 -2720 4198 7025 -1092 -5522 3479 5807 5024 4019 7950 7591 9196
504973I196m320j275k96M272m562p51j646n518r81n191N259R853n757K886P30
$$ 9196 4876 3601 3305 7577 3015 2264 618 -4900 -5881 -11072 -5813 4040 -1717 1169 1899
505889A899K547J038m055j820j47p60L05k143j052P744L145K016m092r05L768
$$ 1899 4446 5484 1429 -391 -538 -1298 -993 -3136 -4188 3556 6701 8717 4625 3720 7488
506804G488K637l702m127j896j506l979K821M420R91J689j0210l889J140K451
$$ 7488 10125 6423 2296 400 -1106 -5085 -2264 2156 3147 4836 -5374 -9263 -8123 -5672
507659e672J1218J414L1n759k899N780q85k616J309K088M274p328m377M531K717
$$ -5672 5546 6960 6991 1232 -1667 4113 3228 612 1921 4009 8283 955 -3422 1109 3826
508575C826J516j376K538o22M266m940l148N836K8k884k336M838M576M08m528
$$ 3826 5342 3966 6504 5882 10148 5208 2060 7896 7924 5040 2704 7542 12118 12526 7998
509490G998q19l839m776l619N445N791m50M69p538j016K53R82j069r236O901J159
$$ 7998 7179 3340 -1436 -5055 390 6181 5731 6200 -1338 -2354 -2101 -1119 -2188 -11424 -4523 -3364
510467c364J686M086O555P84N58k685q552K591n55K623P18k177j016L309J579
$$ -3364 -1678 2408 8963 9747 10305 7620 -932 1659 1104 3727 4445 2268 1252 4561 6140
511382F140J242L64L037m003M889m75j0182Q010L7j1553N207J826j601o887M092
$$ 6140 7382 7746 10783 6780 11669 11194 1012 9022 9059 -2494 2713 4539 2938 -3949 143
512298A43R824l50l910K97N089N62o784J528L774k0o869l106M262p16M26j276
$$ 143 9967 9617 5707 6004 11093 11655 4871 6399 10173 10153 3284 178 4440 3724 4150 2874
513275B874k51o574m781J1676K490l055l319q79L276L487M93m125J345L96q50
$$ 2874 2623 -3951 -8732 2944 5434 2379 -940 -1819 1457 4944 5437 1312 2657 3053 2203
514190B203l45p388j457Q115j692l478R456j507k702J387j703l238L247M90m423
$$ 2203 1858 -5530 -6987 1128 -564 -4042 5414 3907 1205 2592 889 -2349 898 1388 -3035
515106c035j386M881O627m176P12K903j798P159o33j1586J158K705p006L682O041
$$ -3035 -4421 460 7087 2911 3623 6526 4728 11887 11254 -332 826 3531 -3475 207 6248
516021F248l365n560L251M479j607n521J0420M120p911m833q8j453N219o670J114
$$ 6248 2883 -2677 574 5053 3446 -2075 8345 12465 4554 -279 -367 -1820 3399 -3271 -2157
516937b157J219r240n329q74Q082Q510K611r24O59J262r458n286K646m844J1479
$$ -2157 -938 -10178 -15507 -16381 -8299 211 2822 1898 2557 3819 -5639 -10925 -8279 -13123 -1644
517853a644j747m24K269J297M051K382l400P81k250J380J174n591m36J1442l307
$$ -1644 -3391 -3815 -1546 -249 3802 6184 2784 3565 1315 2695 3869 -1722 -2158 9284 5977
518768E977n995L083L154k850l492L78j3K85K68O605N92q807O29K208j419p659
$$ 5977 -18 3065 6219 3369 -123 255 242 527 795 7400 7992 -815 -186 2022 603 -7056
519745g056n34N965J578J792p653k84J0524k249l489l288J785K147K890k949J023
$$ -7056 -7590 -1625 -47 1745 -5908 -6192 4332 2083 -1406 -4694 -2909 -762 2128 -821 202
520660B02J615N192l199k40j198q91l65k050j878k997o179M214O192L414K828
$$ 202 1817 7009 3810 3570 2372 1481 1116 -934 -2812 -5809 -11988 -7774 -1582 1832 4660
521576D660J521p760m266k704L488O255q39l446m93N816m710L609M084n861l167
$$ 4660 6181 -1579 -5845 -8549 -5061 1194 355 -3091 -3584 2232 -2478 1131 5215 -646 -3813
522492c813Q910M046J34p337p247Q504n60j847p413k235L792K232N718J625o878
$$ -3813 5097 9143 9277 1940 -5307 3197 2637 790 -6623 -8858 -5066 -2834 2884 4509 -2369
523407b369L8K150J508k762J521N518j240M15m415O8Q198r57k302K91o249n64
$$ -2369 -2331 -181 1327 -1435 86 5604 4364 4779 364 432 8630 7673 5371 5662 -587 -1151
524384a151q44l104O559k717M572j971n405Q49M228l454J097N446k436n437k42
$$ -1151 -1995 -5099 1460 -1257 3315 1344 -4061 -3212 1016 -2438 -1341 4105 1669 -3768 -4010
525299d010k382J933L978K837o236K216O397m449p228L87O55K696L157J111K243
$$ -4010 -6392 -4459 -481 2356 -3880 -1664 4733 284 -6944 -6557 -5902 -3206 -49 1062 3305
526215C305K878l345O76J082K781j851P91n870j189k081j751O032M420kj263k695
$$ 3305 6183 2838 3514 4596 7377 5526 6317 447 -742 -2823 -4574 1458 5878 5876 4613 1918
527191A918r03M176P12r38J482O327m079p098j876l74M676M359p162p89L871m904
$$ 1918 1015 5191 5903 4965 6447 12774 8695 1597 -279 -653 4023 8382 1220 431 4302 -602
528168f02o468J030O317L736K102l718n709M460K696K222j870J390J01n859q77
$$ -602 -7070 -6040 277 4013 6115 2397 -3312 1148 3844 6066 4196 5586 5687 -172 -1049
529084a049m12o859K563L610N658n3J075O949j841o045m934M848o052J083M989
$$ -1049 -1461 -8320 -5757 -2147 3511 3458 4533 11482 9641 3596 -1338 3510 -2542 -1459 3530
529999C530l569R693M935k169m35n055q282l60l39m032J965M300j237k611n86
$$ 3530 -39 9654 14589 12420 11985 6930 -1352 -1712 -2051 -6083 -4118 182 -1055 -3666 -4252
530915d252LM109N469n004j654p082j6R657J899o658k77j57l331K517Q010j496
$$ -4252 -4249 -140 5329 325 -1329 -8411 -8427 1230 3129 -3529 -3806 -3963 -7294 -4777 3233 1737
531892A737k225n731M244O447J331J062M150k139r92P65r126K209L720n52l262
$$ 1737 -488 -6219 -1975 4472 5803 6865 11015 8876 7884 8649 -477 1732 5452 4900 1638
532807A638O3O921J476n663M259M590j0012K528l092m222l008j745m005J019N486
$$ 1638 1701 8622 10098 4435 8694 13284 3272 5800 2708 -1514 -4522 -6267 -10272 -9253 -3767
533723c767Q99J781L104K051J198o265l532N983P91k221L709k435K355q73r8o003
$$ -3767 -2868 -1087 2017 4068 5266 -999 -4531 1452 2243 22 3731 1296 3651 2778 2680 -3323
534699c323O512N366r05j791M23l771j391o607m675O442J2993M373p216n40j119
$$ -3323 3189 8555 7650 5859 6282 2511 1120 -5487 -10162 -3720 9273 13646 6430 5890 4771
535615D771p574N130J876k695n426j846L005M734j465J256K526r95k833J086Q373
$$ 4771 -2803 2327 4203 1508 -3918 -5764 -2759 1975 510 1766 4292 3297 464 1550 9923
536530I923o321L03m939k69M192l070p274P59L279M538K456J034k373M65J849
$$ 9923 3602 3905 -1034 -1303 2889 -181 -7455 -6696 -3417 1121 3577 4611 2238 2703 4552
537446D552K020n117j353O586L469k924j339q712q014O52l27O16J508K925K904
$$ 4552 6572 1455 102 6688 10157 7233 5894 -2818 -10832 -10180 -10507 -9891 -8383 -5458 -2554
538362b554N757m766k338N719j457l512j45Q384K838q968m66J786m396K159P634
$$ -2554 3203 -1563 -3901 1818 361 -3151 -3296 5088 7926 -1042 -1508 278 -4118 -1959 5675
539277E675p789J760K64k142m132J295P944k904o260P680L890n538m113k649l471
$$ 5675 -2114 -354 -90 -2232 -6364 -5069 2875 -29 -6289 1391 5281 -257 -4370 -7019 -10490
540193a0490k203L453L622L500L98j391l205L230K831L127k904j58o193K138r48
$$ -10490 -12693 -9240 -5618 -2118 -1720 -3111 -6316 -3086 -255 2872 -32 -190 -6383 -4245 -5193
541108e193n406j36O712O19L534j659M157Q358L796l812q031m807l878J618K958
$$ -5193 -10599 -10735 -4023 -3404 130 -1529 2628 10986 14782 10970 2939 -1868 -5746 -4128 -1170
542024a170K073J764J032Q83j085n197J13n19n54J648P437m782K202N019r14q745
$$ -1170 903 2667 3699 4582 3497 -1700 -1587 -2106 -2660 -1012 6425 1643 3845 8864 7950 -795
543000g95l261l475M516N972j278r57N835K302j0624r58j156k206L995Q970M105
$$ -795 -4056 -7531 -3015 2957 1679 722 6557 8859 -1765 -2723 -3879 -6085 -2090 6880 10985
543916A0985J835j671n849o049Q153K784l009K099m487L926L435J20m080m395
$$ 10985 12820 11149 5300 -749 7404 10188 7179 9278 4791 8717 12152 12272 8192 3797
544771C797m54N982m625m163L17l044k484K366n45L016P288P922K159o913m098
$$ 3797 3343 9325 4700 537 854 -2190 -4674 -2308 -2853 163 7451 15373 17532 10619 6521
545686F521r59K388m642L69l547n81j221L025P57m52M64M287k554R40k234p954
$$ 6521 5562 7950 3308 3677 130 -451 -1672 1353 2110 1658 2122 6409 3855 4795 2561 -5393
546663e393K049K248J310L70J689J917n41o194L32P459l31j809m332P19K673m376
$$ -5393 -3344 -1096 214 584 2273 4190 3649 -2545 -2213 5246 4915 3106 -1226 -507 2166 -2210
547639b210N179L167j974o61K367q484j23O295K674K491K601J556j1175l613O82
$$ -2210 2969 6136 4162 3501 5868 -2616 -2739 3556 6230 8721 11322 12878 1703 -1910 -1228
548555a228J649L668j374n126k606L772J961j13J378M19P111n529M416L593r902
$$ -1228 421 4089 2715 -2411 -5017 -1245 716 603 1981 2400 9511 3982 8398 11991 2089
549471B089l454Q786K382n621j197j605k723j614j80L887n322N310L811K315r38
$$ 2089 -1365 7421 9803 4182 2985 1380 -1343 -2957 -3137 750 -4572 738 4549 6864 5926
550386E926k750K331J911l006l736Q14J476M98n08L899M755o518l274k838n008
$$ 5926 3176 5507 7418 4412 676 1490 2966 3464 2956 6855 11610 5092 1818 -1020 -6028
551302f028L015j391K769L312j900k6K133J086m418J496l720P20N963L564k944
$$ -6028 -3013 -4404 -1635 1677 -223 -249 1884 2970 -1448 48 -3672 -2952 3011 6575 3631
552217C631q658L958R82j18l516O446K737L72L094K488K730r71m540m207k454
$$ 3631 -5027 -1069 -87 -205 -3721 2725 5462 5834 8928 11416 14146 13175 8635 4428 1974
553133A974q8M892m283r68J613L847o03j448J13m709k205O897j15n081l447K674
$$ 1974 1886 6778 2495 1527 3140 6987 6384 4936 5049 340 -1865 5032 4917 -164 -3611 -937
554110i37k502o96L336j682Q99K009k824m58j497L868N663j202j164K385m800
$$ -937 -3439 -4135 -799 -2481 -1582 427 -2397 -2855 -4352 -484 5179 3977 2813 5198 398
555025C98N388K161p174M366Q23r85n145q701o398N578Q214J321n25J819j804
$$ 398 5786 7947 773 5139 5962 4977 -168 -8869 -15267 -9689 -1475 -154 -679 1140 -664
555941f64j490M633j051M375l49j950l498m002O495J893K985L311m584j22j213
$$ -664 -2154 2479 1428 5803 5454 3504 6 -3996 2499 4392 7377 10688 6104 5982 4769
556856D769m385o478l699J959M466K410J505J54j604k032l511J61P249O864p830
$$ 4769 384 -6094 -9793 -7834 -3368 -958 547 701 -903 -2935 -6446 -6285 964 7828 -2
557772bJ819r77k401P92n308M882k183L501M527J933p51k693k815n842L05K66
$$ -2 1817 840 -1561 -769 -6077 -1195 -3378 123 4650 6583 5832 3139 324 -5518 -5213 -4947
558748d947K240J031K534j731j75K924K106q7j143l896m854N955q95J389J443
$$ -4947 -2707 -1676 858 -873 -1048 1876 3982 3895 2752 -1144 -5998 -43 -938 451 1894
559664A894o550o974L751K017K961J0655M560p566k555m636j184M250L676J58
$$ 1894 -4656 -11630 -7879 -5862 -2901 7754 12314 4748 2193 -2443 -3627 623 4299 4457
560519D457O64j434r66N293k363m087N245N843m04r722k5l718n28j632N201M979
$$ 4457 5121 3687 2721 8014 5651 1564 6809 12652 12248 2526 2501 -1217 -1745 -3377 1824 6803
561495F803N10Q10J909n533j819O529Q097k723p520l95Q23o057k394L418o4M1
$$ 6803 7313 8123 10032 4499 2680 9209 17306 14583 7063 6668 7491 1434 -960 2458 2394 2435
562472B435R74k109J728o79j12O090K763n950n866p791q73J684P721o601K998
$$ 2435 3409 1300 3028 2349 2237 8327 11090 5140 -726 -8517 -9390 -7706 15 -6586 -3588
563387c588K259K497m600j330J88j399J773M477K270R192j687p953J901K19o34
$$ -3588 -1329 1168 -3432 -4762 -4574 -5973 -4200 277 2547 11739 10052 2099 4000 4219 3585
564303C585K401j578j635j925M290M48p28m095J073L246l388N184N149n775o154
$$ 3585 5986 4408 2773 848 5138 5586 4858 763 1836 5082 1694 6878 12027 6252 98
565219I8J821J757k402K595j236J148K796L54k037l052L931j092n595L258k44
$$ 98 1919 3676 1274 3869 2633 3781 6577 6931 4894 1842 5773 4681 -914 2344 2100
566134B100k374j866J624M914L866m467P097m675j559J285m021o32L84L1L302
$$ 2100 -274 -2140 -516 4398 8264 3797 10894 6219 4660 5945 1924 1292 1676 1707 5009
567050E009L31m195N533k247n121o599p75P606q310M729P23J3K531L176K11J196
$$ 5009 5340 1145 6678 4431 -690 -7289 -8064 -458 -8768 -4039 -3316 -3303 -772 2404 2615 3811
568026C811K280m584L649l051q63J894j29l858J58K594J162m828n2j051N59o094
$$ 3811 6091 1507 5156 2105 1242 3136 3007 -851 -693 1901 3063 -1765 -1817 -2868 -2309 -8403
569003h403N315M061k669K573K316l07R05P277m629k302j364j921l140N17K5M162
$$ -8403 -3088 973 -1696 877 3193 2886 3791 11068 6439 4137 2773 852 -2288 -1771 -1746 2416
569980B416N399k442M954R21j724l015p99l298J152L570n8j415m64p965Q95P752
$$ 2416 7815 5373 10327 11248 9524 6509 5710 2412 3564 7134 7076 5661 5197 -2768 -1873 5879
570956E879O073k915p78l851q29j213q786K113K61j508K769j237m17K329M651
$$ 5879 11952 9037 8259 4408 3579 2366 -6420 -4307 -4046 -5554 -2785 -4022 -4439 -2110 2541
571872B541m607R68j107K354Q801p6l857k063J487o255J943k595O70J73l342J872
$$ 2541 -2066 -1098 -2205 149 8950 8874 5017 2954 4441 -1814 129 -2466 -1796 -1623 -4965 -3093
572848c093J990k315K589N195o219N342j37n837l405M854N521L212L091K544k858
$$ -3093 -1103 -3418 -829 4366 -1853 3489 3352 -2485 -5890 -1036 4485 7697 10788 13332 10474
573764A0474q207K952M797n494o49j47m464l888m392p85O009L829O052j971k078
$$ 10474 2267 5219 10016 4522 3873 3726 -738 -4626 -9018 -9803 -3794 35 6087 4116 2038
574680B038K585n269M029o4L320k246l872j006m72K729K097k676l92j261l757
$$ 2038 4623 -646 3383 3319 6639 4393 521 -485 -957 1772 3869 1193 801 -460 -4217
575595d217L000n117m464M63O202N615O771J791m783j922M56J549l47k345L433
$$ -4217 -1217 -6334 -10798 -10335 -4133 1482 8253 10044 5261 3339 3795 5344 4997 2652 6085
576511F085j904j887q50K874l372j087K016k57o56m168K601k699n131Q96M962
$$ 6085 4181 2294 1444 4318 946 -141 1875 1618 962 -3206 -605 -3304 -8435 -7539 -2577
577426b577n5J802K006M400j80p80O24o391k580L462k859m44k79K617N589L738
$$ -2577 -2632 -830 1176 5576 5396 4616 5240 -1151 -3731 -269 -3128 -3572 -3851 -1234 4355 8093
578403H093l221m535l635m680q67k708k188M657J74R58L711P299J0110k218o962
$$ 8093 4872 337 -3298 -7978 -8845 -11553 -13741 -9084 -8910 -7952 -4241 3058 13168 10950 3988
579318C988o600J338K174k089p966M500j149q33K893K284J160k576q44L298n34
$$ 3988 -2612 -1274 900 -1189 -9155 -4655 -5804 -6637 -3744 -1460 -300 -2876 -3720 -422 -956
580234i56p530P013M610m245k909M989j314l832K688N86J057k305j034N868N091
$$ -956 -8486 -1473 3137 -1108 -4017 972 -342 -4174 -1486 -900 157 -2148 -3182 2686 7777
581150G777n09k550K59M179N30M398k469j078m391n531k465K509M639Q57k966
$$ 7777 7268 4718 4977 9156 9686 14084 11615 10537 6146 615 -1850 659 5298 6155 3189
582065C189L385M875L650j759m910k877q422j000O321N156j401n809p58j918J766
$$ 3189 6574 11449 15099 13340 8430 5553 -2869 -3869 2452 7608 6207 398 -360 -2278 -512
582981e12l976M299M017j801l448R42J63J618k9m793L125K734r25M405Q53j2515
$$ -512 -4488 -189 3828 2027 -1421 -479 -316 1302 1273 -3520 -395 2339 1414 5819 6672 -5843
583958e843M332j278j124l250N252Q157M027m664m469n64K897N925M480j377q158
$$ -5843 -1511 -2789 -3913 -7163 -1911 6246 10273 5609 1140 576 3473 9398 13878 12501 4343
584873D343k97O194O91k898l232J346k209Q89L386m725j793J702n508j02M172
$$ 4343 4046 10240 10931 8033 4801 6147 3938 4827 8213 3488 1695 3397 -2111 -2213 1959
585789A959J55J352O24p111k918r15P45J681O67P1J316M966L67l047K365K424
$$ 1959 2114 3466 4090 -3021 -5939 -6854 -6109 -4428 -3761 -3690 -2374 2592 2959 -88 2277 4701
586766D701q598p388M568J848K713M037o248L943J565J718j429K114L126m458
$$ 4701 -3897 -11285 -6717 -4869 -2156 1881 -4367 -424 1141 2859 1430 3544 6670 2212
587620B212p167J789K636K477O52r369K986Q94O15k887o525Q468K591n930m840
$$ 2212 -4955 -3166 -530 1947 2599 -6770 -3784 -2890 -2275 -5162 -11687 -3219 -628 -6558 -11398
588536a1398L461P909L779r3m616j518k150K363K098k809O840k652k122j494J0465
$$ -11398 -7937 -28 3751 3658 -958 -2476 -4626 -2263 -165 -2974 3866 1214 -908 -2402 8063
589451H063K269l087K191K413J484m465m227o864M014M825K006k954n153J646
$$ 8063 10332 7245 9436 11849 13333 8868 4641 -2223 1791 6616 8622 5668 515 2161
590305B161k999k134P761P012l433q975p23N251J267n183P06j48K45L017k155
$$ 2161 -838 -2972 4789 11801 8368 -607 -1330 3921 5188 5 711 563 808 3825 1670
591221A670k724l31j262l86K130L142M710j073L989J68o415m100L119o633O79
$$ 1670 -1054 -1385 -2647 -3033 -903 2239 6949 5876 9865 10033 3618 -482 2637 -3996 -3317
592137c317k973q73L060j501J19J839n101k804J0036q04l866M481M413m95j975
$$ -3317 -6290 -7163 -4103 -5604 -5485 -3646 -8747 -11551 -1515 -2319 -6185 -1704 2709 2214 239
593052B39l303j325K51o80M37N35P214J549M529k388m391l450j923l565k838m7
$$ 239 -3064 -4389 -4138 -4818 -4381 -3846 3368 4917 9446 7058 2667 -783 -2706 -6271 -9109 -9156
594029i156j877M093J766L028M945L317J547p91o102l696r84j281J346o221K604
$$ -9156 -11033 -6940 -5174 -2146 2799 6116 7663 6872 770 -2926 -3910 -5191 -3845 -10066 -7462
594945g462N328K289K816L127K314J86L7m313O94N476J385o006j350o902N91Q608
$$ -7462 -2134 155 2971 6098 8412 8598 8635 4322 5016 10492 11877 5871 4521 -2381 -1790 6818
595921F818j165n394Q44J0263p38L31l339l628K976O810Mr008L431j758L14l399
$$ 6818 5653 259 1103 11366 10628 10959 7620 3992 6968 13778 13782 4774 8205 6447 6761 3362
596898C362j34p540r09P047P685n279p15L216L17q257l683K318R7j08K371o657
$$ 3362 3228 -4312 -5221 1826 9511 4232 3517 6733 7050 -1207 -4890 -2572 -2475 -2583 -212 -6869
597874f869j18M424m825J59N566J994O009K110m57m231J489k067L385K196M252
$$ -6869 -6987 -2563 -7388 -7229 -1663 331 6340 8450 7993 3762 5251 3184 6569 8765 13017
598790A3017o070m976N08k859K386K500k911K289j07M508j151l853k259k738o03
$$ 13017 6947 1971 2479 -380 2006 4506 1595 3884 3777 8285 7134 3281 1022 -1716 -2319
599706b319O219M476n63l643k547K958l212P0r5k538j41Q32K847k707L878j381
$$ -2319 3900 8376 7813 4170 1623 4581 1369 1439 1344 -1194 -1335 -503 2344 -363 3515 2134
600682B134P56O00j240K543M733p840o746L86O967P87p13m352P04j534L801k376
$$ 2134 2890 3490 2250 4793 9526 1686 -5060 -4674 2293 3080 2367 -1985 -1281 -2815 986 -1390
601659a390J0475k131l712P41k989j023r59k415j891J247o067L805P071l640k423
$$ -1390 9085 6954 3242 3983 994 -29 -988 -3403 -5294 -4047 -10114 -6309 762 -2878 -5301
602575e301N486J783n84n79l554P14M705N597k367n840M321j574O190P97l262
$$ -5301 185 1968 1384 805 -2749 -2035 2670 8267 5900 60 4381 2807 8997 9794 6532
603490F532r115O584M322j1839l764K721N305K041K751N625k10l570n159L729
$$ 6532 -2583 4001 8323 -3516 -7280 -4559 746 2787 5538 11163 10953 7383 2224 5953
604345E953J280m269L525Q60n311J184M042k857j512O248m624n546q780L78M617
$$ 5953 7233 2964 6489 7349 2038 3222 7264 4407 2895 9143 4519 -1027 -9807 -9429 -4812
605260d812k044Q797R885k402p932l069l081J60K553L924L297K27q585o127K834
$$ -4812 -6856 1941 11826 9424 1492 -1577 -4658 -4498 -1945 1979 5276 5503 -3082 -9209 -6375
606176f375J582L415O654o365J990K318K213M11M352k17j144l116j1545M544K600
$$ -6375 -4793 -1378 5276 -1089 901 3219 5432 5843 10195 9978 8834 5718 -5827 -1283 1317
607091A317O519M394L018k594l272J347L024o715o110L105k96L316k154l481j115
$$ 1317 7836 12230 15248 12654 9382 10729 13753 7038 928 4033 3737 7053 4899 1418 303
608007C03p79N363K558m376R52l267J978J1982p482M418k885n143m385J542k510
$$ 303 -476 4887 7445 3069 4021 754 2732 14714 7232 11650 8765 3622 -763 779 -1731
608923a731M274P587L137m364Q3j174j425o73j932n193M149L294M076j863k127
$$ -1731 2543 10130 13267 8903 8986 7812 6387 5714 3782 -1411 2738 6032 10108 8245 6118
609838F118j910j660j89J644N13K448j375P65m434J436l86K777J525K353m663
$$ 6118 4208 2548 2359 4003 4516 6964 5589 6354 1920 3356 2970 5747 7272 9625 4962
610754D962j547m634m279J697K162j004K943Q85R334j179m172J578p102n913J21
$$ 4962 3415 -1219 -5498 -3801 -1639 -2643 300 1185 10519 9340 5168 6746 -356 -6269 -6148
611669f148P462K181j4O390l988k862J092j553j70J872l627M164p01k294j550
$$ -6148 1314 3495 3481 9871 5883 3021 4113 2560 2390 4262 635 4799 4098 1804 254
612585B54N332M763p414K87o4j220K187j921N213K29j860L106M579l359K206K640
$$ 254 5586 10349 2935 3222 3158 1938 4125 2204 7417 7646 5786 8892 13471 10112 12318 14958
613562A4958k922l819J146N38j45L1o997k122n297M246q62k406l90j98j920o382
$$ 14958 12036 8217 9363 9901 9756 9787 2790 668 -4629 -383 -1245 -3651 -4041 -4239 -6159 -12541
614538a2541N97O948K404K155J349K300k469O141J918j746l710j902p35L17l314
$$ -12541 -11944 -4996 -2592 -437 912 3212 743 6884 8802 7056 3346 1444 709 1026 -2288
615454b288J4l513Qj553K642n89Q7L347L169L467k137O36j330r49O547O763k752
$$ -2288 -2274 -5787 -5779 -7332 -4690 -5279 -5192 -1845 1324 4791 2654 3290 1960 1011 7558 14321 11569
616491A1569j835K110l670o502L9m461l048k292O06J549O036K551J816M955k126
$$ 11569 9734 11844 8174 1672 1711 -2750 -5798 -8090 -7484 -5935 101 2652 4468 9423 7297
617407G297n365Q214m18l222k659J334k96K437L466j611k448l083j285K35n55
$$ 7297 1932 10146 9728 6506 3847 5181 4885 7322 10788 9177 6729 3646 2361 2596 2041
618323B041J631L93q484o649L205K297m66j518L777k037J0345O758r497n140J503
$$ 2041 3672 4065 -4419 -11068 -7863 -5566 -6032 -7550 -3773 -5810 4535 11293 1796 -3344 -1841
619238a841m029P84O252J812J464N027o429J269K502j015j788q10N886j35j905
$$ -1841 -5870 -5086 1166 2978 4442 9469 3040 4309 6811 5796 4008 3198 9084 8949 7044
620154G044k135j171K694Q05j0238j085K827k623l552N577J007J762M866j271
$$ 7044 4909 3738 6432 7237 -3001 -4086 -1259 -3882 -7434 -1857 -850 912 5778 4507
621008D507j549n39Q74o443M146j984n796N74Q464R811L917o831m190O393J033
$$ 4507 2958 2419 3293 -3150 996 -988 -6784 -6210 2254 12065 15982 9151 4961 11354 12387
621924A2387q461K001L274j709n321o05M105k593l581l834k666k143O550o00j416
$$ 12387 3926 5927 9201 7492 2171 1566 5671 3078 -503 -4337 -7003 -9146 -2596 -3196 -4612
622839d612m63r08R20q49P63k929K802J894O43j225M827L267l758l891o281j403
$$ -4612 -5075 -5983 -5063 -5912 -5149 -8078 -5276 -3382 -2739 -3964 863 4130 372 -3519 -9800 -11203
623816a1203R347R015n214m529j483L828N467O610Q35M15p296m923K994l056m506
$$ -11203 -1856 7159 1945 -2584 -4067 -239 5228 11838 12673 13088 5792 869 3863 807 -3699
624732c699m265j412O237l133O615Q177m301m559R7J499L871j616M660M92k125
$$ -3699 -7964 -9376 -3139 -6272 343 8520 4219 -340 -243 1256 5127 3511 8171 8663 6538
625647F538J140M87k090n468m454l454N862J0196K979l590m803M685M528n279
$$ 6538 7678 8165 6075 607 -3847 -7301 -1439 8757 11736 8146 3343 8028 12556 7277
626502G277K821j094J101m689p055K715Q364l842m420m712j661L650p71k758M36
$$ 7277 10098 9004 10105 5416 -1639 1076 9440 5598 1178 -3534 -5195 -1545 -2316 -5074 -4638
627417d638P256K271L018L966M12j36k867n076p534L827J933l415K479M370P406
$$ -4638 2618 4889 7907 11873 12285 12149 9282 4206 -3328 499 2432 -983 1496 5866 13272
628333A3272j118n761p612K641k75r84K08M06p491L005j66j76J949O32l63j365
$$ 13272 12154 6393 -1219 1422 1147 163 371 777 -6714 -3709 -3875 -4051 -2102 -1470 -1833 -3198
629310c198j92L521o42J562j196j53m106J088P60p42L359l60N238K122r932p97
$$ -3198 -3390 131 -511 1051 -145 -298 -4404 -3316 -2556 -3298 61 -299 4939 7061 -2871 -3668
630286c668J792N924k866o419j211l580m189R648N157K285l09L898K121k766K515
$$ -3668 -1876 4048 1182 -5237 -6448 -10028 -14217 -4569 588 2873 2564 6462 8583 5817 8332
631202H332J172l273l029k062n993k077K01l766M923P385M58o846J782L643L363
$$ 8332 9504 6231 3202 1140 -4853 -6930 -6729 -10495 -5572 1813 2271 -4575 -2793 850 4213
632117D213o97r98J273N870L57k858j39J244l971Q379N083n489j011L485l150
$$ 4213 3516 2518 3791 9661 10018 7160 7021 8265 4294 12673 17756 12267 11256 14741 11591
633033A1591j178K54m422M081L721Q51m418q406J815J479p83o212o530k358N328
$$ 11591 10413 10667 6245 10326 14047 14898 10480 2074 3889 5368 4585 -1627 -8157 -10515 -5187
633948e187M054r852K387M462J877K386P53j478J203l423J767R99J77O750J047
$$ -5187 -1133 -10985 -8598 -4136 -2259 127 880 -598 605 -2818 -1051 -52 125 6875 7922
634864G922k2r938n544M823O015K077m197o94o14K582k386M012J902j841j746
$$ 7922 7900 -2038 -7582 -2759 3256 5333 1136 442 -172 2410 24 4036 5938 4097 2351
635780B351J155K35m718N078l210L022j0992j222K717k794M404J577M548o037
$$ 2351 3506 3741 -977 4101 891 3913 -7079 -8301 -5584 -8378 -3974 -2397 2151 -3886
636634c886L897N436k141o264l395M638J362k508J259P280K12n619O537K401N690
$$ -3886 11 5447 3306 -2958 -6353 -1715 -353 -2861 -1602 5678 5890 271 6808 9209 14899
637550A4899l893o643o352L660K998j239l257m146L000J991J335P0j068L884L866
$$ 14899 11006 4363 -1989 1671 4669 3430 173 -3973 -973 1018 2353 2423 1355 5239 9105
638465I105M272l680k640q856L424O145o022l997l531J290L205N628Q628J928
$$ 9105 13377 9697 7057 -1799 1625 7770 1748 -2249 -5780 -4490 -1285 4343 12971 14899
639320A4899K788j872k462o389K116K07k316O50J378J121K176m435k724l345j35
$$ 14899 17687 15815 13353 6964 9080 9287 6971 7621 8999 10120 12296 7861 5137 1792 1657
640235A657m757r29Q121k992r41j416l31l424n036M544R283L257M138o628m777
$$ 1657 -3100 -4029 4092 1100 159 -1257 -1588 -5012 -10048 -5504 3779 7036 11174 4546 -231
641151b31j071M060O383n40m568o2l356j870o05N887N011k664l713k724k260K907
$$ -231 -1302 2758 9141 8601 4033 3971 615 -1255 -1860 4027 9038 6374 2661 -63 -2323 584
642128E84O206m953m270N194J942m032L028l189J64j165N234K98k222K571o356
$$ 584 6790 1837 -2433 2761 4703 671 3699 510 674 -491 4743 5041 2819 5390 -966
643043i66L088P705L578L600n667q102k272K829j901m5m302l353m780M79K747
$$ -966 2122 9827 13405 17005 11338 3236 964 3793 1892 1847 -2455 -5808 -10588 -10109 -7362
643959g362M116M879o36M487j058l589J704J791K585J811m561n68o155Q51L828
$$ -7362 -3246 1633 997 5484 4426 837 2541 4332 6917 8728 4167 3599 -2556 -1705 2123
644874B123Q227l926J658p50j221N8J092L09l766O707l90o34j1001l350K602J671
$$ 2123 10350 6424 8082 7332 6111 6169 7261 7570 3804 10511 10121 9487 -1514 -4864 -2262 -591
645851e91K798M782J640j940o798l764p445Q678L585L542n375k684J707K70J1
$$ -591 2207 6989 8629 6689 -109 -3873 -11318 -2640 945 4487 -888 -3572 -1865 -1595 -1584
646767a584J434m13L880K049l410J128k685m675p91L839K838J104j506J67M165
$$ -1584 -150 -563 3317 5366 1956 3084 399 -4276 -5067 -1228 1610 2714 1208 1375 5540
647682E540N146m68n585N816p199k01K793k111q71m84P940l694o118m286p565
$$ 5540 10686 10218 4633 10449 3250 3049 5842 3731 2860 2376 10316 6622 504 -3782 -11347
648598a1347O156j433J575M203N777n149l934k525L308J533M35N761K979o876
$$ -11347 -5191 -6624 -5049 -846 4931 -218 -4152 -6677 -3369 -1836 -1401 4360 7339 463
649452D63k969j054o002k269M419N357M255o027n561j561N557O730k142k383J331
$$ 463 -2506 -3560 -9562 -11831 -7412 -2055 2200 -3827 -9388 -10949 -5392 1338 -804 -3187 -1856
650368a856J299L390l13k732O073K027J625M497k309Q07J090j749k107j3K552
$$ -1856 -557 2833 2520 -212 5861 7888 9513 14010 11701 12508 13598 11849 9742 9729 12281
651284A2281L02m892p33l808n520P55L038M536o5j033k411m492L519N272r45p193
$$ 12281 12583 7691 6958 3150 -2370 -1615 1423 5959 5894 4861 2450 -2042 1477 6749 5804 -1389
652260a389L737O448J663l452N158k728K967o204N01J268j006N6J245j243o426
$$ -1389 2348 8796 10459 7007 12165 9437 12404 6200 6701 7969 6963 7019 8264 7021 595
653176E95q105O314k28k718O17P943m156K86j836m369l776K388K025P695P334
$$ 595 -7510 -1196 -1424 -4142 -3525 4418 262 548 -1288 -5657 -9433 -7045 -5020 2675 10009
654091A0009o078k22k709q125M801R335K302J762n484k029P03k691o133P20n43
$$ 10009 3931 3709 1000 -7125 -2324 7011 9313 11075 5591 3562 4265 1574 -4559 -3839 -4382
655007d382M87J136p62k81R904K720M97k523L1K365n13n820Q73j77J672K72K288
$$ -4382 -3895 -2759 -3521 -3802 6102 8822 9319 6796 6827 9192 8679 2859 3732 3555 5227 5499 7787
656044G787m059l317J557K209m324P118J707p069J70J110k022J487M572l220l460
$$ 7787 3728 411 1968 4177 -147 6971 8678 1609 1779 2889 867 2354 6926 3706 246
656960B46K420P00k923O394l976l103k428j642M485L677j013j485l780K88N443
$$ 246 2666 3366 443 6837 2861 -242 -2670 -4312 173 3850 2837 1352 -2428 -2140 3303
657876C303L194K749j664k787p398n817O356M378K255K829N090j547J84K055j497
$$ 3303 6497 9246 7582 4795 -2603 -8420 -2064 2314 4569 7398 12488 10941 11125 13180 11683
658791A1683m218r527m516L088K409K382K1K265K558O72o51K827j303n981j836
$$ 11683 7465 -2062 -6578 -3490 -1081 1301 1322 3587 6145 6817 6166 8993 7690 1709 -127
659707a27k973K41P98Q08Q173P80m036n687o22k0K406k36J962l210L27k09K127
$$ -127 -3100 -2859 -2061 -1253 6920 7700 3664 -2023 -2645 -2665 -259 -495 1467 -1743 -1416 -1625 502
660744E02k570J980m646K286O638K856K975o079K095l656k194J145j087L038P03
$$ 502 -2068 -88 -4734 -2448 4190 7046 10021 3942 6037 2381 187 1332 245 3283 3986
661660C986m647P61j26P274K387j558j2094J958J1471p240m786q4N389l53m542
$$ 3986 -661 100 -26 7248 9635 8077 -4017 -2059 9412 2172 -2614 -2698 2691 2338 -2204
662576b204Q08m54K242N737j303N223K257l456p896J792J304K760j400N94l304
$$ -2204 -1396 -1850 392 6129 4826 10049 12306 8850 954 2746 4050 6810 5410 6004 2700
663491B700k408q87J694L398l378m253j745M963M534p393L359m049K838L985j907
$$ 2700 292 -595 1099 4497 1119 -3134 -4879 84 4618 -2775 584 -3465 -627 3358 1451
664407A451j178M118l044j806L642o607J089J953R877j297o106j780M39L44L053
$$ 1451 273 4391 1347 -459 3183 -3424 -2335 -382 9495 8198 2092 312 751 1095 4148
665322D148O153j067j207p094k2j89k849k245K430N979k265k584J946M620J146
$$ 4148 10301 9234 8027 933 911 722 -2127 -4372 -1942 4037 1772 -812 1134 5754 6900
666238F900O727K6j527j688n659l353k740J172J689m79M097J070j277k272j247
$$ 6900 13627 13653 12126 10438 4779 1426 -1314 -142 1547 1068 5165 6235 4958 2686 1439
667153A439k753J176p455n107K831J0056n83m933r30m913K954O240J0727j652
$$ 1439 -1314 -138 -7593 -12700 -9869 187 -396 -5329 -6259 -11172 -8218 -1978 8749 7097
668008G097L2J418k392n210Q36O59K634K104R5p385m725J260R600J524O20K092
$$ 7097 7129 8547 6155 945 1781 2440 5074 7178 7273 -112 -4837 -3577 6023 7547 8167 10259
668985A0259r52o651l364j682R362j068l888J377k207L318j086k273J272J181
$$ 10259 9307 2656 -708 -2390 6972 5904 2016 3393 1186 4504 3418 1145 2417 3598
669839C598j666p52P103j174l510k736jr14j929l389o10M304J369J168M814l621
$$ 3598 1932 1180 8283 7109 3599 863 862 -52 -1981 -5370 -5980 -1676 -307 861 5675 2054
670816B054j903N38O894J755n082r53r86n159J849j986P42J375l023n423J351
$$ 2054 151 689 7583 9338 4256 3303 2317 -2842 -993 -2979 -2237 -862 -3885 -9308 -7957
671731g957j90Q038J557l639k836k849K515N746M316k64j27n998j22N011k896
$$ -7957 -8147 -109 1448 -2191 -5027 -7876 -5361 385 4701 4437 4310 -1688 -1810 3201 305
672647C05N795K731J049j134k371M452l552n987o310K272J0474K205K07K193l140
$$ 305 6100 8831 9880 8746 6375 10827 7275 1288 -5022 -2750 7724 9929 10136 12329 9189
673563I189n018L772o305k966l674M041K739L359k336p562m133j245J484N88P865
$$ 9189 4171 7943 1638 -1328 -5002 -961 1778 5137 2801 -4761 -8894 -10139 -8655 -8067 -202
674478b02m2o78J458O15j796j955j312n163m05O709n54k725K703N520K332l177
$$ -202 -244 -922 536 1151 -645 -2600 -3912 -9075 -9480 -2771 -3325 -6050 -3347 2173 4505 1328
675455A328O194k447j849Q47L314o693J806K539j1065O597J113J569l356j0077
$$ 1328 7522 5075 3226 4073 7387 694 2500 5039 -6026 571 1684 3253 -103 -10180
676309a0180j754m21N619J2827R087r431n710P148p76m511p01L872l06j167N188
$$ -10180 -11934 -12355 -6736 6091 15178 5747 37 7185 6409 1898 1197 5069 4763 3596 8784
677225H784n661m570L449q3l83n134q36L402L871K610j593L137j623J766l359
$$ 8784 3123 -1447 2002 1919 1536 -3598 -4434 -1032 2839 5449 3856 6993 5370 7136 3777
678140C777o542q47M156n76j150M09l921m961O530N749O178k660o68m403P059
$$ 3777 -2765 -3612 544 -32 -1182 -773 -4694 -9655 -3125 2624 8802 6142 5474 1071 8130
679056H130J028o61k650K881j947k880k27L17R69m165j354m712M28M036J6K76
$$ 8130 9158 8497 5847 8728 6781 3901 3674 3991 4960 795 -559 -5271 -4843 -807 -791 -515
680033e15k562n069L517j431l32P418K554o216j291N413K939m112j026j22k033
$$ -515 -3077 -8146 -4629 -6060 -6392 1026 3580 -2636 -3927 1486 4425 313 -713 -835 -2868
680948b868K422L199L9o297l129J94J126M091j09j540O132l023l852k939P324
$$ -2868 -446 2753 2792 -3505 -6634 -6440 -5314 -1223 -1332 -2872 3260 237 -3615 -6554 770
681864G70L67L782k294k431O909L654k620j443J056M005Q145p105j2816n220L124
$$ 770 1137 4919 2625 194 7103 10757 8137 6694 7750 11755 19900 12795 -21 -5241 -2117
682779b117J603k910K953l530K727O312p84l503m994K809J873o90j287J976L434
$$ -2117 -514 -3424 -471 -4001 -1274 5038 4254 751 -4243 -1434 439 -251 -1538 438 3872
683695C872M017j591n351j447L102J177l812j658k485N102J810J213j868q7j379
$$ 3872 7889 6298 947 -500 2602 3779 -33 -1691 -4176 926 2736 3949 2081 1994 615
684611F15k884J045Q634q26k122l78p62L365k012P889N485r683k638o857k700
$$ 615 -2269 -1224 7410 6584 4462 4084 3322 6687 4675 12564 18049 8366 5728 -1129 -3829
685526c829J684L313L563k120k940k880J458q842Q69M802l975J828Q59k907J503
$$ -3829 -2145 1168 4731 2611 -329 -3209 -1751 -10593 -9724 -4922 -8897 -7069 -6210 -9117 -7614
686442g614M363J804k569K051J275N543N459k587j581l478k104m192j611K671
$$ -7614 -3251 -1447 -4016 -1965 -690 4853 10312 7725 6144 2666 562 -3630 -5241 -2570
687296b570j370j172L504L890O604l663n727m96j24j311k16L54J028P70O653L969
$$ -2570 -3940 -5112 -1608 2282 8886 5223 -504 -1000 -1124 -2435 -2651 -2297 -1269 -499 6154 10123
688273A0123j172l454j159p1M92L284k096L214K320M38Q6m253n77o378n92J301
$$ 10123 8951 5497 4338 4267 4759 8043 5947 9161 11481 11919 12005 7752 7175 797 205 1506
689250A506J364O400M74m695K60k550m181K065J2460J324m018n255n880m938j642
$$ 1506 2870 9270 9744 5049 5309 2759 -1422 643 13103 14427 10409 5154 -726 -5664 -7306
690165g306J242N687K0l360O346L00m171k116L607J204J152o80J484n820J652
$$ -7306 -6064 -377 -357 -3717 2629 2929 -1242 -3358 249 1453 2605 1925 3409 -2411 -759
691081g59M544l3p478M219l08j0447n17M554k708P285M581N845k158p188o652
$$ -759 3785 3752 -3726 493 185 -10262 -10779 -6225 -8933 -1648 2933 8778 6620 -568 -7220
691996g220J989N103o209l272l475L66N176o85L55K453P286j707j086l919N779
$$ -7220 -5231 -128 -6337 -9609 -13084 -12718 -7542 -8227 -7872 -5419 1867 160 -926 -4845 934
692912I34L416n275l84K056K492p51K432q91K748l018L532j373Q31k917P13M584
$$ 934 4350 -925 -1309 747 3239 2488 4920 4029 6777 3759 7291 5918 6749 3832 4545 9129
693888I129j445q318M156l981M58o358j064L876k853K399L149J706Q397m932m785
$$ 9129 7684 -634 3522 -459 -1 -6359 -7423 -3547 -6400 -4001 -852 854 9251 4319 -466
694804d66K350n3P95j406J939L233J915o479k21r39k579k564q49N710l56N183
$$ -466 1884 1831 2626 1220 3159 6392 8307 1828 1607 668 -1911 -4475 -5324 386 30 5213
695781E213N128j044k286N107J215P78N62o809p327p340L648m21M293L27R78K666
$$ 5213 10341 9297 7011 12118 13333 14111 14673 7864 537 -6803 -3155 -3576 717 1044 2022 4688
696758D688m175j0195m41O696J731m940J946j513q35K004K127J457k616k509L801
$$ 4688 513 -9682 -10123 -3427 -1696 -6636 -4690 -6203 -7038 -5034 -2907 -1450 -4066 -6575 -2774
697673b774O913P929k481l258K76l985m247l176m457J979l064M040k11n745K840
$$ -2774 4139 12068 9587 6329 6605 2620 -1627 -4803 -9260 -7281 -10345 -6305 -6516 -12261 -9421
698588i421L363R265L241K793l680o050m932N156m504k021P237J101K312l644
$$ -9421 -6058 3207 6448 9241 5561 -489 -5421 -265 -4769 -6790 447 1548 3860 216
699443B16n918P825P337N059l640k521m831O157J866o60K031k771j947l607p344
$$ 216 -5702 2123 9460 14519 10879 8358 3527 9684 11550 10890 12921 10150 8203 4596 -2748
700359b748l417P057L754n232N09P643Q889n056o165j646R08l244K310P017J857
$$ -2748 -6165 892 4646 -586 -77 7566 16455 11399 5234 3588 4496 1252 3562 10579 12436
701274A2436q590M44L9P85N21m224J703K62j628k002J622M183j437r788J457L972
$$ 12436 3846 4290 4329 5114 5635 1411 3114 3376 1748 -254 1368 5551 4114 -5674 -4217 -245
702251b45r10O871N867O0n435n993P51k534J094O170k561j060K166k033K855P532
$$ -245 -1155 5716 11583 11643 6208 215 966 -1568 -474 5696 3135 2075 4241 2208 5063 12595
703227A2595l106m513O75l41j819k743j6J827J235l068j596p29Q970J824k509
$$ 12595 9489 4976 5651 5310 3491 748 732 2559 3794 726 -870 -1599 7371 9195 6686
704143F686K492L830j933l274j211n921l000K103l772K945L97O86p58K622J782
$$ 6686 9178 13008 11075 7801 6590 669 -2331 -228 -4000 -1055 -658 28 -730 1892 3674
705059C674o76k312O90J150L607K208k636o58l653l96j934N613j523J99O074l195
$$ 3674 2998 686 1376 2526 6133 8341 5705 5047 1394 998 -936 4677 3154 3353 9427 6232
706035F232o20m33k406N942M2j909k510o992L43l88J871L187L667j485j709N151
$$ 6232 5612 5179 2773 8715 8757 6848 4338 -2654 -2311 -2699 -828 2359 6026 4541 2832 7983
707012G983O90l263k88j532j559N706N237R14N36j830r605M08K147m521j748k191
$$ 7983 8673 5410 5122 3590 2031 7737 12974 13888 14424 12594 2989 3397 5544 1023 -725 -2916
707988b916J659J196j012Q620O938o201p492j82m120k02J493N45O068j592L788
$$ -2916 -1257 -61 -1073 7547 14485 8284 792 610 -3510 -3712 -2219 -1674 4394 2802 6590
708904F590L122l062o289r66m57j11N133M129r963k809j055p08M133M788j093
$$ 6590 9712 6650 361 -605 -1062 -1173 3960 8089 -1874 -4683 -5738 -6446 -2313 2475 1382
709819A382J022j768j695L309o596O872Q15j511l461j641k179K220j947P469N948
$$ 1382 2404 636 -1059 2250 -4346 2526 3341 1830 -1631 -3272 -5451 -3231 -5178 2291 8239
710735H239Q03j009J397J121j917q80l355l875O575k076q031O147l13n140k85
$$ 8239 9042 8033 9430 10551 8634 7754 4399 524 7099 5023 -3008 3139 2826 -2314 -2599
711651b599P584N534n295m440L663n778n867M341O331J074n545j070q15p45K475
$$ -2599 4985 10519 5224 784 4447 -1331 -7198 -2857 3474 4548 -997 -2067 -2882 -3627 -1152
712567a152O307J917l33r80L471m940j0478N368L582L751J355j714O51M50l6l227
$$ -1152 5155 7072 6739 5759 9230 4290 -6188 -820 2762 6513 7868 6154 6805 7255 7219 3992
713543C992L596p590k944P028L34r21J745L440o419m268p30K564N775j743M744
$$ 3992 7588 -2 -2946 4082 4416 3495 5240 8680 2261 -2007 -2737 -173 5602 3859 8603
714459H603J8p515n337J454j342p03L905j984j750M010P40m52o35K90N359m495
$$ 8603 8621 1106 -4231 -2777 -4119 -4822 -917 -2901 -4651 -641 99 -353 -988 -698 4661 166
715435A66L432j395p375K789N152o23p72J620j078m379n624N116M444L805m202
$$ 166 3598 2203 -5172 -2383 2769 2146 1374 2994 1916 -2463 -8087 -2971 1473 5278 1076
716351A076o328o652J998P423M361J368p4M012N984l959o597j440O81J671m290
$$ 1076 -5252 -11904 -9906 -2483 1878 3246 3172 7184 13168 9209 2612 1172 1853 3524 -766
717266g66n24J755p06K901N014m485q66J900J008j416j368M232M409k940j240
$$ -766 -1290 465 -241 2660 7674 3189 2323 4223 5231 3815 2447 6679 11088 8148 6908
718182F908l322m798N59L565N457p071o84J703pk336p9P61R585K738j0151J15
$$ 6908 3586 -1212 -653 2912 8369 1298 614 2317 2310 -26 -105 656 10241 12979 2828 2943
719159B943k856n892j88M295J567K811K893l954L952M197k437q217n937L489N306
$$ 2943 87 -5805 -5993 -1698 -131 2680 5573 1619 5571 9768 7331 -886 -6823 -3334 1972
720074A972J124P7n903Q29j240K672K102L717R87K82n33j401k725Q42m844K968
$$ 1972 3096 3173 -2730 -1901 -3141 -469 1633 5350 6337 6619 6086 4685 1960 2802 -2042 926
721051I26L761P851l782j029p644m20L004o82j698m003O91N286l502K164q7l247
$$ 926 4687 12538 8756 7727 83 -337 2667 1985 287 -3716 -3025 2261 -1241 923 836 -2411
722027b411j089N974k38o281P87K451K186l997m56L237m506j294L246j072j471
$$ -2411 -3500 2474 2236 -4045 -3258 -807 1379 -2618 -3074 163 -4343 -5637 -2391 -3463 -4934
722943d934j83J318K997Q708J642q119l961l326M416J471l017m544M317K173J411
$$ -4934 -5117 -3799 -802 7906 9548 1429 -2532 -5858 -1442 29 -2988 -7532 -3215 -1042 369
723859C69J0370j60n061j0396p73p64O062N296r96m708m10N175M103l758l213
$$ 369 10739 10579 5518 -4878 -5651 -6415 -353 4943 3947 -761 -1171 4004 8107 4349 1136
724774A136J0834K331k631n590p585q88N734K727j247n183K670J716l99k897K339
$$ 1136 11970 14301 11670 6080 -1505 -2393 3341 6068 4821 -362 2308 4024 3625 728 3067
725690C067J079m10j447n353K77J479K200O444J247Q69p639p050m92K539M168
$$ 3067 4146 3736 2289 -3064 -2787 -1308 892 7336 8583 9452 1813 -5237 -5729 -3190 978
726605I78K251k038L31N129j926q148P310O525k222k295k677n83l300L104M569
$$ 978 3229 1191 1522 6651 4725 -3423 3887 10412 8190 5895 3218 2635 -665 2439 7008
727521G008m457p905M638L947J584l799o324L508J2859K224N204k423p820n077
$$ 7008 2551 -5354 -716 3231 4815 1016 -5308 -1800 11059 13283 18487 16064 8244 3167
728376C167l077N942M22k776j280N684N82k630N17K125l645q450k91J368L3m628
$$ 3167 90 6032 6454 3678 2398 8082 8664 6034 6551 8676 5031 -3419 -3710 -2342 -2309 -6937
729352f937K926M655k799Q93J937K140j528k707J015j026M23M913O29p189l270
$$ -6937 -4011 644 -2155 -1262 675 2815 1287 -1420 -405 -1431 -1008 3905 4534 -2655 -5925
730268e925K106p024J794N741K463L900L60K09l540j352K103K917j50O90k682
$$ -5925 -3819 -10843 -9049 -3308 -845 3055 3415 3624 84 -1268 835 3752 3602 4292 1610
731183A610O0J40K616L329n637L446k581j1895m051J190K429Q918M972l339J028
$$ 1610 1670 1810 4426 7755 2118 5564 2983 -8912 -12963 -11773 -9344 -426 4546 1207 2235
732099B235q170l450K038L455N121M356Q050P33k893n337m306J378l63K509j0092
$$ 2235 -5935 -9385 -7347 -3892 1229 5585 13635 14368 11475 6138 1832 3210 2847 5356 -4736
733014d736M017J078J305O285L661o69q752l601K232J479J086p12K16K305K212
$$ -4736 -719 359 1664 7949 11610 10941 2189 -1412 820 2299 3385 2673 2889 5194 7406
733930G406l756q3K153k924r76M80k867L080n884K096Q859l057k782L191k385
$$ 7406 3650 3567 5720 2796 1820 2300 -567 2513 -3371 -1275 7584 4527 1745 4936 2551
734846B551j761K004m906m686k904K251O78R696J005n416j51J050J334K570j164
$$ 2551 790 2794 -2112 -6798 -9702 -7451 -6773 2923 3928 -1488 -1639 -589 745 3315 2151
735761B151n310l126j194J925L507J097R20l687J23L85n850P52M71n915O43M397
$$ 2151 -3159 -6285 -7479 -5554 -2047 -950 -30 -3717 -3594 -3209 -9059 -8307 -7836 -13751 -13108 -8711
736738h711l857L777K383N682J25K885M927L19j086M052k181L272n977O83q80
$$ -8711 -12568 -8791 -6408 -726 -601 2284 7211 7530 6444 10496 8315 11587 5610 6293 5413
737653E413P170J877j208k787o391j535J824o228J260L628N65l235J467Q954K847
$$ 5413 12583 14460 13252 10465 4074 2539 4363 -1865 -605 3023 3588 353 1820 10774 13621
738569A3621L386l334p758k730N235M7l575l190m486m196o32J259N835m975M759
$$ 13621 17007 13673 5915 3185 8420 8467 4892 1702 -2784 -6980 -7612 -6353 -518 -5493 -734
739485g34m03o46Q23J323m68l252n60L00k033J215P78N143L478l285M253k672
$$ -734 -1137 -1783 -960 363 -105 -3357 -3917 -3617 -5650 -4435 -3657 1486 4964 1679 5932 3260
740461C260n434j690L127k04J962R334l756l966l095M47N935o140m849L272j570
$$ 3260 -2174 -3864 -737 -941 1021 10355 6599 2633 -462 -15 5920 -220 -5069 -1797 -3367
741377c367m7k980j796k633L991L640l090N810R038k767n242o964L268K018M009
$$ -3367 -3414 -6394 -8190 -10823 -6832 -3192 -6282 -472 8566 5799 557 -6407 -3139 -1121 2888
742292B888j755K398O099l77K364p211l469O377n379k493j977Q17K804K968K628
$$ 2888 1133 3531 9630 9253 11617 4406 937 7314 1935 -558 -2535 -1718 1086 4054 6682
743208F682m444L555M102l755k618m324r99K758N878l861n47M143m003m013L11
$$ 6682 2238 5793 9895 6140 3522 -802 -1801 957 6835 2974 2427 6570 2567 -1446 -1135
744124a135P743r87l112L752n063M597k445k121n398N220k356j572O779j611K58
$$ -1135 6608 5621 2509 6261 1198 5795 3350 1229 -4169 1051 -1305 -2877 3902 2291 2549
745039B549J832L941l589m089k775N692l66n361k762M389L268m417K18L08L392
$$ 2549 4381 8322 4733 644 -2131 3561 3195 -2166 -4928 -539 2729 -1688 -1470 -1162 2230
745955B230L451p560J157L78l04M776P61J020k032J868L010j552n862l106R51
$$ 2230 5681 -1879 -722 -344 -648 4128 4889 5909 3877 5745 8755 7203 1341 -1765 -814
746870h14n26m653J06J367M436J704J695j329K922R31l1J053j498J374p36m730
$$ -814 -1340 -5993 -5887 -4520 -84 1620 3315 1986 4908 5839 5808 6861 5363 6737 6001 1271
747847A271k403M433O518j859k734k548q489m60J219J604O41J220L595J820K27
$$ 1271 -1132 3301 9819 7960 5226 2678 -5811 -6271 -5052 -3448 -2807 -1587 2008 3828 4055
748762D055J353K752m343l940j740Q817J986n011m187j1760j271R885Q000P02
$$ 4055 5408 8160 3817 -123 -1863 6954 8940 3929 -258 -12018 -13289 -3404 4596 5298
749617E298m962o36Q506j882o478l131n85J579L917K440j285j212Q515j401J297
$$ 5298 336 -300 8206 6324 -154 -3285 -3870 -2291 1626 4066 2781 1569 10084 8683 9980
750533I980N038n010J467M445q024k888n211K628K500J0175k801O09k186o546
$$ 9980 15018 10008 11475 15920 7896 5008 -203 2425 4925 15100 12299 12908 10722 4176
751387D176J920K541L034J850m230o394J380M398l814J216Q19J661o009K948L224
$$ 4176 6096 8637 11671 13521 9291 2897 4277 8675 4861 6077 6896 8557 2548 5496 8720
752303H720n674J703M80k334j880k558J279p95l882O093J0143l019q041K090J132
$$ 8720 3046 4749 5229 2895 1015 -1543 -264 -1059 -4941 1152 11295 8276 235 2325 3457
753218C457l353l11k35k334L584R329l888o489m891k189K670P65J364M243Q298
$$ 3457 104 -207 -442 -2776 808 10137 6249 -240 -5131 -7320 -4650 -3885 -2521 1722 10020
754134A0020j048p706r00J781Q49M04L0l005L732J287N514j783k061r0j809N5
$$ 10020 8972 1266 366 2147 2996 3400 3430 425 4157 5444 10958 9175 7114 7024 5215 5270
755111E270O527J972J123L349r900n956L462O29k999l050R74L503j043k739l944
$$ 5270 11797 13769 14892 18241 8341 2385 5847 6476 3477 427 1401 4904 3861 1122 -2822
756026b822N14O699P819j957j282J593l054k657m47m302l261L263J447L435l122
$$ -2822 -2308 4391 12210 10253 8971 10564 7510 4853 4406 104 -3157 106 1553 4988 1866
756942A866o232l721K223O223l400o440N84R280N820j538J321J513R24J06n629
$$ 1866 -4366 -8087 -5864 359 -3041 -9481 -8897 383 6203 4665 5986 7499 8423 8529 2900
757857B900j459j723K084J543N34K356l593p992l863O20P187N098m207j129q68
$$ 2900 1441 -282 1802 3345 3879 6235 2642 -5350 -9213 -8593 -1406 3692 -515 -1644 -2512
758773b512N590K154l055M850L43m262m022j74J972j616N57R208m781k80K851
$$ -2512 3078 5232 2177 7027 7370 3108 -914 -1088 884 -732 -175 9033 4252 3972 6823
759689F823L82o419J040L98N25m106J127l43L878l01n45m161j999k798j347m175
$$ 6823 7205 786 1826 2224 2749 -1357 -230 -573 3305 3004 2459 -1702 -3701 -6499 -7846 -12021
760665a2021j216J642O347P809L161k297n308M647O400k615N733l378j4081n550
$$ -12021 -13237 -11595 -5248 2561 5722 3425 -1883 2764 9164 6549 12282 8904 -5177 -10727
761520a0727L550K523j065o44M508M512J721K243k598m449k611L776Q90M733K23
$$ -10727 -7177 -4654 -5719 -6363 -1855 2657 4378 6621 4023 -426 -3037 739 1629 6362 6585
762435F585J899L03q27k804n288j439M496K992k717j656M58K345K764K055M03
$$ 6585 8484 8787 7960 5156 -132 -1571 2925 5917 3200 1544 2002 4347 7111 9166 9569
763351I569K758m062q895l028K831m41O871m384k060j979L204P42K943r68N697
$$ 9569 12327 8265 -630 -3658 -827 -1268 5603 1219 -841 -2820 384 1126 4069 3101 8798
764266H798m846n540m610k069J383N794P121J0229k286n597J264j866p036l294
$$ 8798 3952 -1588 -6198 -8267 -6884 -1090 6031 16260 13974 8377 9641 7775 739 -2555
765121b555L1N464L91O960m927O434o66n992n953j998l626n657O427Q293L730
$$ -2555 -2524 2940 3331 10291 5364 11798 11132 5140 -813 -2811 -6437 -12094 -5667 2626 6356
766036F356K936j456l162k361n172l973O595P836k658m048p154K771k281L250
$$ 6356 9292 7836 4674 2313 -2859 -6832 -237 7599 4941 893 -6261 -3490 -5771 -2521
766891b521K454k981l544Q479M336j302J120K023j235M732J496n371M73j337J798
$$ -2521 -67 -3048 -6592 1887 6223 4921 6041 8064 6829 11561 13057 7686 8159 6822 8620
767807H620m048o02j542J960K762o083L233Q440P91r372P59L222L28n402m876
$$ 8620 4572 3970 2428 4388 7150 1067 4300 12740 13531 4159 4918 8140 8468 3066 -1810
768722a810m764J561N634L466m877l793J240O321Q33L293J67j567n972J857J174
$$ -1810 -6574 -5013 621 4087 -790 -4583 -3343 2978 3811 7104 7271 5704 -268 1589 2763
769638B763P782O308p475o189n053L933M279q86k462m652O39R7j938K779j967
$$ 2763 10545 16853 9378 3189 -1864 2069 6348 5462 3000 -1652 -1013 -916 -2854 -75 -2042
770553b042K087K868o841K809J768L435K493K55J88JJ664j663j833P16J946K23
$$ -2042 45 2913 -3928 -1119 649 4084 6577 6832 7020 7021 8685 7022 5189 5905 7851 8074
771530H074k812J325l581J712J0583k853r113J118R81j43L419m42K384N22m803
$$ 8074 5262 6587 3006 4718 15301 12448 3335 4453 5434 5291 8710 8268 10652 11174 6371
772446F371N309J582j636j001J084L37j477o511M807M0j772k39M511J053p656
$$ 6371 11680 13262 11626 10625 11709 12046 10569 4058 8865 8905 7133 6894 11405 12458 4802
773361D802j741m963l625N82K119L169M512N860M75o00o060j043J985K123n432
$$ 4802 3061 -1902 -5527 -4945 -2826 343 4855 10715 11190 10590 4530 3487 5472 7595 2163
774277B163J36l854o95K68K80J590P737l44j180l655j639R02l446j477j175J052
$$ 2163 2299 -1555 -2250 -1982 -1702 -112 7625 7281 6101 2446 807 1709 -1737 -3214 -4389 -3337
775253c337J56k959M142K008J206k177j653l98P437N902q737o23P299l238n746
$$ -3337 -3181 -6140 -1998 10 1216 -961 -2614 -3012 4425 10327 1590 967 8266 5028 -718
776169g18O28o35L898N636j506k886l489J557P87m041J179L586q696L174j905
$$ -718 -90 -725 3173 8809 7303 4417 928 2485 3272 -769 410 3996 -4700 -1526 -3431
777085c431p63J854L511k925o68k045l580L103P790K036r08K718k283N848k079
$$ -3431 -4194 -2340 1171 -1754 -2422 -4467 -8047 -4944 2846 4882 3974 6692 4409 10257 8178
778000H178r626k176N218M981K968o497l681M322J767k953j978L692N881n619
$$ 8178 -1448 -3624 1594 6575 9543 3046 -635 3687 5454 2501 523 4215 10096 4477
778855D477M03l7l796J371j975M908K821l395q586k361K616O35j558m45k870R409
$$ 4477 4880 4843 1047 2418 443 5351 8172 4777 -3809 -6170 -3554 -2919 -4477 -4922 -7792 1617
779831A617N060o25j269n713m787K777K883N515k535p98j13o438Q64N905p516
$$ 1617 6677 6052 4783 -930 -5717 -2940 -57 5458 2923 2125 2012 -4426 -3562 2343 -5173
780747e173R61M340L086R2l810K031O590j310j904n95K343J316j216j765J674
$$ -5173 -4212 128 3214 3306 -504 1527 8117 6807 4903 4308 6651 7967 6751 4986 6660
781663F660J170N2K173l802n657k327K220K297M407l261l213l463K89N683J584
$$ 6660 7830 7882 10055 6253 596 -1731 489 2786 7193 3932 719 -2744 -2455 3228 4812
782578D812M906Q662l088r692o710N09N438k262l61L309L945p28j180n297j463
$$ 4812 9718 18380 15292 5600 -1110 -601 4837 2575 2214 5523 9468 8740 7560 2263 800
783494H00J692n913M444j354K479L152m490k152J469M803l17K611r858q58R25
$$ 800 2492 -3421 1023 -331 2148 5300 810 -1342 127 4930 4613 7224 -2634 -3492 -2567
784409b567J149M842k084L368L31n959j102m765M060K062N948j233K331k391P499
$$ -2567 -1418 3424 1340 4708 5039 -920 -2022 -6787 -2727 -665 5283 4050 6381 3990 11489
785325A1489J526k736k098m7n005k423J282J139M4n749K663M198p73m65m033J032
$$ 11489 13015 10279 8181 8134 3129 706 1988 3127 3171 -2578 85 4283 3510 3045 -988 44
786301D4K210K947N921M305n596q803k823P0Q408j294Q60J442J687J148n753l636
$$ 44 2254 5201 11122 15427 9831 1028 -1795 -1725 6683 5389 6249 7691 9378 10526 4773 1137
787278A137L64J083l48L481J917j988m866L553l90m01n252m751n537L287J1265
$$ 1137 1501 2584 2236 5717 7634 5646 780 4333 3943 3542 -1710 -6461 -11998 -8711 2554
788194B554N249l631q714N760P2m987j68j733K728L330K879n919L893l616J088
$$ 2554 7803 4172 -4542 1218 1290 -3697 -3865 -5598 -2870 460 3339 -2580 1313 -2303 -1215
789109a215J4993M5791K5344j0861o900r759n560o146r917p408j1657p797j0190
$$ -1215 13778 59569 84913 74052 67152 57393 51833 45687 35770 28362 16705 8908 -1282
789903a282N359J3101j096q424m93K383q15l377l475O983R557k676j4369j562
$$ -1282 4077 17178 16082 7658 7165 9548 8733 5356 1881 8864 18421 15745 1376 -186
790757a86L6j746J650J578N337K782L68j672o690j275N340L378L813n400k598
$$ -186 -150 -1896 -246 1332 6669 9451 9819 8147 1457 182 5522 8900 12713 7313 4715
791673D715k726M479N90m073j228N65r61K486K702p747K718j764J577M10k054
$$ 4715 1989 6468 7058 2985 1757 2322 1361 3847 6549 -1198 1520 -244 1333 1743 -311
792589c11l043J056M668q283n294P396Q015K832J607O040l876k368l69J651M411
$$ -311 -3354 -2298 2370 -5913 -11207 -3811 4204 7036 8643 14683 10807 8439 8070 9721 14132
793504A4132J025o394j0179q70L472k841L358j824n37q13N405N857j773k302l311
$$ 14132 15157 8763 -1416 -2286 1186 -1655 1703 -121 -658 -1471 3934 9791 8018 5716 2405
794420B405O095K935o012m671n535L103O960N275m651j3922q74J0694M298L489
$$ 2405 8500 11435 5423 752 -4783 -1680 5280 10555 5904 -8018 -8892 1802 6100 9589
795274I589k457m290J16n18K713m56j25l624K365L683K025l50j465J380l713m188
$$ 9589 7132 2842 2958 2440 5153 4697 4572 948 3313 6996 9021 8671 7206 8586 4873 685
796251F85l00N985N723o39j0835L485J037l655n266J988O637n108L487P913m921
$$ 685 385 6370 12093 11454 619 4104 5141 1486 -3780 -1792 4845 -263 3224 11137 6216
797166F216m647k394P393j520Q66m6n91K071j347j73M90l253j043P060N85r23
$$ 6216 1569 -825 6568 5048 5914 5868 5277 7348 6001 5828 6318 3065 2022 9082 9667 8744
798143H744r267J2L316J653o29p77k874k7P71l67M143j583O045J83L540j689m093
$$ 8744 -523 -511 2805 4458 3829 3052 178 151 922 555 4698 3115 9160 9343 12883 11194 7101
799181G101k154j621n708R151J464L183n153r549M20j343R75M089j526k54K101
$$ 7101 4947 3326 -2382 6769 8233 11416 6263 -3286 -2866 -4209 -3234 855 -671 -925 1176
800096A176N93J451k194j221o177L50N288j747L679Q858L03o898p17N580N710
$$ 1176 1769 3220 1026 -195 -6372 -6022 -734 -2481 1198 10056 10359 3461 2744 8324 14034
801012A4034n098o848k019L437R75l712l005L003J74M117j690o127J290M982J621
$$ 14034 8936 2088 69 3506 4481 769 -2236 767 941 5058 3368 -2759 -1469 3513 5134
801927E134J896J185j383q66Q31n27n223l893L018k630M794O64M918l318k341
$$ 5134 7030 8215 6832 5966 6797 6270 1047 -2846 172 -2458 2336 3000 7918 4600 2259
802843B259K592j37L287k201J603k516o805k89Q13K918L374n002j973J673j151
$$ 2259 4851 4714 8001 5800 7403 4887 -1918 -2207 -1394 1524 4898 -104 -2077 -404 -1555
803758a555q93N642J787L44o150k895L21K612L584j057L242o293K01o554k446
$$ -1555 -2448 3194 4981 5325 -825 -3720 -3399 -787 2797 1740 4982 -1311 -1110 -7664 -10110
804674a0110M89J2492k9J796J262j468k824n944Q813M611l934J04K646R41J937
$$ -10110 -9621 2871 2842 4638 5900 4432 1608 -4336 4477 9088 5154 5258 7904 8845 10782
805590A0782n047j381j901l927K479o708l396M11M253n51l07J60K051r74L601
$$ 10782 5735 4354 2453 -1474 1005 -5703 -9099 -8688 -4435 -4986 -5293 -5133 -3082 -4056 -455
806505d55Q686L060q237n269J592N898k123o57L563n72P524j543j303m902j226
$$ -455 8231 11291 3054 -2215 -623 5275 3152 2495 6058 5486 13010 11467 10164 5262 4036
807421D036m275k446L80L743K066K391L581K942p793l138j399l918K292O19l079
$$ 4036 -239 -2685 -2305 1438 3504 5895 9476 12418 4625 1487 88 -3830 -1538 -919 -3998
808336c998Q94J153k044L18L735o217M872q96P24j842L129K941p5j079M413j411
$$ -3998 -3104 -1951 -3995 -3677 58 -6159 -1287 -2183 -1459 -3301 -172 2769 2694 1615 6028 4617
809313D617J255j790m244L257m71k461K729N344l471L61k815M812p10l520o190
$$ 4617 5872 4082 -162 3095 2624 163 2892 8236 4765 5126 2311 7123 6413 2893 -3297
810229c297Q62P348P508j188L122K54p463m742N952J200o928m68J846l492j356
$$ -3297 -2435 4913 12421 11233 14355 14609 7146 2404 8356 9556 2628 2160 4006 514 -842
811144h42m742J928r05R06k909L606N232M452M348M11q911o298k475N942m57k390
$$ -842 -5584 -3656 -4561 -3655 -6564 -2958 2274 6726 11074 11485 2574 -3724 -6199 -257 -714 -3104
812121c104m68K666J061L404J028q16r34L335p44j169n391M421J522m433l731
$$ -3104 -3572 -906 155 3559 4587 3771 2837 6172 5428 4259 -1132 3289 4811 378 -3353
813036c353n167P797N961j686L540N564n470j684l956n535J916K106k411k098
$$ -3353 -8520 -723 5238 3552 7092 12656 7186 5502 1546 -3989 -2073 33 -2378 -4476
813891d476J982l65K431P505k821j5470o464P250P975n074L835j83M181M498R40
$$ -4476 -2494 -2859 -428 7077 4256 -11214 -17678 -10428 -2453 -7527 -3692 -3875 306 4804 5744
814807E744K884j819l337J184j198m055j230m1L989o041m452k919M426J2430K531
$$ 5744 8628 6809 3472 4656 3458 -597 -1827 -1868 2121 -3920 -8372 -11291 -6865 5565 8096
815722H096q210N412J207K038N388k048J39J248q866L271K428N095n754q741k441
$$ 8096 -114 5298 6505 8543 13931 11883 12022 13270 4404 7675 10103 15198 9444 703 -1738
816638a738j209L756M329l037l140N753J310l821J03j459K681K993R3q01j542
$$ -1738 -2947 809 5138 2101 -1039 4714 6024 2203 2306 847 3528 6521 6614 5813 4271
817553D271l915l79l761M283n154k898O903K556n81J592k985j698l386N730K137
$$ 4271 356 -23 -3784 499 -4655 -7553 -650 1906 1325 2917 -68 -1766 -5152 578 2715
818469B715l259k219K798L880n014J846J802j823j076K25l801N93L614l909O414
$$ 2715 -544 -2763 35 3915 -1099 747 2549 726 -350 -125 -3926 -3333 281 -3628 2786
819385B786N121J853J615j592K61l83k531P7n023l357O818r01O7k211n897M122
$$ 2786 7907 9760 11375 9783 10044 9661 7130 7207 2184 -1173 5645 4744 4811 2600 -3297 825
820361H25M647L035Q500p3l926k419j862l181o564J561N317J116j960l694R54
$$ 825 5472 8507 17007 16934 13008 10589 8727 5546 -1018 543 5860 6976 5016 1322 2276
821277B276N52J411n757n558N704M075N3j486j747M414l198j882J467L275R037
$$ 2276 2828 4239 -1518 -7076 -1372 2703 2756 1270 -477 3937 739 -1143 324 3599 12636
822192A2636o558q162l997k763P436L889j470M694J037Q48k707k95j812P289j000
$$ 12636 6078 -2084 -6081 -8844 -1408 2481 1011 5705 6742 7590 4883 4588 2776 10065 9065
823108I065m634m409K883k447m90K806j96P179N901r467k337N415m299n209L298
$$ 9065 4431 22 2905 458 -32 2774 2578 9757 15658 6191 3854 9269 4970 -239 3059
824023C059j617j651j588m16P086J861k691k079r995Q754L128J391J275r36j623
$$ 3059 1442 -209 -1797 -2213 4873 6734 4043 1964 -8031 723 3851 5242 6517 5581 3958
824939C958o930j092J2651l85l804m581o858L13M95K484M268L823j054k492N56
$$ 3958 -2972 -4064 8587 8202 4398 -183 -7041 -6728 -6233 -3749 519 4342 3288 796 1352
825855A352K553J861L379k142P56r579j86K104M639j261k756L07J96k00L724j082
$$ 1352 3905 5766 9145 7003 7759 -1820 -2006 98 4737 3476 720 1027 1223 1023 4747 3665
826831C665J454p43o329l222L030K426j230M129k064n7K943k655j504j01R584
$$ 3665 5119 4376 -1953 -5175 -2145 281 -949 3180 1116 1059 4002 1347 -157 -258 9326
827747I326L285j117K097j635l083Q97q71m737q76m179j925l276K304J355N640
$$ 9326 12611 11494 13591 11956 8873 9770 8899 4162 3286 -893 -2818 -6094 -3790 -2435 3205
828662C205L525p171j26K280q69M202l956Q29O578J532Q28J077q46j391m488K96
$$ 3205 6730 -441 -567 1713 844 5046 1090 1919 8497 10029 10857 11934 11088 9697 5209 5505
829639E505M308k024q296l405L0m841M515O999J497k534M075l420j058J527L196
$$ 5505 9813 7789 -507 -3912 -3882 -8723 -4208 2791 4288 1754 5829 2409 1351 2878 6074
830554F074J338M635k306m567J358o610j521m266N486j425k240M355M785j062
$$ 6074 7412 12047 9741 5174 6532 -78 -1599 -5865 -379 -1804 -4044 311 5096 4034
831409D034n508O76L177K343P991n560j487L934l444p662o85Q224J700j904O162
$$ 4034 -1474 -798 2379 4722 12713 7153 5666 9600 6156 -1506 -2191 6033 7733 5829 11991
832325A1991k968l481O598P30n324n848j220j172j402M57j579M202m829o214P876
$$ 11991 9023 5542 12140 12870 7546 1698 478 -694 -2096 -1639 -3218 984 -3845 -10059 -2183
833240b183O314O97q80l740J211L335J26k749l131N241k136m018M884j231R09
$$ -2183 4131 4828 3948 208 1419 4754 4880 2131 -1000 4241 2105 -1913 2971 1740 2649
834156B649K19m33L23j657J044R9J110l034k885J072N535J294m2M58J090N658
$$ 2649 2868 2435 2758 1101 2145 2244 3354 320 -2565 -1493 4042 5336 5294 5752 6842 12500
835132A2500N024j835n033l291k211n4K632o456m089L559k534k388M804K821K262
$$ 12500 17524 15689 10656 7365 5154 5100 7732 1276 -2813 746 -1788 -4176 628 3449 5711
836048E711J669J258m059k846L385L399o018K849j810m633K265K81M602J467L651
$$ 5711 7380 8638 4579 1733 5118 8517 2499 5348 3538 -1095 1170 1451 6053 7520 11171
836964A1171r343m361J954N666q62o579O372M662o043k613K168K472K873J729
$$ 11171 1828 -2533 -579 5087 4225 -2354 4018 8680 2637 24 2192 4664 7537 9266
837818I266K61k835k150j032O050k30l46k101P18L012j243o016k704K184L764
$$ 9266 9527 6692 4542 3510 9560 9330 8984 6883 7601 10613 9370 3354 650 2834 6598
838734F598q138j025L354j901L324O812K577J489Pl734K343n16l823j278p658
$$ 6598 -1540 -2565 789 -1112 2212 9024 11601 13090 13097 9363 11706 11190 7367 6089 -1569
839649a569L910R474P702p229o319R63P76l703p455N09P986o7M865J769p966J184
$$ -1569 2341 11815 19517 12288 5969 6932 7708 4005 -3450 -2941 5045 4978 9843 11612 3646 4830
840626D830Q329J966j886l270j883p610J072K109j25q32J211J951j035l781Q98
$$ 4830 13159 15125 13239 9969 8086 476 1548 3657 3532 2700 3911 5862 4827 1046 1944
841542A944K556m848j061M264L612P046m007J238p50o815o687o02O165j823k494
$$ 1944 4500 -348 -1409 2855 6467 13513 9506 10744 9994 3179 -3508 -4110 2055 232 -2262
842457b262K41Q194n52o486M435R59l664n221L106k754j169k6r24J897L867M55
$$ -2262 -2021 6173 5621 -865 3570 4529 865 -4356 -1250 -4004 -5173 -5199 -6123 -4226 -359 96
$$ [...]
##END=
