##TITLE=Unknown
##JCAMP-DX= 5.00 $$From Command Line Converter 1.0
##DATA TYPE= NMR Spectrum
##DATA CLASS=  XYDATA

##ORIGIN= Exported from Command Line Converter 1.0
##OWNER= SVB
##$URL= http://wwwchem.uwimona.edu.jm:1104/software/jcampdx.html
##SPECTROMETER/DATA SYSTEM= NUTS EXPORT
##.OBSERVE FREQUENCY= 75.480980
##.OBSERVE NUCLEUS= ^13C
##INSTRUMENTAL PARAMETERS= 13C
##XUNITS= PPM
##YUNITS= ARBITRARY UNITS
##XFACTOR= 0.0002649675
##YFACTOR= 8.3308920000
##FIRSTX= -17.968720
##FIRSTY= 871.000000
##LASTX= 246.998700
##NPOINTS= 16384
##MAXY= 8116024.000000
##MINY= -214868.000000
##DELTAX=   0.016173
##XYDATA= (X++(Y..Y))
$$ plain form
-67815 104 -12393 -8662 -4419 -1768 -511 4610 8384 2852 -217 3404 9321 8544 -320 -3418 -5480
-66900 -5480 113 3356 -464 -4977 2264 3817 1214 2318 1483 9804 11679 11948 10615 7917 11533
-65984 11533 -1128 -1723 1443 4699 -610 1224 10918 10281 15406 11392 13460 13381 6858 -3403 -4656
-65069 -4656 -2966 -5595 2895 846 705 4806 11202 -1619 -8537 -3092 434 7757 3372 1216
-64214 1216 -3903 -2657 -3855 -6571 4245 9136 1601 3317 -138 -933 1486 2281 -3397 2218 4405
-63299 4405 -145 -1535 8980 13137 12212 9209 10551 3597 9982 11914 7483 6336 8301 9959
-62444 9959 4369 7730 -2107 -5333 -736 2049 -6149 2610 4618 2443 1722 5303 6936 3792 3000
-61529 3000 4688 2762 10955 7740 1080 7740 18271 17038 7362 8213 2629 5168 9236 14267
$$ packed form
-67815A04j2497L731M243K651J257N121L774n532l069L621N917p77q864l098k062
-66900e480N593L243l820m513P241J553k603J104q35Q321J875K69j333k698L616
-65984A1533j2661n95L166L256n309J834R694o37N125m014K068p9o523j0261j253
-65069d656J690k629Q490k049j41M101O396j2821o918N445L526P323m385k156
-64214A216n119J246j198k716J0816M891p535J716l455p95K419P95n678N615K187
-63299D405m550j390J0515M157r25l003J342o954O385J932m431j147J965J658
-62444I959n590L361r837l226M597K785q198Q759K008k175p21L581J633l144p92
-61529C000J688j926Q193l215o660O660J0531j233r676Q51n584K539M068N031
$$ plain form
-60674 14267 8316 5656 9223 5958 4366 3858 -1677 528 7227 10251 4260 3653 -1705 -4009 -2234
-59758 -2234 3606 3286 -3511 -1976 11547 17539 16555 8833 3614 6536 5413 9255 8028 6304 1944
-58843 1944 -5177 -2366 4973 6049 2801 8354 6837 3064 6539 1681 -915 742 -436 -2338
-57988 -2338 -5591 1871 9174 10190 10990 2382 -4097 -18331 -22176 -8130 1019 -2674 -7069 -8931
-57134 -8931 -520 3417 -376 -4269 -4510 -3050 -1730 5257 -4106 -6115 2603 -1145 -9504 -6503 2014
-56218 2014 5197 4618 2745 -8368 -8708 -7278 -3583 2013 10310 14507 15353 13312 17673 17821 19320
-55303 19320 15564 4703 732 8445 12530 -6071 -16308 -9529 -6539 -5341 3136 2238 990 -7840
-54448 -7840 -12553 -12336 -6856 -65 8659 12704 7848 1574 -2929 -3788 -1435 4965 4763 459 -7
$$ packed form
-60674A4267n951k660L567l265j592n08n535K205O699L024n991o07n358k304J775
-59758b234N840l20o797J535J3523N992r84p722n219K922j123L842j227j724m360
-58843A944p121K811P339J076l248N553j517l773L475m858k596J657j178j902
-57988b338l253P462P303J016Q00q608o479j4234l845J4046R149l693m395j862
-57134h931Q411L937l793l893k41J460J320O987r363k009Q718l748q359L001Q517
-56218B014L183n79j873j1113l40J430L695N596Q297M197Q46k041M361J48J499
-55303A9320l756j0861l971P713M085j8601j0237O779K990J198Q477q98j248q830
-54448g840m713K17N480O791Q724M045m856o274m503q59K353O400k02m304m66
$$ plain form
-53532 -7 1233 -825 -6940 -6768 -8874 -7143 2610 4791 6056 3806 3088 39 -3773 -1469 5724 7218
-52556 7218 3807 -5543 -4258 -6747 -9659 207 150 -7875 -10521 -13106 -6057 -5290 -11870 -13664 -7606
-51640 -7606 -3398 -2718 1083 5885 8916 17343 18494 15429 4761 -6284 -5838 -1816 6738 8283
-50786 8283 1675 -1157 -2113 -7550 -4664 -5112 4643 1054 3256 6758 2047 8223 3351 5231 -550
-49870 -550 -6920 -7876 -8232 -10005 -358 -5387 -4087 2107 5654 3991 -5218 -1892 3609 5137 1091
-48954 1091 767 298 5703 7849 9482 6210 1558 -1305 -2387 -5493 -195 7202 9140 -1132 -5421
-48039 -5421 -6910 -1235 7315 3889 1671 243 -5487 3855 6785 -1567 -4503 -4259 150 -4655 -3413
-47123 -3413 1569 1416 3904 5147 4688 1037 -9108 -7729 -4184 1700 13802 4231 2277 -1647
$$ packed form
-53532gJ240k058o115J72k106J731R753K181J265k250p18l049l812K304P193J494
-52556G218l411r350J285k489k912R866n7q025k646k585P049P67o580j794O058
-51640g606M208O80L801M802L031Q427J151l065j0668j1045M46M022Q554J545
-50786H283o608k832r56n437K886m48R755l589K202L502m711O176m872J880n781
-49870e50o370r56l56j773R647n029J300O194L547j663r209L326N501J528m046
-48954A091l24m69N405K146J633l272m652k863j082l106N298P397J938j0272m289
-48039e421j489N675Q550l426k218j428n730R342K930q352k936K44M409m805J242
-47123c413M982j53K488J243m59l651j0145J379L545N884J2102r571j954l924
$$ plain form
-46269 -1647 -5925 -1858 3468 -2270 2823 -3196 -3331 -1732 -3973 1758 -4161 -7260 -2218 -2378 -3030
-45353 -3030 -5900 -11454 -14989 -9132 -4853 2726 1377 5328 6857 6466 9147 5161 -3387 -2358 -1493
-44438 -1493 5953 255 1158 1616 -314 548 7787 7926 8893 10410 12172 7898 10964 10656 2346 5194
-43461 5194 13895 9117 4101 1110 10513 18858 28296 26521 13316 7953 3834 -4018 -5923 -5387
-42606 -5387 880 4202 5094 2929 -4101 -9516 -9908 -441 3053 -941 544 7687 10755 -1892 -2482
-41691 -2482 -1677 -2548 7149 10762 -1495 -1405 -2945 -6863 -5362 -157 -1672 -6946 -1654 6867 2570
-40775 2570 -2244 -1641 -10370 -8182 -1760 -4418 -6377 -349 3170 -3570 -1875 -1825 6748 16259 15635
-39860 15635 14524 10402 10238 6498 3487 4388 9179 3996 9814 19384 16039 14474 19097 12203 2550
$$ packed form
-46269a647m278M067N326n738N093o019j35J599k241N731n919l099N042j60o52
-45353c030k870n554l535N857M279P579j349L951J529l91K681l986q548J029Q65
-44438a493P446n698R03M58j930Q62P239J39R67J517J762m274L066l08q310K848
-43461E194Q701m778n016k991R403Q345R438j775j3205n363m119p852j905N36
-42606e387O267L322Q92k165p030n415l92R467L494l994J485P143L068j2647n90
-41691b482Q05q71R697L613j2257R0j540l918J501N205j515n274N292Q521m297
-40775B570m814O03q729K188O422k658j959O028L519o740J695N0Q573R511o24
-39860A5635j111m122j64l740l011R01M791n183N818R570l345j565M623o894r653
$$ plain form
-38944 2550 1508 14673 7321 3415 819 5535 12444 6981 3748 -6106 -4068 9623 12363 8017
-38089 8017 6564 12958 3658 424 4196 -2720 -8738 -6946 -13075 -12125 -4343 5196 6482 7962 5427
-37174 5427 -4344 -7107 -6346 -2166 -2513 -7057 -5018 5161 1443 2999 3680 2442 408 -1490 -7433
-36258 -7433 -2478 6015 9541 14043 11027 10312 -125 -1497 13019 15788 24191 19404 17937 9746
-35404 9746 7287 1861 1276 -188 -4664 5045 8293 2336 -3426 -5762 347 -1130 2231 4842 201
-34488 201 11851 21214 20741 16345 18455 30327 26590 19892 9515 5949 6016 -1013 625 -831 3029
-33573 3029 9327 9715 12272 6306 697 -1083 950 150 3608 5059 339 7060 3108 4152 7833
-32657 7833 4539 3795 1172 1059 3585 482 -2030 5001 9434 8259 8567 8984 17596 16771 8587 3356
$$ packed form
-38944B550j042J3165p352l906k596M716O909n463l233r854K038J3691K740m346
-38089H017j453O394r300l234L772o916o018J792o129R50P782R539J286J480k535
-37174E427r771k763P61M180l47m544K039J0179l718J556O81j238k034j898n943
-36258g433M955Q493L526M502l016p15j0437j372J4516K769Q403m787j467q191
-35404I746k459n426n85j464m476R709L248n957n762k336O109j477L361K611m641
-34488B01J1650R363m73m396K110J1872l737o698j0377l566O7p029J638j456L860
-33573C029O298L88K557n966n609j780K033q00L458J451m720O721l952J044L681
-32657G833l294p44k623j13K526l103k512P031M433j175L08M17Q612q25q184n231
$$ plain form
-31680 3356 2082 -3255 -11621 -12020 -2974 6667 6337 4352 -3417 -3035 1681 1162 -4459 -7782 -2280
-30765 -2280 -288 2498 -10334 -7488 2280 -73 5131 11602 10220 4330 -54 3680 10131 4935
-29910 4935 -2804 5807 4477 7613 7995 9344 320 4759 14642 9162 -3344 -8620 -7703 -4573 960
-28995 960 6312 -2058 1349 10655 11446 1326 -545 4853 8161 9218 623 3420 6957 7489 4166
-28079 4166 -821 -4747 1883 -847 -5874 -8126 -8630 3620 462 -9877 -8407 -1722 11195 7849
-27225 7849 5455 39 622 -2755 2562 7957 430 -2990 6608 10594 4923 4733 3104 3078 6634
-26309 6634 1468 -5511 -6077 -3780 7041 9766 7335 1945 -4929 -700 1879 4646 -3458 -5497
-25454 -5497 -6118 -6293 -8678 -4532 6086 11470 6134 7214 2345 3908 10278 3669 3315 -884 -2767
$$ packed form
-31680C356j274n337q366l99R046R641l30j985p769L82M716n19n621l323N502
-30765b280J992K786j2832K846R768k353N204O471j382n890m384L734O451n196
-29910D935p739Q611j330L136L82J349r024M439R883n480j2506n276R17L130N533
-28995I60N352q370L407R306P91j0120j871N398L308J057q595K797L537N32l323
-28079D166m987l926O630k730n027k252n04J2250l158j0339J470O685J2917l346
-27225G849k394n416N83l377N317N395p527l420R598L986n671j90j629k6L556
-26309F634n166o979n66K297J0821K725k431n390o874M229K579K767q104k039
-25454e497o21j75k385M146J0618N384n336J080m869J563O370o609l54m199j883
$$ plain form
-24539 -2767 -5857 -5067 -1063 -2464 136 -3777 -4078 1551 1140 -166 6840 8003 8768 10243 11666
-23623 11666 7486 -7431 -15400 -8487 -6376 -3746 6150 7456 1961 -8095 -2419 -3502 -459 1769
-22769 1769 4935 -5465 -4887 -3342 -3075 -13344 -8275 -3515 2734 3758 3405 1323 6101 11174 16126
-21853 16126 8744 14152 23678 17727 16526 12596 3956 -5077 6595 11925 7703 -2969 -6660 1862
-20999 1862 1972 3191 6279 15367 19105 8646 4483 3911 4634 5291 978 -294 -1678 -4893 7949
-20083 7949 8438 1922 4755 5380 876 -2434 -2140 6305 5467 -1071 -5286 5487 9351 8920 15407
-19167 15407 20978 26736 19616 10504 3160 1518 -6730 -4118 5396 11818 11127 10984 11167 7023 8648
-18252 8648 7746 9729 4076 -4933 -9288 -4652 366 6796 1329 -9205 510 119 566 4649 -4103
$$ packed form
-24539b767l090P90M004j401K600l913l01N629m11j306P006J163P65J475J423
-23623A1666m180j4917p969O913K111K630R896J306n495j0056N676j083L043K228
-22769A769L166j0400N78J545K67j0269N069M760O249J024l53k082M778N073M952
-21853A6126p382N408R526n951j201l930q640r033J1672N330m222j0672l691Q522
-20999A862J10J219L088R088L738j0459m163n72P23O57m313j272j384l215J2842
-20083G949M89o516K833O25m504l310K94Q445q38o538m215J0773L864m31O487
-19167A5407N571N758p120r112p344j642q248K612R514O422o91j43J83m144J625
-18252H648r02J983n653r009m355M636N018O430n467j0534R715l91M47M083q752
$$ plain form
-17336 -4103 -7676 -4290 770 5628 2363 8322 10469 4379 3184 1079 -3301 -5012 -310 -3690
-16482 -3690 3391 2776 92 3715 -2445 -9072 -14067 -12892 -6588 5774 2356 -640 2838 -3523
-15627 -3523 -8335 -3603 -13434 -13697 -8816 143 653 1770 9759 5815 5671 9467 9319 8280 3980
-14711 3980 -2807 -1743 -8911 -8986 -2648 -7143 2317 4163 275 1116 1256 -4931 -7009 248 2298
-13796 2298 963 -3789 -9808 -18075 -8730 -7695 -4584 -2349 -5430 -5382 2438 8206 13439 8210 -11330
-12880 -11330 -8510 4334 16632 10028 -808 -2756 -1092 7613 11638 1891 88 -1687 1486
-12087 1486 4573 4773 5972 4577 3623 -2016 -4082 -2083 -8408 -7100 -2654 955 -2602 -6003 3896
-11171 3896 11776 5170 3130 -3778 -7453 -9178 -3506 -883 5544 7415 2409 -1992 786 2322
$$ packed form
-17336d103l573L386N060M858l265N959K147o090j195k105m380j711M702l380
-16482c690P081o15k684L623o160o627m995J175O304J2362l418k996L478o361
-15627c523m812M732r831k63M881Q959N10J117P989l944j44L796j48j039m300
-14711C980o787J064p168p5O338m495R460J846l888Q41J40o187k078P257K050
-13796B298j335m752o019q267R345J035L111K235l081M8P820N768N233n229j9540
-12880a1330K820J2844J2298o604j0836j948J664Q705M025r747j803j775L173
-12087A486L087K00J199j395r54n639k066J999o325J308M446L609l557l401R899
-11171C896P880o606k040o908l675j725N672K623O427J871n006m401K778J536
$$ plain form
-10317 2322 512 -4293 -1767 -3248 1016 9167 3164 5999 11380 15714 15486 14009 11739 5248 -5389
-9401 -5389 -4461 2071 6207 1683 -3605 938 3137 -618 -205 11575 8326 9066 6375 2652 -5382
-8486 -5382 -1777 6105 5696 -1252 5835 11715 5274 3348 6874 2882 5045 14505 12909 2717
-7631 2717 -2355 174 9996 17390 11371 5421 4024 6174 11471 5994 -539 -1340 651 -1499 -2417
-6716 -2417 4729 6251 4653 5729 1178 2477 6621 3880 4902 12022 4784 -9 -7183 -4233
-5861 -4233 -1191 118 -141 4774 359 131 5330 2326 9803 11440 4432 3794 12395 10962 8005
-4946 8005 6803 4073 4031 256 -7026 -1975 -198 6182 6276 4498 -4319 466 12270 14408 18286
-4030 18286 15343 7912 -7175 -4337 1224 4225 -2977 -6029 2954 -5843 -6679 3247 13071 8698
$$ packed form
-10317B322j810m805K526j481M264Q151o003K835N381M334k28j477k270o491j0637
-9401e389R28O532M136m524n288M543K199l755M13J1780l249P40k691l723q034
-8486e382L605P882m09o948P087N880o441j926L526l992K163R460j596j0192
-7631B717n072K529R822P394o019n950j397K150N297n477o533q01J991k150r18
-6716b417P146J522j598J076m551J299M144k741J022P120p238m793p174K950
-5861d233L042J309k59M915m415k28N199l004P477J637p008o38Q601j433k957
-4946H005j202k730m2l775p282N051J777O380R4j778q817M785J1804K138L878
-4030A8286k943p431j5087K838N561L001p202l052Q983q797q36R926R824m373
$$ plain form
-3175 8698 552 6088 12961 9132 11889 14956 7376 2661 13237 14261 13726 8657 8521 8120 4362
-2260 4362 9499 6344 3327 5144 11370 143 2846 2240 8322 5468 1643 4182 4272 975 -3892
-1344 -3892 -5597 -3397 -4189 -2290 -833 55 4802 5467 -2564 -3873 -2730 7820 10842 7170 7437
-429 7437 6915 -111 608 386 -2715 -6534 18 -5580 -4816 -1635 1181 4258 1525 1592 4617 5330
548 5330 10661 4945 7426 1258 -1003 7341 -3 -6794 -7270 -5270 2330 654 -3367 -2619 5509
1464 5509 13046 8133 7504 7892 7284 1191 1497 101 -624 -1690 1347 22 692 4693 449 181
2440 181 2796 8983 10199 12820 16696 16809 7435 3144 8723 16966 14970 11323 9719 8489 7890
3356 7890 7794 5018 6553 12877 12973 2675 5215 11693 3128 -12389 -10509 -12829 -7115 -3735 -890
$$ packed form
-3175H698q146N536O873l829K757L067p580m715J0576J024n35n069j36m01l758
-2260D362N137l155l017J817O226j1227K703o06O082k854l825K539R0l297m867
-1344c892j705K200p92J899J457Q88M747O65q031j309J143J0550L022l672K67
-429G437n22p026P19k22l101l819O552n598P64L181K816L077k733O7L025P13
548E330N331n716K481o168k261Q344p344o791m76K000P600j676m021P48Q128
1464E509P537m913o29L88o08o093L06j396p25j066L037j325O70M001m244k68
2440A81K615O187J216K621L876J13r374m291N579Q243j996l647j604j230n99
3356G890r6k776J535O324R6j0298K540O478q565j5517J880k320N714L380K845
$$ plain form
4271 -890 -7437 -12955 -8949 -3540 3807 870 -9554 -11953 2436 8368 9801 15460 15740 13308
5126 13308 9821 8975 8587 9897 2932 4700 11510 438 6601 8747 7324 11211 11175 3215 -685
6041 -685 4480 -326 4335 -1141 5578 14392 17653 8629 -1090 -6965 -2406 -345 -2529 -2914 3998
6957 3998 4533 8369 9422 9621 9562 5225 2385 3964 6164 9399 8978 13239 8823 5370 4120 7772
7934 7772 3454 9952 4919 -2197 1361 14947 15642 8779 6817 2763 4566 4826 8967 13585 16031
8849 16031 10980 9273 12074 12076 9604 6162 5877 11289 9140 4581 7070 1704 6061 11599 3839
9765 3839 6055 7642 10213 321 5197 668 8115 4312 -2441 -3370 1293 4070 2394 -1429 -8145
10681 -8145 -3837 229 -7680 -8767 -6643 -5506 -1173 124 -7052 -329 -2092 -3597 1743 10108
$$ packed form
4271h90o547n518M006N409P347k937j0424k399J4389N932J433N659K80k432
5126A3308l487q46l88J310o965J768O810j1072O163K146j423L887l6p960l900
6041f85N165m806M661n476O719Q814L261r024r719n875M559K061k184l85O912
6957C998N35L836J053J99n9m337k840J579K200L235m21M261m416l453j250L652
7934G772m318O498n033p116L558J3586O95o863j962m054J803K60M141M618K446
8849A6031n051j707K801Kk472l442k85N412k149m559K489n366M357N538p760
9765C839K216J587K571r892M876m529P447l803o753r29M663K777j676l823o716
10681h145M308M066p909j087K124J137M333J297p176O723j763j505N340Q365
$$ plain form
11535 10108 10702 8871 4327 10074 964 -8842 -13177 -17024 -11972 -1961 8598 10282 3862 1280
12390 1280 886 7819 10624 3418 -6909 -2778 928 5298 4959 7090 1160 -11118 -11074 -1607 6923
13305 6923 5695 6821 5902 6143 3474 6729 9520 9362 6409 11952 13443 6426 3340 -6273 -4468
14221 -4468 757 549 3755 6562 3064 -5301 -6227 -2591 3120 3492 -501 -2316 -1867 3840 563
15136 563 -1659 -6885 1391 7222 1493 7134 7181 9403 20442 16423 4109 -2256 3349 -1997 1308
16052 1308 11380 5414 -3568 1038 5558 1043 -6258 -1130 -662 -2601 -81 96 -10588 -7254
16907 -7254 -3029 -2345 -11061 -14346 -4643 1190 3938 11925 4906 -1150 -6019 -7821 1157 508 5878
17822 5878 5972 6864 3597 1497 4437 -2115 -5264 -6404 -4789 -5538 -3398 4335 2521 -1017 1445
$$ packed form
11535A0108N94j831m544N747r110r806m335l847N052J0011J0559J684o420k582
12390A280l94O933K805p206j0327M131L706M370l39K131n930j2278M4R467Q530
13305F923j228J126r19K41k669L255K791j58k953N543J491p017l086r613J805
14221d468N225k08L206K807l498q365r26L636N711L72l993j815M49N707l277
15136E63k222n226Q276N831n729N641M7K222J1039m019j2314o365N605n346L305
16052A308J0072n966q982M606M520m515p301N128M68j939K520J77j0684L334
16907g254M225O84q716l285R703N833K748P987p019o056m869j802Q978o49N370
17822E878R4Q92l267k100K940o552l149j140J615p49K140P733j814l538K462
$$ plain form
18738 1445 2270 1107 -6029 -8245 -8508 -9846 -9473 -8130 -9614 -3047 -9091 -7196 -1157 -1638 -3928
19653 -3928 -6697 3100 14173 18975 10964 8750 9652 4003 4227 1679 3002 14653 10089 2848
20508 2848 -8747 -12113 -5752 2459 5353 6685 5766 1239 1008 4067 10508 12167 13301 15265 12187
21423 12187 10303 7002 2320 2781 2818 -5 5372 10171 8642 10311 8180 5321 197 9861 12793
22339 12793 2630 -4002 -6874 2928 5669 1697 3728 7945 12308 1640 550 1813 4552 57
23194 57 1779 -735 -602 -9792 -8067 3755 2096 2631 3781 14354 11194 611 -3726 2522 5795
24109 5795 6104 2966 4351 7903 4872 7750 7688 8178 2798 9765 7103 3283 8521 7234 10209
25025 10209 14905 4255 -27 9946 7719 5353 4220 6941 14420 22263 12739 11072 6938 4641
$$ packed form
18738A445Q25j163p136k216k63j338L73J343j484O567o044J895O039m81k290
19653c928k769R797J1073M802q011k214R02n649K24k548J323J1651m564p241
20508B848j1595l366O361Q211K894J332r19m527k31L059O441J659J134J964l078
21423A2187j884l301m682M61L7k823N377M799j529J669k131k859n124R664K932
22339A2793j0163o632k872R802K741l972K031M217M363j0668j090J263K739m495
23194E7J722k514J33r190J725J1822j659N35J150J0573l160j0583m337O248L273
24109E795L09l138J385L552l031K878o2M90n380O967k662l820N238j287K975
25025A0209M696j0650m282R973k227k366j133K721P479P843r524j667m134k297
$$ plain form
25879 4641 6821 471 7004 14442 12272 13136 2519 -72 2181 4011 8494 4263 11476 13846
26734 13846 4957 4 10882 11930 10939 11245 12703 15985 10528 9146 18022 14093 5874 -16
27588 -16 2926 1300 -5331 -6442 -4538 515 6396 7621 7084 5734 6450 9032 6642 5902 7436 1276
28565 1276 7256 7912 5960 2371 -1961 5628 12371 8457 2100 5956 7403 11555 12195 1423 5882
29481 5882 11040 13028 3593 -1542 -409 5461 1910 3643 6708 13361 12738 12726 8534 9725 17146
30396 17146 7617 1319 5107 10267 13135 7714 3021 915 -799 1910 6919 8557 11033 9363
31251 9363 3127 858 456 -1823 166 5851 17501 15193 5865 -2221 -4956 125 2434 -4862
32105 -4862 -14324 -6440 1263 -11 1692 -3406 2676 10266 1507 -3276 536 708 -3280 4511 -802
$$ packed form
25879D641K180o350O533P438k170Q64j0617k591K253J830M483m231P213K370
26734A3846q889m953J0878J048r91L06J458L282n457j382Q876l929q219n890
27588a6K942j626o631j111J904N053N881J225n37j350P16K582k390p40J534o160
28565A276N980O56j952l589m332P589O743l914o357L856J447M152O40j0772M459
29481E882N158J988r435n135J133N870l551J733L065O653o23j2m192J191P421
30396A7146r529o298L788N160K868n421m693k106j714K709N009J638K476j670
31251I363o236k269m02k279J989N685J1650k308r328q086k735N081K309p296
32105d862r462P884P703j274J703n098O082P590q759m783L812J72l988P791n313
$$ plain form
33021 -802 -2682 7926 16796 17255 977 -7062 -591 4188 5124 -1464 1313 10125 12020 9034 612
33937 612 1857 -3753 -6111 1113 12131 13507 9674 8336 7640 3100 1117 -234 -2353 2196 5618
34852 5618 5458 6423 10894 10049 8803 5764 4473 8065 5174 6195 -2875 -6185 26 9069 12214
35768 12214 11783 11845 18543 16728 9295 6585 2087 2315 -5765 -8525 -6496 -4409 -311 2192 2118 3864
36744 3864 212 -5570 -11794 -7387 7864 9286 4362 10953 9284 3865 13326 20042 10317 6574
37599 6574 7134 9329 5024 820 -3578 -4627 -7723 -8309 -7956 1083 -212 -10183 -5417 -3265 -3578
38514 -3578 -485 -5333 1180 11758 7889 4562 2937 -3275 -3314 125 3800 11398 7836 7956 808
39430 808 1640 5491 2837 4401 7017 1666 4997 711 -4121 -12710 -6097 -5836 -8238 -9394 -4923
$$ packed form
33021h02j880J0608Q870M59j6278q039O471M779R36o588K777Q812J895k986q422
33937F12J245n610k358P224J1018J376l833j338o96m540j983j351k119M549L422
34852E618j60R65M471q45j246l039j291L592k891J021r070l310O211R043L145
35768A2214m31O2O698j815p433k710m498K28q080k760K029K087M098K503p4J746
36744C864l652n782o224M407J5251J422m924O591j669n419R461O716r725l743
37599F574N60K195m305m204m398j049l096n86L53R039j295r971M766K152l13
38514c578L093m848O513J0578l869l327j625o212l9L439L675P598l562J20p148
39430H08Q32L851k654J564K616n351L331m286m832q589O613K61k402j156M471
$$ plain form
40345 -4923 5348 2707 3148 1540 3926 -3130 4245 10555 14899 8366 6212 10150 3155 1378
41200 1378 -1067 -604 4922 12442 9702 6413 9304 7068 4176 3603 7574 -3542 -6661 -212 764
42115 764 5538 76 -2207 1285 4709 11694 7470 2432 1952 9019 12412 8451 7660 2172 -738
43031 -738 8390 17177 14883 4905 6921 5950 -3301 -5782 -4231 -5726 -7606 -3925 5922 8262 6114
43947 6114 9739 13177 17188 12877 4594 313 324 -2800 12 6324 11166 10541 11857 13623 7998
44862 7998 7401 5692 2064 -2169 -12336 -5764 -2046 5898 15107 20873 12693 5929 6878 4064 3946
45778 3946 13173 9022 10550 13707 11105 12113 1057 518 626 1899 -5062 -1053 6312 8735 5548
46694 5548 -1637 39 -4062 -6185 1793 5901 5229 14318 18824 15142 15855 14771 12681 14700 8328
$$ packed form
40345d923J0271k641M41j608K386p056P375O310M344o533k154L938o995j777
41200A378k445M63N526P520k740l289K891k236k892n73L971j1116l119O449R76
42115G64M774n462k283L492L424O985m224n038m80P067L393l961p91n488k910
43031g38R128Q787k294r978K016r71r251k481J551j495j880L681R847K340k148
43947F114L625L438M011m311q283m281J1l124K812O312M842o25J316J766n625
44862G998n97j709l628m233j0167O572L718P944R209N766q180o764R49k814j18
45778C946R227m151J528L157k602J008j1056n39J08J273o961M009P365K423l187
46694E548p185J676m101k123P978M108o72R089M506l682P13j084k090K019o372
$$ plain form
47609 8328 2646 904 3431 -713 -7417 -8527 3024 3714 6112 5347 -1322 -1103 1389 6126 5046
48525 5046 3690 6391 11711 9759 4467 3317 -1038 290 7581 5604 865 -5052 -3049 408
49379 408 438 -4118 -4717 -1133 1571 8368 7410 -2762 -13907 -11633 -5197 1542 3013 6036 15175
50295 15175 18973 15504 12357 4637 3642 1893 -992 -1357 1822 11673 9664 5281 12355 12266 8850
51210 8850 12374 13302 14298 15026 8074 6375 3339 6749 6298 9741 16513 18619 11575 16307 13662
52126 13662 13509 20201 15711 23245 30874 56470 120538 293838 701958 594279 420512 297950
52858 297950 211291 156475 132121 100626 80633 66940 49510 27061 16120 10510 18891 25120
53591 25120 19226 18597 21786 15813 14128 19329 27456 30474 23689 19942 14786 14304 4279 7368
$$ packed form
47609H328n682j742K527m144o704j110J1551O90K398p65o669K19K492M737j080
48525E046j356K701N320j952n292j150m355J328P291j977m739n917K003L457
49379D08L0m556n99L584K704O797r58j0172j1145K274O436O739J471L023R139
50295A5175L798l469l147p720r95j749k885l65L179R851k009m383P074q9l416
51210H850L524R28R96P28o952j699l036L410m51L443O772K106p044M732k645
52126A3662j53O692m490P534P629K5596O4068J73300M08120j07679j73767j22562
52858B97950q6659n4816k4354l1495j9993j3693j7430k2449j0941n610Q381O229
53591B5120n894o29L189n973j685N201Q127L018o785l747n156m82j0025L089
$$ plain form
54445 7368 7586 19364 21599 26117 15189 6191 1530 -3228 253 13906 14855 8434 10175 10364
55300 10364 15286 21467 16091 5651 3741 3712 9045 24119 24047 22398 17723 8936 2352 1831 1627
56216 1627 -1310 4725 2152 -1294 -276 -1061 8643 9672 3144 8326 17311 15113 2305 12671
57070 12671 12996 13732 15227 18162 20163 10376 -3169 -1490 9184 4569 7665 6561 4913 -1612
57924 -1612 692 7611 11126 9800 14113 17758 15102 16714 6950 -6011 -2850 -3409 1820 463
58779 463 499 -798 -1280 -1412 -4756 -14290 -9347 -5637 -7214 -7036 -6145 -8610 -7275 -5510 -4408 1999
59756 1999 3911 3233 1260 -2317 -567 1774 -1198 4408 6851 6610 2365 2123 -1457 4297 8652
60671 8652 2350 4491 8964 13466 7404 2377 4881 579 -5375 -6124 59 10220 9846 10563 2361
$$ packed form
54445G368K18J1778K235M518j0928q998m661m758L481J3653R49o421J741J89
55300A0364M922O181n376j0440j910k9N333J5074p2j649m675q787o584n21k04
56216A627k937O035k573l446J018p85R704J029o528N182Q985k198j2808J0366
57070A2671L25P36J495K935K001r787j3545J679J0674m615L096j104j648o525
57924a612K304O919L515j326M313L645k656J612r764j2961L161n59N229j357
58779D63L6j297m82j32l344r534M943L710j577J78Q91k465J335J765J102O407
59756A999J912o78j973l577J750K341k972N606K443k41m245k42l580N754M355
60671H652o302K141M473M502o062n027K504m302n954p49O183J0161l74P17q202
$$ plain form
61587 2361 8365 5642 3239 3000 6166 11457 14862 7098 -491 1099 4919 6960 9086 10743 3829
62503 3829 -3184 865 10293 12214 9677 13226 12154 14068 12310 13977 9344 10411 8982 11734
63357 11734 15794 19045 17793 11382 17837 18114 14937 8767 4234 6590 10797 11763 8492 9957 22601
64273 22601 22323 22179 21327 10561 -6703 -1449 5788 8351 2188 2287 1729 4213 6232 16493 14303
65188 14303 11860 9112 2411 6488 14363 15686 4711 10074 13743 7907 3775 7612 2185 2307
66043 2307 6674 13208 8901 5992 6242 3239 5340 -1416 -6412 5670 3214 2710 8267 4452 2048
66958 2048 1367 7396 9687 9923 10469 6040 8456 7280 6563 -5887 3787 -895 -8268 -6941 -5022
67874 -5022 -5854 -544 9392 3015 10206 15518 27132 27924 24893 21011 10111 4774 6190 8471
$$ packed form
61587B361O004k723k403k39L166N291L405p764p589J590L820K041K126J657o914
62503C829p013M049R428J921k537L549j072J914j758J667m633J067j429K752
63357A1734M060L251j252o411O455K77l177o170m533K356M207R66l271J465J2644
64273B2601k78j44q52j0766j7264N254P237K563o163R9n58K484K019J0261k190
65188A4303k443k748o701M077P875J323j0975N363L669n836m132L837n427J22
66043B307M367O534m307k909K50l003K101o756m996J2082k456n04N557l815k404
66958B048o81O029K291K36N46m429K416j176p17j2450R674m682p373J327J919
67874e022q32N310R936o377P191N312J1614P92l031l882j0900n337J416K281
$$ plain form
68728 8471 9166 10615 14193 18961 10871 2025 6990 7209 4251 3544 3888 2276 8268 3945 1066
69644 1066 -2222 -84 6264 -935 892 2065 -1980 -6163 -4374 3330 8342 7876 10707 8723 -521
70559 -521 8553 5823 2368 1451 9127 6399 9184 10526 7153 3209 2091 12047 6720 1860 -869
71475 -869 -2255 1312 8218 9892 5704 11738 -2339 -6336 -7074 -3759 -1966 -2702 -3221 4421 8067
72391 8067 11674 8220 7967 -1529 1720 50 -837 8904 22973 15460 8524 5235 -43 663 2360
73306 2360 2418 -1968 -2016 7653 13197 12144 9630 9349 11207 3396 -5318 754 1831 -357 -6588 236
74283 236 5138 1356 5447 5414 9595 6610 11812 6092 7524 11761 7010 -248 3139 -4772 1904
75199 1904 14149 17079 12497 13338 9803 11752 11317 5329 5184 12283 9862 5320 -1553 1955 4905
$$ packed form
68728H471O95J449L578M768q090q846M965K19k958p07L44j612N992m323k879
69644A066l288K138O348p199J827J173m045m183J789P704N012m66K831j984r244
70559e21R074k730l455r17P676k728K785J342l373l944j118R956n327m860k729
71475h69j386L567O906J674m188O034j4077l997p38L315J793p36n19P642L646
72391H067L607l454k53r496L249j670q87R741J4069p513o936l289n278P06J697
73306B360N8m386m8R669N544j053k514k81J858p811q714O072J077k188o231O824
74283B36M902l782M091l3M181k985N202n720J432M237m751p258L387p911O676
75199A904J2245K930m582Q41l535J949m35n988j45P099k421m542o873L508K950
$$ plain form
76114 4905 13068 16153 12836 3622 -702 2972 8904 14412 22552 16184 8310 1532 3566 5593
76969 5593 6818 4361 3046 4822 11178 14324 20364 5935 -6880 -9800 -6163 -4447 -8631 -17526
77823 -17526 -8293 -1748 4356 13663 13376 8969 8551 12940 14474 12090 -895 783 6470 5797 3262
78739 3262 9813 20617 11955 9219 9636 10314 10464 8844 11017 5340 5004 1704 -2769 -1826 -7412
79654 -7412 -5969 2415 -1286 -607 6679 6673 5805 1085 2099 -1699 9720 8105 6598 3019 8764
80570 8764 9357 4994 2204 1900 -1920 -6843 -14152 -5304 -4574 -7047 3184 664 1097 9104 10820
81485 10820 4710 4608 5361 7824 9101 4966 -159 -7912 -4627 1094 3125 2458 1009 -866 -3389
82401 -3389 -253 620 2693 9034 11934 9440 7903 3226 6010 9643 13027 17171 17015 3883 -2833
$$ packed form
76114D905Q163L085l317r214m324L674N932N508Q140o368p874o778K034K027
76969E593J225k457j315J776O356L146O040j4429j2815k920L637J716m184q895
77823a7526R233O545O104R307k87m407m18M389J534k384j2985J678N687o73k535
78739C262O551J0804q662k736M17O78J50j620K173n677l36l300m473R43n586
79654g412J443Q384l701O79P286oq68m720J014l798J1419j615j507l579N745
80570H764N93m363k790l04l820m923p309Q848P30k473J0231k520M33Q007J716
81485A0820o110j02P53K463J277m135n125p753L285N721K031o67j449j875k523
82401c389L136Q73K073O341K900k494j537m677K784L633L384M144j56j3132o716
$$ plain form
83317 -2833 -1022 -7821 -3613 -1521 9189 9842 11176 7301 9534 8755 6726 2232 -1757 4022 9723
84232 9723 16506 12766 12565 26510 56965 94700 220525 645029 672168 440140 292983 196417
84965 196417 137540 112775 101681 94927 76682 56221 37731 29299 25008 29813 23859 15160
85697 15160 13886 8437 13053 12008 13527 15452 14024 13791 13916 14775 10259 9585 13483 12938 6884
86613 6884 7696 2089 878 5703 5889 11541 18202 8343 6391 9366 5960 11605 11819 10861 19779
87529 19779 23165 12764 6793 6933 4260 6783 11099 11522 2972 1574 2527 2324 7381 6878 8910
88444 8910 25583 24524 10881 7552 13378 19070 20192 19349 27200 23550 14682 14272 11020 19793
89299 19793 26587 26242 23284 30533 35449 49175 81702 166468 392580 974208 701448 408031
$$ packed form
83317b833J811o799M208K092J0710O53J334l875K233p79k029m494l989N779N701
84232I723O783l740k01J3945L0455L7735J25825M24504K7139k32028j47157r6566
84965A96417n8877k4765j1094o754j8245k0461j8490q432m291M805n954q699
85697A5160j274n449M616j045J519J925j428k33J25Q59m516o74L898n45o054
86613F884Q12n607j211M825J86N652O661r859j952K975l406N645K14r58Q918
87529A9779L386j0401n971J40k673K523M316M23q550j398R53k03N057n03K032
88444H910J6673j059j3643l329N826N692J122q43P851l650q868m10l252Q773
89299A9793O794l45k958P249M916J3726L2527Q4766K26112N81628k72760k93417
$$ plain form
90031 408031 263428 179801 140647 118575 101885 83667 64539 46002 36898 30704 33872 33805
90763 33805 29232 24908 22053 22734 17388 22224 21002 17154 10600 4186 2319 11899 10405 10163 7038
91679 7038 2108 4976 10091 10867 16169 12668 7183 3627 4731 14535 18430 17316 11916 15771 6077
92595 6077 4734 8225 6023 2220 9622 11321 7702 9438 5075 -59 6510 8720 4893 5890 9601
93510 9601 8013 3515 1639 5688 7696 14495 19592 16295 14289 10788 8857 11042 2405 5797
94365 5797 17058 22264 18555 25356 23727 13936 15702 15715 11807 17279 17390 20206 12806 5543 4621
95280 4621 3343 4915 1149 7782 14779 15164 6279 -470 696 9427 17932 17101 7350 1423 5973
96196 5973 13347 13670 2565 2164 8305 3666 8471 13679 12718 17246 20306 21637 19844 16149 16044
$$ packed form
90031D08031j44603q3627l9154k2072j6690j8218j9128j8537r104o194L168o7
90763C3805m573m324k855O81n346M836j222l848o554o414j867R580j494k42l125
91679G038m930K868N115P76N302l501n485l556J104R804L895j114n400L855r694
92595F077j343L491k202l803P402J699l619J736m363n134O569K210l827R97L711
93510I601j588m498j876M049K008O799N097l297k006l501j931K185q637L392
94365E797J1261N206l709O801j629r791J766J3l908N472J11K816p400p263r22
95280D621j278J572l766O633O997L85q885o749J166Q731Q505q31r751n927M550
96196E973P374L23j1105m01O141m639M805N208r61M528L060J331j793l695j05
$$ plain form
97112 16044 15653 7227 9157 5282 -231 -1830 -1561 5033 -2110 -5139 -8110 -7162 1308 -14907 -9046
98027 -9046 -5120 -4316 -1383 5361 12107 17233 17168 16560 19868 12912 12423 9229 2816 10533 10703 12255
99004 12255 5612 2084 5372 5575 9500 15114 11715 11683 10033 8566 8137 12552 5482 -2507 -2768
99919 -2768 -3538 -10988 -6555 -3704 5349 10532 5801 11255 13534 4305 2075 -559 -155 -3916 -2511
100835 -2511 -2100 858 3993 -1805 -2190 -765 2718 2790 -2304 5333 21445 24335 25520 9226 3106
101750 3106 -627 1602 3794 6258 2694 8008 1849 -11026 -13534 -8792 -1578 6295 4446 5049
102605 5049 5989 9116 15195 17465 14264 10666 7928 7337 11923 7658 2765 -1227 -2187 -642 852
103521 852 2927 -1934 -1123 -321 6082 7888 11078 4967 2427 2473 1563 -184 668 6902 8913 4569
$$ packed form
97112A6044l91q426J930l875n513j599K69O594p143l029k971R48Q470j6215N861
98027i046L926Q04K933O744O746N126o5o08L308o956m89l194o413P717J70J552
99004A2255o643l528L288K03L925N614l399l2j650j467m29M415p070p989k61
99919b768p70p450M433K851R053N183m731N454K279r229k230k634M04l761J405
100835b511M11K958L135n798l85J425L483P2n094P637J6112K890J185j6294o120
101750C106l733K229K192K464l564N314o159j2875k508M742P214P873j849O03
102605E049R40L127O079K270l201l598k738n91M586m265m893l992r60J545J494
103521H52K075m861Q11Q02O403J806L190o111k540M6r10j747Q52O234K011m344
$$ plain form
104497 4569 186 8318 9857 10713 13886 14845 15146 10187 13461 13953 12693 7102 7272 7513 9476 5112
105474 5112 6688 1066 3860 5248 1306 -10327 -19149 -9969 -864 5159 10183 9694 5630 4109
106328 4109 -2379 822 8262 5270 11609 15701 15662 25956 28433 11876 8698 11107 8452 3252
107183 3252 -6251 -1784 8779 12947 15393 16529 4039 360 10468 7366 2810 2771 1949 2114 2225
108099 2225 7558 9779 8443 14580 26253 38732 54999 76906 128721 275405 739565 880678
108831 880678 520782 333104 223404 168469 137129 113421 93848 71082 56652 45941 40300
109503 40300 36158 32614 22580 17601 14947 17209 12979 14070 14903 17923 18782 3363 279 7070
110357 7070 15226 21931 16866 4383 13133 21217 9430 10375 12024 9262 3362 9947 7531 7893
$$ packed form
104497D569m383Q132J539Q56L173R59L01m959L274M92j260n591J70K41J963m364
105474E112J576n622K794J388l942j1633q822R180R105O023N024m89m064j521
106328D109o488L201P440k992O339M092l9J0294K477j6557l178K409k655n200
107183C252r503M467J0563M168K446J136j2490l679J0108l102m556l9q22J65J11
108099B225N333K221j336O137J1673J2479J6267K1907N1815J46684M64160J41113
108831H80678l59896j87678j09700n4935l1340k3708j9573k2766j4430j0711n641
109503D0300m142l544j0034m979k654K262m230J091Q33L020Q59j5419l084O791
110357G070Q156O705n065j2483Q750Q084j1787R45J649k762n900O585k416L62
$$ plain form
111212 7893 6539 -2153 -6786 -164 5094 3037 5314 18472 26328 27488 25068 18194 17236 23405
112066 23405 35212 63909 169531 374623 300682 216170 163427 121006 92395 67392 56432
112737 56432 52707 51404 44208 32530 28157 22951 24250 26434 21277 12236 11093 8911 5787 5861
113592 5861 3545 6380 7457 -1105 3012 8608 12669 11655 7462 3723 2477 -4783 -2242 543
114446 543 4116 6570 10364 7341 12036 9408 2524 10817 8807 20596 12276 4224 -359 -2177
115301 -2177 3853 5895 3825 5375 6848 5530 -1438 -4465 -2027 1849 8707 12746 13642 16117 9311
116217 9311 8313 7318 5345 3587 1581 2800 3531 -1661 -900 3153 -8021 1388 10511 12818 13456
117132 13456 7823 7773 9834 11617 11965 11848 3244 544 11062 10175 -3956 483 -6587 -5458 5458
$$ packed form
111212G893j354q692m633O622N258k057K277J3158P856J160k420o874r58O169
112066B3405J1807K8697J05622K05092p3941q4512n2743m2421k8611k5003j0960
112737E6432l725j303p196j1678m373n206J299K184n157r041j143k182l124P4
113592E861k316K835J077q562M117N596M061j014m193l739j246p260K541K785
114446E43L573K454L794l023M695k628o884Q293k010J1789q320q052m583j818
115301b177O030K042k070J550J473j318o968l027K438L876O858M039Q96K475o806
116217I311r98r95j973j758k006J219P31n192P61M053j1174R409R123K307O38
117132A3456n633n0K061J783L48j17q604k700J0518q87j4131M439p070J129J0916
$$ plain form
118048 5458 15470 13575 7250 3839 597 -1037 3964 14166 16569 14800 14670 26803 31729 45883
118902 45883 84562 215428 644790 805254 497018 327308 224828 167951 143732 124101
119513 124101 98272 82176 58692 32759 26289 25713 31498 41140 37523 23543 18668 16899 12469
120306 12469 9292 10152 13702 12306 3143 7874 7091 1309 -3726 -5 -1661 5773 14027 24109
121161 24109 22937 26368 30445 26750 13194 1217 -3157 -3477 -463 -8664 -1853 12793 13536 15526
122015 15526 2916 -12625 -5370 -428 -5109 7928 8540 7217 5382 921 4271 7198 11519 6736
122870 6736 3647 1128 6157 6600 6501 14862 20088 16669 9616 10033 9788 7652 6267 8655 8896 6972
123846 6972 8878 8385 7696 10681 8636 6987 16877 23196 15511 9821 10233 17917 13886 4766 11263
$$ packed form
118048E458J0012j895o325l411l242j634N001J0202K403j769j30J2133M926J4154
118902D5883L8679J30866M29362J60464l08236j69710j02480n6877k4219j9631
119513A24101k5829j6096k3484k5933o470n76N785R642l617j3980m875j769m430
120306A2469l177Q60L550j396r163M731p83n782n035L721j656P434Q254J0082
121161B4109j172L431M077l695j3556j1977m374l20L014q201O811J4646P43J990
122015A5526j2610j5541P255M942m681J3037O12j323j835m461L350K927M321m783
122870F736l089k519N029M43r9Q361N226l419p053M17k45k136j385K388K41j924
123846F972J906m93o89K985k045j649R890O319p685n690M12P684m031r120O497
$$ plain form
124762 11263 11432 10740 -1767 -3656 -2009 1866 10995 5666 3739 3953 961 -488 2629 7597 -1346
125678 -1346 -4170 -6192 3600 4458 5827 10506 12189 6669 11203 10386 3300 1768 4647 11954 6273
126593 6273 7567 20573 9736 2867 -3445 -1178 4848 -2466 -5043 2866 9009 12400 16256 14393
127448 14393 11231 10085 5504 -598 9356 9611 8824 10555 7042 7513 7737 10126 6415 1646 -2286
128363 -2286 3688 8472 3922 4172 8196 13591 14249 186 4083 -5625 -11023 -4207 -4072 -1120 324
129279 324 -5809 -8456 -2589 3250 -3297 1208 3453 1794 3942 14206 18276 12995 10492 8383
130134 8383 11366 21826 21622 19474 9294 1096 -6285 -7722 -4313 -3549 -2603 280 2636 7455 7738
131049 7738 8693 6782 10491 14790 5543 6103 7471 174 6415 18399 19365 16551 17297 15684 14518
$$ packed form
124762A1263J69o92j2507j889J647L875R129n329j927K14k992j449L117M968q943
125678a346k824k022R792Q58J369M679J683n520M534q17p086j532K879P307n681
126593F273J294J3006j0837o869o312K267O026p314k577P909O143L391L856j863
127448A4393l162j146m581o102R954K55p87J731l513M71K24K389l711m769l932
128363b286N974M784m550K50M024N395O58j4063L897r708n398O816J35K952J444
129279C24o133k647N867N839o547M505K245j659K148J0264M070n281k503k109
130134H383K983J0460k04k148j0180q198p381j437L409P64R46K883K356M819K83
131049G738R55j911L709M299r247N60J368p297O241J1984R66k814P46j613j166
$$ plain form
131965 14518 10353 3108 8628 5130 11532 5190 -1779 -4753 1197 5722 6582 3078 6240 12092
132819 12092 15995 18374 17838 13336 12300 13171 10947 5279 9711 9623 13296 11903 16543 14897 19997
133735 19997 23126 9379 2473 1868 11631 16321 11393 4214 6623 10124 6087 4590 13325 9407
134589 9407 3663 12622 12369 10746 1849 -1478 13040 18297 17352 19634 22372 23356 21190 14968 15928
135505 15928 11416 10037 4369 -1398 2790 11291 8258 4365 5978 6048 2703 -798 -7711 -4524 4010
136421 4010 10327 2320 4898 211 6 -468 4879 12865 10523 13219 2377 -634 2339 1936 -2065
137336 -2065 1233 2714 -1706 -3987 4392 4616 3322 4624 3735 8355 7823 9639 12401 11716 5466
138252 5466 -1862 -6729 -2419 1020 -7112 -5118 4888 10262 10957 8620 9325 6161 559 1966 -999
$$ packed form
131965A4518m165p245N520l498O402o342o969k974N950M525Q60l504L162N852
132819A2092L903K379n36m502j036Q71k224n668M432q8L673j393M640j646N100
133735A9997L129j3747o906o05R763M690m928p179K409L501m037j497Q735l918
134589I407n744Q959k53j623q897l327J4518N257r45K282K738R84k166o222R60
135505A5928m512j379n668n767M188Q501l033l893J613P0l345l501o913L187Q534
136421D010O317q007K578m687k05m74N347P986k342K696j0842l011K973m03m001
137336b065L298J481m420k281Q379K24j294J302q89M620n32J816K762o85o250
138252E466p328m867M310L439q132J994J0006N374O95k337P05l164n602J407k965
$$ plain form
139167 -999 -10695 -19895 -16979 -18143 -13141 -3146 458 -4332 -7980 -7542 -4074 -811 -2852 -6109 -5701
140083 -5701 -4334 4132 1535 -3707 -2548 -5138 874 12165 16817 8841 1719 4904 7781 7595
140937 7595 10270 8354 5809 8295 12610 7934 -135 3503 13602 12266 6366 13351 27959 27686
141792 27686 21362 11670 5923 11150 15958 21153 14597 9549 9298 7974 3477 5324 15235 12481
142647 12481 6179 8757 17292 17307 16449 10613 9174 5141 -336 3328 10041 11999 13087 10770 6272
143562 6272 12284 7907 8126 12264 8626 2870 9244 13829 10959 5886 7510 15116 20337 16937 15723
144478 15723 10643 11899 22537 22731 8721 1917 371 3081 12407 5432 7329 5714 -776 -2174
145332 -2174 -2900 -5434 -25 -5504 -4570 95 5779 10139 9107 8652 538 2905 2876 9852 10335 8975
$$ packed form
139167i99r696r200K916j164N002R995L604m790l648M38L468L263k041l257M08
140083e701J367Q466k597n242J159k590O012J1291M652p976p122L185K877j86
140937G595K675j916k545K486M315m676q069L638J0099j336n900O985J4608k73
141792B7686o324r692n747N227M808N195o556n048k51j324m497J847R911k754
142647A2481o302K578Q535J5q58n836j439m033n477L664O713J958J088k317m498
143562F272O012m377K19M138l638n756O374M585k870n073J624P606N221l400j214
144478A5723n080J256J0638J94j4010o804j546K710R326o975J897j615o490j398
145332b174p26k534N409n479R34M665N684M360j032m55q114K367k9O976M83j360
$$ plain form
146309 8975 1114 9256 11039 11453 1193 -9583 -6160 -8537 -5594 -1167 2690 12677 18681 2775
147164 2775 -4056 -2116 2962 -6201 -3879 -307 -2714 10873 6314 3028 5728 8860 9339 1119
148018 1119 4314 10410 -862 -6811 -4081 8702 8663 10225 14392 9927 2445 3249 -17 1647 3562
148934 3562 5750 -1314 -7158 -10025 -3273 8441 12184 15005 13591 11075 11735 15549 12602 11343
149788 11343 2746 4893 5943 5496 3681 3445 4640 3116 -5712 -12876 -1903 -3304 -2256 9463
150643 9463 15058 7508 7583 2026 -2188 6817 4213 -5887 -10592 -11360 -2338 4243 10385 8792 -7255
151558 -7255 917 5157 11311 11522 2580 -4298 1862 3043 -3594 -4713 -4058 3912 7083 7780 7582
152474 7582 1456 2291 21422 22910 10042 8183 4567 1300 1720 -4026 1731 3958 -7168 -67
$$ packed form
146309H975p861Q142J783M14j0260j0776L423k377K943M427L857R987O004j5906
147164B775o831J940N078r163K322L572k407J3587m559l286K700L132M79q220
148018A119L195O096j1272n949K730J2783l9J562M167m465p482Q04l266J664J915
148934C562K188p064n844k867O752J1714L743K821j414k516O60L814k947j259
149788A1343q597K147J050m47j815k36J195j524q828p164J0973j401J048J1719
150643I463N595p550P5n557m214R005k604j0100m705p68R022O581O142j593j6047
151558g255Q172M240O154K11q942o878O160J181o637j119O55P970L171O97j98
152474G582o126Q35J9131J488j2868j859l616l267M20n746N757K227j1126P101
$$ plain form
153329 -67 6660 2679 69 4111 10714 7686 3122 -505 -2426 -168 -1634 -9356 -15659 -8339 -6636
154244 -6636 -1578 -3160 -1644 2303 -4636 -4914 -3461 -2820 -6197 -6222 409 7409 6022 1553 3869
155160 3869 6291 7960 9600 8187 1225 -747 2037 6609 936 2119 -2603 -3051 15611 13324
156014 13324 9724 12549 11243 10309 5871 8370 -3343 -5093 9479 10981 11079 933 10806 13597
156869 13597 10155 11278 8813 134 4733 6162 6896 -1232 -2669 -4889 -7229 -4484 -1014 4730
157723 4730 -528 -6178 -9078 -6383 -2936 2166 17706 22621 20177 20233 14780 3069 281 -2786
158578 -2786 -1602 -5763 -31 -4522 -1553 3217 7796 1126 -181 -10029 -7635 -3476 13297 17074
159432 17074 416 1969 8853 9731 19686 18587 14327 17866 7421 5349 8536 13036 13780 14298
$$ packed form
153329f7O727l981k610M042O603l028m564l627j921K258j466p722o303P320J703
154244f636N058j582J516L947o939k78J453O41l377k5O631P000j387m469K316
155160C869K422J669J640j413o962j972K784M572n673J183m722m48J8662k287
156014A3324l600K825j306r34m438K499j1713j750J4572J502R8j0146R873K791
156869A3597l442J123k465q679M599J429P34q128j437k220k340K745L470N744
157723D730n258n650k900K695L447N102J5540M915k444N6n453j1711k788l067
158578b786J184m161N732m491K969M770M579o670j307r848K394M159J6773L777
159432A7074j6658J553O884Q78R955j099m260L539j0445k072L187M500P44N18
$$ plain form
160287 14298 16176 10524 8664 4183 3967 -4115 -7732 1423 -12486 -16202 -4187 1239 -2984 7933
161141 7933 6124 7633 7022 11743 7620 2555 -5554 932 7974 3608 -1904 2883 9507 8936 4679
162057 4679 -4167 -7573 1864 12035 15352 17388 22012 13501 20545 5097 -4805 -4754 -2296 -3111 -4558
162973 -4558 2367 9166 14684 13841 7300 2821 6015 11427 12628 15514 5786 276 -7318 -7885 -6924
163888 -6924 -5260 5367 10518 8933 14749 8990 13143 12804 16546 13847 11146 11828 14249 11147 17307
164804 17307 37307 46766 44740 69910 144459 406724 969288 720149 452251 305059 211297
165475 211297 169515 142177 118742 95618 76330 59315 42545 35016 27036 33810 38127 31292
166208 31292 21256 20555 20450 21116 19734 9716 16187 18577 18868 23776 20464 8432 4510 911
$$ packed form
160287A4298J878n652j860m481k16q082l617R155j3909l716J2015N426m223J0917
161141G933j809J509o11M721m123n065q109O486P042m366n512M787O624n71m257
162057D679q846l406R437J0171L317K036M624q511P044j5448r902N1K458q15j447
162973d558O925O799N518q43o541m479L194N412J201K886r728n510p594n67R61
163888f924J664J0627N151j585N816n759M153l39L742k699k701O82K421l102O160
164804A7307K0000R459k026K5170P4549K62265N62564k49139k67898j47192r3762
165475B11297m1782k7338k3435k3124j9288j7015j6770p529p980O774M317o835
166208C1292j0036p01j05O66j382j0018O471K390K91M908l312j2032l922l599
$$ plain form
167062 911 4438 11717 7065 4781 8511 7212 -3463 5947 10118 9231 10597 5740 6208 8714 1275
167978 1275 -121 7833 565 3396 8915 18887 20860 17312 19430 15348 12414 14166 8768 13447
168832 13447 6878 5202 10234 11224 5530 9795 2831 4175 1204 -5281 -947 5266 -3909 -3733 4297
169748 4297 11162 14878 14803 20773 18255 21398 9324 -248 6027 7721 4694 3334 -1032 1618 -2699
170663 -2699 1508 10835 14766 10463 13558 13827 8431 13229 9411 1270 1535 3702 2569 2449 7780
171579 7780 8542 10717 17469 13050 10220 8629 8595 5459 -463 -4506 -5562 -2427 3486 5743 6262
172494 6262 9325 7666 6143 13894 11078 8988 18611 23747 29928 24700 13244 8747 15169 12959
173349 12959 6472 10687 7982 3752 -593 831 5029 -264 -292 4247 6011 -3684 6010 5217 7314
$$ packed form
167062I11L527P279m652k284L730j299j0675R410M171q87J366m857M68K506p439
167978A275j396P954p268K831N519R972J973l548K118m082k934J752n398M679
168832A3447o569j676N032R90n694M265o964J344k971o485M334O213r175J76Q030
169748D297O865L716p5N970k518L143j2074r572O275J694l027j360m366K650m317
170663b699M207R327L931m303L095K69n396M798l818q141K65K167j133j20N331
171579G780P62K175O752m419k830j591l4l136n922m043j056L135N913K257N19
172494F262L063j659j523P751k816k090R623N136O181n228j1456m497O422k210
173349A2959o487M215k705m230m345J424M198n293k8M539J764r695R694p93K097
$$ plain form
174265 7314 11597 2217 4190 -928 3859 764 -4095 -8538 -1322 3244 7720 3813 2835 7343 7240
175180 7240 3643 1473 3056 12005 11281 411 1365 2990 5400 1725 -1062 6505 1892 -1226 -4685
176096 -4685 -8716 -8082 -1995 -2325 1190 6434 8481 -297 -6584 -7823 -23051 -15028 6915 12836
176950 12836 12138 11269 3404 263 8092 12259 6283 9953 3551 3710 7268 3979 3563 -72 6158
177866 6158 858 2599 9212 10957 17370 11617 11230 15636 17695 6526 -2339 5345 5446 3371 1671
178782 1671 -1970 5946 4789 728 -9702 -3438 -2744 -6991 -8661 2594 7944 8990 -550 2994
179636 2994 -6518 -8804 -1010 221 -2091 93 9218 2701 673 6765 4609 5909 4322 -391
180491 -391 10233 3391 7206 4510 12534 18901 16701 16541 15101 13613 13061 18372 13745 15724 10445
$$ packed form
174265G314M283r380J973n118M787l095m859m443P216M566M476l907r78M508j03
175180G240l597k170J583Q949p24j0870R54J625K410l675k787P567m613l118l459
176096d685m031O34O087l30L515N244K047q778o287j239j5228Q023K1943N921
176950A2836o98q69p865l141P829M167n976L670o402J59L558l289m16l635O230
177866F158n300J741O613J745O413n753l87M406K059j1169q865P684J01k075j700
178782A671l641P916j157m061j0430O264O94m247j670J1255N350J046r540L544
179636B994r512k286P794J231k312K184R125o517k028O092k156J300j587m713
180491c91J0624o842L815k696Q024O367k200j60j440j488n52N311m627J979n279
$$ plain form
181406 10445 12251 11645 13799 12327 6914 -336 -3310 1750 2596 6128 5942 10158 11021 13175 4865
182322 4865 2463 6372 3771 -1109 -6335 -5404 -8561 -8080 -8007 -5518 -8181 -3916 4584 6402 1547
183237 1547 -3496 8381 21631 17933 18230 19360 26277 19311 15907 13394 5377 5550 17949 17387
184092 17387 10365 15096 7666 -1534 -3300 205 8284 6946 5000 91 -10057 -5193 -7508 9331
184947 9331 15143 4351 -715 1418 -2765 -7318 -7334 -4452 -3607 -1228 -1879 -4254 -6268 -6776 -2941
185862 -2941 -9318 -10367 -362 -10122 543 3151 2304 1937 -1114 5942 4083 5830 -24 -3254
186717 -3254 6973 13996 7595 2762 2304 5547 13657 15822 11159 13814 14581 11879 3427 3830 4417
187632 4417 2849 5501 -3600 -5135 1406 1215 3993 13396 14854 -1037 -10006 -4914 -2172 -5571
$$ packed form
181406A0445J806o06K154j472n413p250k974N060Q46L532j86M216Q63K154q310
182322D865k402L909k601m880n226R31l157M81P3K489k663M265Q500J818m855
183237A547n043J1877J3250l698K97J130O917o966l404k513q017J73J2399n62
184092A7387p022M731p430r200j766L505Q079j338j946m909j0148M864k315J6839
184947I331N812j0792n066K133m183m553j6K882Q45K379o51k375k014n08L835
185862b941o377j049J0005r760J0665K608q47l67l051P056j859J747n854l230
186717c254J0227P023o401m833m58L243Q110K165m663K655P67k702q452M03N87
187632D417j568K652r101j535O541j91K778R403J458j5891q969N092K742l399
$$ plain form
188487 -5571 -2843 188 -2940 -4801 6851 8840 10327 10095 10417 9764 78 -921 4410 4756 8177
189402 8177 1213 6183 20104 17805 16594 13182 5619 6067 10246 8212 8871 13427 11927 11932 13566
190318 13566 6755 9161 9535 6761 13894 10539 8194 9321 8077 10826 2560 5372 6746 8972
191173 8972 13240 9407 8026 9486 7856 3451 -4062 -12511 -10036 -4380 -4020 -3992 759 4359 3250
192088 3250 5298 -6815 -3624 1142 9896 11533 2249 13562 20091 11795 7880 -3669 672 -2972
192943 -2972 74 -1798 -8925 -5679 5626 8547 2758 -7025 -11150 -8485 -5887 -1335 -1352 3492 1795
193858 1795 8324 8169 201 -1816 -2147 -121 -2127 131 4757 13739 22772 15762 1655 -490 8480
194774 8480 8391 6709 659 263 -4266 2661 13152 17488 9804 8689 575 -5292 2397 15166 21291
$$ packed form
188487e571K728L031l128j861J1652J989J487k32L22o53r686r99N331L46L421
189402H177o964M970J3921k299j211l412p563M48M179k034O59M556j500NJ634
190318A3566o811K406L74k774P133l355k345J127j244K749q266K812J374K226
191173H972M268l833j381J460j630m405p513q449K475N656L60K8M751L600j109
192088C250K048j2113L191M766Q754J637r284J1313O529q296l915j1549M341l644
192943b972L046j872p127L246J1305K921n789r783m125K665K598M552j7M844j697
193858A795O529j55p968k017l31K026k006K258M626Q982R033p010j4107k145Q970
194774H480q9j682o050l96m529O927J0491M336p684j115q114n867P689J2769O125
$$ plain form
195689 21291 16265 10628 18771 24179 24810 22617 21880 16761 -1161 -10306 265 10689 17385 10832
196544 10832 4681 -317 -3051 924 5792 7481 7641 9975 11749 7386 7970 -2231 3214 6408
197398 6408 825 -4026 -156 7347 14414 15228 8153 -2525 -3986 441 -2270 -4145 -534 2562
198253 2562 -3765 -9320 -8324 -5987 -4842 166 1165 2127 2837 1799 -2714 2209 10557 12944 9766
199168 9766 7224 13688 21589 19799 10152 8098 -1913 -2090 719 189 -7072 -12279 -2313 7889
200023 7889 7050 3101 -2109 535 385 -14400 -8283 -4728 -1489 853 2866 4288 7037 9986 13191
200939 13191 20101 21979 17165 11667 5706 8330 7142 8173 6942 -4428 -2599 -4679 -4784 -810
201793 -810 3841 10312 15861 21833 11735 1789 -6160 -7492 -4153 2628 1697 1231 2384 4018 5742
$$ packed form
195689B1291n026n637Q143N408O31k193p37n119j7922r145J0571J0424O696o553
196544A0832o151m998k734L975M868J689J60K334J774m363N84j0201N445L194
197398F408n583m851L870P503P067Q14p075j0678j461M427k711j875L611L096
198253B562o327n555R96K337J145N008R99R62P10j038m513M923Q348K387l178
199168I766k542O464P901j790r647k054j0011j77K809n30p261n207R966J0202
200023G889q39l949n210K644j50j4785O117L555L239K342K013J422K749K949L205
200939A3191O910J878m814n498n961K624j188J031j231j1370J829k080j05L974
201793h10M651O471N549N972j0098r946p949j332L339O781r31m66J153J634J724
$$ plain form
202709 5742 3358 11927 10896 7563 236 -570 1733 -834 54 3776 3204 -6845 -1226 11176 2198
203624 2198 3572 3284 7668 5872 4248 -2097 -4070 1335 9081 17225 14271 10752 66 -4754
204479 -4754 -337 39 1121 7363 11869 7035 6176 16563 15876 4129 5369 5191 1759 4446 7474
205394 7474 3141 -558 5457 1211 4077 1577 -4188 794 14140 15386 16763 18904 13222 115
206249 115 -7016 -7585 -2652 1301 -239 1146 10797 6696 -8046 -2834 6192 4914 -10231 -8276
207104 -8276 -76 3923 4682 753 3471 2397 5358 11313 12341 7106 7961 8100 7843 8527 9192 4127
208080 4127 2476 2666 8179 20580 11572 1656 409 1146 -3125 -1994 -4284 -6852 1163 3891 2991
208996 2991 3774 -71 30 1929 11053 7666 8379 1920 7041 -509 1809 -2504 -6051 145 -2656
$$ packed form
202709E742k384Q569j031l333p327q06K303k567Q88L722n72j0049N619J2402q978
203624B198J374k88M384j796j624o345j973N405P746Q144k954l519j0686m820
204479d754M417L76J082O242M506m834q59J0387o87j1747J240j78l432K687L028
205394G474m333l699O015m246K866k500n765M982J3346J246J377K141n682j3107
206249A15p131n69M933L953j540J385R651m101j4742N212R026j278j5145J955
207104h276Q200L999P59l929K718j074K961N955J028n235Q55J39k57O84O65n065
208080D127j651J90N513J2401r008r916j247P37m271J131k290k568Q015K728r00
208996B991P83l845J01J899R124l387P13o459N121p550K318m313l547O196k801
$$ plain form
209911 -2656 -6993 -7659 639 4451 4191 5064 6946 9121 12834 9833 4437 -1321 1701 6920 4105
210827 4105 3407 8241 7662 10023 6921 8845 9082 5347 1635 4641 5547 12375 11632 5683 2822 -163
211804 -163 8635 5209 4565 -6342 -8072 -1723 1986 7196 7300 5678 6478 -1994 -1828 4078 6319
212719 6319 12184 8454 2343 9408 10717 13940 13926 728 -9031 -10644 1479 -5900 -13901 -1885
213574 -1885 -2200 3894 2537 -3329 -4202 -12785 -4836 8106 -723 -6060 -4077 -6907 445 9125 3365
214489 3365 4406 -3803 -5908 3880 9601 18367 6087 -986 9572 11829 12554 17884 15566 11427
215344 11427 16113 11438 -3674 -3801 5770 3651 7343 15696 13319 10179 6124 6017 144 -6115
216198 -6115 -3393 -8847 -15297 -10381 -10530 -7469 -7359 -406 9596 3813 -13689 -17219 -10066 -93
$$ packed form
209911b656m337o66Q298L812k60Q73J882K175L713l001n396n758L022N219k815
210827D105o98M834n79K361l102J924K37l735l712L006R06O828p43n949k861k985
211804a63Q798l426o44j0907j730O349L709N210J04j622Q00q472J66N906K241
212719F319N865l730o111P065J309L223j4j3198r759j613J2123p379q001J2016
213574a885l15O094j357n866q73q583P949J2942q829n337J983k830P352Q680n760
214489C365J041q209k105R788N721Q766j2280p073J0558K257P25N330k318m139
215344A1427M686m675j5112j27R571k119L692Q353k377l140m055j07n873o259
216198f115K722n454o450M916j49L061J10O953J0002n783j7502l530P153R973
$$ plain form
217053 -93 10041 12848 10585 6818 4698 1460 -3236 -5236 -6402 1718 8526 3393 1684 4090 1992
217969 1992 4482 -5002 1490 14750 17172 12447 5364 -4006 -1796 8416 10064 3386 127 5758
218823 5758 20527 18458 15691 7632 6618 6333 -187 1176 4575 5980 10936 9132 9445 4409 8034
219739 8034 7607 -917 2496 13554 13504 13605 17621 20082 21540 9673 -2648 7916 7791 5606 -1594
220654 -1594 309 2111 -1468 4865 16202 7359 442 -7820 -5532 5830 17731 16429 11139 8520
221509 8520 8885 5293 6341 9399 13021 15140 15725 12257 12897 15318 9354 5717 7573 7201 2416
222425 2416 2313 -1963 6962 14491 8345 7282 7879 10429 2928 -3952 -1587 781 2070 2353 8262
223340 8262 7226 8240 13348 12527 3412 1915 6709 5818 19114 28212 31493 29284 21156 11888 6681
$$ packed form
217053i3J0134K807k263l767k120l238m696k000j166Q120O808n133j709K406k098
217969A992K490r484O492J3260K422m725p083r370K210J0212J648o678l259N631
218823E758J4769k069k767q059j014k85o520J363L399J405M956j804L13n036L625
219739H034m27q524L413J1058n0J01M016K461J458j1867j2321J0564j25k185p200
220654a594J903J802l579O333J1337q843o917q262K288J1362J1901j302n290k619
221509H520L65l592J048L058L622K119N85l468O40K421n964l637J856l72m785
222425B416j03m276Q925P529o146j063N97K550p501o880K365K368J289K83N909
223340H262j036J014N108q21r115j497M794q91J3296R098L281k209q128r268n207
$$ plain form
224256 6681 2889 205 2411 14487 9607 5305 8157 4397 -777 -1282 9157 15350 10453 11235
225110 11235 5008 6638 14436 12829 11129 9100 11669 6698 -1532 7583 10993 11335 9567 4002
225965 4002 -1081 6352 13901 14106 10342 7806 856 4335 12094 23813 22686 16562 11897 8205
226819 8205 4616 10397 15919 18782 15480 19755 9504 6966 5877 5764 924 5250 17343 17241
227674 17241 9153 7480 12236 14098 18431 7953 473 2999 -1227 -5573 -168 10121 13955 1794
228528 1794 -10592 -11871 -4371 5801 13165 3294 1550 1035 6929 11554 4663 -3811 -8192 -1337
229383 -1337 5898 9986 3317 1941 9406 10647 7185 7029 7894 5964 12153 16917 16860 12396 11137
230298 11137 10314 9313 13037 9717 5744 6386 5265 3026 5880 11760 7091 5136 601 3715 7902
$$ packed form
224256F681l792k684K206J2076m880m302K852l760n174n05J0439O193m897P82
225110A1235o227J630P798j607j700k029K569m971q230R115L410L42j768n565
225965D002n083P433P549K05l764k536o950L479P759J1719j127o124m665l692
226819H205l589N781N522K863l302M275j0251k538j089j13m840M326J2093j02
227674A7241q088j673M756J862M333j0478p480K526m226m346N405J0289L834j2161
228528A794j2386j279P500J0172P364r871j744n15N894M625o891q474m381O855
229383a337P235M088o669j376P465J241l462j56Q65j930O189M764n7m464j259
230298A1137q23j001L724l320l973O42j121k239K854N880m669j955m535L114M187
$$ plain form
231214 7902 3028 2777 1439 -4597 -6021 2621 12659 8159 2871 -7655 -8659 -3843 -179 2937
232068 2937 593 2842 -6860 -6278 -4623 -611 -527 1717 -2325 425 2187 5061 14538 17044 13983
232984 13983 18387 22662 14189 8739 7406 14288 9842 12622 12410 13000 2837 -71 6290 11877
233838 11877 10342 5641 11637 14489 15224 14195 12065 12122 4694 353 313 -2651 3115 12660 9750
234754 9750 11264 10178 7516 8920 13406 10734 9236 7722 -249 -4360 2599 4290 5613 -45
235609 -45 536 3059 -2480 -3399 3050 7361 11864 15549 3025 -6913 -7462 -6041 -4714 -2699 4259
236524 4259 7957 6896 4457 3415 4103 6216 4111 2289 8119 5524 5664 -1706 3729 -2743 1349
237440 1349 13531 14922 14015 18786 16142 12505 13705 10435 7266 3708 11214 14404 10608 1205
$$ packed form
231214G902m874k51j338o036j424Q642J0038m500n288j0526j004M816L664L116
232068B937k344K249r702N82J655M012Q4K244m042K750J762K874R477K506l061
232984A3983M404M275q473n450j333O882m446K780k12N90j0163k908O361N587
233838A1877j535m701N996K852P35j029k130N7p428m341m0k964N766R545k910
234754I750J514j086k662J404M486k672j498j514p971m111O959J691J323n658
235609d5N81K523n539r19O449M311M503L685j2524r938n49J421J327K015O958
236524D259L698j061k439j042O88K113k105j822N830k595J40p370N435o472M092
237440A349J2182J391r07M771k644l637J200l270l169l558P506L190l796r403
$$ plain form
238294 1205 4872 11825 8089 18369 11617 7459 1781 -1461 1121 9227 3892 4566 8465 4425
239149 4425 9162 8709 10232 3670 1418 9612 10763 13018 9481 4357 2785 -1069 279 8288 11699
240065 11699 11449 5503 13715 11256 -2387 -11676 -15968 -14396 -9034 -3886 664 4210 11768 14473
240919 14473 6752 3049 6007 8358 -492 -5890 -2141 12686 9715 14622 3140 -3687 2874 6057
241774 6057 9054 19407 18339 9220 8375 15536 15454 25528 27248 19785 17983 17391 11548 8347 16921
242689 16921 21927 9652 5379 7725 2024 -501 10372 4818 820 -4744 97 5039 -2400 -2904
243544 -2904 2546 8675 5508 3131 6998 6415 6663 5326 11605 14665 18143 16896 11990 547 692
244459 692 4796 4531 2412 -841 1802 4378 5820 10536 7261 -4998 -3315 -3370 -850 3865 7353
$$ packed form
238294A205L667O953l736J0280o752m158n678l242K582Q106n335O74L899m040
239149D425M737m53J523o562k252Q194J151K255l537n124j572l854J348Q009L411
240065A1699k50n946Q212k459j3643r289m292J572N362N148M550L546P558K705
240919A4473p721l703K958K351q850n398L749J4827k971M907j1482o827O561L183
241774F057K997J0353j068r119q45P161q2J0074J720p463j802n92n843l201Q574
242689A6921N006j2275m273K346n701k525J0873n554l998n564M841M942p439n04
243544b904N450O129l167k377L867n83K48j337O279L060L478j247m906j1443J45
244459F92M104k65k119l253K643K576J442M716l275j2259J683n5K520M715L488
$$ plain form
245375 7353 4439 3913 4555 -787 4336 5490 13677 9478 5687 -1993 -383 10506 10608 13567 7580
246291 7580 1851 8993 4823 11867 6964 8757 16148 14058 8647 7498 -2271 -5080 -1466 83
247145 83 2986 6585 10997 7987 2180 -1650 10821 11773 11501 19410 20308 19818 21101 22452 9055
248060 9055 5183 -4154 -10223 -3672 -4259 -8381 -11021 -11500 -8501 -4092 -5314 -7438 -6331 -7952 -1644
248976 -1644 8171 9410 2889 5122 145 4485 20600 20479 9126 6587 8217 12366 17594 7647
249831 7647 -278 3925 11336 18755 21777 15568 5244 3234 3400 -596 768 3444 11905 20815
250685 20815 24348 26927 24198 19040 20273 14064 11467 14561 7195 4390 6018 923 1710 6531
251540 6531 4634 10557 12545 14638 12589 8726 7941 5396 6276 15687 22628 16695 24379 25887 19808
$$ packed form
245375G353k914n26O42n342N123J154Q187m199l791p680J610J0889J02K959n987
246291G580n729P142m170P044m903J793P391k090n411j149r769k809L614J549
247145H3K903L599M412l010n807l830J2471R52k72P909Q98m90J283J351j3397
248060I055l872r337o069O551n87m122k640m79K999M409j222k124J107j621O308
248976a644R815J239o521K233m977M340J6115j21j1353k539J630M149N228r947
249831G647p925M203P411P419L022o209j0324k010J66l996J364K676Q461Q910
250685B0815L533K579k729n158J233o209k597L094p366k805J628n095P87M821
251540F531j897N923J988K093k049l863p85k545Q80R411O941n933P684J508o079
$$ plain form
252455 19808 10534 787 10872 25039 17275 15200 18597 8710 8415 4267 1836 1749 1011 6088 14221
253371 14221 -658 -11144 -8405 -4609 2557 26 3339 7726 12837 13048 5266 5362 1169 4119
254225 4119 428 -3200 -2544 -4526 3528 15451 22145 18612 14657 17450 14992 10732 8752 7300
255080 7300 5939 7360 4727 9403 7305 9278 8050 4665 -725 2449 8730 12961 6397 1790
255935 1790 10294 14090 4776 -3717 -1748 1899 7 -1009 6171 7418 6907 10520 13349 15348 5367
256850 5367 5644 13219 13840 8156 21 -3553 3442 8319 6190 8501 3601 3877 9775 4945 14621
257766 14621 13323 10281 12667 8810 13472 17370 15571 13883 12751 8268 5748 2971 3599 6351
258620 6351 -2271 -343 10007 11810 12360 5932 -4095 -8018 -5948 2103 6819 1140 2530 1449
$$ packed form
252455A9808r274r747J0085J4167p764k075L397r887k95m148k431q7p38N077Q133
253371A4221j4879j0486K739L796P166k531L313M387N111K11p782R6m193K950
254225D119l691l628O56j982Q054J1923O694l533l955K793k458m260j980j452
255080G300j361J421k633M676k098J973j228l385n390L174O281M231o564m607
255935A790Q504L796r314q493J969L647j892j016P180J247n11L613K829J999r981
256850E367K77P575O21n684q135l574O995M877k129K311m900K76N898m830R676
257766A4621j298l042K386l857M662L898j799j688j132m483k520k777O28K752
258620F351q622J928J0350J803N50o428j0027l923K070Q051M716n679J390j081
$$ plain form
259475 1449 3540 11099 13520 10171 6173 -2499 -7814 -5795 -12197 -11605 -4973 3944 6287 6435 7930
260391 7930 10432 13372 15507 16029 16462 11894 10983 7766 10857 9204 4517 8736 16671 13867 14924
261306 14924 4010 899 6313 6806 8641 13984 9635 6375 9138 11007 1160 -2919 -278 4732
262161 4732 8105 9169 11734 11615 10518 15253 7583 7871 6165 9905 5766 11997 4844 -2581 -599
263076 -599 2820 6821 8292 5016 9816 5192 2795 9174 10926 7780 5357 9097 9269 10646 5672
263992 5672 10728 6639 4864 9780 10216 9511 -691 -486 -6617 -8071 -9251 -2538 -4853 -5268 2936
264907 2936 2734 2953 4286 5455 12000 4508 25 -2383 1292 4114 5495 8403 15883 14214 15267
265823 15267 10020 1102 3516 3518 10701 21838 19364 18302 17476 6134 2808 12301 12102 10859 9094
$$ packed form
259475A449K091P559K421l349l998q672n315K019o402N92O632Q917K343J48J495
260391G930K502K940K135N22M33m568r11l217L091j653m687M219P935k804J057
261306A4924j0914l111N414M93J835N343m349l260K763J869r847m079K641N010
262161D732L373J064K565j19j097M735p670K88j706L740m139O231p153p425J982
263076e99L419M001J471l276M800m624k397O379J752l146k423L740J72J377m974
263992E672N056m089j775M916M36p05j0202K05o131j454j180O713k315m15Q204
264907B936k02K19J333J169O545p492m483k408L675K822J381K908P480j669J053
265823A5267n247q918K414KP183J1137k474j062q26j1342l326R493j99j243j765
$$ plain form
266739 9094 14136 15780 21680 21985 25041 13690 2838 1674 9876 14750 18255 9205 7644 11187
267593 11187 6422 2903 8048 1656 -1089 8718 11509 1160 -122 1497 -1155 441 -1239 4594
268448 4594 3646 5424 7293 1331 -2026 2308 4633 -463 -1203 5379 5234 9392 12021 11430 8940
269363 8940 7034 2393 -7834 -1682 5707 13973 11516 15280 17451 12722 9199 8410 9880 13120
270218 13120 12996 8831 11248 16884 12783 13378 8027 14326 24647 16777 6749 2576 3815 2596
271072 2596 3325 240 2763 2715 -143 1620 9060 17583 16407 10238 7793 15663 19423 11513 5492
271988 5492 -174 3174 6258 -2617 -4302 2990 14567 18594 13916 3910 5379 5817 5284 9912
272843 9912 11108 8747 2718 4986 5993 4094 -1058 -4607 794 -1052 4546 6158 7935 11779
$$ packed form
266739I094N042J644N900L05L056j1351j0852j164Q202M874L505r050j561L543
267593A1187m765l519N145o392k745R807K791j0349j282J619k652J596j680N833
268448D594r48J778J869n962l357M334K325n096p40O582j45M158K629n91k490
269363H940j906m641j0227O152P389Q266k457L764K171m729l523p89J470L240
270218A3120j24m165K417N636m101N95n351O299J0321p870j0028m173J239j219
271072B596P29l085K523m8k858J763P440Q523j176o169k445P870L760p910o021
271988E492n666L348L084q875j685P292J1577M027m678j0006J469M38n33M628
272843I912J196k361o029K268J007j899n152l549N401j846N598J612J777L844
$$ plain form
273697 11779 18559 16656 9386 2246 1283 4845 14605 6803 10683 7721 6731 8023 17554 20833 22811
274613 22811 17779 15842 13301 15369 12415 4684 4537 8443 18421 7700 7122 3443 6217 9386
275467 9386 12673 4172 7854 15031 18543 15641 22101 21020 14288 9055 6090 9418 4982 13107
276322 13107 11406 13455 17594 12016 9465 7135 -2051 -1934 -1731 -4018 -1841 4404 590 4848 298
277237 298 -2241 5672 10420 -1169 -15376 -16163 -6182 -2680 -4613 -6640 -9189 -2658 -85 2663
278092 2663 3965 8378 13992 14267 10713 3292 -7366 -10305 -4906 4922 -408 2045 6415 2195
278946 2195 -1288 1526 8219 11040 15382 18333 20370 14114 7088 7304 16811 15164 16879 13047 15012
279862 15012 11583 5161 5436 1867 7955 7463 3998 2013 10393 12563 5956 4243 5939 9656 3588
$$ packed form
273697A1779O780j903p270p140r63L562R760p802L880k962r90J292R531L279J978
274613B2811n032j937k541K068k954p731j47L906R978j0721n78l679K774L169
275467I386L287q501L682P177L512k902O460j081o732n233k965L328m436Q125
276322A3107j701K049M139n578k551k330r186J17K03k287K177O245l814M258m550
277237B98k539P913M748j1589j4207p87R981L502j933k027k549O531K573K748
278092B663J302M413N614K75l554p421j0658k939N399R828n330K453M370m220
278946B195l483K814O693K821M342K951K037o256p026K16R507j647J715l832J965
279862A5012l429o422K75l569O088m92l465j985Q380K170o607j713J696L717o068
$$ plain form
280777 3588 7070 7147 3206 1262 4805 1651 3639 5155 7298 908 -6383 -7744 -2845 3448 13779
281693 13779 13123 10413 7432 649 3313 5056 10292 10689 13364 6127 2063 -557 -590 8249 11209
282609 11209 5958 3182 10464 11041 14943 4723 -4791 -1783 -5263 -5436 3211 4865 818 -5605
283463 -5605 1584 446 -5923 -3665 3694 2078 11302 10580 6112 3867 4575 13334 16917 24227 21671
284379 21671 10797 6254 8501 9536 7618 9832 9835 19633 25131 13943 2656 -3559 5253 14740
285233 14740 11927 7135 1497 13051 14309 17851 11036 13015 13723 10105 8097 3906 4139 5430
286088 5430 19867 19604 17935 14091 10743 14130 11435 4579 6003 7015 7072 12515 6971 10074 17307
287003 17307 14275 12995 9914 13897 14688 18671 9585 12136 22796 19569 12009 17145 14107 12062
$$ packed form
280777C588L482P7l941j944L543l154J988J516K143o390p291j361M899O293J0331
281693A3779o56k710k981o783K664J743N236L97K675p237m064k620l3Q839K960
282609A1209n251k776P282N77L902j0220r514L008l480j73Q647J654m047o423
283463e605P189j138o369K258P359j616R224p22m468k245P08Q759L583P310k556
284379B1671j0874m543K247J035j918K214LR798N498j1188j1287o215Q812R487
285233A4740k813m792n638J1554J258L542o815J979P08l618k008m191K33J291
286088E430J4437k63j669l844l348L387k695o856J424J012N7N443n544L103P233
287003A7307l032j280l081L983P91L983r086K551J0660l227p560N136l038k045
$$ plain form
287858 12062 6825 6575 11629 15436 12513 4882 13492 20437 12476 9425 12560 14444 12225 23874
288713 23874 28681 31793 51025 83520 178692 316116 316470 251639 193685 148487 120504 113296
289445 113296 110474 104293 85863 65400 53143 42428 36908 39868 34571 30507 26117 25434 20408
290239 20408 30344 32963 35556 46338 88894 172508 312933 344955 277888 219102 178479 140916
290971 140916 115714 106066 96434 88022 75989 66267 65040 63255 57382 52109 46374 45061 38710
291764 38710 41318 43186 47799 48303 50312 68267 136785 271363 340745 290277 237619 180200
292497 180200 139379 120277 113565 105406 94782 75685 58344 39815 29136 29466 29356 25547 24049
293290 24049 17112 11935 16989 20940 13349 11130 18706 20992 16329 17926 19717 21037 24756 18014
$$ packed form
287858A2062n237k50N054L807k923p631Q610O945p961l051L135J884k219J1649
288713B3874M807L112J9232L2495R5172J37424L54o4831n7954m5198k7983p208
289445A13296k822o181j8430k0463j2257j0715n520K960n297m064m390o83n026
290239B0408R936K619K593J0782M2556Q3614J40425L2022o7067n8786m0623l7563
290971A40916k5202r648r632q412j2033r722j227j785n873n273n735j313o351
291764C8710K608J868M613N04K009J7955O8518J34578O9382n0468n2658n7419
292497A80200m0821j9102o712q159j0624j9097j7341j8529j0679L30j10l809j498
293290B4049o937n177N054L951p591k219P576K286m663J597J791J320L719o742
$$ plain form
294145 18014 18466 19570 13878 10226 7277 2485 -5970 -3168 11940 14524 8508 12741 15293 19807
295000 19807 28539 24802 25196 24545 16091 14048 19409 21020 17607 23715 28137 19446 11952 9761 9095
295915 9095 5691 8739 14907 25272 26391 15765 715 4751 18239 14140 13843 13825 11705 16125
296770 16125 16115 11199 12129 13119 14951 8615 14675 14167 4802 2996 5849 9381 11658 21462 22501
297685 22501 16589 9228 10633 15011 14450 6325 8351 13868 24880 16387 10634 16574 20834 14445
298540 14445 23529 18413 7673 3702 2006 11640 11341 7570 2182 3640 16693 9366 4482 1996
299394 1996 3715 2620 1116 4959 7500 9429 5137 -4373 1632 5798 -558 4228 13057 11776
300249 11776 11516 10809 7101 10805 3691 -541 2925 11490 13356 3815 1065 2773 4851 1629 4858
$$ packed form
294145A8014M52J104n692l652k949m792q455K802J5108K584o016M233K552M514
295000A9807Q732l737L94o51q454k043N361J611l413O108M422q691p494k191o66
295915I095l404L048O168J0365J119j0626j5050M036J3488m099k97j8k120M420
296770A6125j0m916R30R90J832o336O060n08r365j806K853L532K277R804J039
297685B2501n912p361J405M378n61q125K026N517J1012q493n753N940M260o389
298540A4445R084n116j0740l971j696R634k99l771n388J458J3053p327m884k486
299394A996J719j095j504L843K541J929m292r510O005M166o356M786Q829j281
300249A1776k60p07l708L704p114m232L466Q565J866r541k750J708K078l222L229
$$ plain form
301164 4858 3386 7648 -250 -6159 -4271 -1518 5159 8442 4339 6884 10363 9095 3962 13002
302019 13002 14410 5374 6218 9473 17527 13665 8746 9065 3880 7256 12698 6757 10920 6834 6858
302934 6858 11804 13384 14384 13052 7734 5706 615 450 4140 -5294 -3395 -1874 3638 11349 2308
303850 2308 13740 20006 13178 10487 5944 7783 10449 15687 14014 4351 6550 15618 22607 22258
304705 22258 23588 12727 15772 18406 11724 7110 1309 -1255 3610 3274 6292 3685 8841 11364
305559 11364 7727 4888 143 1614 15451 19341 17101 15183 13249 14725 16645 15107 8342 10369
306414 10369 10941 6969 6079 3957 6316 9303 5983 6073 -37 255 -3431 -1517 2350 -935 253
307329 253 63 8584 8316 9945 -123 -1212 7130 10050 5521 2212 3541 8293 10694 15610 12154
$$ packed form
301164D858j472M262p898n909J888K753O677L283m103K545L479j268n133R040
302019A3002J408r036Q44L255Q054l862m919L19n185L376N442n941M163m086K4
302934F858M946J580J000j332n318k028n091j65L690r434J899J521N512P711r041
303850B308J1432O266o828k691m543J839K666N238j673r663K199R068O989l49
304705B2258J330j0861L045K634o682m614n801k564M865l36L018k607N156K523
305559A1364l637k839m745J471J3837L890k240j918j934J476J920j538o765K027
306414A0369N72l972q90k122K359K987l320R0o110K92l686J914L867l285J188
307329B53j90Q521k68J629j0068j089Q342K920m529l309J329M752K401M916l456
$$ plain form
308245 12154 20898 19851 14017 -1082 -1976 10664 4349 4520 13986 8582 12802 23056 17587 18686
309099 18686 10730 3376 8236 4431 1116 805 11505 14007 15960 13424 6118 6679 -5105 -9280
309954 -9280 -11335 -3664 12331 18712 12334 6136 10078 7890 7321 11404 10301 1657 -9867 -8139
310809 -8139 5419 4491 2258 1524 -847 1022 17 3278 848 4865 2490 4972 9689 12495 6495
311724 6495 4508 14585 18201 14876 1279 -5775 5003 9562 13471 5383 -1902 2227 1511 7719
312579 7719 4587 4658 5844 6597 3721 4596 4485 2470 -2217 681 1112 -5749 -4804 4376 5166 9309
313555 9309 11076 7776 7067 1743 -179 9746 11129 3960 -3936 13785 17999 15908 13284 8738
314410 8738 10900 7260 138 7181 10528 11212 9918 2125 1695 3289 13382 15706 9559 19839
$$ packed form
308245A2154Q744j047n834j5099q94J2640o315J71R466n404M220J0254n469J099
309099A8686p956p354M860l805l315l11J0700K502J953k536p306N61j1784m175
309954i280k055P671J5995O381o378o198L942k188n69M083j103q644j1524J728
310809h139J3558r28k233p34k371J869j005L261k430M017k375K482M717K806o000
311724F495j987J0077L616l325j3597p054J0778M559L909q088p285M129p16O208
312579G719l132P1J186P53k876Q75j11k015m687K898M31o861R45R180P90M143
313555I309J767l300p09n324j922R925J383p169p896J7721M214k091k624m546
314410H738K162l640p122P043L347O84j294p793m30J594J0093K324o147J0280
$$ plain form
315265 19839 18427 6371 14797 13165 14836 25734 25995 17109 17604 13252 22521 17262 17394 21530
316119 21530 23168 17830 8646 12312 9209 1571 -2538 5558 16688 13165 8443 7714 -1732 -4984
316974 -4984 1523 3552 5046 11611 12605 10689 5311 8534 10273 8653 9257 6575 8191 7864 8522
317889 8522 6153 8680 1001 -2772 -3099 -5540 -11345 -7149 -731 -1437 1143 4005 -1925 -1175 -2639
318805 -2639 1778 6719 12084 7230 -1966 -7531 -3447 1757 2833 1802 2986 8571 12785 11420
319659 11420 9797 12928 7921 17563 23148 10477 845 -1653 -305 -9173 -10811 -98 5390 9960
320514 9960 16594 15831 11046 4874 11941 12876 17181 16079 15985 11825 -2981 -5845 -898 8217 20442
321430 20442 7867 -53 3926 -3261 -3685 3714 13040 8623 -4464 -5885 -1349 1884 -1739 -7336
$$ packed form
315265A9839j412j2056Q426j632J671J0898K61q886M95m352R269n259J32M136
316119B1530J638n338r184L666l103p638m109Q096J1130l523m722p29r446l252
316974d984O507K029J494O565R94j916n378L223J739j620O04k682J616l27O58
317889H522k369K527p679l773l27k441n805M196O418p06K580K862n930P50j464
318805b639M417M941N365m854r196n565M084N204J076j031J184N585M214j365
319659A1420j623L131n007R642N585j2671r632k498J348q868j638J0713N488M570
320514I960O634p63m785o172P067R35M305j102r4m160j4806k864M947R115J2225
321430B0442j2575p920L979p187m24P399R326m417j3087j421M536L233l623n597
$$ plain form
322284 -7336 -4311 9707 17892 13300 8472 6109 8886 13084 19339 13089 4748 4750 9159 8737 9431
323200 9431 8683 15828 10480 6825 -1929 -6882 -6054 -3909 2887 5615 -1144 -4804 -3570 -1430 3316
324115 3316 5468 2469 9069 10110 5478 -4777 -5914 -2781 3768 6112 352 7858 8894 7776
324970 7776 5727 1219 -4366 -8194 2545 8398 325 -1728 7843 11582 7773 3522 4793 3453
325824 3453 -5305 -7316 -2280 6482 16838 16974 12523 12390 12204 9584 10878 8295 1388 -2705 1772
326740 1772 6903 8528 13947 15968 20219 14460 5556 1009 3461 6602 7705 5072 3109 1419
327594 1419 2944 1221 1270 9825 5676 9015 9229 5904 10444 14978 18843 23950 19434 15997 14157
328510 14157 9196 2848 1264 -11763 -13324 -6933 -563 8265 13372 6934 11852 9863 3898 2632
$$ packed form
322284g336L025J4018Q185m592m828k363K777M198O255o250q341KM409m22O94
323200I431p48P145n348l655q754m953Q28K145O796K728o759l660J234K140M746
324115C316K152k999O600J041m632j0255j137L133O549K344n760P506J036j118
324970G776k049m508n585l828J0739N853q073k053R571L739l809m251J271j340
325824C453q758k011N036Q762J0356J36m451j33j86k620J294k583o907m093M477
326740A772N131J625N419K021M251n759q904m547K452L141J103k633j963j690
327594A419J525j723M9Q555m149L339K14l325M540M534L865N107m516l437j840
328510A4157m961o348j584j3027j561O391O370Q828N107o438M918j989n965j266
$$ plain form
329364 2632 2465 4951 9511 9551 11218 16594 5264 573 6526 10960 5975 4826 4608 12421 9151
330280 9151 2813 3539 6606 -1929 -6633 -6025 -7963 -3225 4808 2652 6658 13565 4781 -9746 -9597
331196 -9597 -14677 -9599 -4340 3118 13555 570 -2472 4728 4618 14526 24278 20704 11390 9921
332050 9921 12073 14945 16267 826 -2407 -3419 -1436 -508 1240 4096 12291 15560 8741 5194
332905 5194 5027 4659 9480 10178 7548 -3230 -2074 9173 9217 6109 2254 11865 15464 13621 7854
333820 7854 8652 15828 13447 9779 6686 5554 11647 14768 9644 4255 7362 19024 22993 15255
334675 15255 9157 5239 -3703 -10239 -3323 779 85 -6658 -2270 4473 -231 15898 18305 15548
335529 15548 12940 10392 5598 -2528 3009 5179 8123 7519 1496 -2270 -371 12766 16902 17094
$$ packed form
329364B632j67K486M560M0J667N376j1330m691N953M434m985j149k18P813l270
330280I151o338P26L067q535m704O08j938M738Q033k156M006O907q784j4527J49
331196i597n080N078N259P458J0437j2985l042P200j10R908R752l574r314j469
332050I921K152K872J322j5441l233j012J983R28J748K856Q195L269o819l547
332905E194j67l68M821O98k630j0778J156J1247M4l108l855R611L599j843n767
333820G854P98P176k381l668l093j132O093L121n124n389L107J1662L969p738
334675A5255o098l918q942o536O916M102o94o743M388O743m704J6129K407k757
335529A5548k608k548m794q126N537K170K944o04o023l766J899J3137M136J92
$$ plain form
336384 17094 12973 2380 1181 289 5283 5031 1410 -1383 -250 1829 -2578 -2821 -8495 -724 8454
337300 8454 8977 8259 10690 14126 17598 10430 1507 -2686 -3737 7682 23828 24622 13422 11058
338154 11058 5823 8003 3045 6973 6941 12417 13672 9628 7887 11740 14745 13758 11979 7051 6001
339070 6001 3924 12089 1548 -1931 7641 8893 8391 6553 3319 6748 6305 5083 6767 5586 6228
339985 6228 7189 11119 14097 7537 6348 9181 11313 10569 15116 12164 3055 5352 11460 11882 -2419
340901 -2419 -6057 -11232 -11342 -4359 5285 8146 9332 7045 2284 3583 3387 4239 2875 -8634 3063
341817 3063 15662 13476 10145 4371 11049 19450 21158 2984 796 2760 5732 4093 8565 13445
342671 13445 19015 13881 11909 14641 13885 8534 13070 2537 7414 12045 8362 5475 11962 14536
$$ packed form
336384A7094m121j0593j199q92M994k52l621k793J133K079m407k43n674P771R178
337300H454N23p18K431L436L472p168q923m193j051J1419J6146P94j1200k364
338154A1058n235K180m958L928l2N476J255m044j741L853L005r87j779m928j050
339070F001k077Q165j0541l479R572J252n02j838l234L429m43j222J684j181O42
339985F228R61L930K978o560j189K833K132p44M547k952r109K297O108M22j4301
340901b419l638n175j10O983R644K861J186k287m761J299j96Q52j364j1509J1697
341817C063J2599k186l331n774O678Q401J708j8174k188J964K972j639M472M880
342671A3445N570n134j972K732p56n351M536j0533M877M631l683k887O487K574
$$ plain form
343526 14536 14428 9299 5299 453 -8818 -9299 4214 13147 8362 9042 1129 1785 2462 5918 9887
344441 9887 9250 10858 11352 9982 9939 12065 11854 9888 7857 11374 5121 9205 21650 18598 10811
345357 10811 4972 1743 6367 8069 18052 20002 11342 4121 3835 1659 859 3464 3563 6719 13232
346272 13232 13113 16201 13356 14214 16737 17469 10123 10330 15366 7231 5071 2284 -661 -1874 -2384
347188 -2384 3305 13129 10445 10783 14354 20349 23130 16802 9076 20942 14678 11519 10138 5851
348042 5851 1585 26 3514 6706 11961 15415 9565 8691 11598 6052 7697 7725 9776 17960 20439
348958 20439 15724 11778 10641 3871 2259 8955 13337 8599 203 1101 614 8358 9719 9621 12293
349873 12293 12913 16056 14691 12003 14869 14582 14054 10941 4464 11847 9974 -886 2876 8023 7795
$$ packed form
343526A4536j08n129m000m846r271m81J3513Q933m785O80p913O56O77L456L969
344441I887o37J608M94j370m3K126k11j966k031L517o253M084J2445l052p787
345357A0811n839l229M624J702R983J950q660p221k86k176q00K605R9L156O513
346272A3232j19L088k845Q58K523P32p346K07N036q135k160k787k945j213n10
347188b384N689R824k684L38L571N995K781o328p726J1866o264l159j381m287
348042E851m266j559L488L192N255L454n850q74K907n546J645K8K051Q184K479
348958B0439m715l946j137o770j612O696M382m738q396Q98m87P744J361r8K672
349873A2293O20L143j365k688K866k87n28l113o477P383j873j0860L762N147k28
$$ plain form
350789 7795 11296 9675 11319 9120 1866 2517 9743 -325 3046 12843 19064 24339 24479 31534 30662
351705 30662 17301 9863 13965 9602 12640 13259 16379 21813 20746 11714 4163 -177 -4323 -1417
352559 -1417 12251 18485 15161 8308 9280 14999 16262 6815 2392 10388 8094 2576 7754 7715 9432
353475 9432 7345 5329 10041 8214 4064 2206 331 6266 7106 8330 4582 -4304 -3462 6106 9813
354391 9813 10724 5404 10076 15752 10134 13349 5694 5933 6736 5780 13373 20895 12967 12115 14622 17094
355367 17094 16616 20573 24748 22901 23728 15437 18830 19937 18649 14519 7127 -816 -1013 6064 9193
356283 9193 12058 4345 -2215 -565 2828 5553 8703 -2272 3140 15341 13680 19030 14810 7582
357137 7582 10921 18615 14903 5509 5668 3109 13021 11674 9264 1234 -2027 -897 7503 12144 7830
$$ packed form
350789G795L501j621J644k199p254O51P226j0068L371R797O221N275J40P055q72
351705C0662j3361p438M102m363L038O19L120N434j067r032p551m340m146K906
352559a417J3668O234l324o853R72N719J263r447m423P996k294n518N178l9J717
353475I432k087k016M712j827m150j858j875N935Q40J224l748q886Q42R568L707
354391I813R11n320M672N676n618L215p655K39Q03r56P593P522p928q52K507K472
355367A7094m78L957M175j847Q27q291L393J107j288m130p392p943j97P077L129
356283I193K865p713o560J650L393K725L150j0975N412J2201j661N350m220p228
357137G582L339P694l712r394J59k559R912j347k410q030l261J130Q400M641m314
$$ plain form
358053 7830 12483 11346 10966 10177 6166 15907 14445 1154 -464 2919 2013 10329 17199 20619 26257
358968 26257 20261 11834 3232 -4046 -4060 4928 4785 6203 10700 19612 15760 10266 7828 10085 5062
359884 5062 -3397 2206 3170 -2464 1959 10634 15922 17079 10926 11987 11482 5475 8247 16703 19015
360799 19015 18005 21254 14809 9223 10419 9283 5988 16012 18975 15865 8251 8294 10134 12074
361654 12074 13841 17444 17577 7875 3335 13205 11513 -146 367 -3678 -10183 -6263 480 5463
362508 5463 5838 2429 2269 211 544 2689 -2926 -16436 -25792 -25346 -22830 -13781 -10018 -3143 194
363424 194 -620 -3380 -3797 6466 11143 5042 -644 6574 15936 20861 15173 11065 9950 8479 12759
364340 12759 10924 11315 19230 23926 13232 9487 7100 11882 14377 9906 8674 21268 17054 18899
$$ packed form
358053G830M653j137l80p89m011R741j462j3291j618L383r06Q316O870L420N638
358968B6257n996q427q602p278j4Q988j43J418M497Q912l852n494k438K257n023
359884E062q459N603R64n634M423Q675N288J157o153J061n05o007K772Q456K312
360799A9015j010L249o445n586J196j136l295J0024K963l110p614M3J840J940
361654A2074J767L603J33r702m540R870j692j1659N13m045o505L920O743M983
362508E463L75l409j60k058L33K145n615j3510r356M46K516R049L763O875L337
363424A94q14k760m17J0263M677o101n686P218R362M925n688m108j115j471M280
364340A2759j835L91P915M696j0694l745k387M782K495m471j232J2594m214J845
$$ plain form
365194 18899 21585 5675 3384 12629 6762 3026 163 7435 14107 10119 3324 -328 776 -1053
366049 -1053 -7367 -4495 1149 2708 8339 8982 12918 13633 2130 1352 7198 10474 4839 3870 924
366964 924 1348 14052 17659 5180 1292 9962 13658 20090 22992 17511 8804 12810 7605 7868 6296
367880 6296 5331 8826 7465 707 -4676 -5617 1107 2065 3593 10689 12638 22249 21677 12011 3922
368795 3922 5351 7849 4128 -2286 2197 10071 17691 13810 10738 10738 11149 4186 12136 14941 16839
369711 16839 12515 12151 6640 10635 15417 7212 15524 20949 16356 7530 5976 11164 4905 7276
370566 7276 8551 4681 6509 16861 14205 8405 7838 15383 16164 9490 2744 10151 20779 15558
371420 15558 17569 19708 19659 8995 17639 18790 16915 17355 13426 5983 4276 -3723 -2454 4642 11199
$$ packed form
365194A8899K686j5910k291R245n867l736k863P272O672l988o795l652J104j829
366049a053o314K872N644J559N631O43L936P15j1503p78N846L276n635r69k946
366964I24M24J2704L607j2479l888Q670L696O432K902n481q707M006n205K63j572
367880F296r65L495j361o758n383r41O724R58J528P096J949R611n72r666q089
368795C922J429K498l721o414M483P874P620l881l072%M11o963P950K805J898
369711A6839m324l64n511L995M782q205Q312N425m593q826j554N188o259K371
370566G276J275l870J828J0352k656n800n67P545P81o674o746P407J0628n221
371420A5558K011K139m9j0664Q644J151j875M40l929p443j707p999J269P096O557
$$ plain form
372336 11199 11024 8943 5770 4857 10857 7957 8023 914 -2111 1558 544 -6 7437 8303 13515 12931
373312 12931 5862 1083 -1078 3795 2904 -1452 -2733 2045 -7685 -4709 1805 2758 -3606 -6325 -1281
374228 -1281 -756 2029 2697 8706 9333 12727 12572 16125 14136 14694 13811 13098 12442 9457 2980 -1315
375205 -1315 10508 19315 21472 12662 10164 8796 6911 1274 -1070 -2009 8087 4811 -3212 -8265
376059 -8265 -3560 338 221 -2959 -176 4718 7719 6529 840 3121 8366 10616 9576 20186
376914 20186 20136 19103 20536 23164 17269 11879 12488 9988 11499 10614 6733 5326 4123 11215 16425
377829 16425 21396 22070 21386 7777 3130 7481 5969 -7197 -96 -1785 -5675 -1517 8270 11769
378684 11769 5000 5051 1846 6913 9712 16990 15915 5987 3537 -1633 3590 4373 4161 9772 12545
$$ packed form
372336A1199j75k081l173r13O000k900O6p109l025L669j014n50P443Q66N212n84
373312A2931p069m779k161M873q91m356j281M778r730K976O514R53o364k719N044
374228a281N25K785O68O009O27L394j55L553j989N58q83p13o56k985o477m295
375205a315J1823Q807K157q810k498j368j885n637k344r39J0096l276q023n053
376059h265M705L898j17l180K783M894L001j190n689K281N245K250j040J0610
376914B0186n0j033J433K628n895n390O09k500J511q85l881j407j203P092N210
377829A6425M971O74o84j3609m647M351j512j3166P101j689l890M158R787L499
378684A1769o769N1l205N067K799P278j075r928k450n170N223P83k12N611K773
$$ plain form
379599 12545 11504 4527 6202 15371 15086 14563 15340 16010 10906 11008 17716 19777 13931 5372 6853
380515 6853 7952 9805 8616 5637 3581 5742 14465 11874 1373 -1466 7114 6346 2436 -4230
381370 -4230 3162 16082 8756 11174 10153 6582 13507 20024 17984 14180 12435 10022 2844 696
382224 696 -171 492 6834 4757 5694 7991 -4374 3132 8171 8589 13720 8601 -161 912 5174
383140 5174 5107 4114 3997 11332 15438 9132 8367 7573 3896 4211 10253 11943 15075 21252 18060 8742
384116 8742 8362 7525 13496 20431 17122 11676 9437 11972 -2520 1812 8274 7722 1929 5039 5152
385032 5152 2628 13432 22407 8931 2560 10605 5011 2735 1195 15171 18246 23164 28645 31511
385886 31511 23079 9833 3977 136 5970 4843 9967 10410 5706 114 -4455 -20 7080 10428
$$ packed form
379599A2545j041o977J675R169k85n23P77O70n104J02O708K061n846q559J481
380515F853J099J853j189k979k056K161Q723k591j0501k839Q580p68l910o666
381370d230P392J2920p326K418j021l571O925O517k040l804j745k413p178k148
382224F96q67O63O342k077R37K297j2365P506N039M18N131n119q762J073M262
383140E174o7r93j17P335M106o306p65p94l677L15O042J690L132O177l192r318
384116H742l80q37N971O935l309n446k239K535j4492M332O462n52n793L110J13
385032E152k524J0804Q975j3476o371Q045n594k276j540J3976L075M918N481K866
385886C1511q432j3246n856l841N834j127N124M43m704n592m569M435P100L348
$$ plain form
386741 10428 14213 27218 19995 12000 2469 11985 4343 -7077 -6636 -189 -5103 -10088 -12790 -5783
387595 -5783 -2037 4339 9819 15829 12068 9703 -1565 2123 9225 6759 4885 20502 21239 14630
388450 14630 15084 21024 14621 4031 571 -6611 -1459 5219 4957 -153 9856 9980 14465 14078 18180
389365 18180 19535 10573 2223 3812 12544 20787 16304 11972 11023 19815 12249 1890 4757 5113
390220 5113 2806 1135 1399 670 4536 6155 10981 -1304 -5964 7497 10863 5021 1739 4148
391075 4148 13090 13688 18191 11811 7856 8880 6151 5846 4733 5428 6697 1012 -1356 6415 5897
391990 5897 6615 18344 17871 18157 16767 14755 17706 14576 7905 5565 4539 16564 15541 7683 4736
392906 4736 1747 6989 7272 4854 338 760 3032 9121 12917 14893 12169 19245 25292 19157 11138
$$ packed form
386741A0428L785J3005p223p995r531R516p642j1420M41O447m914m985k702P007
387595e783L746O376N480O010l761k365j1268L688P102k466j874J5617P37o609
388450A4630M54N940o403j0590l460p182N152O678k62n110J0009J24M485l87M102
389365A8180J355q962q350J589Q732Q243m483m332r49Q792p566j0359K867L56
390220E113k307j671K64p29L866J619M826j2285m660J3461L366n842l282K409
391075D148Q942N98M503o380l955J024k729l05j113O95J269n685k368P771n18
391990E897P18J1729m73K86j390k012K951l130o671k340j026J2025j023p858k947
392906D736k989N242K83k418m516M22K272O089L796J976k724P076O047o135q019
$$ plain form
393821 11138 12630 11335 13505 10710 5769 926 2680 11604 16178 19258 18982 9029 6926 3552
394676 3552 -1172 -349 8629 8398 8226 12310 19701 17940 22489 22055 23428 22369 12867 586 -1690
395592 -1690 6106 9328 9882 5760 6062 7207 16597 9365 5874 12407 15727 18575 26343 30997 22318
396507 22318 15018 11462 15803 15061 9082 -2669 781 1090 17032 21256 15094 11923 9342 4810
397362 4810 231 4636 5494 7027 6458 8543 13066 12671 17974 5626 4084 370 379 2253 6569 10141
398338 10141 14451 14324 5398 -2408 5409 4543 6902 -2240 -4100 6018 6791 9060 11103 11955 15987
399254 15987 17360 20867 16646 20774 26780 29096 22115 22785 20905 7938 3578 7106 5142 702
400108 702 5077 9926 16910 13305 8713 1969 -755 6426 290 -11324 -3212 -5943 -8584 -1652
$$ packed form
393821A1138J492j295K170k795m941m843J754Q924M574L080k76r953k103l374
394676C552m724Q23Q978k31j72M084P391j761M549m34J373j059r502j2281k276
395592a690P796L222N54m122L02J145R390p232l491O533L320K848P768M654q679
396507B2318p300l556M341p42n979j1751L450L09J5942M224o162l171k581m532
397362D810m579M405Q58J533n69K085M523l95N303j2348j542l714RJ874M316L572
398338A0141M310j27q926p806P817q66K359r142j860J0118P73K269K043Q52M032
399254A5987J373L507m221M128O006K316o981O70j880j2967m360L528j964m440
400108G02M375M849O984l605m592o744k724P181o136j1614Q112k731k641O932
$$ plain form
400963 -1652 7948 2356 -1793 4254 16658 12926 3194 4222 8082 9897 5831 9242 8187 6689
401818 6689 10398 11945 10976 4910 10998 17379 16638 3836 2931 5717 11359 13627 13171 14298 10831
402733 10831 9696 4165 5584 4943 7039 12746 4804 5424 10569 14279 5933 13371 10130 5320 944
403649 944 7969 11885 7568 8455 14459 13598 4094 7143 1653 -1882 -3910 1645 -7785 -14656 -8791
404564 -8791 -5310 -6095 -12863 -13565 -4586 -8520 -5333 8258 13088 9080 10774 10494 5836 -1883 -4564
405480 -4564 419 8229 9151 5258 4370 359 2640 1468 3771 2753 -2789 -1900 -1270 -3649 2131
406395 2131 10738 9348 -577 -445 8345 11129 14126 12810 10972 9052 13071 7165 5540 3600 5461
407311 5461 13558 2748 2242 788 9308 13337 9535 280 9609 22703 16161 5192 11734 9769
$$ packed form
400963a652R600n592m149O047J2404l732r732J028L860J815m066L411j055j498
401818F689L709J547r69o066O088O381p41j2802r05K786N642K268m56J127l467
402733A0831j135n531J419o41K096N707p942O20N145L710q346P438l241m810m376
403649I44P025L916m317Q87O004q61r504L049n490l535k028N555r430o871N865
404564h791L481p85o768p02Q979l934L187J3591M830m008J694k80m658p719k681
405480d564M983P810R22l893q88m011K281j172K303j018n542Q89O30k379N780
406395B131Q607j390r925J32Q790K784K997j316j838j920M019n906j625j940J861
407311E461Q097j0810n06j454Q520M029l802r255R329J3094o542j0969O542j965
$$ plain form
408166 9769 18372 19210 12452 3779 11183 9478 11792 10129 15938 8924 8331 5376 9589 11785 5929
409081 5929 2650 -3076 -5420 -4048 1984 11950 12134 2801 2004 4265 2555 5873 14743 16582 9205
409997 9205 9499 10286 10044 13107 13218 19230 26932 27386 26439 23595 16367 5754 -3262 -4620 -832 7135
410973 7135 7779 6633 18436 13144 8086 10786 15569 10917 3766 8797 8685 123 8683 18296 11701
411889 11701 7375 6599 8019 12552 12039 9525 12692 7474 1243 1926 -3127 -5210 -749 3954 5358
412805 5358 8091 7526 3806 8113 12351 8169 -446 3637 9296 11906 9483 9542 12216 10610 13319
413720 13319 11894 10081 11338 12626 3919 8828 10315 14115 6932 500 10932 17812 12406 10068
414575 10068 18293 15445 11213 40 -7001 305 -6706 -16679 -11796 -3734 4898 3438 -4124 -4519
$$ packed form
408166I769Q603Q38o758q673P404j705K314j663N809p014n93k955M213K196n856
409081E929l279n726k344J372O032R966J84r333p97K261j710L318Q870J839p377
409997I205K94P87k42L063J11O012P702M54r47k844p228j0613r016j358L788P967
410973G135O44j146J1803n292n058K700M783m652p151N031j12q562Q560R613o595
411889A1701m326p76J420M533n13k514L167n218o231O83n053k083M461M703J404
412805E358K733n65l720M307M238m182q615M083N659K610k423N9K674j606K709
413720A3319j425j813J257J288q707M909J487L800p183o432J0432O880n406k338
414575A0068Q225k848m232j1173p041P306p011r973M883Q062Q632j460p562l95
$$ plain form
415429 -4519 1193 6460 2461 -115 480 7996 13934 13405 7010 8473 3483 -1936 -1212 6151 10139
416345 10139 1976 3067 8354 9019 3168 -549 -5349 -5271 -3329 -2404 -2168 -8849 -1468 3179 9326
417260 9326 16550 17876 15853 17818 20021 12934 6712 10643 13578 11551 15992 12084 12874 6994 10972
418176 10972 21757 21276 14995 14357 857 4682 9472 13787 4885 3138 5063 14140 13544 1501
419031 1501 885 3300 -284 2822 6650 8617 10240 12309 9886 -369 -974 5816 13581 16961 15631
419946 15631 25626 20923 12166 5042 7161 5272 11865 14734 9916 7151 11048 13010 16850 18980
420801 18980 13797 5882 6516 5131 6861 5398 10026 18451 29213 22778 14218 6680 1612 3768
421655 3768 6844 8737 10518 15828 13572 16286 15489 14958 12516 9935 2929 -2045 -5230 -9022 200
$$ packed form
415429d519N712N267l999k576N95P516N938n29o395J463m990n419P24P363L988
416345A0139q163J091N287O65n851l717m800P8J942R25K36o681P381M647O147
417260I326P224J326k023J965K203p087o222L931K935k027M441l908P90n880L978
418176A0972J0785m81o281o38j3500L825M790M315q902j747J925R077n96j2043
419031A501o16K415l584L106L828J967J623K069k423j0255o05O790P765L380j330
419946A5631R995m703q757p124K119j889O593K869m818k765L897J962L840K130
420801A8980n183p915O34j385J730j463M628Q425J0762o435q560p538n068K156
421655C768L076J893J781N310k256K714p97n31k442k581p006m974l185l792R222
$$ plain form
422571 200 3011 2614 9290 5334 2031 2650 2582 5790 4137 4012 -2152 7685 11215 10807 1961 5989
423547 5989 7634 7585 193 8734 13602 9733 2912 6605 13169 24190 25238 13275 10040 16524
424402 16524 16463 15544 13924 11142 18544 19662 15733 8848 4945 4964 16394 19548 17113 12752 6728
425318 6728 1762 401 -1164 -1084 2617 670 1943 5507 10146 14499 23591 24994 22350 10517 9015
426233 9015 20355 18955 20911 25884 24926 14034 4547 11393 11288 16880 17165 21996 19857 6432
427088 6432 17812 12167 9187 -635 -4298 2277 3468 6364 2156 3774 13253 6998 2695 11426
427942 11426 4283 7625 17108 12874 10980 12498 7052 4647 -1730 -41 -4745 -5984 -4006 7030
428797 7030 8558 5850 20482 26174 20711 18141 12943 -2844 2027 8093 12007 6026 -713 -6911
$$ packed form
422571B00K811l97O676l956l303O19o8L208j653j25o164R837L530m08q846M028
423547E989J645m9p392Q541M868l869o821L693O564J1021J048j1963l235O484
424402A6524o1r19j620k782P402J118l929o885l903J9J1430L154k435m361o024
425318F728m966j361j565Q0L701j947J273L564M639M353R092J403k644j1833j502
426233I015J1340j400J956M973r58j0892r487O846j05N592K85M831k139j3425
427088F432J1380n645k980r822l663O575J191K896m208J618R479o255m303Q731
427942A1426p143L342R483m234j894J518n446k405o377J689m704j239J978J1036
428797G030J528k708J4632N692n463k570n198j5787M871O066L914n981o739o198
$$ plain form
429651 -6911 -5212 -729 3007 10234 15891 19712 14598 18679 25301 23679 23428 24800 22111 15668 11727
430567 11727 9155 2889 9680 11568 7760 1582 8509 26833 32183 27849 19371 6063 2416 10512
431421 10512 10413 9327 12107 10017 2611 13801 17489 16596 19996 14050 4043 11367 16320 18672
432276 18672 7867 -2203 -8673 6537 15285 12466 11033 7933 476 6099 7428 2128 -831
433069 -831 -1005 5630 9977 19178 19260 8588 4308 12565 21182 12630 7113 2036 3589 7559 2530
433985 2530 -1992 -1668 1982 16143 12981 13502 16284 10447 8948 12544 10412 16261 18745 13666 15135
434901 15135 9664 4400 13079 11774 2347 -3178 -8625 -6087 713 2939 8852 13365 8863 12209
435755 12209 10767 14228 17537 22578 23824 16796 12660 13798 15476 16998 18254 17335 13722 8584
$$ packed form
429651f911J699M483L736P227N657L821n114M081O622j622k51J372k689o443l941
430567A1727k572o266O791J888l808o178O927J8324N350m334q478j3308l647Q096
431421A0512r9j086K780k090p406J1190L688q93L400n946j0007P324M953K352
432276A8672j0805j0070o470J5210Q748k819j433l100p457N623J329n300k959
433069h31j74O635M347R201Q2j0672m280Q257Q617q552n517n077J553L970n029
433985B530m522L24L650J4161l162N21K782n837j499L596k132N849K484n079J469
434901A5135n471n264Q679j305r427n525n447K538O800K226N913M513m502L346
435755A2209j442L461L309N041J246p028m136J138J678J522J256r19l613n138
$$ plain form
436610 8584 2020 9793 11064 13633 14446 16671 16110 3523 -7646 2566 7734 1529 287 1174
437464 1174 -635 -7895 -8445 -8687 -10500 -8570 2409 9958 12623 6999 8505 15812 8170 8489 3848
438380 3848 441 -2605 -3526 5827 3360 -522 3716 8548 10010 5646 6364 2824 6592 1577 4812
439295 4812 -9062 -4679 -4216 2037 506 8041 -1817 8147 16955 19447 19589 14795 7163 7030 4126
440211 4126 5155 -1512 5016 9477 16969 20950 19617 15882 10614 11022 16740 9476 2417 -3285 1447
441127 1447 -2462 -1246 2372 12068 12762 8038 14146 6271 2363 -5954 814 3792 -4467 -8577 -5046
442042 -5046 -2041 -3299 -517 -1646 -886 -2839 -2385 -1046 -4025 3879 5241 -4986 3583 8142 -902
442958 -902 -6247 -8101 -9442 -6251 -3155 -353 -1628 -5416 -2899 5124 7143 11121 -4023 64
$$ packed form
436610H584o564P773J271K569Q13K225n61j2587j1169J0212N168o205j242Q87
437464A174j809p260n50k42j813J930J0979P549K665n624J506P307p642L19m641
438380C848l407l046r21R353k467l882M238M832J462m364P18l540L768n015L235
439295D812j3874M383M63O253j531P535r858R964Q808K492J42m794p632j33k904
440211D126J029o667O528M461P492L981j333l735n268M08N718p264p059n702M732
441127A447l909J216L618R696O94m724O108p875l908q317O768K978q259m110L531
442042e046L005j258K782j129P60j953M54J339k979P904J362j0227Q569M559r044
442958i02n345j854j341L191L096K802j275l788K517Q023K019L978j5144M087
$$ plain form
443812 64 372 6149 15662 13906 4520 1614 869 7498 10942 8347 5061 13416 14680 7858 9081
444728 9081 16278 8369 2015 -2492 3954 -936 2165 -842 6546 8673 8775 2853 1192 2926 9201
445644 9201 10971 11799 11331 7645 8398 11637 10909 8034 2869 -1873 6134 11358 9811 5501 8169
446559 8169 5027 3248 3098 3700 -1141 -1701 6100 3371 9365 15671 16282 13169 12193 10564 6300 -287
447536 -287 -4883 -6866 -6359 -5437 -2452 12255 14041 4689 11934 8460 -335 3806 6455 -842 -4824
448451 -4824 -9764 -1875 6880 6704 5656 11522 19065 20200 16702 8870 1628 4379 2003 -875 4322
449367 4322 2657 355 -2558 6173 5968 4376 4028 942 4044 250 324 11353 11861 5884 6956
450282 6956 14738 13943 15469 9801 11317 7073 2735 3996 4011 4307 3249 3122 8623 5633 526 2453
$$ packed form
443812F4L08N777R513j756r386k906p45O629L444k595l286Q355J264o822J223
444728I081P197p909o354m507O446m890L101l007P388K127J02n922j661J734O275
445644I201J770Q28m68l686P53L239p28k875n165m742Q007N224j547m310K668
446559H169l142j779j50O02m841n60P801k729N994O306O11l113r76j629m264o587
447536b87m596j983N07R22K985J4707J786r352P245l474q795M141K649p297l982
448451d824m940P889Q755j76j048N866P543J135l498p832p242K751k376k878N197
449367D322j665k302k913Q731k05j592l48l086L102l794P4J1029N08n977J072
450282F956P782p95J526n668J516m244m338J261J5K96j058j27N501k990n107J927
$$ plain form
451259 2453 111 -4530 5907 3481 5522 10132 15717 15771 10345 5027 4854 7773 8756 12369 8577
452175 8577 10284 12105 7050 -2400 -2938 -1898 590 4589 5837 7854 813 8761 18237 19153 8991
453090 8991 5062 7308 9585 2340 -45 337 1272 -3124 3872 585 3831 361 5461 12265 7031
454006 7031 6949 13050 14984 16267 18219 9207 3196 931 7489 6495 6128 20455 13922 4197 9211
454921 9211 7355 13759 25225 31269 22465 21721 15286 3738 9399 15900 14741 7039 4674 11850
455776 11850 17947 12920 6635 156 4744 8685 8508 13917 19080 15460 12717 8714 9036 17513 20479
456692 20479 11732 8906 11813 10790 15431 16824 16494 15855 10500 14527 16811 4854 3535 8715
457546 8715 8120 9883 10389 19297 22100 9991 12671 12733 4108 10978 16304 14408 14013 14988 18683 20001
$$ packed form
451259B453k342m641J0437k426K041M610N585N4n426n318j73K919R83L613l792
452175H577J707J821n055r450n38J040K488L999J248K017p041P948R476R16j0162
453090H991l929K246K277p245k385L82R35m396O996l287L246l470N100O804n234
454006G031q2O101J934J283J952r012o011k265O558r94l67J4327o533r725N014
454921I211j856O404J1466O044q804p44o435j1548N661O501j159p702k365P176
455776A1850O097n027o285o479M588L941j77N409N163l620k743m003L22Q477K966
456692B0479q747k826K907j023M641J393l30o39n355M027K284j1957j319N180
457546H715n95J763N06Q908K803j2109K680O2q625O870N326j896l95R75L695J318
$$ plain form
458523 20001 19546 27546 30165 22614 11816 8041 5797 -569 5089 10957 10018 3784 1531 7506
459377 7506 11654 3242 572 4014 2880 3776 8448 17700 17039 10120 11216 2794 -2454 -209 -2966
460293 -2966 3581 3085 6163 3459 3311 12784 18544 25081 17460 10253 7920 -2186 4547 9971 6782
461209 6782 6872 5987 16281 21500 28206 25234 23901 18188 18011 4867 1096 2799 6806 11303 13226
462124 13226 19590 20022 17005 13310 3520 1002 13993 28091 19552 26052 31680 28475 16625 5374
462979 5374 2806 11582 11427 4515 5529 4537 2139 -6946 3016 11311 10154 9440 3260 -1957 4486
463894 4486 16014 6608 6986 10569 13039 11292 6634 13893 20995 8277 5584 5038 -1407 1989
464749 1989 13099 14205 9515 8629 7108 16017 17638 18768 21600 16318 15749 13742 6663 10295 11863
$$ packed form
458523B0001m55Q000K619p551j0798l775k244o366N658N868r39o234k253N975
459377G506M148q412k670L442j134Q96M672R252o61o919J096q422n248K245k757
460293b966O547m96L078k704j48R473N760O537p621p207k333j0106O733N424l189
461209F782R0q85J0294N219O706k972j333n713j77j3144l771J703M007M497J923
462124A3226O364M32l017l695r790k518J2991J4098q539O500N628l205j1850j1251
462979E374k568Q776j55o912J014r92k398r085R962Q295j157p14o180n217O443
463894D486J1528r406L78L583K470j747m658P259P102j2718k693n46o445L396
464749A989J1110J106m690q86j521Q909J621J130K832n282n69k007p079L632J568
$$ plain form
465664 11863 11158 14562 19138 17463 20071 19717 20120 17810 12868 5189 -626 8450 5164 8240 8040
466580 8040 8543 8988 -4559 -8035 -3823 -7239 -9139 -912 -4189 -2773 -6222 335 -389 4300 125
467495 125 -3456 -3568 9966 19451 20807 12566 6423 1275 -6739 -3356 4219 8103 6573 8443 6158
468411 6158 16961 10997 12620 9250 4896 -1622 -2006 4207 1011 4611 4099 -3484 -4541 416 10580
469327 10580 10954 11529 9248 5310 14085 15745 16021 12372 15653 13072 13538 10930 16645 20196 16480
470242 16480 8271 4996 3184 14090 13745 16586 12514 7580 -1538 6503 11121 14516 11877 9859
471097 9859 8070 13419 15296 13391 7815 -4847 -11141 3163 10623 4751 4278 1645 6730 9209
471951 9209 3182 1500 39 -3155 -1869 112 1888 -4315 -5029 -2694 2881 7374 3695 8903 12218
$$ packed form
465664A1863p05L404M576j675K608l54M03k310m942p679n815R076l286L076k00
466580H040N03M45j3547l476M212l416j900Q227l277J416l449O557p24M689m175
467495A25l581j12J3534R485J356q241o143n148q014L383P575L884j530J870k285
468411F158J0803n964J623l370m354o518l84O213l196L600n12p583j057M957J0164
469327A0580L74N75k281l938Q775J660K76l649L281k581M66k608N715L551l716
470242A6480q209l275j812J0906l45K841m072m934r118Q041M618L395k639k018
471097I859j789N349J877j905n576j2662o294J4304P460n872m73k633N085K479
471951I209o027j682j461l194J286J981J776o203p14K335N575M493l679N208L315
$$ plain form
472867 12218 5331 8841 9828 16077 21751 20033 21155 17459 17557 13958 12263 11512 10077 14064 25465
473783 25465 22028 18239 8115 -413 8756 8204 -992 -4932 -6679 -3309 9632 15276 11093 10214
474637 10214 7279 7116 8830 15001 17888 14011 -748 -1761 840 -925 -1327 3588 10146 17474
475491 17474 16993 9886 10168 14967 13197 4714 10669 6123 4372 12298 16555 7806 -2117 241 5726
476407 5726 4612 8429 4157 9280 13700 15953 13446 10974 4310 3847 256 1970 5443 15098 7462
477323 7462 -8733 -8142 1566 6802 7757 13192 15092 19014 18854 16857 11499 11724 15900 14492 13703
478238 13703 11620 -27 -5363 949 5354 -1398 1552 2310 11099 16654 20976 16414 14738 12633
479093 12633 14844 15836 2456 637 -1014 -6012 -7214 -3101 -2424 1391 7815 -1037 5300 6
$$ packed form
472867A2218o887L510R87O249N674j718J122l696R8l599j695p51j435L987J1401
473783B5465l437l789j0124q528R169n52r196l940j747L370J2941N644m183q79
474637A0214k935j63J714O171K887l877j4759j013K601j765m02M915O558P328
475491A7474m81p107K82M799j770q483N955m546j751P926M257q749r923K358N485
476407E726j114L817m272N123M420K253k507k472o664m63l591J714L473R655p636
477323G462j6195N91R708N236R55N435J900L922j60j997n358K25M176j408p89
478238A3703k083j1647n336O312M405o752K950P58Q789N555M322m562j676k105
479093A2633K211R92j3380j819j651m998j202M113O77L815O424q852O337n294
$$ plain form
479947 6 2645 14915 13322 9492 6241 3547 -2377 -399 -1702 -943 4100 1332 -3811 -8302 -7554
480863 -7554 -4063 -4964 -867 -1325 9492 11491 8419 13045 22885 12746 9720 9836 11550 9150 8274
481778 8274 -3465 -5744 -6302 -13517 -10876 -1981 -4470 -9778 -5952 -1780 6484 19774 9008 7028
482633 7028 4081 1817 611 2249 73 -1080 7273 9624 4763 5038 10713 17491 13999 2060
483488 2060 -1639 2176 7558 7784 -3306 -1348 11030 8960 14037 4982 -4100 -3471 3068 7030
484342 7030 9596 14916 22482 21148 7361 -4440 -4800 -3152 -1615 6683 12582 16775 15792 14434
485197 14434 4895 327 172 646 3801 16585 11685 681 -3699 6376 6611 684 -82 2397
486051 2397 -214 -4118 -11349 2810 10250 13316 15747 20495 15120 16866 15710 16434 11967 15809
$$ packed form
479947FK639J2270j593l830l251k694n924J978j303P59N043k768n143m491P48
480863g554L491r01M097m58J0817J999l072M626R840j0139l026J16J714k400q76
481778H274j1739k279n58p215K641Q895k489n308L826M172Q264J3290j0766j980
482633G028k947k264j206J638k176j153Q353K351m861K75N675O778l492j1939
483488B060l699L815N382K26j1090J958J2378k070N077r055r082O29O539L962
484342G030K566N320P566j334j3787j1801l60J648J537Q298N899M193r83j358
485197A4434r539m568j55M74L155J2784m900j1004m380J0075K35n927p66K479
486051B397k611l904p231J4159P440L066K431M748n375J746j156P24m467L842
$$ plain form
486906 15809 19990 20688 22782 20189 14498 11505 4177 -3759 -7195 -7318 -3031 4564 6215 1992 -3436
487821 -3436 -6782 -3574 -563 464 3868 6267 5140 3060 6594 6214 -1952 5963 10586 -2885
488676 -2885 7643 3652 6732 11504 17167 11531 7106 9307 2522 295 183 -126 8141 13454 16475
489592 16475 6603 -1666 2901 15300 16081 14791 7812 5276 770 800 3330 5261 4141 4472 2568
490507 2568 -1818 -1662 3752 7702 4810 10523 11687 5448 7765 5717 9632 13415 10704 5547 13107
491423 13107 20233 16324 9833 -3844 -940 -354 9963 12297 10422 2525 188 10505 9144 9302
492277 9302 15636 19245 6998 -738 -4264 -93 -3491 5836 17502 21517 16486 5186 430 622
493132 622 6615 13677 20744 15305 11421 17523 13904 6963 2655 5626 1873 -3463 -6807 -534 4740
$$ packed form
486906A5809M181O98K094k593n691k993p328p936l436j23M287P595J651m223n428
487821c436l346L208L011J027L404K399j127k080L534l80q166P915M623j3471
488676b885J0528l991L080M772N663n636m425K201o785k227j12l09Q267N313L021
489592A6475r872q269M567J2399P81j290o979k536m506L0K530J931j120L31j904
490507B568m386J56N414L950k892N713J164o239K317k048L915L783k711n157P560
491423A3107P126l909o491j3677K904N86J0317K334j875p897k337J0317j361J58
492277I302O334L609j2247p736l526M171l398R327J1666M015n031j1300m756J92
493132F22N993P062P067n439l884O102l619o941m308K971l753n336l344O273N274
$$ plain form
494047 4740 5202 252 8072 3534 -2828 -494 2091 13931 17520 8313 8063 1341 -1625 5516 17017
494963 17017 19013 14586 15559 27045 21098 4761 5056 18353 16083 13473 8201 538 8703 7081
495817 7081 12402 5320 8252 11776 9624 3688 8031 14073 14947 3629 13038 13329 9809 4904 -540
496733 -540 3534 1828 13902 17900 13442 14284 25295 23252 15970 4593 7326 16422 18863 11750
497587 11750 19794 19502 19337 6218 -3128 14367 11883 15615 16136 13393 15863 15173 11311 11794 7549
498503 7549 5646 3495 5143 9688 5360 10262 9503 14748 17815 4436 3377 2320 3279 8783 8649
499419 8649 7538 13685 18756 7889 9187 9394 2599 -1535 4631 4886 12472 12732 11889 12260 10898
500334 10898 13320 7025 6764 559 -1499 3838 -1477 4874 8833 7002 1616 -3208 6907 14835
$$ packed form
494047D740M62m950P820m538o362K334K585J1840L589r207k50o722k966P141J1501
494963A7017J996m427R73J1486n947j6337K95J3297k270k610n272p663Q165j622
495817G081N321p082K932L524k152n936M343O042Q74j1318R409K91l520m905n444
496733e40M074j706J2074L998m458Q42J1011k043p282j1377K733R096K441p113
497587A1750Q044k92j65j3119r346J7495k484L732N21k743K470o90l862M83m245
498503G549j903k151J648M545m328M902p59N245L067j3379j059j057R59N504j34
499419H649j111O147N071j0867J298K07o795m134O166K55P586K60q43L71j362
500334A0898K422o295k61o205k058N337n315O351L959j831n386m824J0115P928
$$ plain form
501189 14835 19324 18741 12667 9758 12198 20136 11020 9170 8936 7753 4061 5755 6997 9724 15809
502104 15809 14929 9775 14568 10294 6800 7139 7217 16061 14543 10968 15917 14866 14218 11098 10146 12715
503081 12715 8929 9010 12740 12727 12570 10332 1783 628 -574 489 -518 1513 4825 159 -2497
503997 -2497 -7188 -12357 -13960 -9873 -1217 7329 15496 10259 951 12044 14053 9967 13487 10523
504851 10523 8970 7434 6448 9057 -135 1406 -695 -191 -4938 -1471 10082 11129 16240 17054 13119
505767 13119 7927 8520 3561 4466 11403 10023 16665 20426 11599 10287 13897 10200 4953 1856 11322
506682 11322 14181 23608 21411 23464 20145 10690 4040 -1758 -3476 4192 6752 1125 6405 7191
507537 7191 7625 14759 8177 225 8137 13993 10461 2843 -941 1947 4481 3327 6164 15289 14846
$$ packed form
501189A4835M489n83o074k909K440P938r116j850k34j183l692J694J242K727O085
502104A5809q80n154M793m274l494L39P8Q844j518l575M949j051o48l120r52K569
503081A2715l786Q1L730j3j57k238q549j155j202J063j007K031L312m666k656
503997b497m691n169j603M087Q656Q546Q167n237r308J1093K009m086L520k964
504851A0523j553j536r86K609r192J541k101N04m747L467J1553J047N111Q14l935
505767A3119n192N93m959R05O937j380O642L761q827j312L610l697n247l097R466
506682A1322K859R427k197K053l319r455o650n798j718P668K560n627N280P86
507537G191M34P134o582p952P912N856l532p618l784K888K534j154K837R125m43
$$ plain form
508452 14846 8289 3266 4405 3720 1903 14914 17720 5157 1446 2299 10330 13161 6542 4980
509307 4980 2244 3111 -2547 247 7382 7988 -4536 -2705 1477 3457 2889 6961 4613 128 -1201
510223 -1201 -45 -4551 5172 6015 3900 3278 1477 8125 12421 3570 932 2242 -892 -1686 1028
511138 1028 4610 3164 -5598 1814 8794 2729 557 -7475 -11974 -10466 5592 9212 14088 14876
511993 14876 9272 5018 4697 14737 14063 8911 8812 2659 344 3117 -2528 286 1470 -540 524
512908 524 2921 7815 4171 -2264 -563 -2910 3271 12749 13224 6519 5170 10212 14412 16056 8713
513824 8713 5149 11387 12003 6514 -212 4403 2076 -1240 9790 9177 8117 10963 8155 9036 20347
514739 20347 17894 3409 2389 3493 6790 4748 2372 -2620 -2788 -1572 -2302 616 -5280 -9383
$$ packed form
508452A4846o557n023J139o85j817J3011K806j2563l711Q53Q031K831o619j562
509307D980k736Q67n658K794P135O06j2524J831M182J980n68M072k348m485j329
510223a201J156m506R723Q43k115o22j801O648M296q851k638J310l134p94K714
511138A028L582j446q762P412O980o065k172q032m499J508J6058L620M876P88
511993A4876n604m254l21J0040o74n152r9o153k315K773n645K814J184k010J064
512908E24K397M894l644o435J701k347O181R478M75o705j349N042M200J644p343
513824H713l564O238O16n489o726M615k327l316J1030o13j060K846k808Q81J1311
514739B0347k453j4485j020J104L297k042k376m992j68J216p30K918n896m103
$$ plain form
515594 -9383 -9709 -28 12265 14441 10906 15952 8476 4011 16849 15454 12661 9317 6211 8199
516449 8199 10158 12642 17886 22745 23532 26520 20928 13925 14119 14075 10835 9376 3595 16076 21798
517364 21798 9477 388 -7946 -2163 3919 12524 12756 20006 22871 21242 16646 16220 14910 10125
518219 10125 7560 -1493 -3612 2551 6594 -424 -12941 -10432 -6032 -12193 -8785 -7559 -3887 3792
519073 3792 8821 12744 11385 9428 10759 12479 11961 14847 7741 383 2813 9048 6546 1192 2746
519989 2746 5960 4556 -1824 -3152 9304 8560 15358 9046 19247 25133 24014 12474 3955 8324
520843 8324 3747 3073 7215 3256 1918 944 1990 5582 7294 6350 979 -1578 9664 10629 15192
521759 15192 16152 8636 4627 13071 22220 28113 25306 22758 13052 550 1641 1383 3498 4283 12029
$$ packed form
515594i383l26R681J2293K176l535N046p476m465J2838j395k793l344l106J988
516449H199J959K484N244M859P87K988n592p003J94m4l240j459n781J2481N722
517364B1798j2321r089q334N783O082Q605K32P250K865j629m596m26j310m785
518219A0125k565r053k119O163M043p018j2517K509M400o161L408J226L672P679
519073C792N029L923j359j957J331J720n18K886p106p358K430O235k502n354J554
519989B746L214j404o380j328J2456p44O798o312J0201N886j119j1540q519M369
520843H324m577o74M142l959j338r74J046L592J712r44n371k557J1242R65M563
521759A5192R60p516m009Q444R149N893k807k548r706j2502J091k58K115P85P746
$$ plain form
522675 12029 10137 7070 6098 11559 11699 10246 9682 4067 -156 10339 10186 10541 15046 15226 16203 11061
523651 11061 12902 8603 7395 10095 9956 10357 2091 1822 7167 4954 9071 14149 20354 17480 13935
524567 13935 13789 4528 1572 -793 1504 6315 1977 8792 9178 4696 -475 6326 5970 7703 2907
525482 2907 -4814 -11634 -3076 7839 11144 13826 12726 10773 20158 12131 3971 4309 14278 14068 14490
526398 14490 16470 12324 15020 13210 2262 1195 -7296 -1320 2935 8991 -487 -4826 -2705 -4917
527252 -4917 -1856 9391 13640 18721 16809 5792 2013 6504 8123 2502 3276 -5023 -2969 -1253
528107 -1253 8295 13145 10561 7336 9462 9853 7302 10604 13726 17850 13450 17534 10098 7387 10470
529023 10470 11120 15880 11001 14420 10823 10861 14015 28083 28310 17612 15552 11761 9009 6494 15764
$$ packed form
522675A2029j892l067r72N461J40j453n64n615m223J0495j53L55M505J80R77n142
523651A1061J841m299j208K700j39M01q266k69N345k213M117N078O205k874l545
524567A3935j46r261k956k365K297M811m338O815L86m482n171O801l56J733m796
525482B907p721o820Q558J0915L305K682j100j953R385q027q160L38R969k10M22
526398A4490J980m146K696j810j0948j067q491N976M255O056r478m339K121k212
527252d917L061J1247M249N081j912j1017l779M491J619n621P74q299K054J716
528107a253R548M850k584l225K126L91k551L302L122M124m400M084p436k711L083
529023A0470O50M760m879L419l597L8L154J4068K27j0698k060l791k752k515R270
$$ plain form
529938 15764 10534 6949 6222 9533 11961 11731 4017 8013 14038 9107 5516 -90 7135 8041 -2141
530854 -2141 -7784 -6595 -6194 1177 9174 15827 10054 4837 -3454 -5219 3382 10423 6986 281 -2124
531769 -2124 621 4472 7882 16753 19424 21134 25778 30513 25630 17293 8845 3642 -2905 4557
532624 4557 7494 -864 -3425 1929 12572 19947 14299 16295 22097 20721 23566 24756 16395 6684
533479 6684 5422 13056 14212 7480 -1296 -750 11457 9865 7536 5922 7862 10846 16057 21192
534333 21192 15519 9499 16240 17724 18088 19819 15369 15204 18579 7924 8544 17082 14633 4901 -430
535249 -430 48 -2562 -1641 1611 -3409 -7136 -4575 4359 8448 10157 16728 16053 14809 15403 6514 9626
536225 9626 5872 3411 1727 5789 5247 -6857 -1419 4425 2238 1516 2295 2777 4081 5078 8687
$$ packed form
529938A5764n230l585p27L311K428k30p714L996O025m931l591n606P225R06j0182
530854b141n643J189M01P371P997O653n773n217q291j765Q601P041l437o705k405
531769b124K745L851L410Q871K671J710M644M735m883q337q448n203o547P462
532624D557K937q358k561N354J0643P375n648J996N802j376K845J190q361r711
533479F684j262P634J156o732q776N46J2207j592k329j614J940K984N211N135
534333B1192n673o020O741J484L64J731m450j65L375j0655O20Q538k449r732n331
535249d30M78k610R21L252n020l727K561Q934M089J709O571o75j244N94q889L112
536225I626l754k461j684M062n42j2104N438N844k187p22P79M82J304R97L609
$$ plain form
537141 8687 12141 13072 11758 8302 7811 13000 17659 17602 14944 9909 2017 2129 12941 12303 11966 14820
538117 14820 11379 8073 7532 2097 2673 3176 5184 2790 -1117 3956 6899 10273 14301 19874 20608
539033 20608 22933 11744 19914 18305 6348 32 2482 2296 7688 11452 18514 10009 614 -5563
539887 -5563 -2510 1788 -3942 -11970 -5685 3220 -4116 -10680 -2350 8248 13659 12480 14835 15479
540742 15479 7370 3376 9219 4945 7609 10701 12983 8456 11034 18007 12313 -2318 -5523 -1529
541596 -1529 3670 6940 8537 5674 -2522 2112 10806 4993 6230 10688 16837 11792 663 3202
542451 3202 7625 12693 15169 15697 19775 22978 11812 -17 -7 2197 6719 7098 7695 19154 19352
543367 19352 7178 10105 8958 9839 15147 14244 15288 13261 11086 7152 4161 7882 7224 8695 12961
$$ packed form
537141H687L454R31j314l456m91N189M659n7k658n035p892J12J0812o38l37K854
538117A4820l441l306n41n435N76N03K008k394l907N073K943L374M028N573P34
539033B0608K325j1189Q170j609j1957o316K450j86N392L764P062q505r395o177
539887e563L053M298n730q028O285Q905p336o564Q330J0598N411j179K355O44
540742A5479q109l994N843m274K664L092K282m527K578O973n694j4631l205L994
541596a529N199L270J597k863q196M634Q694n813J237M458O149n045j1129K539
542451C202M423N068K476N28M078L203j1166j1829J0K204M522L79N97J1459J98
543367A9352j2174K927j147Q81N308r03J044k027k175l934k991L721o58J471M266
$$ plain form
544282 12961 11799 16512 18788 7455 4606 4461 5540 12688 14474 11695 6109 9062 12741 11945
545137 11945 4665 -1460 -6666 -3865 5872 11184 14668 12454 17610 13933 8272 2626 1892 -1447
545991 -1447 -5574 -9122 -2571 -3854 2076 2559 2531 -5 12815 14329 1833 3709 -1500 572 -1087
546907 -1087 8066 20258 18574 12540 17830 22825 16541 14060 17155 10379 8366 17512 24942 26962
547761 26962 18091 7360 12539 9974 14656 11879 12718 14800 14126 22179 20350 19760 10888 -10577
548616 -10577 -10523 3626 14675 10391 9930 1748 7181 13308 7780 -57 1782 1419 7547 1559 3753
549532 3753 5130 15432 17989 7356 14125 14643 8442 3004 1173 -1619 858 -2818 13937 19749
550386 19749 15280 9793 3052 9161 8518 7445 5009 7151 9141 6988 5741 6744 3849 -3669
$$ packed form
544282A2961j162M713K276j1333k849j45J079P148J786k779n586K953L679p96
545137A1945p280o125n206K801R737N312L484k214N156l677n661n646p34l339
545991a447m127l548O551j283N930M83k8k536J2820J514j2496J876n209K072j659
546907a087R153J2192j684o034N290M995o284k481L095o776k013R146P430K020
547761B6962q871j0731N179k565M682k777Q39K082o74Q053j829n90q872k1465
548616a0577N4J4149J1049m284m61q182N433O127n528p837J839l63O128n988K194
549532C753J377J0302K557j0633O769N18o201n438j831k792K477l676J6755N812
550386A9749m469n487o741O109o43j073k436K142J990k153j247J003k895p518
$$ plain form
551241 -3669 -279 12910 13702 8485 12522 11120 17480 19316 19488 12555 8267 4154 -550 -6291 3690
552156 3690 8615 6750 9757 9324 9082 8154 7010 6608 11478 10665 5210 7674 14466 4005 -2486
553072 -2486 3421 17305 13854 13821 8370 5995 6237 11043 5274 1034 9448 11028 6726 1129 -4250
553987 -4250 1920 7086 15237 11501 15041 25555 8912 -1004 1006 8077 10775 15221 19398 13677
554842 13677 17147 11380 10682 14599 11932 6093 73 4920 14207 7507 7998 1754 7543 3209 -1499
555758 -1499 4057 5714 1834 7576 -5696 -4537 2732 2056 2631 4781 9864 12588 10850 13251 14001
556673 14001 16140 17969 22329 14531 6926 9393 11538 14236 9603 -1133 4313 2720 -112 4333
557528 4333 4536 7756 1706 2856 13293 10530 4867 7794 12597 21004 15531 12550 7953 12018
$$ packed form
551241c669L390J3189P92n217M037j402O360J836J72o933m288m113m704n741R981
552156C690M925j865L007m33k42r28j144m02M870q13n455K464O792j0461o491
553072b486N907J3884l451l3n451k375K42M806n769m240Q414J580m302n597n379
553987d250O170N166Q151l736L540J0514j6643r916K010P071K698M446M177n721
554842A3677L470n767o98L917k667n839o020M847R287o700M91o244N789m334m708
555758a499N556J657l880N742j3272J159P269o76N75K150N083K724j738K401P50
556673A4001K139J829M360p798p605K467K145K698m633j0736N446j593k832M445
557528D333K03L220o050J150J0437k763n663K927M803Q407n473k981m597M065
$$ plain form
558382 12018 13784 13205 9064 15487 7834 9929 9885 7704 9454 2266 6338 7360 870 303 2502
559298 2502 13242 12370 13842 15503 8129 16632 14124 4468 4433 2091 7679 -4050 -7284 -629 10193
560214 10193 13036 9336 3805 9548 9741 1110 -3796 2226 8066 6602 -368 6873 1373 -3156
561068 -3156 -6822 -5948 -796 16780 14774 10570 7296 9970 5550 6331 15113 16783 18634 11045 2797
561984 2797 2593 5041 2326 2063 5882 850 529 4098 7848 9665 9559 6063 8278 17072 11801
562899 11801 11401 11102 4615 2644 7224 1320 -6571 2252 -22 4131 1451 4660 2350 6794 14762
563815 14762 12309 10076 14919 18540 22907 27172 33027 30708 31199 21167 10831 9206 7519 15330
564669 15330 13017 2605 682 11481 10014 7318 9670 16074 16975 12217 14562 12172 -1659 5357
$$ packed form
558382A2018J766n79m141O423p653K095m4k181J750p188M072J022o490n67K199
559298B502J0740q72J472J661p374Q503k508r656l5k342N588j1729l234O655J0822
560214A0193K843l700n531N743J93q631m906O022N840j464o970P241n500m529
561068c156l666Q74N152J7576k006m204l274K674m420P81Q782J670J851p589q248
561984B797k04K448k715k63L819n032l21L569L750J817j06l496K215Q794n271
562899A1801m00k99o487j971M580n904p891Q823k274M153k680L209k310M444P968
563815A4762k453k233M843L621M367M265N855k319M91j0032j0336j625j687P811
564669A5330k313j0412j923J0799j467k696K352O404R01m758K345k390j3831P016
$$ plain form
565524 5357 9403 5746 5606 14162 10617 6763 6169 3787 -3958 1725 7354 4926 5261 7179 7543
566439 7543 3230 7582 18170 16991 18249 18705 8536 2504 1629 4182 3979 11117 8885 2098 3602
567355 3602 3247 8619 10837 9946 10071 4594 3515 3329 -1276 1544 3864 5462 7376 14548 23426
568270 23426 13807 14382 14497 6119 11618 11646 5231 10695 15221 12310 8662 7064 15513 9923 6198
569186 6198 10256 9034 10438 5666 1440 1502 -3590 -3241 -2502 -6882 -3241 -1879 -3174 2839 9799
570102 9799 4389 7078 5266 -3405 573 893 986 4946 2110 15157 19590 9921 10871 1919 4936
571017 4936 2845 11560 13537 10833 3807 -1468 8204 12178 8305 12757 14095 11996 19540 19782 13196
571933 13196 6786 5158 1265 -441 9445 8698 11451 16041 10519 1042 -5409 23 5067 7956
$$ packed form
565524E357M046l657j40Q556l545l854n94k382p745N683N629k428L35J918L64
566439G543m313M352J0588j179J258M56j0169o032q75K553k03P138k232o787J504
567355C602l55N372K218q91J25n477j079j86m605K820K320J598J914P172Q878
568270B3426r619N75J15q378N499K8o415N464M526k911l648j598Q449n590l725
569186F198M058j222J404m772m226O2n092L49P39m380L641J362j295O013O960
570102I799n410K689j812q671L978L20R3L960k836J3047M433r669R50q952L017
571017D936k091Q715J977k704p026n275R672L974l873M452J338k099P544K42o586
571933A3196o410j628l893j706R886p47K753M590n522r477o451N432N044K889
$$ plain form
572787 7956 6516 8312 10836 15142 5898 -1275 -3729 -2533 1646 1827 2206 -9687 -1043 6681 8280
573703 8280 -471 -1120 -1846 -2763 -14517 -9827 -8654 -4325 1718 4782 4324 -264 1302 281 7932
574618 7932 10733 8021 8934 1624 -5761 -2071 3389 8883 8723 11306 3843 5776 1278 3679 10410
575534 10410 12260 17341 21498 16016 21220 22451 24835 20543 12353 6239 -3883 -7966 1178 1789
576389 1789 -1630 -5677 6746 7262 9142 8179 7130 6258 6517 8818 5945 -842 -354 2356 5316
577304 5316 11437 12832 11688 16276 10418 19113 24227 21373 14505 11377 11305 21539 16939 5592
578159 5592 5314 10178 11680 11056 13140 11491 4243 -2269 5891 8079 11135 8849 5448 -2000 -217
579074 -217 7341 10459 13954 4500 10803 9388 6851 3689 -825 1920 6566 11599 15284 8654 -2347
$$ packed form
572787G956j440J796K524M306r244p173k454J196M179J81L79j1893Q644P724J599
573703H280q751o49p26r17j1754M690J173M329O043L064m58m588J566j021P651
574618G932K801k712R13p310p385L690N460N494j60K583p463J933m498K401O731
575534A0410J850N081M157n482N204J231K384m292q190o114j0122m083R144O11
576389A789l419m047J2423N16J880r63j049q72K59K301k873o787M88K710K960
577304E316O121J395j144M588n858Q695N114k854o868l128p2J0234m600j1347
578159E592k78M864J502o24K084j649p248o512Q160K188L056k286l401p448J783
579074b17P558L118L495r454O303j415k537l162m514K745M646N033L685o630j1001
$$ plain form
579990 -2347 7194 5764 1623 6082 11104 4407 -234 9840 7890 5287 4652 538 -107 6910 7017
580906 7017 -651 8197 9216 5640 4526 15340 25383 17747 5841 3599 -5723 -4560 -2079 2243
581760 2243 4300 9401 12514 18939 17462 14513 14390 8406 9112 7041 11206 18239 13003 16311 8762
582676 8762 16921 24694 19405 10822 7151 12691 12426 8806 2822 -1800 -4349 12208 13170 8736 -2510
583591 -2510 -1403 3558 8740 3028 2116 6014 16417 20608 17808 9029 2066 -934 2255 6961
584446 6961 15893 12473 6172 3948 4600 916 1037 4191 8795 6100 6018 8961 -570 -1862 3316
585361 3316 4526 -2758 -2354 1123 559 10328 12865 15673 4351 5687 7585 7862 658 -7628 -8326
586277 -8326 -11036 -2332 4667 11694 12529 -2078 -7014 -2190 2878 6689 5181 -2182 -7122 -4864
$$ packed form
579990b347R541j430m141M459N022o697m641J0074j950k603o35m114o45P017J07
580906G017p668Q848J019l576j114J0814J0043p636j1906k242r322J163K481M322
581760B243K057N101L113O425j477k949j23n984P06k071M165P033n236L308p549
582676H762Q159P773n289q583l671N540k65l620n984m622k549J6557R62m434j1246
583591b510J107M961N182n712r12L898J0403M191k800q779o963l000L189M706
584446F961Q932l420o301k224O52l684J21L154M604k695q2K943r531j292N178
585361C316J210p284M04L477n64R769K537K808j1322J336J898K77p204q286o98
586277h326k710Q704O999P027Q35j4607m936M824N068L811j508p363m940K258
$$ plain form
587132 -4864 6977 4210 1214 6413 2537 -7661 -7391 -261 7562 3239 -3363 619 5937 745
587986 745 -1406 -5949 -4658 -6630 -8369 -7591 899 7313 8826 7247 12907 8821 6408 7611 11477
588902 11477 21128 15933 9484 7935 10860 7510 9953 12980 9999 13361 16904 18825 12486 12829
589756 12829 14851 6646 3805 9445 4341 4407 2340 -698 3897 -4681 910 6004 3733 546 3855
590672 3855 4829 10723 9403 8494 4536 140 -724 -5008 374 4120 9626 11458 12712 15419 9127
591588 9127 10154 8815 -93 4549 7723 6300 1615 -2100 -1399 -862 6290 8 3530 9695 8415
592503 8415 11912 21791 21869 12015 7111 2055 2204 1915 2132 12541 11242 3249 711 2556 -666
593419 -666 -5668 -4348 2478 2685 8647 8544 6048 -3908 -12832 -3031 2803 5961 5879 6451 1851 2016
$$ packed form
587132d864J1841k767k996N199l876j0198K70P130P823m323o602L982N318n192
587986G45k151m543J291j972j739P78Q490O414J513j579N660m086k413J203L866
588902A1477R651n195o449j549K925l350K443L027k981L362L543J921o339L43
589756A2829K022q205k841N640n104O6k067l038M595q578N591N094k271l187L309
590672C855R74N894j320r09l958m396q64m284N382L746N506J832J254K707o292
591588I127J027j339q908M642L174j423m685l715P01N37P152o282L522O165j280
592503H415L497R879P8r854m904n056J49k89K17J0409j299p993k538J845l222
593419f66n002J320O826K07N962j03k496r956q924R801N834L158q2N72m600J65
$$ plain form
594395 2016 4388 7549 12706 6860 3128 1348 2401 5108 12425 11501 2722 -1110 5989 10971 6228
595311 6228 -387 1662 7911 11791 12128 7734 4150 1747 3575 1882 -4289 -7905 -9901 -5898 1280
596226 1280 13126 13969 10284 -4572 -7232 -4911 -5366 -143 4000 -1650 1606 8720 13263 15287
597081 15287 14975 10767 3632 786 9116 10266 13999 6015 4847 6770 10421 9820 10523 9100 2650
597997 2650 -5416 -8413 -1190 -3264 -4170 3253 5294 7323 4223 9724 11117 15798 13983 17178 18455
598912 18455 18240 12995 5967 5069 4428 14386 17217 15039 18328 16473 9690 410 786 -469 -122
599828 -122 -1620 8145 3339 259 -7369 -16593 -10555 2998 730 12320 9806 2985 7824 6990
600682 6990 -2109 -5904 1285 987 630 7174 11869 5494 7727 21487 13040 9185 10164 14898 15183
$$ packed form
594395B016K372L161N157n846l732j780J053K707P317r24q779l832P099M982m743
595311F228o615K049O249L880L37m394l584k403J828j693o171l616j996M003P178
596226A280J1846Q43l685j4856k660K321m55N223M143n650L256P114M543K024
597081A5287l12m208p135k846Q330J150L733p984j168J923L651o01P03j423o450
597997B650q066k997P223k074r06P423K041K029l100N501J393M681j815L195J277
598912A8455k15n245p028q98o41R958K831k178L289j855o783r280L76j255L47
599828a22j498R765m806l080p628r224O038J3553k268J1590k514o821M839q34
600682F990r099l795P189k98l57O544M695o375K233J3760q447l855R79M734K85
$$ plain form
601598 15183 16017 11941 15438 19003 13456 11683 10597 4582 -1601 1858 702 -897 -2784 4271
602452 4271 11027 12071 11277 15900 11380 10051 5357 8901 7897 14630 19444 17759 14749 17186 19182
603368 19182 20118 11300 -2185 4723 -3700 -7755 -2647 6364 11224 15213 6772 9388 21324 16376
604223 16376 16527 13280 5116 6789 5874 9052 6016 153 4112 4965 4812 554 9949 19239 21685
605138 21685 9558 3684 -155 2968 3041 -3070 678 3098 1109 5215 2264 3798 10161 2186
605993 2186 -3873 201 6331 5745 78 7459 1877 2879 913 4642 8847 8352 13670 9488 10089
606908 10089 8818 2653 -1054 7113 11756 12097 18394 16281 5656 681 -4284 7163 13697 17275
607763 17275 15316 14768 14628 6252 2084 -2886 5200 8365 10994 7289 5661 5229 8548 6097 2926
$$ packed form
601598A5183Q34m076L497L565n547j773j086o015o183L459j156j599j887P055
602452D271O756J044p94M623m520j329m694L544j004O733M814j685l010K437J996
603368A9182R36q818j3485O908q423m055N108R011M860L989q441K616J1936m948
604223A6376J51l247q164J673r15L178l036n863L959Q53j53m258R395R290K446
605138B1685j2127n874l839L123P3o111L748K420j989M106k951J534O363p975
605993B186o059M074O130n86n667P381n582J002j966L729M205m95N318m182O01
606908A0089j271o165l707Q167M643L41O297k113j0625m975m965J1447O534L578
607763A7275j959n48j40q376m168m970Q086L165K629l705j628m32L319k451l171
$$ plain form
608678 2926 4599 5243 10663 14157 15991 13506 14321 8335 321 -3170 -3377 7114 4922 7775 4420
609594 4420 7497 20718 26147 17444 7747 1870 -671 5369 11129 17677 9883 5346 13252 8861
610448 8861 14161 9220 14325 9407 9377 9074 -1073 2862 8571 6177 2414 1367 -2489 5075 13028
611364 13028 14646 12956 5789 3565 11859 13415 11545 12785 17124 13476 3373 -9422 -4457 10231
612218 10231 16398 18733 10847 16393 17165 15341 14949 11530 10662 2705 7640 5030 12905 15829 14718
613134 14718 16555 18210 19582 24848 22042 21884 18662 4991 7980 4849 3108 3369 7352 9800
613989 9800 2969 6721 6865 941 3196 6464 10717 10693 16700 10612 11647 15015 11056 19196 18069
614904 18069 13500 1076 1232 4949 4506 12107 20254 12262 8334 10585 12496 25201 29693 25108
$$ packed form
608678B926J673O44N420L494J834k485Q15n986q014l491k07J0491k192K853l355
609594D420L077J3221N429q703r697n877k541O040N760O548p794m537P906m391
610448H861N300m941N105m918l0l03j0147L935N709k394l763j047l856P564P953
611364A3028J618j690p167k224Q294J556j870J240M339l648j0103j2795M965J4688
612218A0231O167K335p886N546P72j824l92l419q68p957M935k610P875K924j111
613134A4718J837J655J372N266k806j58l222j3671K989l131j741K61L983K448
613989I800o831L752J44n924K255L268M253k4O007o088J035L368l959Q140j127
614904A8069m569j2424J56L717m43P601Q147p992l928K251J911J2705M492m585
$$ plain form
615759 25108 15563 18419 13694 7103 5960 9161 5097 -387 1364 4178 5276 10378 12858 10371
616613 10371 8980 8780 16304 14125 14206 16636 11359 6482 684 -2894 5130 7938 5172 951 9403
617529 9403 8049 13650 14018 8645 11416 8404 7535 3957 -742 -6048 -3200 4669 7393 7383 3595
618444 3595 1775 3939 -4503 -1953 3512 9017 8622 4822 10269 15720 14316 11487 4719 4400 -2648
619360 -2648 -7377 -3542 -3715 -4706 -4618 -11788 -1727 9641 13437 12749 14969 19613 17653 12324 8386
620276 8386 2308 -1492 -1624 -2082 -4229 2117 -11174 -7562 7690 17094 8342 -1492 3789 7308
621130 7308 8769 14805 13259 3173 3018 15305 15514 14130 16645 20907 22596 22585 14417 2644 8370
622046 8370 7268 9486 12534 17584 20351 15469 13489 6664 8415 18598 18998 12334 10541 12630
$$ packed form
615759B5108r545K856m725o591j143L201m064n484J751K814J098N102K480k487
616613A0371j391k00P524k179Q1K430n277m877n798l578Q024K808k766m221Q452
617529I403j354N601L68n373K771l012q69l578m699n306K848P869K724j0l788
618444C595j820K164q442K550N465N505l95l800N447N451j404k829o768l19p048
619360b648m729L835j73r91Q8p170J0061J1368L796o88K220M644j960n329l938
620276H386o078l800j32m58k147O346j3291L612J5252R404q752r834N281L519
621130G308J461O036j546j0086j55J2287K09j384K515M262J689j1q168j1773N726
622046H370j102K218L048N050K767m882j980o825J751J0183M00o664j793K089
$$ plain form
622900 12630 7307 4403 9362 5388 -5334 2738 1837 -1403 -238 2161 7552 7911 4758 4478 221
623816 221 -1269 8479 11326 14141 11326 8174 9883 7224 9069 11076 13665 16737 11188 11743 8894
624732 8894 3269 2304 5611 4590 5791 14492 13457 9224 9345 3694 -610 2190 -156 -4694 679
625647 679 11809 9315 2806 5900 4206 -2246 1023 -4901 -6349 -1253 2212 3122 38 -4712 2172
626563 2172 4965 4130 -691 -3349 -758 12705 16084 10815 -487 -1574 8163 2032 7026 18415
627417 18415 11622 3471 4969 13457 9424 4527 1891 4053 9531 7211 3931 -2842 -1348 -3441
628272 -3441 -4941 5830 2475 1094 4701 1597 -4012 -1610 533 -281 3116 -373 -7702 -3187
629126 -3187 11162 11054 6165 6368 15642 22143 15040 1706 468 -3669 -1048 210 3325 189
$$ packed form
622900A2630n323k904M959l974j0722Q072r01l240J165K399N391L59l153k80m257
623816B21j490R748K847K815k815l152J709k659J845K007K589L072n549N55k849
624732H894n625r65L307j021J201Q701j035m233J21n651m304K800k346m538N373
625647F79J1130k494o509L094j694o452L269n924j448N096L465R10l084m750O884
626563B172K793q35m821k658K591J3463L379n269j1302j087R737o131M994J1389
627417A8415o793q151J498Q488m033m897k636K162N478k320l280o773J494k093
628272c441j500J0771l355j381L607l104n609K402K143q14L397l489p329M515
629126c187J4349j08m889K03R274O501p103j3334j238m137K621J258L115l136
$$ plain form
629981 189 4515 5912 -115 3936 5181 4662 8480 8260 11068 6392 5391 5517 8912 15139 21197
630897 21197 15133 7370 9298 5676 -229 3458 9184 9861 15136 20299 19268 18441 20901 23271 12903
631812 12903 7492 4913 1613 10056 8759 3622 6618 -3044 909 2221 876 -3075 -36 7181
632667 7181 19499 20695 13563 16558 19638 24024 20803 9879 7304 14911 16178 13253 9601 5323
633521 5323 403 6293 7436 5270 6708 13694 10208 -4433 1031 8175 15857 13816 6703 2813
634376 2813 7116 10162 14855 11756 10405 7880 -1998 -9197 -9817 -3414 395 7965 10569 7144 10103
635291 10103 8101 14664 14616 19689 17143 11558 11611 2989 309 4978 2155 -126 -2781 2118 7391
636207 7391 12912 16462 10989 17741 22727 14926 11247 12737 18366 13152 15738 21780 8660 -2336
$$ packed form
629981A89M326J397o027M051J245n19L818k20K808m676j001J26L395O227O058
630897B1197o064p763J928l622n905L687N726O77N275N163j031q27K460K370j0368
631812A2903n411k579l300Q443j297n137K996r662L953J312j345l951L039P217
632667G181J2318J196p132K995L080M386l221j0924k575P607J267k925l652m278
633521E323m920N890J143k166J438O986l486j4641N464P144P682k041p113l890
634376B813M303L046M693l099j351k525r878p199o20O403L809P570K604l425K959
635291A0103k002O563m8N073k546n585N3q622k680M669k823k281k655M899N273
636207G391N521L550n473O752M986p801l679J490N629n214K586O042j3120j0996
$$ plain form
637061 -2336 -1138 -6554 -1682 6831 14874 8455 9525 10686 20382 21343 21113 9183 5801 7323 7154
637977 7154 8994 2789 4470 16021 19183 10548 8911 5214 7380 8670 5122 3424 7681 5653
638831 5653 4137 10946 9498 4104 8560 4832 -1443 -9738 3283 4440 5216 3236 3038 5770 8191
639747 8191 7009 -4500 -2508 7483 3778 960 -2006 2110 9184 16995 11338 -1333 -825 -5109
640602 -5109 -8165 -3502 1343 6536 4980 9717 9090 2464 144 616 673 2726 1822 11901 16031
641517 16031 16295 10117 6657 -5275 -9168 -2025 4019 11788 14487 9147 9808 12767 6723 -3766
642372 -3766 2984 -530 -2032 -981 1338 2878 6398 5534 2905 3652 -3605 10131 12050 13156 17086
643287 17086 16319 15637 11278 4544 -4769 -3773 -200 3736 990 10687 9801 5778 10671 10739 11406 13105
$$ packed form
637061b336J198n416M872Q513Q043o419J070J161R696R61k30j1930l382J522j69
637977G154J840o205J681J1551L162q635j637l697K166J290l548j698M257k028
638831E653j516O809j448n394M456l728o275q295J3021J157P76j980j98K732K421
639747H191j182j1509J992R991l705k818k966M116P074P811n657j2671N08m284
640602e109l056M663M845N193j556M737o27o626k320M72N7K053r04J0079M130
641517A6031K64o178l460j1932l893P143O044P769K699n340O61K959o044j0489
642372c766O750l514j502J051K319J540L520q64k629P47p257J3736J919J106L930
643287A7086p67o82m359o734r313R96L573L936k746R697q86m023M893O8O67J699
$$ plain form
644264 13105 11773 12077 7639 3675 4192 -2435 406 -3301 -5516 -137 4099 3616 5961 8199 6032
645179 6032 6205 -122 3146 2862 -1092 -5816 -4650 -5836 -3575 -1174 11134 13627 15025 9337 15161
646095 15161 16547 10779 845 3189 2024 12994 21904 14743 15247 10065 -5479 -10769 2784 19301
646950 19301 16079 9453 11993 11984 1625 -327 491 -4113 -290 7833 14656 12785 7680 9045 12584
647865 12584 223 -7841 -2686 1281 2587 4797 4163 12789 12720 15180 6984 -970 -9067 -19201
648720 -19201 -20404 -12960 3826 12675 21733 21376 17213 11365 5571 5814 10496 5278 11315 16158
649574 16158 11890 6615 8344 10784 5514 1932 -4431 -3456 4230 1388 5212 14649 15310 12088 12535
650490 12535 5553 -349 3692 8245 13242 14564 11606 12886 19781 14635 8113 9403 10962 11406
$$ packed form
644264A3105j332L04m438l964N17o627K841l707k215N379M236m83K345K238k167
645179F032J73o327L268k84l954m724J166j186K261K401J2308K493J398n688N824
646095A5161J386n768r934K344j165J0970Q910p161N04n182j5544n290J3553J6517
646950A9301l222o626K540rj0359j952Q18m604L823Q123O823j871n105J365L539
647865A2584j2361q064N155L967J306K210o34Q626o9K460q196p954q097j0134
648720a9201j203P444J6786Q849R058l57m163n848n794K43M682n218O037M843
649574A6158m268n275J729K440n270l582o363R75P686k842L824R437O61l222M47
650490A2535o982n902M041M553M997J322k958J280O895n146o522J290J559M44
$$ plain form
651344 11406 12352 9896 14144 18331 21945 16083 11586 8810 11052 5472 -881 -6900 -6261 -5891 1435
652260 1435 5359 10127 3292 4675 8067 11202 12280 21850 16392 11271 6785 9089 15249 12425
653115 12425 5420 5526 11632 12658 17129 19789 15653 11931 10806 14027 9182 9918 8032 444 6925
654030 6925 -215 -2644 1458 8055 6801 3990 4467 6447 19710 27782 21696 12453 20090 14838
654885 14838 17520 22960 15596 7527 8378 11378 7601 6307 452 -3222 -1283 -137 3551 6385
655739 6385 -4409 -6696 -240 16596 14771 11625 12650 12804 11374 6532 5454 13596 7718 3472
656594 3472 -2927 -2131 8378 13614 123 1202 3853 576 -2700 321 8479 20940 18421 16760
657449 16760 14188 7377 56 8500 8934 11418 8434 13925 17196 11259 1074 1279 -4617 -3660 3739
$$ packed form
651344A1406R46k456M248M187L614n862m497k776K242n580o353o019O39L70P326
652260A435L924M768o835J383L392L135J078R570n458n121m486K304O160k824
653115A2425p005J06O106J026M471K660m136l722j125L221m845P36j886p588O481
654030F925p140k429M102O597j254k811M77J980J3263Q072o086r243P637n252
654885A4838K682N440p364q069Q51L000l777j294n855l674J939J146L688K834
655739F385j0794k287O456J6836j825l146J025J54j430m842j078Q142n878m246
656594C472o399P96J0509N236j3491J079K651l277l276L021Q158J2461k519j661
657449A6760k572o811p321Q444M34K484k984N491L271n937j0185K05n896R57P399
$$ plain form
658364 3739 15386 18089 12885 11762 10390 12593 5599 6310 16296 13475 7112 6478 768 -5772 -3681
659279 -3681 806 -909 -13626 -10367 -1047 1692 -1809 -920 4169 7657 7801 4027 5193 2288 4669
660195 4669 3005 14000 25105 12400 6660 1327 3143 1773 3247 2016 327 -6081 -1460 12662
661049 12662 20656 15460 7578 2339 3914 6252 5761 6745 10842 4601 6209 7706 -4077 -6579
661904 -6579 -9975 -2353 6503 18954 12625 9488 9403 11057 2781 6040 5923 -5382 -5693 1100 486
662820 486 -5373 360 9039 11572 14577 13971 9158 10667 16630 19444 5110 5496 7831 2044 3564
663735 3564 6482 1989 6748 7571 7075 14207 17932 20736 12082 3335 8595 7499 13018 13668 19516
664651 19516 21717 14090 3839 -3062 -3317 111 7178 8292 8944 8904 9670 6693 7592 7092 1459 -5157
$$ packed form
658364C739J1647K703n204j123j372K203o994P11R986k821o363o34n710o540K091
659279c681M487j715j2717L259R320K739l501Q89N089L488J44l774J166k905K381
660195D669j664J0995J1105j2705n740n333J816j370J474j231j689o408M621J4122
661049A2662P994n196p882n239J575K338m91R84M097o241J608J497j1783k502
661904f579l396P622Q856J2451o329l137q5J654q276L259j17j1305l11O793o14
662820D86n859N733Q679K533L005o06m813J509N963K814j4334L86K335n787J520
663735C564K918m493M759Q23m96P132L725K804q654q747N260j096N519O50N848
664651A9516K201p627j0251o901k55L428P067J114O52m0P66k977Q99n00n633o616
$$ plain form
665628 -5157 -2758 1311 473 8281 19712 8011 10125 13671 9403 17559 14421 23499 29810 17229
666482 17229 11294 6413 12687 20803 19647 10435 5072 2504 426 6662 9648 16128 18873 13900
667337 13900 -132 -3714 3511 10065 15815 17513 8961 5212 3130 1765 847 -2921 -9761 -10306
668191 -10306 -6761 -4067 -3498 -12479 -9985 -3354 -4500 2644 86 -6383 -6317 3764 10754 3892 7204
669107 7204 14094 6446 8497 5456 -204 4766 8481 9504 14794 13848 7908 5473 1293 6561 5507
670022 5507 4604 6794 14874 15890 9508 9278 -2681 -2238 2830 4839 -938 -5043 -9659 -3040 -2384
670938 -2384 -930 2133 1350 -3222 -15355 -13256 -3579 3020 8966 6046 6753 5492 3354 7044 3354
671853 3354 -1991 -11171 -15447 -11493 -1214 5033 -13267 -7878 -2980 -1520 783 -5887 -6984 2838
$$ packed form
665628e157K399M069q38P808J1431j1701K114L546m268Q156l138R078O311j2581
666482A7229n935m881O274Q116j156r212n363k568k078O236K986O480K745m973
667337A3900j4032l582P225O554N750J698q552l749k082j365r18l768o840n45
668191a0306L545K694N69q981K494O631j146P144k558o469O6J0081O990o862L312
669107G204O890p648K051l041n660M970L715J023N290r46n940k435m180N268j054
670022E507r03K190Q080J016o382k30j1959M43N068K009n777m105m616O619O56
670938b384J454L063p83m572j2133K099R677O599N946k920P07j261k138L690l690
671853C354n345r180m276L954J0279O247j8300N389M898J460K303o670j097R822
$$ plain form
672708 2838 9868 8767 -1538 2088 10249 7690 5057 8247 -942 -4809 -596 4532 -9739 -7515
673563 -7515 -9356 -2453 6851 3817 3422 5787 7054 2707 -1290 3531 22244 27160 22341 13341
674417 13341 2345 3974 8348 7296 2666 6604 3756 8641 19700 24591 29528 20866 19186 12600
675272 12600 37 6085 10168 6730 11262 12619 10159 -723 592 1519 2762 -177 1483 2363
676126 2363 6079 7864 3777 -1819 2659 15228 21671 19050 8277 -2377 -899 -2944 -2739 -1486
676981 -1486 -3317 -5054 -3041 -651 4173 3109 7961 17189 13231 9945 3115 -3383 -4919 -7189
677835 -7189 -6458 -4048 1019 5517 7304 15313 16266 11844 7275 -1380 357 -6586 -15300 -7083 -7313
678751 -7313 2710 -2952 -3980 2631 780 1720 -6336 -10046 1817 13699 9638 10383 7066 10647
$$ packed form
672708B838P030j101j0305L626Q161k559k633L190r189l867M213N128j4271K224
673563g515j841O903R304l034l95K365J267m347l997M821J8713M916m819r000
674417A3341j0996J629M374j052m630L938k848M885J1059M891M937q662j680o586
675272A2600j2563O048M083l438M532J357k460j0882J315R27J243k939J660Q80
676126B363L716J785m087n596M478J2569O443k621j0773j0654J478k045K05J253
676981a486j831j737K013K390M824j064M852R228l958l286o830o498j536k270
677835g189P31K410N067M498J787Q009R53m422m569q655J737o943q714Q217k30
678751g313J0023n662j028O611j851R40q056l710J1863J1882m061P45l317L581
$$ plain form
679606 10647 9361 10022 11631 14269 9152 -550 4722 6968 402 -2261 4754 -143 -1910 3734
680460 3734 6570 4010 -4571 -7762 -2826 -1373 8499 8781 9268 12086 12000 9301 -2143 3650 9097
681376 9097 14648 22393 20783 13365 12485 4608 9662 9357 4314 4315 4132 -1142 -1564 2163 10938 10137
682352 10137 1806 7066 17245 13599 7918 3172 4873 5731 5153 4236 293 -9643 -8215 -2408 5713
683268 5713 9129 6272 -2140 -2876 3480 4206 9022 9809 10651 12845 15034 1255 758 9408 13092
684184 13092 11824 2264 -5530 -7674 -10664 -10546 -18910 -18701 -6828 1642 6980 8586 10937 18059
685038 18059 17889 9076 1968 5851 4056 -807 -4171 -4070 -1282 -3210 -1803 -1420 4413 6437 9861
685954 9861 2725 -1901 2835 12979 23077 14629 3502 1552 -4709 -4265 3609 12911 18385 20606
$$ packed form
679606A0647j286O61J609K638n117r702N272K246o566k663P015m897j767N644
680460C734K836k560q581l191M936J453R872K82M87K818q6k699j1444N793N447
681376I097N551P745j610p418q80p877N054l05n043Jj83n274m22L727Q775q01
682352A0137q331N260J0179l646n681m746J701Q58n78r17l943r936J428N807Q121
683268E713L416k857q412p36O356P26M816P87Q42K194K189j3779m97Q650L684
684184A3092j268r560p794k144k990J18q364K09J1873Q470N338J606K351P122
685038A8059j70q813p108L883j795m863l364J01K788j928J407L83N833K024L424
685954I861p136m626M736J0144J0098q448j1127j950o261M44P874R302N474K221
$$ plain form
686808 20606 22903 15869 7681 3861 13508 30244 22142 11174 13655 9680 10799 13621 18315 13447
687663 13447 11189 2464 -1597 5543 4878 -1525 7026 7070 8470 7944 7618 10910 6878 13220 9380
688578 9380 8508 3687 5108 13049 11239 6294 7533 9391 9832 9489 20591 12024 2879 7459 10275
689494 10275 9083 5273 3908 2540 3 3445 3617 11815 17222 14579 11270 9128 9584 12399 9539
690409 9539 6362 -4284 1274 5415 -5141 -7321 2862 4503 3082 3279 5360 1921 8047 7929
691264 7929 12177 19879 18457 15300 16023 16526 11733 -34 180 4920 7892 7233 7028 1988 6634
692179 6634 1622 3313 11582 21328 21808 19499 13760 15628 14127 15615 12206 6089 8994 11323 12148
693095 12148 9694 10637 11275 16907 16725 10147 15210 17338 16090 11993 9417 3351 5684 3205 2715
$$ packed form
686808B0606K297p034q188l820R647J6736q102j0968K481l975J119K822M694m868
687663A3447k258q725m061P140o65o403Q551M4J400n26l26L292m032O342l840
688578I380q72m821J421P941j810m945J239J858M41l43J1102q567r145M580K816
689494A0275j192l810j365j368k537L442J72Q198N407k643l309k142M56K815k860
690409I539l177j0646N558M141j0556k180J0183J641j421J97K081l439O126j18
691264G929M248P702j422l157P23N03m793j1767K14M740K972o59k05n040M646
692179F634n012J691Q269R746M80k309n739J868j501J488l409o117K905K329Q25
693095A2148k454R43O38N632j82o578N063K128j248m097k576o066K333k479m90
$$ plain form
694010 2715 1753 2956 4447 -72 -1669 1371 11463 14152 13736 17069 21927 14330 3619 3093 10166
694926 10166 12243 8068 2306 4800 5011 1787 341 5563 13406 1581 -5564 -1586 2324 10045
695781 10045 13347 8280 6419 2004 6617 12638 11599 17133 14148 10109 18006 23193 11500 4613
696635 4613 -3225 -5816 -2183 -1608 -767 11344 14669 6660 6886 4476 7577 8223 11401 7775 7680 12541
697612 12541 8539 7837 10640 7868 9323 9789 12167 4389 7081 20574 21158 14613 13992 5912 5188
698527 5188 1684 3702 9977 12752 5990 11045 13345 13522 4810 8574 11096 20743 14660 1528
699382 1528 5081 1593 4240 336 -5634 3548 4791 -813 -524 1349 6578 20538 19536 15868
700237 15868 7145 4854 8083 12395 13710 15629 21825 19739 11567 14302 11447 2647 -1255 -324
$$ packed form
694010B715r62J203J491m519j597L040J0092K689m16L333M858p597j0711n26P073
694926A0166K077m175n762K494K11l224j446N222P843j1825p145L978L910P721
695781A0045L302n067j861m415M613O021j039N534k985m039P897N187j1693o887
696635D613p838k591L633N75Q41J2111L325q009K26k410L101O46L178l626r5M861
697612A2541m002p02K803k772J455M66K378p778K692J3493N84o545o21q080p24
698527E188l504K018O275K775o762N055K300J77q712L764K522R647o083j3132
699382A528L553l488K647l904n970R182J243n604K89J873N229J3960j002l668
700237A5868q723k291L229M312J315J919O196k086q172K735k855q800l902R31
$$ plain form
701091 -324 -18 -10076 -10385 299 11035 11538 5643 7456 6223 5035 9884 8030 -2397 3037
701946 3037 6951 2372 -3469 80 -1242 5715 15011 20830 18907 13119 4019 -2172 -7267 -1157
702800 -1157 5369 7820 2151 11339 9350 3254 7822 3665 -2337 1031 10568 7474 1427 -34
703655 -34 -1821 2371 8142 9144 6830 -7568 -6341 3233 5795 9406 11200 14516 21090 23624 15887
704570 15887 4291 -1461 3602 8854 14323 5881 6206 7400 12220 15033 9112 7221 11815 16687
705425 16687 13649 11062 15685 15658 23217 34362 24727 15876 15333 11233 21542 15306 -666 -6366
706279 -6366 3638 11892 6358 6451 17052 14996 6876 5208 9466 7164 2161 9135 7388 9942
707134 9942 9953 3760 5060 6348 3353 6096 18321 16800 16316 9052 13957 18941 26242 19098 14540
$$ packed form
701091c24L06j0058l09J0684J0736N03n895J813j233j188M849j854j0427N434
701946C037L914m579n841L549j322O957R296N819j923n788r100o191n095O110
702800a157O526K451n669R188j989o096M568m157o002L368R537l094o047j461
703655c4j787M192N771J002k314j4398J227R574K562L611J794L316O574K534p737
704570A5887j1596n752N063N252N469q442L25J194M820K813n921j891M594M872
705425A6687l038k587M623k7P559J1145r635q851n43m100J0309o236j5972n700
706279f366J0004Q254n534R3J0601k056q120j668M258k302n003O974j747K554
707134I942J1o193J300J288k995K743J2225j521m84p264M905M984P301p144m558
$$ plain form
708049 14540 13827 6818 5604 623 6600 16742 26076 19941 20247 10842 1630 9565 13187 9583
708904 9583 8823 20278 21144 11954 9309 13881 5425 5471 1477 -244 7913 7061 4556 5315 14965 16301
709881 16301 13399 14008 9404 4807 4358 9284 12405 8296 4248 -2147 -1432 716 318 6973 8619
710796 8619 6045 498 4480 8487 4872 11241 14070 6697 1990 -4211 -5327 1374 5477 1738
711651 1738 5639 4858 7565 3832 4331 3889 8497 6505 10164 9805 3457 4215 5881 15189 12754 10270
712628 10270 6595 5051 -2427 182 226 -3187 1371 7021 14897 9127 585 -557 2462 10597 16312
713543 16312 6836 6017 7025 11676 20964 16827 15145 19155 10075 1253 7710 12321 10763 8856
714398 8856 482 278 8684 3516 -556 3695 9694 2752 -4107 1683 11472 3167 1878 12512
$$ packed form
708049A4540p13p009j214m981N977J0142R334o135L06r405r212P935L622l604
708904I583p60J1455Q66r190k645M572q456M6l994j721Q157q52k505P59R650J336
709881A6301k902O09m604m597m49M926L121m109m048o395P15K148l98O655J646
710796H619k574n547L982M007l615O369K829p373m707o201j116O701M103l739
711651A738L901p81K707l733M99m42M608j992L659l59o348P58J666R308k435k484
712628A0270l675j544p478K609M4l413M558N650P876n770q542j142L019Q135N715
713543A6312r476q19J008M651R288m137j682M010r080q822O457M611j558j907
714398H856q374k04Q406n168m072M251N999o942o859N790R789q305j289J0634
$$ plain form
715252 12512 11418 1894 7307 8149 2714 6236 8533 4899 3340 -2562 -3840 -5374 -2896 -8659
716107 -8659 -9322 -2850 -1470 1777 3298 14675 12123 9486 13876 9216 3764 7593 5891 6108 11663
717022 11663 12400 17279 19114 18755 15306 5928 4675 3232 4045 3082 6558 3034 -2452 4440 3731
717938 3731 7051 10084 9258 3971 4098 11483 2184 -8928 -2012 -7530 -4702 1406 545 10975 14470
718853 14470 4556 2346 8397 4833 -3735 -5170 -2132 9585 20525 10287 12714 8411 8079 15313
719708 15313 20254 15620 9118 8256 17354 17492 8819 9720 7991 6549 1040 395 3872 5046 -79
720623 -79 5488 3135 -2740 7810 6669 10910 14977 11164 9240 10708 9416 8728 7684 4660 5781
721539 5781 -4877 -8668 -6493 -994 11548 13623 11402 10822 9635 8876 701 708 8536 1466 4037
$$ packed form
715252A2512j094r524N413Q42n435L522K297l634j559n902j278j534K478n763
716107h659o63O472J380L247J521J1377k552k637M390m660n452L829j702K17N555
717022A1663P37M879J835l59l449r378j253j443Q13r63L476l524n486O892p09
717938C731L320L033q26n287J27P385r299j1112O916n518K828O108q61J0430L495
718853A4470r914k210O051l564q568j435L038J1717J0940j0238K427m303l32P234
719708A5313M941m634o502q62R098J38q673R01j729j442n509o45L477J174n125
720623g9N567k353n875J0550j141M241M067l813j924J468j292o88j044l024J121
721539E781j0658l791K175N499J2542K075k221n80j187p59q175PP828p070K571
$$ plain form
722455 4037 4368 6989 15574 7954 4171 -3061 1941 -11882 -8935 -6046 -362 6421 8933 10621
723309 10621 13052 17701 18024 12629 7827 9658 9981 20391 19702 23381 27137 28871 28018 21770 7497
724225 7497 8331 14999 9951 7173 6687 5756 7083 9321 10437 7754 6678 10693 11015 13317 8012
725140 8012 8631 8504 6807 13259 19448 22741 18674 12375 8704 8238 6234 -955 5868 6937 -366
726056 -366 9774 17926 17294 11695 6330 5177 3761 4031 7104 1536 10506 22547 14776 964
726910 964 5583 14798 10044 110 4555 9442 6121 1051 -5092 5851 15422 13718 5556 5529 -1797
727826 -1797 1747 8637 19318 16981 10379 7087 3006 1193 1420 7677 7891 9531 12760 13342 17142
728742 17142 15151 15905 18459 12574 19129 19463 28303 28875 21644 19079 18033 14180 21927 16710 7993
$$ packed form
722455D037L31K621Q585p620l783p232N002j3823K947K889N684O783K512J688
723309A0621K431M649L23n395m802J831L23J0410o89L679L756J734q53o248j4273
724225G497Q34O668n048k778m86r31J327K238J116k683j076M015L22K302n305
725140H012O19j27j697O452O189L293m067o299l671m66k004p189O823J069p303
726056c66J0140Q152o32n599n365j153j416K70L073n568Q970J2041p771j3812
726910I64M619R215m754r934M445M887l321n070o143J0943R571j704q162k7p326
727826a797L544O890J0681k337o602l292m081j813K27O257K14J640L229N82L800
728742A7142j991P54K554n885O555L34Q840N72p231k565j046l853P747n217q717
$$ plain form
729657 7993 -3037 6807 8178 5580 1080 -5113 -5607 -8337 -5230 -4122 -70 7295 6290 3943
730512 3943 9918 5825 2382 9249 12408 31466 16207 9090 9702 11794 14446 12668 9482 8663
731366 8663 -155 -1494 11133 12579 12448 12181 17721 10004 6742 13419 12501 13729 18751 19733 17851
732282 17851 11287 -4168 -4158 7991 14618 11253 13241 19760 14638 2576 6308 15362 23599 23249
733137 23249 13750 14408 15470 5803 -214 2273 7619 9173 7549 12834 14291 7007 3266 8406
733991 8406 3292 3708 3123 2463 -9787 -13729 -5809 6108 212 -8504 -5281 -2157 9315 9056 -49
734907 -49 -27 7183 13865 9284 1558 7876 7952 10445 13360 7202 4492 6245 3649 4483 -3244 745
735883 745 13334 8389 11773 14703 8032 8816 -497 -3369 2560 7905 215 -1697 11599 14265
$$ packed form
729657G993j1030R844J371k598m500o193m94k730L107J108M052P365j005k347
730512C943N975m093l443O867L159J9058j5259p117O12K092K652j778l186q19
731366H663q818j339J2627J446j31k67N540p717l262O677r18J228N022R82j882
732282A7851o564j5455J0J2149O627l365J988O519n122j2062L732R054Q237l50
733137B3249r499O58J062r667o017K487N346J554j624N285J457p284l741N140
733991H406n114M16n85o60j2250l942P920J1917n896q716L223L124J1472k59r105
734907d9K2P210O682m581p726O318P6K493K915o158k710J753k596Q34p727L989
735883G45J2589m945L384K930o671P84r313k872N929N345p690j912J3296K666
$$ plain form
736738 14265 8820 1339 -445 4162 11584 20195 12511 4137 8889 11889 13265 16713 14076 1791
737592 1791 6815 14794 14527 12596 7910 -1256 -4595 -2501 8325 10695 11316 8815 8786 16104 18730
738508 18730 8567 4582 6473 2446 -1678 6470 15344 14851 14731 13801 12955 6869 9145 8090 3850
739424 3850 6500 13766 18472 17381 10004 -586 3491 4106 4386 6984 14858 19413 12671 4366 7440
740339 7440 2420 7428 10426 10972 10215 9328 8540 10036 11905 17215 19916 12180 7323 878 3781
741255 3781 9911 11587 11112 14428 20219 13741 10886 805 -6336 -5638 -5330 -1587 4597 11077 21361
742170 21361 21398 14355 8909 3306 7310 12121 10264 9467 7360 5887 5778 3832 -3517 -3032 2344
743086 2344 2372 -7228 -4150 -4742 -33 1154 3407 -412 2602 7709 6483 10037 6756 7026 1011
$$ packed form
736738A4265n445p481j784M607P422Q611p684q374M752L000J376L448k637j2285
737592A791N024P979k67j931m686r166l339K094J0826K370O21k501k9P318K626
738508A8730j0163l985J891m027m124Q148Q874m93j20r30q46o086K276j055m240
739424C850K650P266M706j091p377j0590M077O15K80K598P874M555o742q305L074
740339G440n020N008K998N46p57q87p88J496J869N310K701p736m857o445K903
741255C781O130J676m75L316N791o478k855j0081p141O98L08L743O184O480J0284
742170B1361L7p043n446n603M004M811j857p97k107j473j09j946p349M85N376
743086B344K8r600L078n92M709J187K253l819L014N107j226L554l281K70o015
$$ plain form
744001 1011 226 -4303 -2422 3172 13503 1236 782 -419 2896 4834 10497 9117 5379 284
744856 284 -3041 8403 6726 6472 6219 13185 13367 8587 485 6130 12076 18679 17134 10880 2579
745772 2579 -2174 8186 10887 12205 7297 7337 8823 3694 -2817 -1055 7904 13987 16180 12118 12473
746687 12473 7589 -1147 -2859 -4500 3123 6968 5899 9764 1088 -4408 -1197 5760 8954 17283
747542 17283 25771 21858 21975 7756 -3472 -318 675 1749 5982 6848 1994 5273 7502 12948
748396 12948 7149 3197 4822 7706 9141 11731 7718 2524 15167 17379 10039 5537 8463 10170
749251 10170 10181 -3341 4502 14126 10189 12922 6932 6725 7440 14057 4159 2238 2874 9311 5880
750166 5880 6567 8413 7520 18432 22178 16291 9694 6297 -1637 -831 622 8129 15652 14238 6048
$$ packed form
744001A011p85m529J881N594J0331j2267m54j201L315J938N663j380l738n095
744856B84l325J1444j677k54k53O966J82m780q102N645N946O603j545o254q301
745772B579m753J0360K701J318m908M0J486n129o511J762Q959O083K193m062L55
746687A2473m884q736j712j641P623L845j069L865q676n496L211O957L194Q329
747542A7283Q488l913J17j4219j1228L154R93J074M233Q66m854L279K229N446
748396A2948n799l952J625K884J435K590m013n194J2643K212p340m502K926J707
749251A0170J1j3522P843R624l937K733n990k07P15O617r898j921O36O437l431
750166E880O87J846q93J0912L746n887o597l397p934Q06J453P507P523j414q190
$$ plain form
751082 6048 2468 8999 12552 13863 22141 22968 10477 6784 -1908 -7523 -3680 -670 -218 4899 6892
751997 6892 4933 191 2313 7651 6493 4569 6564 10151 4908 -359 263 -6797 -6480 709 4207
752913 4207 3743 8294 5783 4806 5931 4001 3955 3232 918 2982 4932 842 -4952 -900 7427 2052
753890 2052 512 1313 -1011 2734 -1188 -4377 -6282 -10570 -8071 3906 11820 14951 11724 4562
754744 4562 3931 11877 13650 10191 7368 4387 1333 6660 7837 9467 2094 4702 7977 14185 -990
755660 -990 1031 5932 2113 2786 8177 9816 12931 15056 18086 14441 16771 14943 10963 7057 2490
756576 2490 -3568 -2383 -3315 -771 5476 9211 3195 -1007 2395 9794 8758 10378 7869 -2479
757430 -2479 -7921 -3275 2975 9970 13211 10662 9909 9114 11808 14748 11604 17391 15891 3603 1873
$$ packed form
751082F048l580O531L553J311Q278Q27j2491l693q692n615L843L010M52N117J993
751997F892j959m742K122N338j158j924J995L587n243n267O22p060L17P189L498
752913D207m64M551k511r77J125j930m6p23k314K064J950m090n794M052Q327n375
753890B052j540Q01k324L745l922l189j905m288K499J1977P914L131l227p162
754744D562o31P946J773l459k823k981l054N327J177J630p373K608L275O208j5175
755660i90K021M901l819O73N391J639L115K125L030l645K330j828l980l906m567
756576B490o058J185r32K544O247L735o016m202L402P399j036J620k509j0348
757430b479n442M646O250O995L241k549p53p95K694K940l144N787j500j2288j730
$$ plain form
758346 1873 -371 -7531 -3677 -2863 4344 7168 11914 15436 10668 1927 469 4964 5166 4955 5269
759261 5269 831 -2167 -908 -549 5393 5063 10916 8988 4838 4656 6405 6490 11425 15873 12453 4954
760238 4954 2838 4554 15535 17259 8090 7696 7390 12455 10746 5322 5109 10818 15788 12774 6699
761153 6699 5985 14388 15279 11621 1778 -349 1426 8539 7945 3875 6064 14644 8029 6950 18689
762069 18689 11808 4431 3639 11992 6811 -259 716 7753 6446 4870 -33 6114 2956 7742 14027
762984 14027 10092 13246 9298 1431 5160 13527 11563 11266 6984 6427 2711 6547 3951 -3625 4318
763900 4318 11703 14520 4242 -7632 -7705 -1585 6966 4390 -4696 -3934 -4187 -1112 3654 10392 8586
764816 8586 2979 5393 3310 8724 3937 1259 4632 6607 6589 4177 2222 -6012 -936 2145 -546
$$ packed form
758346A873k244p160L854Q14P207K824M746L522m768q741j458M495K02k11L14
759261E269m438k998J259L59N942l30N853j928m150j82J749Q5M935M448l420p499
760238D954k116J716J0981J724r169l94l06N065j709n424k13N709M970l014o075
761153F699p14Q403Q91l658r843k127J775P113n94m070K189Q580o615j079J1739
762069A8689o881p377p92Q353n181p070R75P037j307j576m903O147l158M786O285
762984A4027l935L154l948p867L729Q367j964k97m282n57l716L836k596p576P943
763900D318P385K817j0278j1874p3O120Q551k576r086P62k53L075M766O738j806
764816H586n607K414k083N414m787k678L373J975j8k412j955q234N076L081k691
$$ plain form
765731 -546 1073 -2740 2321 456 7106 12685 2267 7438 4469 3346 735 -913 -3114 -4637
766586 -4637 -5066 -5793 2546 11355 12561 16338 10092 8912 1409 2203 7366 12150 8984 7822 13298
767501 13298 17057 8277 5187 10752 4963 3021 197 3627 4436 10371 16928 21275 18296 7193
768356 7193 10302 16656 15349 22775 11521 1964 10524 12538 12688 10744 13041 11559 7022 4851
769210 4851 -2675 5278 16680 13999 19460 29105 22369 13267 2753 10176 16902 13918 4926 5391
770065 5391 6904 5477 4379 12954 28692 21651 10335 9112 2310 1524 4233 8669 -650 -2261
770920 -2261 -600 264 9738 21904 8391 4718 4442 2769 4225 -2744 -7119 -6861 -5089 11659
771774 11659 16219 13744 7219 -2893 525 4427 9960 10654 6604 4098 520 -13479 -12062 -2357
$$ packed form
765731e46J619l813N061j865O650N579j0418N171k969j123k611j648k201j523
766586d637m29p27Q339Q809J206L777o246j180p503P94N163M784l166j162N476
767501A3298L759q780l090N565n789j942k824L430Q09N935O557M347k979j1103
768356G193L109O354j307P426j1254r557Q560K014J50j944K297j482m537k171
769210D851p526P953J1402k681N461R645o736r102j0514P423O726k984q992M65
770065E391J513j427j098Q575J5738p041j1316j223o802p86K709M436r319j611
770920b261J661Q64R474J2166j3513l673k76j673J456o969m375K58J772J6748
771774A1659M560k475o525j0112L418L902N533O94m050k506l578j3999J417R705
$$ plain form
772629 -2357 11487 12448 2093 -2251 1631 3478 2063 -4601 -8106 -7373 -823 11490 13103 9809
773483 9809 1856 -3974 -2734 6020 9701 7681 10702 17304 16521 14013 10866 6490 4768 10163 6307
774399 6307 1744 -588 -931 3274 1312 7834 10663 12870 13066 6674 -5274 -5050 -3827 -2016 -2453
775314 -2453 608 2135 8484 9605 13649 13016 4975 1749 6083 9588 10644 9451 -745 -2077
776169 -2077 -5548 3611 5745 6282 10665 4230 2177 12061 10079 13999 10478 6852 11705 4160 12652
777085 12652 10246 5372 749 5179 6112 4593 -2631 267 -3246 2676 7407 14440 12103 421
777939 421 1414 -3235 -134 -353 1158 -3652 -7901 -5678 -4640 -4086 -203 -1875 -552 2949 6016
778855 6016 -3715 -6726 3154 6690 9589 471 2221 11182 14812 11596 15869 15893 16646 -4331 -8330
$$ packed form
772629b357J3844R61j0355m344L882J847j415o664l505P33O550J2313J613l294
773483I809p953n830J240Q754L681k020L021O602p83k508l147m376j722N395l856
774399F307m563k332l43M205j962O522K829K207J96o392j1948K24J223J811m37
775314b453L061J527O349J121M044o33q041l226M334L505J056j193j0196j332
776169b077l471R159K134N37M383o435k053R884j982L920l521l626M853p545Q492
777085A2652k406m874m623M430R33j519p224K898l513N922M731P033k337j1682
777939D21R93m649L101k19J511m810m249K223J038N54L883j672J323L501L067
778855F016r731l011R880L536K899r118J750Q961L630l216M273K4P53k0977l999
$$ plain form
779770 -8330 3197 11904 8552 7848 12108 13626 10173 14725 14083 734 -7492 -1064 7675 3555
780625 3555 11637 11572 11158 5246 12559 18698 15448 5705 6630 9284 11643 8171 3127 3495 6061 9580
781601 9580 8853 7823 13801 16358 9159 5065 -2645 -5361 -6034 -7386 1319 6370 12164 11488 5883
782517 5883 7765 13761 9873 7463 11640 4304 -218 8123 12294 12463 9245 15013 13279 5981 1399
783433 1399 -2553 -79 6933 -3048 -5888 2726 11474 7895 8036 5716 9622 4233 -2617 2686 347
784348 347 -6637 -6933 -4669 -3170 7651 10382 12547 8035 840 -3566 2511 -698 1679 -3602 3506
785264 3506 4846 6941 -5817 -8021 -6984 -9829 -5937 -6423 -7541 -11508 -5658 -1346 2543 10164
786118 10164 17986 21288 25311 18977 16974 5969 734 5650 6231 16582 14504 19095 11386 4041
$$ packed form
779770h330J1527Q707l352p04M260J518l453M552o42j3349q226O428Q739m120
780625C555Q082o5m14n912P313O139l250r743R25K654K359l472n044L68K566L519
781601I580p27j030N978K557p199m094p710k716o73j352Q705N051N794o76n605
782517E883J882N996l888k410M177p336m522Q341M171J69l218N768j734p298m582
783433A399l952K474P012r981k840Q614Q748l579J41k320L906n389o850N303k339
784348C47o984k96K264J499J0821K731K165m512p195m406O077l209K377n281P108
785264C506J340K095j2758k204J037k845L892m86j118l967N850M312L889P621
786118A0164P822L302M023o334k003j1005n235M916N81J0351k078M591p709p345
$$ plain form
786973 4041 7078 2742 2146 8457 4431 3488 2263 3150 9124 2463 597 7260 12462 13343 2377
787888 2377 4368 5609 3870 -3851 421 12299 9960 4600 -6417 -1072 1525 450 -3777 -3732
788743 -3732 6481 16231 12077 12812 13619 14561 18670 5873 7984 16981 42381 72266 65927 57572
789597 57572 56861 51723 43903 42573 43659 39383 31714 23767 21308 15871 16197 16263 12136 8221 12875
790513 12875 15947 19054 21057 24893 16474 17783 19104 13757 17052 17627 21449 12303 8436 11147
791367 11147 22781 19475 15536 16327 15521 9236 3647 -246 11320 4153 -866 10973 11922 13506
792222 13506 13295 7377 2675 613 -143 8125 8886 5731 8978 4061 -984 3865 3972 8316 13536
793138 13536 15287 12495 12293 8069 14293 19102 22958 15445 9149 -802 -4002 5511 5122 314 3012
$$ packed form
786973D041L037m336n96O311m026r43j225Q87N974o661j866O663N202Q81j0966
787888B377J991J241j739p721M272J1878k339n360j1017N345K597j075m227M5
788743c732J0213R750m154P35Q07R42M109j2797K111Q997K5400K9885o339q355
789597E7572p11n138p820j330J086m276p669p947k459n437L26O6m127l915M654
790513A2875L072L107K003L836q419J309J321n347L295N75L822r146l867K711
791367A1147J1634l306l939P91q06o285n589l893J1566p167n019J1839R49J584
792222A3506k11n918m702k062p56Q268P61l155L247m917n045M849J07M344N220
793138A3536J751k792k02m224O224M809L856p513o296r951l200R513l89m808K698
$$ plain form
794053 3012 -3103 -6602 3847 11523 12576 10350 6624 299 -5057 -5108 293 6000 6887 3740 12339
794969 12339 16220 15173 10970 6067 639 12103 14851 15169 11911 13238 13007 6438 -144 2566
795823 2566 5360 1969 -1378 5424 2418 6588 7849 2918 5741 2009 2787 970 5747 11012 9796
796739 9796 7108 5274 3079 5018 4700 8929 2371 786 7521 9620 -1875 -2053 -1539 4631 8539
797655 8539 14733 9887 10833 11749 13305 7586 4200 7826 13667 8744 9722 8365 13398 10802 2731
798570 2731 3175 3843 -1034 14 6419 3944 9688 12484 12945 9380 1785 5062 10842 9528 4706
799486 4706 4411 1937 1266 5350 11813 14961 10009 16138 12911 3754 939 -2956 -5734 -4298 1825
800401 1825 5048 2907 3955 15502 15148 8245 9068 9242 9199 10175 8123 -480 -180 -4459 -2402 12109
$$ packed form
794053C012o115l499J0449P676J053k226l726o325n356n1N401N707Q87l147Q599
794969A2339L881j047m203m903n428J1464K748L18l258J327k31o569o582K710
795823B566K794l391l347O802l006M170J261m931K823l732P78j817M777N265j216
796739I796k688j834k195J939l18M229o558j585O735K099j1495j78N14O170L908
797655H539O194m846R46R16J556n719l386L626N841m923R78j357N033k596q071
798570B731M44O68m877J048O405k475N744K796M61l565p595L277N780j314m822
799486D706k95k474o71M084O463L148m952O129l227r157k815l895k778J436O123
800401A825L223k141J048J1547l54o903Q23J74m3R76k052q603L00m279K057J4511
$$ plain form
801378 12109 19113 -302 -5308 -2144 -993 11985 8626 12043 11241 17228 16094 8304 9168 7965
802232 7965 2221 1428 -750 2256 7581 10780 1775 6926 6470 1073 -2069 5109 10316 13033 13882
803148 13882 11262 14148 14757 8429 7396 6383 2371 4004 9098 5651 2949 -2189 -10325 -779
804003 -779 1528 -3381 -2841 6756 7398 3987 4876 10145 11092 11348 11636 11918 4866 9602 4607 -8353
804979 -8353 -1231 9539 9725 4737 8092 9697 14023 9480 -1274 3835 581 3178 -5485 -9737
805834 -9737 -8168 -6404 1589 2593 5428 -3570 -9979 -7523 2962 10953 17399 18502 11201 8819
806688 8819 11044 6799 7280 11862 11819 4517 1066 12542 10823 9210 2323 8054 11839 13891 8293
807604 8293 6112 2377 -3095 -14375 -12164 2336 7548 6144 7946 7823 10841 7494 6023 9866
$$ packed form
801378A2109P004j9415n006L164J151J2978l359L417q02N987j134p790Q64j203
802232G965n744p93k178L006N325L199r005N151m56n397l142P178N207K717Q49
803148A3882k620K886O09o328j033j013m012J633N094l447k702n138q136R546
804003g79K307m909N40R597O42l411Q89N269R47K56K88K82p052M736m995j2960
804979h353P122J0770J86m988L355J605M326m543j0754N109l254K597q663m252
805834i737J569J764P993J004K835q998o409K456J0485P991O446J103p301k382
806688H819K225m245M81M582m3p302l451J1476j719j613o887N731L785K052n598
807604H293k181l735n472j1280K211J4500N212j404J802j23L018l347j471L843
$$ plain form
808458 9866 13264 6258 6535 14509 15146 13905 5534 11164 6993 1908 9297 11200 10570 10304 5193
809374 5193 6592 4446 -2095 -1541 5707 9661 9339 12158 26132 32507 18802 10998 16925 10176
810229 10176 -5355 -5497 -4074 -782 -1787 -1025 1223 9409 7456 6964 5610 6340 4565 -5366 3723
811144 3723 9694 10953 13665 10243 3463 3048 2927 4299 15301 21185 6188 -2590 295 9746
811999 9746 13680 9680 12804 7137 -4890 -5287 958 3714 15686 17451 7501 2266 791 2201
812853 2201 1765 2942 18958 26914 24520 17281 5446 7500 8245 9217 9412 11113 8130 -408 1026
813769 1026 1777 -1546 -167 8859 4831 -413 4442 8294 6326 9738 7025 5713 14317 6880 14732
814684 14732 11515 7788 -1104 -1998 -432 11325 21902 17034 13123 12567 5082 5831 11345 11295 11345
$$ packed form
808458I866L398p006K77P974O37j241q371N630m171n085P389J903o30k66n111
809374E193J399k146o541N54P248L954l22K819J3974O375j3705p804N927o749
810229A0176j5531j42J423L292j005P62K248Q186j953m92j354P30j775r931R089
811144C723N971J259K712l422o780m15j21J372J1002N884j4997q778K885R451
811999I746L934m000L124n667j2027l97O245K756J1972J765r950n235j475J410
812853B201m36J177J6016P956k394p239j1835K054P45R72J95J701k983q538J434
813769A026P51l323J379R026m028n244M855L852j968L412k713j312Q604p437P852
814684A4732l217l727q892q94J566J1757J0577m868l911n56p485P49N514n0N0
$$ plain form
815600 11345 12447 7498 11254 9305 6630 2041 5481 13186 1228 -1275 -1138 -3443 -8077 -1429
816455 -1429 3134 -2701 -3137 -1999 4280 14549 7376 363 3768 1853 -2325 2590 -178 -7725
817309 -7725 -20 7803 3328 8353 9771 14276 24536 26973 20207 14520 6700 8123 9330 9930
$$ packed form
815600A1345J102m949L756j949k675m589L440P705j1958k503J37k305m634O648
816455a429M563n835m36J138O279J0269p173p013L405j915m178M915k768p547
817309g725P705P823m475N025J418M505J0260K437o766n687p820J423J207O00
$$ [...]
##END=
