##TITLE=Unknown
##JCAMP-DX= 5.00 $$From Command Line Converter 1.0
##DATA TYPE= NMR Spectrum
##DATA CLASS=  XYDATA

##ORIGIN= Exported from Command Line Converter 1.0
##OWNER= SVB
##$URL= http://wwwchem.uwimona.edu.jm:1104/software/jcampdx.html
##SPECTROMETER/DATA SYSTEM= NUTS EXPORT
##.OBSERVE FREQUENCY= 75.480980
##.OBSERVE NUCLEUS= 13C
##INSTRUMENTAL PARAMETERS= 13C
##XUNITS= PPM
##YUNITS= ARBITRARY UNITS
##XFACTOR= 0.0002649675
##YFACTOR= 46.0253490000
##FIRSTX= -17.968720
##FIRSTY= 17390.000000
##LASTX= 246.998700
##NPOINTS= 16384
##MAXY= 45780244.000000
##MINY= -245105.000000
##DELTAX=   0.016173
##XYDATA= (X++(Y..Y))
-67815C77k34L53n12n25k35J030m92k89O28j13n10n78J517L40M19j373p98j370
-66717b365r11J860q02j748O02J394J963J156o65o0J073j575K07K81n44r18k83
-65679a335Q68Q42k27R34j043l94P47p70p97J089J338n67k68r34n49M35K01r31
-64580a361L03J20l45l27l96p56l23M33J280k52r64O88N67J80P36N30J72j368
-63482a083j04j9R87M39O43j27j30r75M72j576k560K552J266l8j434r12k77Q30
-62383b046j745j535J337M82N25P86P89L22L70m3J564j68l37j226Nj178L14K3
-61284a761J04K44Q74O13q76j326n62k86K107J241j19p64j526M31L67J23Q73M9
-60186a94R55j023J01o75J95M2p94P21J716l42j634l72k24J047k00m42J896k73
$$ plain form
-67815 377 143 496 -16 -541 -776 254 -238 -527 101 -12 -522 -1100 417 757 1176 -197 -995 -2365
-66717 -2365 -3276 -1416 -2218 -3966 -3364 -1970 -7 1149 484 424 1497 -78 129 410 -134 -1052 -1335
-65679 -1335 -467 375 148 1082 39 -355 392 -378 -1175 -86 1252 685 417 -517 -1066 -631 -430 -1361
-64580 -1361 -1058 -938 -1283 -1610 -2006 -2762 -3085 -2652 -1372 -1624 -2588 -1900 -1333 -1153 -417 113 285 -1083
-63482 -1083 -1187 -1206 -219 220 863 736 606 -369 103 -1473 -4033 -1481 -215 -253 -1687 -2599 -2876 -2046
-62383 -2046 -3791 -5326 -3989 -3507 -2982 -2196 -1407 -1085 -715 -758 806 638 301 -925 -920 -2098 -1784 -1761
-61284 -1761 -1657 -1413 -539 74 -802 -2128 -2690 -2976 -869 372 253 -511 -2037 -1606 -1239 -1116 -243 -194
-60186 -194 761 -262 -161 -836 -641 -599 -1393 -672 1044 702 -932 -1304 -1528 -481 -681 -1123 773 500
-59087E00n37j268M48n84J073R14M85K45q97n49J246J554k015n90l66L70j265
-58049a236k036J082K010J442P24k96n15j242p88m18j108L06l1O71K92m32p04
-57012b279M97j13l45J86O1j383K215J610R59j155j953L28M8j031n8J551L97o21
-55913a086j073p32l5J87M80J159P25j4P73J484j341L46q35K34j99r93J4j902
-54814b808O37Q03K79n07l19n38J696R74J44r49L72J92j156r90K76q7j18Q27J109
-53655a63M66l35q23J127N61j057n37p3K66Q66j814q78K34K033m16L0n64R39k95
-52495d33k064j044j471J790L375p08k7r78n02K34Q5L37K32j287j19N07K067J737
-51396A731l96o93j501k622O11J199l9q78J336K81J078O74j71k99N06Q3n01r49
$$ plain form
-59087 500 -37 -1305 -857 -1441 -368 546 1031 1276 379 -170 1076 2630 615 25 -341 29 -1236
-58049 -1236 -3272 -2190 -180 1262 1986 1690 1175 -67 -855 -1273 -2381 -2075 -2106 -1435 -1143 -1575 -2279
-57012 -2279 -1782 -1895 -2240 -2054 -1993 -3376 -1161 449 1408 253 -1700 -1372 -1324 -2355 -2413 -862 -465 -1086
-55913 -1086 -2159 -2891 -2926 -2739 -2259 -1100 -375 -389 384 1868 527 873 38 272 73 -920 -906 -2808
-54814 -2808 -2171 -1368 -1089 -1596 -1915 -2453 -757 217 361 -588 -216 -24 -1180 -2170 -1894 -1981 -2099 -1272 -163
-53655 -163 303 -32 -855 272 833 -224 -761 -834 -568 298 -1516 -2394 -2160 -127 -543 -513 -1077 -138 -433
-52495 -433 -2497 -3541 -5012 -3222 153 -555 -582 -1560 -2062 -1828 -1743 -1406 -1174 -2461 -2580 -2073 -6 1731
-51396 1731 1335 642 -859 -3481 -2870 -1671 -1710 -2588 -1252 -971 107 781 610 311 817 900 399 -550
-50297e50J262r27q34n05k52J027j62M29M03j67Q85o01J04P48j085j7l0J226l36
-49138F18j016k76Q34N12j361j491M53J344M02K48j544n94r5l09Q69p76k138N30
-48039c790J969K208M35m27J72L61q93L22j79p3j092k168J680K205j222L49K65
-47001A22q02j019n40j0j56O62m34J205R46k62q34j07J47j582P50J547J757j465
-45902g5q54j82p6L08j419J275n47o45J232N74n59j298l30P37R34k01k09p6J143
-44743b68k16p19J024n55M88R8q33l75l72K60P43JQ37k04Qm44l64P92j335R10
-43522e24o84q90P9q12p59L74N77O80P19J419m73R91j722m64o48O72j037j93l82
-42362c077J483Q66p28k51J336j35o53N02M30q82k3l95j82r87N36N51m43J202
$$ plain form
-50297 -550 712 -215 -1049 -1554 -1806 -779 -941 -512 -109 -276 609 8 112 860 -225 -242 -272 954 618
-49138 618 -398 -674 160 672 -689 -2180 -1727 -383 19 267 -1277 -1871 -1966 -2275 -1406 -2182 -4320 -3790
-48039 -3790 -1821 387 822 395 567 928 35 357 178 105 -987 -3155 -1475 730 -492 -143 122
-47001 122 -680 -1699 -2239 -2249 -2405 -1743 -2177 -972 -26 -288 -1122 -1229 -1082 -2664 -1914 -367 1390 -75
-45902 -75 -929 -1111 -1187 -879 -2298 -1023 -1570 -2215 -983 -409 -968 -2266 -2596 -1859 -925 -1126 -1335 -1411 -268
-44743 -268 -484 -1203 -179 -734 -246 -148 -981 -1356 -1728 -1468 -725 -724 113 -91 -83 -527 -891 -99 -1434 -524
-43522 -524 -1208 -2098 -2019 -2831 -3590 -3216 -2639 -1959 -1240 179 -294 697 -1025 -1489 -2137 -1465 -2502 -2695 -3077
-42362 -3077 -1594 -728 -1456 -1707 -371 -506 -1159 -657 -227 -1109 -1132 -1527 -1709 -2696 -2160 -1609 -2052 -850
-41264h50J722j174j373L14l66J43P3J2J920n56j14p96j05J103J119Q32J273j299
-40165A878o75j900m53O33N72J72o11K23P70p79p29n19j96O93p75m42J34p15K
-39005b717j084K43Q38J076p92N8M59K08j138J946K91j322m37M42J250N43k91
-37967d27J166J106j445M42j120l73m90r36K65J655q27m00o3p58o60J79K092n23
-36869a117J38M59L69q67j472N78J19N23J653j24p10J579p19j929j702o08J090
-35831b740J082j553q64L054N11o36j42l06J397K94o55J439k40j043l22J82j048
-34793a590j362J458Q87oq1M49n5j775p34J168J948J460m59O05j078o71J114K62
-33695A540j806p8P10l37J49q65J24m33k558j00R01J371j41q39j85J558O57l77
$$ plain form
-41264 -850 872 -302 -1675 -1361 -1727 -1584 -1511 -1499 421 -135 -249 -1045 -1150 -47 1072 1904 3177 1878
-40165 1878 1203 -697 -1150 -517 55 227 -384 -161 609 -170 -899 -1418 -1614 -921 -1696 -2138 -2004 -2719 -2717
-39005 -2717 -3801 -3558 -2720 -1644 -2436 -2378 -1919 -1711 -2849 -903 -612 -1934 -2371 -1929 -679 -136 -427
-37967 -427 739 1845 400 842 -278 -651 -1141 -2077 -1812 -157 -984 -1384 -1447 -2205 -2865 -2686 -594 -1117
-36869 -1117 -979 -520 -151 -1018 -2490 -1912 -1793 -1270 383 259 -451 1128 409 -1520 -3222 -3830 -2740
-35831 -2740 -1658 -3211 -4075 -1021 -510 -1146 -1288 -1594 -197 97 -558 881 641 -402 -724 -542 -1590
-34793 -1590 -2952 -1494 -607 -613 -694 -245 -300 -2075 -2809 -1641 307 1767 1308 1913 835 164 1278 1540
-33695 1540 -266 -344 366 29 178 -687 -563 -996 -3554 -3654 -2753 -1382 -1523 -2362 -2547 -989 -332 -709
-32596g09r19L90J679k19m27j82L01m19J31j552j069K254N28J87L25j471K51O15
-31497c06K87j196L61M40n48R17R1m19p26O66j712J88j070J858M98P23J539j067
-30399E24k99k73j188j098q90J29Q86R17K16R45P61j117m99k19J3R0l66l22r70
-29239b760pN91R28J270K43P11j269j781J083J795L12j272n57L63r58j498K06
-28201b600NJ187n3j70Q15R43p15M45L79j94j047K37j011j423J734K454j002m21
-27102d37Pn12K842J41l090J67J60j694j170O03J683O42r91J46p0P81K25K65M98
-25943A96J08k818j259K781R1r52j94J606k75l11P88N33l34k06p48p01O46n05
-24844a554K71K068RJ67K61r90J003L62R4j239J81p26j344q39Q48J546K81o39
$$ plain form
-32596 -709 -1628 -1238 441 222 -205 -387 -86 -505 -374 -1926 -2995 -741 -213 -26 299 -1172 -921 -306
-31497 -306 -19 -1215 -854 -414 -962 -45 46 -373 -1099 -433 -2145 -1957 -3027 -1169 -671 52 1591 524
-30399 524 225 -48 -1236 -2334 -3224 -3095 -2209 -1292 -1076 -131 630 -487 -986 -1205 -1192 -1102 -1468 -1790 -2760
-29239 -2760 -2767 -2176 -1248 22 265 976 -293 -2074 -991 804 1116 -156 -713 -350 -1308 -2806 -2600
-28201 -2600 -2595 -1408 -1461 -1631 -816 127 -588 -143 236 42 -1005 -768 -1779 -3202 -1468 986 -16 -437
-27102 -437 -430 -942 1900 2041 -1049 -882 -722 -2416 -3586 -2983 -1300 -658 -1649 -1503 -1573 -792 -567 -302 196
-25943 196 304 -2514 -3773 -992 -901 -1853 -2047 -441 -716 -1027 -239 294 -40 -246 -994 -1695 -1049 -1554
-24844 -1554 -1283 785 794 961 1222 232 1235 1597 1691 452 633 -93 -1437 -2276 -1428 118 399 -240
-23745b40L75r40k02k96r3R6N32J208K028R16q86j280k242p90j360P02K025R21
-22647D74m5o00M92K30j149J122j86R8j423j361K62r65q12J06R08n96J019Q65
-21548a561J115M33K21r17j202p59p34J707J390j677O36Q56K045m06M02n71j326
-20510c48n17J01M97J695q08Q74J65j253q90r66Q07Q24r61P95M51L39M66j384
-19412a13k440M25M41O07k18J162l45n58m13l7J84p92L22l48J59j30l05o03N43
-18252b459Q18L67q00J664jk60m44j085K46L32J905l08j364N76O89j6j288j279
-17153b707L72J453J347J53o84j18Q4R6q4j743N74J609m71k224J113Q82K37J74
-16054F3l69j45K02q65J088j049o08L07m85R03k39J335J08j527n46j052J332Q84
$$ plain form
-23745 -240 135 -805 -1007 -1303 -1396 -1300 -768 440 2468 3384 2498 1218 -1024 -1814 -3174 -2472 -447 474
-22647 474 429 -171 321 551 -598 524 338 436 -987 -2348 -2086 -3051 -3863 -3757 -2849 -3445 -2426 -1561
-21548 -1561 -446 -13 208 -709 -1911 -2670 -3404 -1697 -307 -1984 -1348 -492 1553 1147 1549 978 -348
-20510 -348 -865 -764 -267 1428 620 1494 1659 406 -484 -1450 -643 181 -780 15 466 805 1271 -113
-19412 -113 -2553 -2128 -1687 -1080 -1298 -136 -481 -1039 -1452 -1489 -1305 -2097 -1775 -2123 -1964 -2094 -2399 -3002 -2459
-18252 -2459 -1641 -1274 -2074 -410 -411 -671 -1115 -2200 -1954 -1622 283 -25 -1389 -813 -124 -140 -1428 -2707
-17153 -2707 -2335 -882 465 618 -66 -184 -100 -4 -88 -1831 -1257 352 -119 -2343 -1230 -348 -111 63
-16054 63 -306 -451 -249 -1114 -26 -1075 -1683 -1376 -1861 -958 -1197 138 246 -1281 -1827 -2879 -1547 -663
-14956f63rJ068L61J77n05O1j062j34J192l02r80m06M84r60J4q0R99O0l87J208
-13735A36n63p68o86M62Q1K28K41k18k96N34j62j060L04J124j581j743J008J275
-12636a684m10J423J01p89J14J080J031j836j002R35j183j416O09J400K06m65
-11660a886JO18J012R59n93k291M21j052Q7O96p54j192J293J316J266N55N4j27
-10561C83J25j916q8J60M58Q73J434o98N42J71J82K20m87p94j034j206l1P16J287
-9401B97r19L3M49P86J022r4J67k314o17n71M3K84R70L00J162r60j236j13Q14
-8241d97R63J274M5K93n81j688n71R85L12L12p4J47p63k353n3J179R35n75m04
-7082a114m96j602L3Q73k69O30P5J704m7j407k32l24J368l84j368M93J260Q79
$$ plain form
-14956 -663 -672 396 757 934 429 490 -572 -706 486 184 -796 -1202 -718 -1678 -1664 -1744 -745 -685 -1072 136
-13735 136 -427 -1195 -1881 -1419 -1338 -1110 -869 -1087 -1383 -849 -1011 -2071 -1767 -643 -2224 -3967 -2959 -1684
-12636 -1684 -2094 -671 -570 -1359 -1245 -165 866 -970 -1972 -1037 -2220 -3636 -3027 -1627 -1421 -1886
-11660 -1886 -1885 -1267 -255 704 111 -2180 -1759 -2811 -2724 -2028 -2782 -3974 -2681 -1365 -99 456 510 383
-10561 383 508 -1408 -1496 -1336 -878 -5 1429 731 1273 1444 1626 1846 1359 565 -469 -1675 -1706 -990 297
-9401 297 -622 -589 -140 646 1668 1574 1741 -573 -1190 -1761 -1718 -1434 -464 -164 998 38 -1198 -1311 -497
-8241 -497 466 1740 1785 2078 1497 -191 -762 223 535 847 773 920 157 -2196 -2249 -1070 -135 -710 -1114
-7082 -1114 -1610 -3212 -3179 -2306 -2575 -1945 -1870 -166 -213 -1620 -1852 -2176 -808 -1192 -2560 -2067 -807 72
-5983G2n39P34J79j36j119O11k21Q38R37k268j075O41L10k05K0l97R08l38J68
-4823h80O95Q5L5j70r75j978k22J418M86nJ520k7n78m32j22K90o09j74n81J283
-3603i41n42J256j24k347n90M99J92N40o19l06j72J207N2J032L8n23J823M8j482
-2443i59j035M48j5o09k2J360j871r88J266J405p69N1N78K79j62m85l65J043
-1344h50p90J287Q36j389k93N94Q85J8n85j564Q79R18j947j30N22M46j32n14
-245a809n54k12M12m01J239J153K08n54J683J819j748m37N33j144k4o47L11
792a72L22m04M8O52j88N50j528n26J253R53o87j802j099K7m77m15K004J586
1891I7k23r97o58J112J335o2N4n06q03P96J247N15j66j1j532J297J53L58M43
$$ plain form
-5983 72 -467 267 446 310 -809 -198 -419 419 1356 -912 -1987 -1346 -1036 -1241 -1221 -1618 -710 -1048 -880
-4823 -880 -185 -100 -65 -235 -1210 -3188 -3410 -1992 -1506 -1511 9 -18 -596 -1028 -1150 -860 -1469 -1643 -2224 -941
-3603 -941 -1483 -227 -351 -2698 -3288 -2789 -2597 -2057 -2676 -2982 -3154 -1947 -1895 -863 -825 -1348 475 523 -959
-2443 -959 -1994 -1546 -1561 -2170 -2192 -832 -2703 -3691 -2425 -1020 -1789 -1738 -1160 -881 -1043 -1528 -1893 -850
-1344 -850 -1640 -353 483 -906 -1199 -605 280 298 -287 -1851 -972 -54 -2001 -2131 -1609 -1163 -1295 -1809
-245 -1809 -2363 -2575 -2163 -2564 -1325 -172 36 -518 1165 2984 1236 799 1332 188 164 -483 -172
792 -172 150 -254 -206 446 258 808 -720 -1246 7 960 273 -1529 -2628 -2601 -3078 -3493 -1489 97
1891 97 -126 -1123 -1781 -669 666 604 658 152 -651 145 1392 1907 1741 1730 198 1495 1648 2006 2449
3051B449j664o10r25j028O94L11r91m47R03r10r39j77P33Q31j98l78k58K057
4149e47M99J65j217j312l2K9o05n33K16J156K17m93R20M89L90j950P4k43J21
5309b656J740j365q64L4P65K357K03j015P43nk523r50J140J627N17J210j018
6347f0j984q76K02J887O87J035j046M79M60q67K53M65N1j002r91j997O06Q90
7445a808q96P41O33l87r12J380K06k55p90J89R97J131J41Q04j214j742J027
8483g55K06PJ76l79J309Q74k187j720Q97J816Q67j38m81j189m22M8R03K99n91
9643d60m75r03n91J678L42j78k09p20J365J06l03j21Q99m65p17K25k85J332
10742E20L04m89j558N60j67p24l22o5l11o6j706M49L63P02n6J319J076k99k01
$$ plain form
3051 2449 785 175 -750 -1778 -1084 -773 -1764 -2211 -1308 -2218 -3157 -3334 -2601 -1770 -1968 -2346 -2604 -547
4149 -547 -48 117 -1100 -2412 -2444 -2415 -3020 -3553 -3337 -2181 -1964 -2457 -1537 -1048 -658 -2608 -2534 -2777 -2656
5309 -2656 -916 -2281 -3145 -3111 -2346 11 214 -801 -58 -63 -2586 -3536 -2396 -769 -252 958 -60
6347 -60 -2044 -2920 -2718 -831 -144 891 -155 324 784 -83 170 635 686 -316 -1307 -3304 -2698 -1808
7445 -1808 -2704 -1963 -1330 -1717 -2629 -1249 -1043 -1298 -2088 -1899 -902 229 370 1174 -40 -1782 -755
8483 -755 -549 -542 -366 -745 564 1438 -749 -2469 -1572 244 1111 973 492 -697 -1119 -1071 -168 131 -460
9643 -460 -935 -1838 -2429 -751 -409 -587 -796 -1516 -151 -45 -348 -469 430 -35 -752 -527 -812 520
10742 520 824 335 -1223 -663 -830 -1554 -1876 -1941 -2252 -2318 -4024 -3575 -3212 -2510 -2566 -1247 -171 -470 -671
11901f71r05R59K7M02j858j975J428J992j326r70J261J535K04j79R9J039j73
12939H89k191P81j85k63l54p41j451P29J472l25o46K159J870l65j828j927J109
13977a267J773j593J167J509k41j319P0j229M42L33M32r14m77q06O62J35r07
15014b230N97Q43m2r70m44J61R93J82J570o41k6j851o28J273J408q1L91j393
16113h88o34J392J379J99j078o7K64r25j13J220j155k16K21k28J562j61o47j66
17212d1L81j58P8j494O30n45J016R08r14P70R56q67j737P11Q52M40Nj025j024
18371a058N51J069l32Jk124m58k25k10J222K603l63j159n50J145n7o96J15N38
19470A2J45Q66J259l88q39j49k73J657N02k244j542k29O03P37M4j496m57J627
$$ plain form
11901 -671 -1576 -617 -590 -188 -2046 -4021 -2593 -601 -1927 -2897 -1636 -101 103 -76 23 1062 889
12939 889 -1302 -521 -706 -969 -1323 -2064 -3515 -2786 -1314 -1639 -2285 -126 1744 1379 -449 -2376 -1267
13977 -1267 506 -1087 80 1589 1348 29 99 -1130 -688 -355 77 -837 -1314 -2120 -1458 -1323 -2230
15014 -2230 -1633 -790 -832 -1802 -2246 -2085 -1092 -910 660 19 -7 -1858 -2486 -1213 195 114 505 -888
16113 -888 -1522 -130 1249 1448 370 303 567 -358 -471 749 -406 -622 -401 -629 933 772 125 -41
17212 -41 340 182 260 -1234 -604 -1149 -133 775 -139 631 1587 720 -1017 -306 546 986 991 -34 -1058
18371 -1058 -507 562 230 231 -1893 -2351 -2576 -2786 -1564 1039 676 -483 -1033 112 55 -641 -526 12
19470 12 157 1023 2282 1894 1055 906 633 2290 2792 548 -994 -1223 -620 117 161 -1335 -1792 -165
20569a65J553k44k21R15j174r40j56n01R41Q66k08O12n44L05q6J39M58M52j473
21729E29n30Q01R60P6j208q47R56k10p91k30m98p5l54M3j47R97J343q82N92p05
22950a80j590r28m58J357J55J250K91n3j936K38J218O20o03j154j056K321Q52
23987C44j73n11P70L1J443J123q46r08n20K05r73k517J064J77J373J390k27j107
25086A38J10p7k76K030L74k431j689M13j302N85k24K119P89O94m30j367q48j8
26184a410P25J545L54q66q62m34O25j05P47J66k60k069L75Q8K03J006P05P23
27283A256m8k115l67O41r93K39M10p8M68l64q78J37L23J443j316K43j096L90
28382a705m52L93k61r30N90l8J017l86r30N26r29Q39j291M94J920J452M07j438
$$ plain form
20569 -165 1388 1144 923 1838 664 -276 -432 -933 8 874 666 1278 734 1039 953 1092 1550 2002 529
21729 529 -1 800 1760 1836 628 -219 737 527 -264 -494 -992 -1067 -1421 -1378 -1525 -528 815 -67 525 -180
22950 -180 -1770 -2698 -3156 -1799 -1644 -394 -103 -156 -2092 -1854 -636 -16 -619 -1773 -2829 -508 344
23987 344 171 -340 430 461 1904 3027 2181 1273 753 958 -15 -2532 -1468 -1291 82 1472 1245 138
25086 138 248 171 -105 1925 2299 -132 -1821 -1408 -2710 -2125 -2349 -230 559 1253 823 -544 -1392 -1410
26184 -1410 -685 860 1214 348 -514 -948 -323 -428 319 485 225 -1844 -1469 -1381 -1178 -172 533 1256
27283 1256 1208 -907 -1274 -633 -1626 -1387 -977 -1055 -587 -951 -1829 -1692 -1369 74 -1242 -999 -2095 -1705
28382 -1705 -2157 -1764 -2025 -2955 -2365 -2403 -1386 -1772 -2702 -2176 -3105 -2266 -3557 -3063 -1143 309 716 -722
29481g22k089k04j154J620K484j123J31k4r71n26J244m22P87J148L6l67r10o10
30579a672N92j23N53J514l09n01J068n67r90m02K786r16j358n55J02Q9o43Q62
31678d70K86k26Q78p09n02N7p56L33k94N01j5J080k92j298k27M89m57Q63p05
32838a464l19m94R99L47N61j277J767N17l06O98l96j153r22J656k02k044n1J294
33937g89r08p03P57Q92M71M39J374j035q49L40P20r10p86n56L80M79J277l00
35035B93O44m32M44o38m5j3j598J388N34p50j79p29j052q15J780m56O89N68r57
36195a324R79O70k280j344J180K97n66p09J112P60m54J69R6K86N52N88j328O27
37293f89R09J416m86o12n97J97j267r57J20N14R3l31j552J109K140K339r21m26
$$ plain form
29481 -722 -2811 -3015 -4169 -2549 -65 -1188 -1057 -1081 -2052 -2578 -1334 -1756 -969 179 215 -152 -1062 -1672
30579 -1672 -1080 -1203 -650 864 555 54 1122 555 -435 -837 1949 1033 -325 -880 -778 -689 -1332 -470
31678 -470 -184 -410 468 -241 -743 -686 -1442 -1109 -1403 -902 -917 163 -129 -1427 -1654 -1165 -1622 -759 -1464
32838 -1464 -1783 -2277 -1278 -931 -370 -1647 120 637 331 1029 633 -520 -1442 214 12 -2032 -2083 -789
33937 -789 -1697 -2400 -1643 -751 -280 159 1533 498 -351 -11 709 -201 -987 -1543 -1163 -684 593 293
35035 293 937 505 949 311 266 253 -1345 43 577 -173 -352 -1081 -2133 -2948 -1168 -1624 -935 -367 -1324
36195 -1324 -345 325 -1955 -3299 -2119 -1822 -2388 -3097 -1985 -1225 -1679 -1510 -1414 -1128 -576 12 -1316 -689
37293 -689 220 1636 1150 538 -59 138 -1129 -2086 -1966 -1452 -1359 -1690 -3242 -2133 7 2346 1425 999
38392I99j901q2J918R29Rj634n25l65j128n59J393J381n43j062K19O99j116m14
39491a782J240L51J56J80L85j493J28n41J180l24k14r63k47J752J058q5p47J131
40590A165N39O03k57q81l59m00o67o5k013j58m26J242Q96j66n42J860P97l3L10
41749A445q46j037rL56P04j347l7J022n63M20n99M21K6m12o25r45l41L76j124
42909c115J820N68l117J170R93J416P02L69J063n94r96j552P65Q45n15K10N76
43947F08J31j068o93J152O81j232m09K35K19L79q2L50j047O30J068n26o09M00
45046A87N22j624q72J77L45R9J241K84p37J90p39o12j060Q9q21n81J049K339
46144e24K015P73m85k36J02n25j398n75J154J191M47o02k66m20o40o92m63L79
$$ plain form
38392 999 -902 -984 934 1863 1872 238 -287 -652 -1780 -2339 -946 435 -108 -1170 -951 -252 -1368 -1782
39491 -1782 -542 -191 -35 145 530 -963 -835 -1376 -196 -520 -734 -1697 -1944 -192 866 781 34 1165
40590 1165 1704 2307 2050 1169 810 410 -257 -322 -2335 -2493 -2919 -1677 -781 -947 -1489 371 1168 1135 1445
41749 1445 599 -438 -447 -91 613 -734 -771 251 -312 108 -491 -70 -44 -456 -1081 -2026 -2367 -1991 -3115
42909 -3115 -1295 -727 -3844 -2674 -1681 -265 437 806 1869 1275 279 -1273 -508 337 -178 32 608
43947 608 739 -329 -1022 130 811 -421 -830 -595 -376 3 -79 271 -776 -146 922 396 -213 187
45046 187 709 -915 -1787 -1610 -1265 -1166 75 359 -378 -188 -927 -1539 -2599 -2510 -3331 -3912 -2863 -524
46144 -524 1491 2264 1779 1543 1645 1120 -278 -853 301 1492 1939 1337 1071 651 11 -681 -1144 -765
47243g65N73n40P07L44n1r5k26J114N95p77M37k47j479k16j397J288J236j70
48341C31K83p26n90l0J267j446r24O67J80P20O1R5o63P30J483P10r28k116o9
49501i65J368N81n61m96p01l21K071l1j447l5N84j301o93K13M58j287K069J294
50600H00j4q19n99L93M09p79k720j12l50l94J403N5J966k05J61j90J080R1L8
51760B14Q2M77l44J348q89l97m78j27j109k60J196P68o31O73N94l89o09M79p58
52919a60l56k67L78J536k073j614L94M38M35P71J372J20q99p14J10j303m71N15
54018a788M26M36pj301j73J381k04l60J57j235k5l5J65P3J000J304q7P21L97
55178H45R67J068j866j846p52J263o40j289K719J574j218r48Q69k05j496J071
$$ plain form
47243 -765 -192 -732 -25 319 268 173 -53 1061 1656 879 1316 1069 -410 -626 -2023 -735 501 331
48341 331 614 -112 -702 -732 535 -911 -1835 -1168 -988 -268 -207 -112 -775 -45 1438 2148 1220 -896 -965
49501 -965 403 984 423 -73 -774 -1095 976 945 -502 -537 47 -1254 -1947 -1734 -1276 -2563 -494 800
50600 800 786 -33 -632 -239 170 -609 -3329 -3441 -3791 -4185 -2782 -2727 -761 -966 -805 -995 85 176 214
51760 214 296 773 429 1777 888 491 13 -114 -1223 -1483 -287 481 -150 523 1117 728 119 598 -160
52919 -160 -516 -783 -405 1131 -942 -2556 -2162 -1724 -1289 -518 854 974 75 -639 -529 -1832 -2303 -1788
54018 -1788 -1362 -926 -933 -2234 -2407 -1026 -1230 -1590 -1433 -2668 -2693 -2728 -2563 -2490 -1490 -186 -273 448 845
55178 845 1812 2880 1014 -832 -1584 -321 -961 -2250 469 2043 825 -123 746 541 -955 116
56155A16J245p39j425L12p16N61R25j212o36q96k119O63J600J636p83L02l71
57192a537l00K146l65r26K6J411J031j73p05p14j571O42J76K91K00j512M52o22
58291b050M30N4k58j605N93J014P91n62j86R78O11Qk45O87M81q23l03l41J607
59451H81j31j20n28J284j194j360P35O83j253r49n0J81j56n83R15J871J36L23
60549F85j15r20q11O24J758o0n62k35o15J117L22q75k97m83r63J88J1o50J173
61709g08J412l80j410j347J166K123M87M63k634j252J75J064O45k66o43K35R39
62747F9K98j121P8j269j027N30K116J84K506j342k053o45L55k96n1m2l27K54
63845a783M81j60k95J060J171j784j245J066J661r3N98J22p83M6N02j259k4M10
$$ plain form
56155 116 1361 622 -803 -491 -1207 -646 279 -933 -1569 -2465 -4584 -3921 -2321 -685 -1468 -1166 -1537
57192 -1537 -1837 309 -56 -982 -956 455 1486 1313 608 -106 -1677 -1035 -859 -568 -368 -1880 -1428 -2050
58291 -2050 -1620 -1566 -1824 -3429 -2836 -1822 -1031 -1593 -1779 -801 -190 -182 -427 260 741 -82 -385 -726 881
59451 881 750 630 102 1386 192 -1168 -433 250 -1003 -1952 -2002 -1821 -1977 -2560 -1645 226 362 685
60549 685 570 -350 -1161 -537 1221 1161 599 364 -251 866 1188 313 16 -467 -1430 -1242 -1231 -1881 -708
61709 -708 704 324 -1086 -2433 -1267 856 1343 1806 -828 -2080 -1905 -841 -196 -462 -1105 -870 69
62747 69 367 -754 -676 -1945 -2972 -2442 -326 -142 2364 1022 -1031 -1676 -1321 -1617 -1668 -1710 -2037 -1783
63845 -1783 -1302 -1462 -1757 -697 474 -1310 -2555 -1489 172 79 677 799 16 62 564 -695 -719 -309
64944c09J02o29r69R05M6o07p01J181j02P4r26J695K014j85j605q31J259K55
66043F67k376M61R60k01k98R64J347N48q20M37k31J013k70q24j201L75J000k170
67141f19K67J247N1j85J98r32l75J45J054p2k41j002P8K97K06j691o76O02O96
68301i52M69l78R66M93O44q27p16q44N13N96J15j60l53k99p68l07Q0L80N47k00
69522a001J047O32N50N07j09j004K55J070J020j388q15j600K92j194O49m39N5
70559a473J459p8k76l45P17N49K93M92j722L58O98j714k028O41M80L17j10n49
71659b291J192J467l29l34j00M59n17m29M95M13N19K79k52j96q42LL99j8j340
72818a422J001l54R01l20q33J413k60k49m81N6j06j385J252Q53J145j005O64
$$ plain form
64944 -309 -207 -836 -1805 -900 -854 -1461 -2162 -981 -1083 -1009 -1935 -240 1774 1589 -16 -847 412 667
66043 667 -1709 -1248 -288 -489 -787 177 1524 2072 1252 1689 1458 2471 2201 1377 176 551 1551 -619
67141 -619 -352 895 946 761 959 27 -348 -203 851 779 538 -464 -386 -89 117 -1574 -2250 -1648 -952
68301 -952 -483 -861 105 598 1242 415 -301 -1145 -632 -36 79 -81 -434 -733 -1501 -1808 -1728 -1348 -801 -1001
69522 -1001 46 678 1228 1735 1626 622 877 1947 2967 1579 764 -836 -544 -1738 -1089 -1528 -1473
70559 -1473 -14 -92 -368 -713 4 553 846 1338 -384 -26 672 -1042 -3070 -2429 -1949 -1632 -1742 -2291
71659 -2291 -1099 368 39 -295 -395 64 -453 -882 -387 26 545 824 572 376 -466 -463 -64 -82 -1422
72818 -1422 -421 -775 126 -194 -1027 386 126 -123 -604 -548 -654 -2039 -787 66 1211 206 870
73856H70O8J214J310p08l63o34k89j82j248p51M8J753M09P07K22m24k28p81O10
75015A603Q8j520j712K29R48L72M99m54l30m77K10N12m09J917j056j136J697
76053I81J159j131o50m70J700Q50p83m71j446r16K550j23N8L77j38J447q53r91
77152A150q27j155O09l14k38K33l61K071Q04Q82O50j159J3L89k27q49j226o95
78251b50K7Q21p24l48L14J11J041N35J011o68l95O3L69j199k471q09K154L53
79349f5o94n04J287n11J54N31m20m68J345L20M90k00j53m07j214Q35Q94m26j134
80509c40J366l34m38m94J112O09j547j95O06L06r86J18p32O34N84L78j30N66
81608A083N72j357R9M19J396P36j539k73j100n26l97N07J614l53J005j34q61
$$ plain form
73856 870 938 2152 3462 2754 2391 1757 1468 1286 38 -713 -665 1088 1497 2204 2426 2002 1774 993 1603
75015 1603 1691 171 -1541 -1312 -364 8 507 53 -277 -754 -544 -32 -441 1476 420 -716 981
76053 981 2140 1009 359 -111 1589 2439 1656 1185 -261 -1177 1373 1250 1308 1685 1547 2994 2141 1150
77152 1150 323 -832 -223 -537 -775 -542 -903 1168 1972 2854 3504 2345 2358 2747 2520 1671 445 -250
78251 -250 -223 598 -126 -474 -160 -49 992 1527 2538 1870 1475 1538 1907 708 -1763 -2572 -418 -65
79349 -65 -759 -1263 24 -487 -333 198 -222 -690 655 975 1465 1265 1112 705 -509 326 1220 794 -340
80509 -340 1026 692 254 -240 872 1481 -66 -261 345 651 -335 -217 -949 -315 269 647 517 1083
81608 1083 1655 298 397 816 2212 2948 1409 1136 36 -490 -887 -380 1234 881 1886 1752 891
82646H91J715K270q08k814j116L03m14q7R67J746j05n73q80k246m87M01N57J267
83744E87M94l31q68Q22J122K054J990k916j094K5N5M46N72n23j836J079K18J30
84843B026o27P97L53K44j704R0p33n22o5l60N47R02K368J420K054k476l315J8
85941A017P11n70j347r86j82K661J645p10K02r90k34j317k463N85K128J464l
86979A611L09p19Q17o02j70R81Q67J061k95j417k83j953p68O40P64J435l01l1
88078A946L01k82j050J31J67k31r61n47n61J704J55Q92j050k173J017K242N68
89115B268p85j214L82P74n63J941q0l40O99n27l68l70J04j52k58L77L40K48k78
90275B198L95j699j62N97J539J650j164n31P3r80m61J081P19%M2N72M8l90M1
$$ plain form
82646 891 2606 4876 4068 1254 138 441 27 -60 907 2653 2548 1975 1095 -1151 -1638 -1237 -680 587
83744 587 1081 750 -118 704 1826 3880 5870 2954 1860 1885 1940 2386 2958 2435 599 1678 1896 2026
84843 2026 1399 2196 2549 2793 1089 1179 446 -76 -141 -501 46 948 3316 4736 6790 4314 999 1017
85941 1017 1728 1158 -189 -1175 -1357 1304 2949 2239 2441 1451 1217 -100 -2563 -1978 150 1614 1611
86979 1611 1920 1201 2018 1416 1246 2227 3094 4155 3860 2443 2160 207 -561 79 843 2278 1977 1946
88078 1946 2247 1965 915 1046 1213 982 21 -526 -1087 617 772 1664 614 -1559 -542 1700 2268
89115 2268 1483 269 651 1425 862 2803 2723 2383 3082 2555 2187 1817 1921 1769 1511 1888 2228 2476 2198
90275 2198 2593 894 732 1329 2868 4518 3354 2823 2896 1916 1455 2536 3255 3255 3297 3869 3917 3527 3568
91435C568M18N11j21r01l96l8J676J410j085k52M58j37N14j11JQ40K607j094
92534G868J494J405L6j70O91M022M84j373l65L96K277L450j477o8M701M293N890
93571C3554J3561K3912N0348J43906K90873k00130j52773p7161m4498j9707j0630
94243E1255p321p711o725q557n063l957n244o88j227j344R59K819j965j330m35
95158C466o41k225R26M18o04p5J003j245j021P11N78m22Q93L16j055k265R49
96196b93J55j19J806Q37m38p59Q76k07r86j020L1J157J251q51k27j194k024P07
97295a298K565q00p93J052n18k05l79p7Q64K222p15r57o38O04R8K726m53K03
98393C501j047p84J944J122J057k918Q07o10P50K656r84k266l32J129J233o21
$$ plain form
91435 3568 3986 4497 4376 3475 3079 3041 4717 6127 5042 4790 5248 5111 5625 5514 5515 6355 8962 7868
92534 7868 9362 10767 10803 10633 11324 15346 15830 14457 14092 14488 16765 20215 18738 18670 23371 27664 33554
93571 33554 47115 71027 121375 265281 556154 356024 203251 126090 81592 61885 51255
94243 51255 43934 36223 29498 20941 15878 11921 6677 5989 4762 3418 4377 7196 5231 3901 3466
95158 3466 2825 600 1526 1944 1340 1265 2268 1023 2 713 1291 869 1762 2078 1023 -1242 -293
96196 -293 -138 -257 1549 2386 1948 1189 2065 1858 872 -148 -117 1040 2291 1440 1213 19 -2005 -1298
97295 -1298 1267 467 -326 726 208 3 -376 -453 411 2633 1918 961 323 927 1025 3751 3298 3501
98393 3501 2454 1670 3614 4736 5793 2875 3682 3072 3822 6478 5494 3228 2896 4025 5258 4637
99370D637J391J888o07k260Q70m0J176J37K421J441o00k100Q3K295K180P09K64
100408A3885J071j18K110K185N194L760l655j227M43K090L888P806R860J5096
101262F2388K6388N0752J22462L79991L52693m12713k24051j31017p9540l5303
101872A12050j9783j6467j6619j4692j2653q272q835k957J608m537m963l256L2
102666F56O1k707k69K38L56L28R91r9j442m68j567Q67J435j4r19r03m05O72K921
103826b68L557j988q8K89j07n56j235Q66P73o41j19J66m15j201j629l97p36j03
104925c832N52l95r40K17R38R52O59q4o31n81J69q75O17n14J383L75j166M07K070
106084f79P09o35L96K216j0j73o92n87m22q42j269Q5j217Q26K43r15M14l23q70
$$ plain form
99370 4637 6028 7916 7309 5049 5919 5879 7055 7192 9613 11054 10454 8354 8437 10732 12912 13621 13885
100408 13885 14956 14838 16948 19133 24327 28087 24432 23205 23648 25738 29626 37432 47292 62388
101262 62388 88776 139528 261990 641981 994674 581961 357910 226893 147353 112050
101872 112050 92267 75800 59181 44489 31836 23564 14729 11772 13380 8843 3880 624 656
102666 656 717 -1990 -2259 -2021 -1665 -1337 -346 -445 -1887 -2355 -3922 -3055 -1620 -1634 -2553 -3456 -3861 -3189 -268
103826 -268 3289 1301 1213 1502 1395 839 -396 470 1243 602 483 649 234 -967 -2596 -2993 -3729 -3832
104925 -3832 -3280 -3675 -4615 -4398 -3460 -2508 -1849 -1933 -2564 -3145 -2976 -3851 -3234 -3748 -2365 -1990 -3156 -2749 -679
106084 -679 30 -605 -209 2007 1997 1824 1132 545 123 -719 -1988 -1903 -3120 -2294 -2051 -2966 -2552 -2875 -3745
107244c745J138l12L02J84q17J112J670j13N28j281L46j220m1K48N03o59M02r55
108343b710K59J836M49q60j991p2o43J112R96j026p0M5J33P43J365O60n55j892
109442b221q03N21J575O87L45K0R2o23j04o25J23L190q25j712m09O88m50j186
110540a717M38M6M23l78p46L75k27L07J142q94j332l27q71J024J954P12l97N39
111639G1j967n20o1J573J467j66o10N35j352j625K39N60P57o71j317k43J003K303
112737b4Q65k21j418O33M19J013k06m56p34j506j459J477Q13k32L67K7O49K83
113836B90o06j430Q11M95P30O21p48j337L06l68j295P57O56j999o4M44J989o21
114935a369J74O33l19m32N28k56m5N92O86O10L92l40j338j21Q40p21p12K68p88
$$ plain form
107244 -3745 -2607 -2919 -2617 -2433 -3250 -2138 -468 -581 -53 -1334 -988 -2208 -2249 -2001 -1498 -2157 -1755 -2710
108343 -2710 -2451 -615 -166 -1026 -3017 -3089 -3732 -2620 -1624 -2650 -2720 -2675 -2542 -1799 -434 226 -329 -2221
109442 -2221 -3024 -2503 -928 -241 104 124 216 -407 -511 -1136 -1013 2177 1352 -360 -769 -81 -531 -1717
110540 -1717 -1279 -1233 -810 -1188 -1934 -1559 -1786 -1479 -337 -1231 -2563 -2890 -3761 -2737 -783 -71 -468 71
111639 71 -1896 -2416 -2477 -904 563 397 -213 322 -1030 -2655 -2416 -1856 -1099 -1770 -3087 -3330 -2327 -24
112737 -24 841 620 -798 -165 254 1267 1061 605 -129 -1635 -3094 -1617 -804 -1036 -669 -642 7 290
113836 290 -316 -1746 -935 -440 290 911 163 -1174 -868 -1236 -2531 -1774 -1118 -3117 -3181 -2737 -748 -1369
114935 -1369 -1195 -562 -881 -1313 -785 -1041 -1086 -494 192 802 1194 854 -484 -605 235 -486 -1198 -930 -1718
116095a718j0j40P91M78j530j777R14M09L52J637j79j99j070M38j54L11p01n61
117193b709Q54N27p97j87K049R23q13o77j91n81k248J210J263n09L39oL61m22
118292a614K12l12j299K209K81L1n81L78N73L26p15k2n26l19J179P73q7j581p27
119452a821J184p58R02K782K773j793j785o00j337N53Q88P58r34j926P5M66J115
120490E42l18p14Q01j23j720J621R17O13P35o5o68j161j456m30l0l24n47R61l38
121649a704m41J36K77kJ449l14k463l60J254J675J372p73j245K19L46K19q0l90
122748h25N6j703J178J725J026r6o68q99j720j30J26M15j67q50J222L49n91r7
123846a649j164j014Q09K193R98n74J12j723j61Q07o67m52J59K092J554r88j020
$$ plain form
116095 -1718 -1728 -1868 -1077 -599 -2129 -3906 -2992 -2583 -2231 -594 -773 -972 -2042 -1604 -1758 -1447 -2148 -2709
117193 -2709 -1855 -1328 -2125 -2312 -263 660 -153 -830 -1021 -1602 -3850 -2640 -1377 -1886 -1547 -1553 -1192 -1614
118292 -1614 -1402 -1714 -3013 -804 -523 -492 -1073 -695 -122 204 -511 -533 -1059 -1378 -199 574 487 -1094 -1821
119452 -1821 -637 -1395 -493 2289 5062 3269 1484 884 -453 100 988 1746 812 -1114 -1039 -573 542
120490 542 224 -490 311 188 -1532 89 1006 1619 2354 2289 1621 460 -996 -1426 -1456 -1780 -2327 -1366 -1704
121649 -1704 -2145 -2009 -1732 -1734 -285 -599 -3062 -3422 -2168 -493 879 106 -1139 -920 -574 -355 -435 -825
122748 -825 -769 -2472 -1294 431 1457 1361 693 -206 -1926 -2056 -1930 -1515 -1682 -2532 -1310 -961 -1552 -1649
123846 -1649 -2813 -3827 -3018 -825 173 -401 -289 -2012 -2173 -1366 -2033 -2485 -2326 -234 1320 332 -688
124884f88j444P84R84r29m09M43o6r4j167r37M34P89k84K73M77Q11m38N05M66
126044d90M64r50j346n37j19P99L51J241m5r58k72O61p19K559n65j984j26J028
127143a008P12q53J560J567j502k21L26j033r16m99m65J064M7M48O89j06p58q55
128241a803N34J614M9j242q78p32n8J333Q25P21j08Q03j36q57Q1M46o97R86k18
129401F63O72p39j793j173k73l02n80q3K52J196j051Q21J377j368J912n32j653
130439b654j98m88J221N87J121L08p66N45O43n11O64j156K70M39L32o47R8J80
131538a2n50j442N39q58j92k33J98N04k92L84J698l34q04m69O65J050j65n45R58
132697A00M08j202l2J2P57m3o26j533J085L06q9Q48P52J75m90K54o49k365k20
$$ plain form
124884 -688 -2132 -1348 -364 -1293 -1702 -1259 -1325 -1419 -2586 -3523 -3089 -2300 -2584 -2311 -1834 -1023 -1461 -956 -490
126044 -490 -26 -976 -2322 -2859 -2978 -2179 -1828 -587 -632 -1590 -1862 -1201 -1920 639 74 -1910 -2036 -1008
127143 -1008 -296 -1149 411 1978 476 255 581 -452 -1368 -1867 -2332 -1268 -1221 -773 -84 -190 -948 -1803
128241 -1803 -1269 345 394 -848 -1726 -2458 -2516 -1183 -358 363 255 1058 922 65 146 592 -105 881 663
129401 663 1335 596 -1197 -2370 -2643 -2945 -3525 -3608 -3356 -2160 -3211 -2390 -1013 -2381 -469 -1001 -2654
130439 -2654 -2852 -3340 -2119 -1532 -411 -103 -869 -324 319 -192 472 -684 -414 25 357 -290 -192 -12
131538 -12 -562 -2004 -1465 -2323 -2515 -2748 -2550 -2046 -2338 -1954 -256 -590 -1394 -1863 -1198 -148 -313 -858 100
132697 100 508 -694 -726 -714 43 0 -626 -2159 -1074 -768 -857 -9 743 918 428 682 33 -2332 -2552
133857b552K054J186M17M2p17j040j252K74R13J166K80j550k87L34O55Q66L44
134895A133j119n43j356r57J104J014L71j37j08L02j528j338j065J010J730J197
135871b90r18o92j836j026N37J834L42k13J031j676J03O45P52L95J73J56j550
136909b233r31J112J924q08L42J843j04Q72r86j338J620n60L18R59K1j135p06
137947B10k6P37j659k79M0p49Q51Q63L6J87n07M3n04J260L77P72j320m58L29O34
139167H37r21j352P75J977L55j276p30l81J134J409k86j710o32J268M40r88K253
140205B172j949j838N41L96K63r11L27J658o68j118J001o20k49j311M23J544J236
141243H97j041j269qJ167J067j669oK084J480j557k053K84o5N23r80r19l64R0
$$ plain form
133857 -2552 -498 688 1105 1147 430 -610 -1862 -1588 -675 491 771 -779 -1066 -732 -77 789 1133
134895 1133 14 -529 -1885 -2842 -1738 -724 -353 -490 -598 -296 -1824 -3162 -4227 -3217 -1487 -290
135871 -290 -1208 -1900 -3736 -4762 -4225 -2391 -2049 -2262 -1231 -2907 -2804 -2159 -1407 -1012 -839 -683 -2233
136909 -2233 -3164 -2052 -128 -936 -594 1249 1145 2017 1031 -307 1313 753 1071 2030 2051 916 210
137947 210 184 921 -738 -1017 -977 -1726 -875 -12 24 211 -296 -253 -757 503 880 1652 332 -126 203 837
139167 837 -84 -1436 -661 1316 1671 395 -335 -716 418 1827 1541 -169 -801 467 907 -81 2172
140205 2172 223 -1615 -1074 -678 -415 -1326 -999 659 -9 -1127 -126 -746 -995 -2306 -1883 -339 897
141243 897 -144 -1413 -1421 -254 813 -856 -862 1222 2702 1145 -908 -624 -689 -166 -1146 -2065 -2429 -2339
142342b339R41R09J46j005q57R00k84j598R97J093k35K95j04N45M11l85j50m74
143440a194j013j569K683J127o70j291j578Q29J707P35M86j908j076J670J231
144356A69j000j184k8J038p52j014J496R81k80j320J040J129K5J242P66j342k46
145393G20K29K63L9j243r08r08j961J459J529J528m36j452J12K44N33O35J972
146431B355o44K83o35l43l58l105l89J015l4K72K006J122n80j303M2o2k94q20
147530a472N41J459J739j047q57k12n23R02o37p09J87J527O49l27J26K00j845
148567b99p41j13M40O6j160L37J788j4P80m42j032q97J817N59q34J073m39o03
149666B86o04J59q0j246k70J568O75r32j558p80j678J209K455K00J675R61o40
$$ plain form
142342 -2339 -1398 -489 -343 -1348 -2205 -1305 -1589 -3187 -2190 -1097 -1332 -1037 -1141 -596 -185 -570 -720 -1194
143440 -1194 -2207 -3776 -1093 34 -636 -1927 -3505 -2676 -969 -234 252 -1656 -2732 -1062 169
144356 169 -831 -2015 -2043 -1005 -1757 -2771 -1275 -294 -574 -1894 -854 275 300 1542 2308 966 720
145393 720 949 1212 1251 8 -900 -1808 -3769 -2310 -781 747 311 -1141 -1029 -785 -252 383 2355
146431 2355 1711 1994 1359 1016 658 -2447 -2836 -1821 -1855 -1583 423 1545 965 -338 -296 -358 -652 -1472
147530 -1472 -931 528 2267 1220 363 151 -372 530 -107 -816 -629 898 1547 1220 1346 1546 -299
148567 -299 -1040 -1153 -713 -647 -1807 -1470 318 304 1084 642 -390 -1287 530 1089 255 1328 889 286
149666 286 -318 -159 -239 -1485 -1755 -187 488 -444 -2002 -2782 -4460 -3251 -796 -596 1079 2040 1400
150704A400p94j630o71J386Q17k35l76J751k11K62K27j760p82p83j43J256J969
151742A683L77j8j034j196J892n67J454M8J77J21k107k672O78L43L444M30k074
152779I79l62K80R43n5j226j63J49O3m24K77j024J25J69R7N29l49pM0K077L64
154000B482q05l50q83m8K02J228N37j084j88N4l32K60o10j22J91J247J237j126
155099A890J47J267J009M00L42o07j10j077q94p00Q6J635L9n86r59L60J459J333
156197E034M24j12N35n97L810J427M30K114k73L329j911K2L808K953j222J363
157174B1134J785O78L609P771J0547J5862K8806N6723J48048M70390K07330m06158
157906E66525k00668j27876p6068l6861k1637j5580j4119j7462j7229j1192o696
$$ plain form
150704 1400 606 -1024 -1695 -309 508 273 -103 1648 1437 1699 1926 166 -616 -1399 -1542 -286 1683
151742 1683 2060 2042 1008 -188 1704 1137 2591 2639 2816 2937 830 -1842 -1164 -821 2623 3053 979
152779 979 617 897 1840 1785 559 396 545 608 184 461 -563 -438 -269 -172 357 8 1 41 2118 2482
154000 2482 1677 1327 444 396 598 1826 2363 1279 1091 1145 813 1073 463 341 532 1779 3016 1890
155099 1890 2037 3304 4313 4713 5055 4448 4338 3261 2367 1667 1753 3388 3427 2841 1882 2242 3701 5034
156197 5034 5458 5346 5881 5284 9094 10521 10951 13065 12792 16121 14210 14232 18040 20993 19771 21134
157174 21134 22919 23597 27206 34977 45524 61386 90192 146915 294963 765353 972683 566525
157906 566525 365857 237981 161913 125052 103415 87835 73716 56254 39025 27833 21137
158578B1137n761q54k746l385j710j949k248j546p85l54r25J378J721j483j690
159493a200L53J033j654l14q30N90J720L68J92l66K16O40n94P18p18J18o68P1
160592c25r42N23L10r96L54p0P6J16K08m05p35l44o27O68N99J10K80J056J470
161752A326Q50j620J32j630j105N48m93l52j90K444K006j473n8M5k018j539l72
162789c499O04J684O60j222K89J313P31R80L93J195R78N46j438k131j333K67K81
163827B98j515j76l46j756K185P89R97j03j586j057j85N10n10P23K024m19j314
164865a441j45L45o05q9N37K57J059j47n01m87j130r93M63K902K520j260j367
165902h2n56r21j04K23J262M42o40k56m43P49Q47o13n07N87K091M31O1o53k246
$$ plain form
158578 21137 15376 14522 11776 8391 6681 4732 2484 938 153 -201 -1126 252 1973 490 -1200
159493 -1200 -847 186 -1468 -1782 -2612 -2022 -302 66 258 -108 108 748 154 872 154 272 -396 -325
160592 -325 -1267 -744 -434 -1430 -1076 -1146 -1070 -954 -746 -1151 -1886 -2230 -2857 -2189 -1590 -1480 -1200 -144 1326
161752 1326 2176 556 688 -942 -2047 -1499 -1992 -2344 -2534 -90 1916 443 385 430 -1588 -3127 -3499
162789 -3499 -2895 -1211 -551 -1773 -1484 -171 560 1540 1933 3128 4106 4652 3214 1083 -250 17 298
163827 298 -1217 -1393 -1739 -3495 -1310 -521 476 373 -1213 -2270 -2455 -1945 -2455 -1732 292 -127 -1441
164865 -1441 -1586 -1241 -1846 -1935 -1398 -1141 -82 -229 -730 -1217 -2347 -3340 -2877 25 2545 1285 -82
165902 -82 -638 -1559 -1663 -1440 -178 264 -376 -632 -1075 -326 521 -92 -599 -12 2079 2510 2571 1918 -328
167062c28j60J918M41j695p45r18P3J310J4Q09j029J49K44Q26j621j68J365N7
168161E42N94k104j583J128J939o25j52p74Q1J733m54j466j673J82N79o68O33
169199b088l1o64M3M56R80j48j65L35J122P58P19o06k57N16j74r94j067j475M95
170358b245k70j919j87J480N14J415J452p08L39n62k67p52l21q71J544M10j078
171396b026N08L82k168J67J324K50q44J624J080J086L91n54L44r7r99n46l64j381
172494a823j367K96k218K5J651R06J129J138r42j873L82J538N58o77p17k40m65
173532b699J14P27L15r90J45P64m83P61j531P27M75mj07j149J918J888l20oQ03
174692A348j269j289L2m76Q94j218P36n02J13J269R89k23j231j60J648N33L20
$$ plain form
167062 -328 -488 1430 1871 176 -569 -1487 -1414 -104 -90 719 -310 -161 83 909 -712 -880 485 542
168161 542 1136 -968 -2551 -1423 516 -109 -261 -1035 -954 779 325 -1141 -2814 -2632 -2053 -2721 -2088
169199 -2088 -2119 -2783 -2740 -2284 -1304 -1452 -1617 -1282 -160 598 1317 711 454 970 796 -198 -1265 -2740 -2245
170358 -2245 -2515 -4434 -4621 -3141 -2627 -1212 240 -468 -129 -691 -958 -1710 -2031 -2902 -1358 -948 -2026
171396 -2026 -1518 -1136 -3304 -3137 -1813 -1563 -2407 -783 297 1383 1774 1220 1564 1467 468 -78 -442 -1823
172494 -1823 -3190 -2894 -5112 -5087 -3436 -2530 -1401 -263 -1205 -3078 -2696 -1158 -600 -1277 -1994 -2234 -2699
173532 -2699 -2585 -1858 -1543 -2533 -2388 -1624 -2107 -1346 -2877 -2150 -1675 -1679 -1786 -2935 -1017 871 551 545 1348
174692 1348 79 -1210 -1178 -1654 -760 -1978 -1242 -1744 -1631 -362 627 404 -827 -987 661 1194 1514
175730A514j822j174j302J458J195m34l94R63j395j5J006J009N8J209j282l85
176706B09j300j636K88m74L98J783r28N96k8J20K74K18P63p23K41r70L73j75j882
177866b853l32OR52m6j304K52L68M66K62L18O50o03k59J480P73j345k62k15R60
179026g32o72J112m66r07n40N23R23l42j120J344J26N86l91j125O28P76M63J175
180125A361r96r69P58k17R09j617j020k55K2k3J246J232j27j028j10L7q88p47
181223b432P36J191L20l44q77p50k04K08J855m57n0J238k00N64j259n66j17m16
182322a560o35K45J320o35j551J72J035O52J457K01M67J69K39n31j580o8N61J08
183420F6j345j859J340O55J081j170l48l41m18o69k06K113J277l14J60j79J76
$$ plain form
175730 1514 -308 -1482 -2784 -1326 -131 -565 -959 4 -1391 -1406 -400 609 667 1876 594 209
176706 209 -1091 -2727 -2439 -2913 -2515 -732 -1660 -1064 -1092 -972 -698 -480 283 -440 -199 -1169 -796 -971 -2853
177866 -2853 -3185 -3179 -2227 -2273 -3577 -3325 -2957 -2491 -2229 -1911 -1261 -1864 -2123 -643 130 -1215 -1477 -1692 -732
179026 -732 -1404 -292 -758 -1665 -2205 -1682 -759 -1101 -2221 -877 -751 -165 -556 -1681 -1053 -277 186 1361
180125 1361 365 -604 154 -63 846 -771 -1791 -2046 -2024 -2047 -801 431 304 -724 -834 -797 -1685 -2432
181223 -2432 -1696 -505 -185 -529 -1406 -2156 -2360 -2152 -297 -754 -804 434 234 798 -461 -1027 -1144 -1560
182322 -1560 -2195 -1950 -630 -1265 -2816 -2644 -1609 -957 500 701 1168 1337 1576 1045 -535 -603 -42 66
183420 66 -1279 -3138 -1798 -1143 -62 -1232 -1580 -1921 -2339 -3008 -3214 -1101 176 -138 22 -157 19
184458A9m35j224L75M0R4q13n63N05J408l46k17P09J79q1K35j663J21J563j9j586
185679a699j753J333o41n92M21J462n94j221N18P91L86n42L83j151O44m22J748
186717i29L03Q3k20j188q53p21m42J68j50L94J570M18m7m28j687M28J723L52K765
187876A539J351j852o54j057l13j127l82n31L77L99J250J051O01K68m14m70m55
188914d19L86j480k2J477N05M74J271R49q44k474o37r16J323K034j688j049j49
189952a259O97j210p28k3M01m22J787J81q24O12p22Q15J265m67n51J396l2p19
191051A97q58O65J430K87j719k39m99m5m0O78R12p26p83J9j010M44O33J369j403
192210f88r23j75J391J953P93j304k621k42m20J156J045P37o4r1r79n52M09M61
$$ plain form
184458 19 -416 -1640 -1265 -1225 -1131 -1944 -2507 -2002 -594 -940 -1157 -448 -269 -350 -115 -1778 -1657 -94 -113 -1699
185679 -1699 -3452 -2119 -2760 -3352 -2931 -1469 -2063 -3284 -2766 -1975 -1589 -2131 -1748 -2899 -2255 -2677 -929
186717 -929 -626 -543 -763 -1951 -2804 -3525 -3967 -3799 -3949 -3555 -1985 -1567 -1614 -2042 -3729 -3301 -1578 -1226 1539
187876 1539 2890 1038 384 -673 -986 -2113 -2495 -3026 -2649 -2250 -1000 51 652 920 506 36 -419
188914 -419 -33 -1513 -1535 -58 447 921 2192 3141 2297 -177 -814 -1730 -407 1627 -61 -1110 -1259
189952 -1259 -562 -1772 -2500 -2523 -2122 -2544 -757 -576 -1400 -788 -1510 -695 570 103 -448 948 916 197
191051 197 -661 4 1434 1721 2 -237 -736 -781 -821 -143 769 43 -740 -721 -1731 -1287 -654 715 -688
192210 -688 -1611 -1786 -395 1558 2351 1047 -1574 -1816 -2236 -1080 -35 702 638 547 -432 -984 -575 -114
193309a14n04o8K66p2L9j272L33Q76k31L19J4J586O64n11n23r62j033J497p96
194468d92J994m63k396M33J437R0R9j31K56J162J85q16p65j818k2J548j326l35
195567a360J197J19Q9n91r16J17J117k030q92J443J603j539q59M76P71l78N77
196605a056J570L0J417N30o61K3k49k94j138k57J75j050k89J612O76J80Np21k38
197765B65j764r82j36o6j304L78m09P18Q56j07J368J997k078J37N0n79j404P74
198863b286J038L61J381J65j2k71j059k1P6o63J290J28q7N79j421J4K34J61j552
200023a945J394J326j568n93J080K95l73P25N64p78r26K52J098L86O28j102n47
201061h4j007L97l05K161J065j311n32M13m21j441Q53q05k8K96P19N96M72j199
$$ plain form
193309 -114 -618 -686 -420 -492 -453 -1725 -1392 -516 -747 -428 -414 1172 1836 1325 802 -160 -1193 304 -492
194468 -492 1502 1039 -1357 -924 513 603 702 571 827 1989 2174 1358 593 -1225 -1247 301 -1025 -1360
195567 -1360 -163 -44 45 -546 -1462 -1345 -228 -2258 -3150 -1707 -104 -1643 -2502 -2026 -1255 -1633 -1056
196605 -1056 514 544 1961 2491 1830 1853 1604 1310 172 -85 90 -960 -1249 363 1039 1219 1224 503 265
197765 265 -1499 -2481 -2617 -2683 -3987 -3609 -4018 -3300 -2444 -2551 -1183 814 -1264 -1127 -1077 -1656 -3060 -2286
198863 -2286 -1248 -887 494 659 647 376 -683 -704 -628 -1291 -1 127 40 619 -802 -788 -554 -393 -1945
200023 -1945 -551 775 -793 -1386 -306 -11 -384 341 905 127 -799 -547 551 937 1565 463 -84
201061 -84 -1091 -694 -999 1162 2227 916 384 797 376 -1065 -212 -1017 -1045 -749 -30 566 1038 -161
202160a61j028J453L9l39r7O01k81o41k01k38p26k21q76P44J427n03%k85J08J083
203380a42M5o62n34l8P3J112p22j037n40J17J042l20p6j97K45J589J7j37k986
204540c151J059R65L70j344J097j208O78N8J191k75o47q28r15P32N71M64K81L71
205639e31n98R4k102oJ575P71m38o85K578j61q24K69r1m55k261Q92J061k4j625
206798b561l26N49J619J606M19j104j151m62P12J082n86M66J553j498O71J506
207775B495m25j028j600m01N97k67l8K59q13J16P64p16Q58J964k71r74j434j99
208874a113M54r20m13Q74j204l01O09n87P98M02j09N64J455K46j461J133j419
209911i92n35j43p61J406M80j937R52q1j934n68N31J351J102o05p39J204P35n83
$$ plain form
202160 -161 -1189 264 303 -36 -133 468 187 -454 -655 -893 -1619 -1840 -2716 -1972 -545 -1048 -1048 -1333 -1225 -142
203380 -142 -97 -759 -1293 -1331 -1258 -146 -868 -1905 -2445 -2328 -1286 -1606 -1682 -1879 -1634 -45 -28 -165 -3151
204540 -3151 -2092 -1127 -757 -2101 -1004 -2212 -1534 -1476 -285 -560 -1207 -2035 -2950 -2218 -1647 -1183 -902 -531
205639 -531 -1129 -1035 -3137 -3143 -1568 -797 -1235 -1920 658 497 -327 -58 -149 -604 -2865 -1973 -912 -936 -2561
206798 -2561 -2887 -2338 -719 887 1306 202 -949 -1411 -699 383 -203 263 1816 318 989 2495
207775 2495 2070 1042 -558 -959 -362 -629 -667 -408 -1221 -1105 -341 -1057 -199 1765 1494 520 -914 -1113
208874 -1113 -659 -1579 -1992 -1118 -2322 -2623 -2014 -2601 -1803 -1401 -1510 -946 509 755 -706 427 -992
209911 -992 -1527 -1670 -2431 -1025 -545 -2482 -1530 -1611 -3545 -4113 -3582 -2231 -1129 -1734 -2473 -1269 -534 -1117
211010a117r42n25j53J372Q87P11J266o47n62j569J175l67q81K11Q60K69k49j817
212109b078q44L95J358l12J89O15O84n40N92j491j561r78P75J539m04j443J162
213147b342J545J75k52k8J033N51q36j010J024M55m84j026m61p04R84q3M87k16
214245a188J043O73k422l90N00p01m09J410R60Q79j465o01N2M21l59q7R60l87
215344a111j188K86J077l57l08k268j340K202R37L52k369l50J903J576k83P74
216320d67k113k561P40J780J327J94O60J94j06L04N46k3o05j365K57R19k22n92
217419a133q76R49Q03j543j340Q57Q21K413L88J294n91r48Q71q7n70j198K3L17
218518D50K43j68j127j145R82j018O35K067J039j872R0j034m84K499p86j571o96
$$ plain form
211010 -1117 -2059 -2584 -2737 -1365 -478 233 1499 852 290 -1279 -104 -471 -1352 -1141 -281 -12 -261 -2078
212109 -2078 -2922 -2527 -1169 -1481 -1292 -677 7 -533 59 -1432 -2993 -3971 -3196 -1657 -2061 -3504 -2342
213147 -2342 -797 -622 -874 -902 131 682 -154 -1164 -140 315 -169 -1195 -1656 -2360 -1376 -1459 -972 -1188
214245 -1188 -145 528 -1894 -2284 -1784 -2485 -2894 -1484 -524 355 -1110 -1711 -1659 -1238 -1597 -1684 -724 -1111
215344 -1111 -2299 -2013 -936 -1293 -1601 -3869 -5209 -3007 -2070 -1718 -4087 -4437 -2534 -958 -1241 -467
216320 -467 -2580 -5141 -4401 -2621 -1294 -1100 -440 -246 -352 -48 498 475 -130 -1495 -1238 -319 -541 -1133
217419 -1133 -2009 -1060 -257 -1800 -3140 -2283 -1462 951 1339 2633 2042 1094 1965 1878 1308 110 133 450
218518 450 693 525 -602 -1747 -765 -1783 -1148 919 1958 86 176 -858 -1342 1157 371 -1200 -1896
219556a896M61j14m40J507J157J374J000Q24k247j436q27J88k05O56O83q18n82
220593g15p2J14o16O88J121J468L688O31l514k319j707J44O54J163o37j59J544
221631A476j347o22P31J078P3k962o27M94m24R99K314M17M52l9Mj183j487K00
222730d53L81P96K6j244P02l72Q13R29q88K47O6P26j398Q9J525j385j666q11m9
223889a966J250L38P22k19r75R30j24N2q75R15q80n73J295j082j576O91Q75O24
224988e78j539J98J573m72p31k18N15J372O4j82m20m3k12L91Rm9k92j052j043
226148b709N36P74k51M82J333O28j393q34k71n61J356J870Q99n45l712j110O71
227185b837j17j76M20L27J644J244p49R07j05k324j383L88Q78O31L93q9j99j055
$$ plain form
219556 -1896 -1435 -1549 -1989 -482 675 2049 3049 3873 1626 190 -637 -449 -654 2 685 -133 -715
220593 -715 -787 -673 -1289 -601 520 1988 5676 6307 2793 474 -1233 -1089 -435 728 91 -68 1476
221631 1476 129 -493 238 1316 1389 -1573 -2200 -1706 -2130 -1131 1183 1600 2052 2013 2017 834 -653 -453
222730 -453 -72 724 750 -494 208 -164 649 1578 690 937 1003 1729 331 420 1945 560 -1106 -1917 -1966
223889 -1966 -716 -378 344 125 -850 80 -44 8 -867 48 -832 -1405 -110 -1192 -2768 -2077 -1202 -578
224988 -578 -2117 -1919 -346 -818 -1549 -1767 -1252 120 184 2 -418 -461 -673 -282 -273 -322 -614 -1666 -2709
226148 -2709 -2173 -1399 -1650 -1168 165 793 -600 -1434 -1705 -2266 -910 960 1859 1314 -2398 -3508 -2837
227185 -2837 -2954 -3130 -2710 -2383 -739 505 -244 663 558 -1766 -3149 -2761 -1883 -1252 -859 -948 -1147 -2202
228284b202P89M71k68j447R70J643J056J461j345j804q68N03P66j926P89J121
229261b91m67q47n86L96K90P24K28R23L56j09O02j971j563l62rK094p00r3Q90
230420d95N77q31q78J885j71j407o19J105P56j80R31q61k12m39p67j16j33J722
231519a33N36r97q43J62J18o14M4J95r15J94J818J194K52j535j45M17K72P28j06
232679F42o48l15K72q06k43r7P03P05O51j426L62R77K79mj68O28j16k384j330
233838b318J02R62R15p66q22m2r08J56O90J658O17j6O23p42L82R59j621o40K521
234999A710o78j403j403j436J928K97J88j178Q53M87N75O05o21j647p43K405R45
236036H84m3j245J184m89M23k62R5J103k92k89j704M11j357K63k82L92q27l0j776
$$ plain form
228284 -2202 -1413 -942 -1210 -2657 -1687 -44 1012 2473 1128 -676 -1544 -1041 -275 -2201 -1412 -291
229261 -291 -758 -1605 -2191 -1795 -1505 -781 -553 370 726 617 1219 -752 -2315 -2677 -2686 -592 -1292 -1385 -495
230420 -495 82 -749 -1627 258 87 -1320 -1939 -834 -78 -258 673 -188 -400 -839 -1606 -1722 -1855 -133
231519 -133 403 -594 -1437 -1275 -1157 -1771 -1727 -1532 -2447 -2253 -435 759 1011 -524 -669 -252 20 748 642
232679 642 -6 -321 -49 -855 -1098 -1195 -492 213 864 -562 -200 777 1056 1052 884 1512 1396 -988 -2318
233838 -2318 -2216 -1254 -339 -1105 -1927 -1969 -2877 -2721 -2031 -373 244 228 851 109 491 1450 -171 -811 1710
234999 1710 1032 -371 -1774 -3210 -1282 -985 -797 -1975 -1122 -635 -60 545 -76 -1723 -2466 -61 884
236036 884 841 -404 780 291 714 452 547 1650 1358 1069 -635 -224 -1581 -1318 -1600 -1208 -2035 -2065 -3841
237196c841J90K368J722l93j135o13J938P6k029q94J489k23Q43O29j180l42p5
238233a470J355o00n55J354p4N6o53m96n62J79L18J542M79Q18k54L95k63k02J75
239393A542J118n66R74j500l01J48k805K03k39j388K869k02j382K52j179l29K480
240431c05J61M0j79J37j69n36Q66j048j683J134J195K27q71J73P23J084k32k207
241530a490R35L98O7J0O63q57l56j87J4k73J108R83M48K16j372k200p96L64m8
242689b373qQ36J329J9l10m76M12r50K93J082Q41j3Op92k270R19k94L22j257o14
243910c298M17K349J346J512J083r67p89j591k17j022P4K413k91M04j86n29j448
244948g40R22K012p9j22q14j142j325j376K00J051J061J281l12N7J152R06j095
$$ plain form
237196 -3841 -3651 -1283 439 46 -1089 -1702 236 312 -1717 -2611 -1122 -1345 -502 127 -1053 -1395 -1470
238233 -1470 -115 -715 -1270 84 10 66 -587 -1083 -1645 -1466 -1148 394 873 1691 1437 1832 1569 1367 1542
239393 1542 2660 2094 3068 1568 1267 1415 -1390 -1187 -1426 -2814 55 -147 -1529 -1277 -2456 -2785 -305
240431 -305 -144 -104 -283 -146 -315 -851 15 -1033 -2716 -1582 -387 -160 -1031 -858 -135 949 717 -1490
241530 -1490 -555 -157 -90 -80 583 -274 -630 -817 -803 -1076 32 1015 1463 1679 307 -1893 -2689 -2325 -2373
242689 -2373 -2381 -1545 -216 -197 -507 -983 -571 -1521 -1228 -146 695 682 688 -104 -2374 -1455 -1749 -1427 -2684 -3298
243910 -3298 -2881 -532 814 2326 3409 2442 1653 62 -155 -1177 -1103 1310 1019 1423 1237 708 -740
244948 -740 182 2194 2115 1993 1179 37 -1288 -2664 -2464 -1413 -352 929 617 674 1826 2732 1637
245986A637J27p16j083o23p96n44Q01O28k38r43q83J042J760L44J193k409q44
247023a547J664M78j95j037n60l40J514j307K22k9J052N29k58J120r98k469J36
248060b025R59p76O25J125J205Q84n54j569R11p08M60P38r3j03Q1j846m54q92
249159b032K99M64J434l17j447P67J57j412L91l45Q42L34Q74o09k5O88M06P78
250258A247r68o92k14J258l96k37K184p31p53m48j095J51n18J517m16m00K92R63
251357G44Q3k36K81k7P11j42k301n62Q26M74n7N97l74M03n75j77J66l88j36j058
252578a748j023N9J384M8J619o33k37J685o71l07L41j137k13J307j133K32l37
253615g64K712l54n87k38r54q14j348O24J674Q98k3M6J16p41M45p11j368M28j083
$$ plain form
245986 1637 1764 1048 -35 -658 -1454 -1998 -1197 -569 -807 -1750 -2633 -1591 169 513 1706 -703 -1547
247023 -1547 117 595 400 -637 -1197 -1537 -23 -1330 -1108 -1137 -85 444 186 1306 308 -2161 -2025
248060 -2025 -1066 -1842 -1217 -92 1113 1997 1443 -126 785 77 537 1275 1182 1079 1160 -686 -1140 -2032
249159 -2032 -1733 -1269 165 -152 -1599 -832 -675 -2087 -1696 -2041 -1199 -865 9 -600 -625 63 469 1247
250258 1247 279 -413 -627 631 235 -2 2182 1451 698 250 -845 -694 -1212 305 -111 -511 -219 744
251357 744 827 591 872 845 1556 1414 -887 -1449 -623 -149 -206 391 17 420 -155 -332 -166 -554 -690 -1748
252578 -1748 -2771 -2712 -1328 -1280 339 -294 -531 1154 483 176 517 -620 -833 474 -659 -427 -764
253615 -764 1948 1594 1007 769 -185 -999 -2347 -1723 -49 849 826 872 988 247 692 -19 -1387 -959 -2042
254775b042Q29J300k82j142j134m57P31O91J393p84q53n2L40k28N64J672k83j128
255874h65J946J364j459pO16n66j375j96k292p48J340K01P5Q39K26J255l1n30
256972b07r31j16o84L45K586q01k127L83J368J59j487Q26n40L88J980k18p49J8
258071A93j467l59J333M02O7L98k092l86R73J306P1j279m09R85J200j616j761
259109b441J721K22O67J068j001p10M70r66m18K468j9p16l46Q13M08P57j109o1
260207H07j716j168k4k99k14L52J71J75K93P20l01j339m43j58Q75Q54K061L58
261306A004p1M18J80j62r45o41k28k72L52L63j503k60N03J591L62L74o8j244R74
262466G27j360M0Q91p7K22j003q69K7M35l20P59r06j062K1J706Q13Q67J97j497
$$ plain form
254775 -2042 -1213 87 -195 -1337 -2471 -2928 -2197 -1506 -113 -897 -1750 -1802 -1462 -1690 -1126 546 263 -865
255874 -865 1081 2445 986 979 1595 1029 -346 -542 -2834 -3582 -2242 -2041 -1966 -1127 -901 354 323 -207
256972 -207 -1138 -1254 -1938 -1593 993 192 -1935 -1552 -184 -25 -1512 -686 -1226 -838 1142 924 175 193
258071 193 -1274 -1633 -300 102 169 567 -1525 -1911 -938 368 439 -840 -1249 -264 936 -680 -2441
259109 -2441 -720 -498 169 1237 236 -474 -4 -970 -1388 1080 1061 345 -1 812 1220 1977 868 807
260207 807 -909 -2077 -2101 -2400 -2614 -2262 -2091 -1916 -1623 -903 -1204 -2543 -2986 -3144 -2269 -1415 646 1004
261306 1004 933 1351 1531 1369 424 -217 -445 -717 -365 -2 -1505 -1765 -1262 329 691 1065 997 -247 727
262466 727 -633 -593 298 221 443 -560 -1429 -1402 -967 -1287 -528 -1434 -2496 -2475 -769 44 911 1108 -389
263626c89P05M93j507n54J35J26J591J093L59r98P21j005j561j231L84J298l41
264663f81j853L85O56M41q94k5M51L31K92n78m82j034K74J902J42j02R97j077
265762h55j772l46N40K21K421J005l59j221j495l80l76K110J487R5Q39K96m00
266800A810k323o39J286Q43q15j420L74P08l26j080J77K54J877L33k287m60J179
267837e09n49N34J636m78j251j84O62j097j109L73P54N74K271m4j912Q44o71R65
268936H09P62j357l84M00m2Q9j02k85j467j59Q56q73k88O58M7P76j152P31P16
270096b65K27K0J019J61P4n52o8p66j275K70O4J02Q10O0o21J328J122K80l1j57
271316A802j173m75j128K74j62j9R7n06P06R8n44M87M28l03j565l92R19n26m81
$$ plain form
263626 -389 316 809 -698 -1252 -1117 -991 600 1693 2052 1054 1775 770 -791 -2022 -1638 -340 -681
264663 -681 -2534 -2149 -1493 -1052 -1946 -1971 -1520 -1189 -897 -1475 -1957 -2991 -2717 -815 -673 -775 222 -855
265762 -855 -2627 -2973 -2433 -2212 209 1214 855 -366 -1861 -2241 -2617 -507 980 1075 1914 2210 1810
266800 1810 -513 -1152 134 977 162 -1258 -884 -176 -502 -1582 -1405 -1151 726 1059 -1228 -1688 -509
267837 -509 -1058 -524 1112 634 -617 -801 -139 -1236 -2345 -1972 -1218 -644 1627 1583 -329 515 -156 809
268936 809 1571 214 -170 230 188 277 175 -110 -1577 -1736 -880 -1753 -2041 -1383 -1336 -560 -1712 -981 -265
270096 -265 -38 -18 1001 1162 1236 684 616 -150 -1425 -1155 -1091 -989 -179 -119 -740 588 1710 1990 1959 1802
271316 1802 629 154 -974 -700 -862 -881 -784 -1290 -584 -486 -1030 -543 -115 -418 -1983 -2375 -1456 -1982 -2463
272476b463j126J088j26Q06J668R67p28o04J453r10j30p08J374R93O41n45m98
273514A152j54o50L25P15p51n6j315k13J33M85k24J317P70p92j668k046J255K107
274613C90L01J8J05N64P65n25r80j210K0j55P92m07P73j500n05j179K62O35Q06
275772a030Q69n8j918K05K72n89q29N55J901j20m5J340L36L63n82O34k298j135
276871b129K48Q86j551M16O45K600L7k677n68k83J158Q13j288j754j169P55R23
277909b938p53Q30K22J43j70K95k65P61N77n89K84K03j201J694J382q10Q4m17
279007f68N99P79M61j339q78J76L81M39j04j603p20J043k80n42N19l86J493R51
280106C21j344j019J914n10k60P8k41n00L41N79J868J91r28n84J295o36l03J451
$$ plain form
272476 -2463 -3589 -2501 -2627 -1821 -153 814 86 -518 935 25 -105 -813 561 1554 2195 1650 1152
273514 1152 998 348 673 1388 637 581 -734 -947 -814 -329 -553 764 1534 742 -926 -2972 -1717 390
274613 390 691 709 814 1378 2143 1618 638 -572 -552 -707 85 -322 451 -1049 -1554 -2733 -2471 -1836 -1030
275772 -1030 -161 -219 -2137 -1932 -1660 -2249 -3078 -2523 -622 -742 -787 553 889 1252 670 1304 -994 -2129
276871 -2129 -1881 -995 -2546 -2130 -1485 1115 1152 -1525 -2093 -2376 -1218 -405 -1693 -3447 -4616 -3861 -2938
277909 -2938 -3691 -2861 -2639 -2496 -2666 -2371 -2636 -1875 -1298 -1887 -1603 -1400 -2601 -907 475 -335 -251 -668
279007 -668 -69 710 1171 -168 -1046 -870 -489 -50 -154 -1757 -2477 -1434 -1714 -2256 -1737 -2123 -630 321
280106 321 -1023 -2042 -128 -638 -898 -820 -1061 -1561 -1220 -641 1227 1418 490 -94 1201 565 262 1713
281205A713N11O66j84j649k6K08k695j048N07J191J244L89L10j762J025M39J594
282242B433O7q71j276j754P49O53o14J46r52P6J251N16p45J243J463l93o74J568
283341B886j323q27l68j147J24p03K98O35n18q14J060J22J33l22j166j243P86
284379b387m58P70Q50P32n26j135R45L157q01m39J9O05j025j092n55J015o71j94
285478a190J14K277L01q82J143k260k27k75q15k51L70L56K3m96J13J339P85O35
286576A060J453j68j438q31m1L16L67M42j294N9J67r74P20J361J713K1p38N67
287675B762n96n75q25M16n27p02Q58r75j346K681O33r84N64l18o88LO66Q9k54
288835H82N69P09k53M94K14p17m85j46J448K554L963P097J5099J9638l670j0210
$$ plain form
281205 1713 2224 2890 2706 1057 1031 1239 -1456 -2504 -1997 -806 438 827 1137 -625 400 839 2433
282242 2433 2500 1629 353 -1401 -652 1 -613 -467 -1419 -1343 -92 424 -321 922 2385 1992 1318 2886
283341 2886 1563 736 368 -779 -655 -1358 -1060 -425 -943 -1757 -697 -575 -442 -764 -1930 -3173 -2387
284379 -2387 -2845 -2075 -1225 -493 -1019 -2154 -1209 1948 1147 708 727 1332 307 -785 -1340 -325 -996 -1190
285478 -1190 -1076 1201 1502 620 1763 -497 -724 -999 -1814 -2065 -1695 -1339 -1316 -1812 -1699 -360 425 1060
286576 1060 2513 2345 907 76 35 351 718 1160 -134 -75 92 -882 -162 1199 2912 2933 2195 2762
287675 2762 2166 1591 766 1182 655 -47 811 -164 -1510 1171 1804 820 1384 1066 378 381 1047 1136 882
288835 882 1451 2160 1907 2401 2615 1898 1413 1267 2715 5269 9232 16329 31428 51066 47396 37186
289811C7186r354o337l833j251q68j806j171l78m109j657l714Q55P15r67q98Q9
290788B502O66N18K398K879L625M692J1366K0107J789j1614j0047p331n376l586
291642A2588l52o30q32j234j120k084J94j482j579l77p33L86L65L65O24K420K101
292680H620M117R871K0382J0881j0108q090q160o620l915k742k806j855j506o31
293534G438l121k47M42r28o28O75k68j175k101l73R26n51J100m05j348J118P01
294572A255K85j28P05o75L08N05o53l44q04j099Q71K36n42N81K035L95K10j481
295671A660l52r40j178q32r38K10J561p26p04J79K264K737r86r87M75n29N23L28
296770A765k68r04j95k68n62J34Q29j57k294O73r77J61O06O42M13l16p91K079
$$ plain form
289811 37186 27832 21495 17662 16411 15543 13737 12566 12188 8079 6422 2708 3563 4278 3311 2413 2502
290788 2502 3168 3686 6084 8963 12588 17280 28646 48753 50542 38928 28881 21550 16174 12588
291642 12588 12236 11606 10774 9540 8420 6336 6530 5048 3469 3092 2359 2745 3110 3475 4099 6519 8620
292680 8620 12737 22608 42990 53871 43763 35673 27513 20893 16978 14236 11430 9575 8069 7438
293534 7438 4317 4070 4512 3584 2956 3631 3363 2188 87 -286 640 89 1189 784 -564 554 1255
294572 1255 1540 1412 2117 1442 1750 2255 1602 1258 454 -645 226 462 -80 501 2536 2931 3141 1660
295671 1660 1308 368 -810 -1642 -2580 -2370 -809 -1535 -2239 -2060 204 2941 1955 968 1443 914 1437 1765
296770 1765 1497 593 398 130 -432 -298 531 374 -1920 -1247 -2224 -2063 -1457 -815 -402 -718 -1509 570
297868E70J138N54n92J99p68j55L78q05Q71N29R98o92k53M40j278j660J60P11
298967C45rj069p79P84O89L84O88j261R76N96q53p03Q01L75j792M74J177o75j812
300127a664L55J757j514n43q44j72J585J1j629P92O75k00q28K342o3n07J933L25
301226A811j166k040K112J256J79j425k46l9J54J246j244j507m49J002j039l38
302202a733p47n65M77N64Q45l97N95k11M4J954J724j922n90J010m82n7P61O73
303301A943j77k417l74k98j103J322K220j237L60Q21j603l94l45m37j130L03J745
304339h01l18j148k1J130R61Q83m60j186K252k00j050M31Q13o83j953J257O39
305376E46N1k842O95K818R26Q9j574j117O78k02j32%k067P79L23q25k2M27Q91
$$ plain form
297868 570 1708 2262 1670 1869 1101 946 1324 519 1390 1919 2917 2225 1972 2412 1134 -526 -366 345
298967 345 336 -733 -1512 -728 -39 345 1033 -228 748 1344 491 -212 589 964 -828 -354 823 148 -1664
300127 -1664 -1309 448 -1066 -1609 -2453 -2625 -1040 -1029 -2658 -1866 -1191 -1391 -2219 123 60 -447 1486 1811
301226 1811 645 -1395 717 1973 2152 727 481 442 596 1842 598 -909 -1358 -356 -1395 -1733
302202 -1733 -2480 -3045 -2568 -2004 -1159 -1556 -961 -1172 -1128 826 2550 628 38 1048 566 509 1270 1943
303301 1943 1766 -651 -1025 -1323 -2426 -1104 1116 -121 239 1060 -543 -937 -1282 -1719 -2849 -2546 -801
304339 -801 -1119 -2267 -2288 -1158 -197 686 226 -960 1292 1092 42 473 1286 603 -1350 -93 546
305376 546 597 -2245 -1550 1268 2194 2283 709 -408 270 68 -64 -64 -2131 -1352 -1029 -1854 -1876 -1449 -558
306536e58j32J10J085k66j348R83p15o45R09l36M14J777K74n94k96nL1n72J83
307696B99j630j552K29J486K27p38J750K63q04J1q80n94N48q3j408P78O76Q40
308794e82K78r15J590J19p78j348k99J140L27j843j94P14j572J205K488R20j028
309832B22o78k84o91J563k3P72K147j651o8J374j548k233J29q08P44K650j086
310870E31J14N45K16R80J11k97j013q53o10k211N79J137Q68J441J466l82M4j700
311968I66o96K20J064n52j741l4j799o67J303L52j69K045N45j330j42K82l81p72
313067a506MJ071K99m83j820J94N65O39l04j04J88J464j0O38n0j660j514J283
314166a106J474r10K61P27n39o90n41J206R50J19k60q25n28P10Q70j2j146M47
$$ plain form
306536 -558 -690 -580 505 239 -1109 -126 -841 -1486 -577 -913 -499 1278 1552 958 662 657 688 116 299
307696 299 -1331 -2883 -2654 -1168 -941 -1679 71 334 -470 -459 -1339 -1933 -1385 -1468 -2876 -2098 -1422 -582
308794 -582 -304 -1219 371 490 -288 -1636 -1935 -795 -468 -2311 -2505 -1791 -3363 -2158 330 1250 222
309832 222 -456 -740 -1431 132 109 881 3028 1377 1309 2683 1135 -1098 -969 -1777 -1033 1617 531
310870 531 645 1190 1406 2386 2497 2200 1187 334 -276 -2487 -1908 -771 97 1538 3004 2622 2666 966
311968 966 270 490 1554 1002 -739 -773 -2572 -3239 -1936 -1584 -1753 292 837 -493 -635 -353 -734 -1506
313067 -1506 -1502 -431 -132 -615 -2435 -2241 -1676 -1037 -1341 -1445 -1257 207 197 835 785 -875 -2389 -1106
314166 -1106 368 -542 -281 446 -93 -783 -1324 -118 832 951 691 -134 -662 48 918 906 -240 207
315265B07N37J70Q72M1k284n14J100l43J12p18l58j012o70J170O84R44J67m83
316363c78q85p18k03O31L17J881n73J100j383j763O80j368R76R1K38K047J180
317401A870O93k117j095k59J102J756L48L17k235j228Q13N71j157q77M11M55J30
318438e02m11k82N67J554k07n43q47j406K86j32o26N09J109J020l32r18O9k06
319537a298O26p8J56O27o87qK49m86L06n29j161O13R34j264k07J828Q63o58J81
320697GJ672L60j777n41p05r69j131J527J236n77r34MJ234R9k0q1R45j236j09
321857i96k0K009P03j917j821O40j348k1J21J229L10K98K27L27l96o11J785R2
322955F11N62j634o13o09N55J909M99r54j55p20j472o23M09J278K962p33j563
$$ plain form
315265 207 744 914 1786 1827 -457 -971 129 -214 -102 -820 -1178 -2190 -2860 -1690 -1006 -62 105 -378
316363 -378 -1263 -1981 -2184 -1553 -1236 645 72 1172 -211 -1974 -1294 -2662 -1686 -1595 -1357 690 1870
317401 1870 2563 446 -649 -908 194 1950 2298 2615 380 -848 -35 536 -621 -1498 -1087 -632 -502
318438 -502 -913 -1195 -628 926 719 176 -671 -2077 -1791 -1923 -2549 -2040 -931 89 -243 -1161 -1092 -1298
319537 -1298 -672 -750 -594 33 -654 -662 -413 -899 -593 -1122 -2283 -1670 -736 -2000 -2207 -379 484 -174 7
320697 7 1679 2039 262 -279 -984 -1953 -3084 -1557 -321 -898 -1832 -1828 -594 -495 -515 -596 349 -887 -996
321857 -996 -1016 993 1696 -221 -2042 -1402 -2750 -2771 -2650 -1421 -1111 -813 -586 -259 -655 -1266 519 611
322955 611 1173 -461 -1074 -1683 -1128 781 1280 326 171 -549 -2021 -2644 -2235 -957 2005 1272 -291
323993b91P8P80M71o59o65o39K2r26R42P62j290j262N73P83J196j160J0J046M06
325153A77q27M42j54J926J224K35k281m61K10Q35L4O13M60j578k41k092o81m44
326252b603J033M85q2l4n41N61K04j124L21K36Q85J783J10m67Q12o10r47N59L37
327411I18P0j150j012J224o47LJ282j260j920p6K026J737j072J49r04K09J313
328449H90p28j096l28M15r0j532o9N55Q69j40M36k8O55o91M37P95J486j294j29
329608D13r48k2N50K83M71j184l30J827q88k97j348K5L18p32J828K420q22j005
330707E59P4j60j083J007J053k85j407R62r32P54N94j607r03K17J640R52O13r69
331806A079J43L60l46P95r71k009k37j130l91k18J014j09o28m52K418J017p75
$$ plain form
323993 -291 -213 567 1038 379 -286 -925 -903 -1829 -887 -125 -1415 -2677 -2104 -1321 -125 -1285 -1275 -229 177
325153 177 -650 -208 -362 1564 2788 3023 742 281 491 1326 1360 1973 2433 855 614 -1478 -2159 -2603
326252 -2603 -1570 -1085 -1167 -1201 -1742 -1181 -977 -2101 -1780 -1544 -659 1124 1234 767 1579 969 22 581 918
327411 918 988 -162 -1174 50 -597 -594 688 -572 -2492 -2568 -542 1195 123 272 -632 -423 890
328449 890 162 -934 -1262 -847 -937 -2469 -2538 -1983 -1114 -1254 -818 -846 -191 -882 -445 350 1836 542 413
329608 413 -535 -557 -7 276 747 -437 -767 1060 172 -125 -1473 -1448 -1130 -1862 -34 2386 1564 559
330707 559 633 473 -610 397 1450 1165 -242 720 -212 542 1136 -471 -1374 -1157 483 1435 2048 1079
331806 1079 1222 1582 1236 2031 1060 -949 -1186 -2316 -2707 -2925 -1911 -2020 -2648 -3100 -682 335 -440
332844d40n60k76p37o37J75P75q90j15M42J118M94nq5N7QO19j306O28P48Q69q00
334125H2j196r63M32O5J887J447q14r26m1j276O66L65J060N74j332j205J880K917
335224C622o63j173p53k301N38J561j014j418j769P31J382l17j115J159L94j370
336201b506J092l44J741K051o87J89N26j270j173J639j54K41k53P4j007j245j238
337239b324L06Q87J502O0j338P08L69k285Q47q09J39M34p70R56m73L7K67l02R55
338398h34j93N47M37j03o64j161Q22k59M53K86K76M35N72j144M26q42J059Q59
339497I72Q77k01k734ok49p13J30K85l08N91P82J379m10M42M93j17K98j56k51
340656A104K08p0O86J215O36r72n46p93j078o48j020q37J011J731p45k91K78j378
$$ plain form
332844 -440 -1000 -1276 -2013 -2650 -2475 -1700 -2590 -2705 -2263 -1145 -651 -656 -741 -684 -676 -57 -1363 -735 13 882 82
334125 82 -1114 -2077 -1645 -1580 307 1754 940 14 -27 -1303 -637 -272 788 1362 30 -1175 705 3622
335224 3622 2959 1786 1033 -1268 -730 831 -183 -1601 -3370 -2639 -1257 -1574 -2689 -1530 -1136 -2506
336201 -2506 -1414 -1758 -17 2034 1347 1536 2062 792 -381 1258 1104 1345 1092 1166 159 -1086 -2324
337239 -2324 -2018 -1131 371 431 -907 -199 170 -2115 -1268 -2077 -1938 -1504 -2274 -1318 -1791 -1754 -1487 -1789 -834
338398 -834 -1027 -480 -43 -146 -810 -1971 -1149 -1408 -955 -669 -393 42 614 -530 -104 -946 113 972
339497 972 1849 1648 -1086 -1092 -1341 -2054 -1924 -1639 -1947 -1356 -574 805 395 837 1330 1213 1511 1355 1104
340656 1104 1312 1242 1928 3143 3779 2807 2261 1468 390 -258 -1278 -2115 -1104 627 -118 -409 -131 -1509
341755a509k3o99j71Q66j5k31O67j95J005p47K74P21l058J22K038J050j436j705
342854c046L94N90K05n80N64N3J149J451P92q63r70m22q3J023n45j545J303p38
343953a268r82P16LJ244J246N57K58j930k039J8k8k0J88J054K97j470l73J065
345051a464M07J729Q77P51r31k925p00J225J22N37p1j617p89p45J449J194O59
346089b92o75o96j63j033K185M8n55j62O47M50j74p66o00P58J974J291L38q70
347188A705j094p27r69J111Pj218j048J597K68J374k150q22K815O90j207q93Q82
348226C21N67R53j595k059P33J520J382k60j19j20j477o05p15J026J197N65o39
349263F75o55n3j026p54J910L26J33L72o54K29M25j391J70O23r41J7J114Q8o88
$$ plain form
341755 -1509 -1532 -2231 -2402 -1536 -1551 -1782 -1115 -1310 -305 -1052 -778 -57 -3115 -2993 -955 95 -1341 -3046
342854 -3046 -2652 -2062 -1857 -2437 -1873 -1820 -671 780 1572 709 -261 -683 -766 257 -288 -1833 -530 -1268
343953 -1268 -2250 -1534 -1531 -287 959 1516 1774 -156 -2195 -2177 -2205 -2225 -2037 -983 -686 -2156 -2529 -1464
345051 -1464 -1057 672 1549 2300 1369 -1556 -2256 -1031 -909 -372 -443 -2060 -2849 -3594 -2145 -951 -292
346089 -292 -967 -1663 -1826 -2859 -674 -626 -1181 -1343 -696 -246 -420 -1186 -1786 -1028 946 2237 2575 1705
347188 1705 611 -116 -1085 26 33 -1185 -2233 -636 -368 1006 -1144 -1966 849 1539 332 -561 321
348226 321 888 1841 246 -1813 -1080 440 1822 1562 1443 1323 -154 -759 -1474 -448 749 1314 675
349263 675 20 -33 -1059 -1813 97 423 556 928 274 503 928 -463 -293 330 -611 -594 520 608 -80
350423h0l10p90q59N04K104P31L05j298p14p94J396L66r59m28m26n63J383j126
351521a558O22J364N26j79Q51n24j657k221j507O34J198J718R52k2J088r04k05
352559A76K0N49l54j482L10K338j165m68q66J12J078n63R24R42p9K20m13L42L69
353719A990r99j781O81j149o67j3MJ648K133n44j301n97p77q84O88l43K50J024
354818f37n66P85j154J07J40J269L76J819P83j437q07k22O86J036l62j125j277
355855e86R49j184m39J142M94n07J024J09K63n39l01k267m5O59J200J696m69j511
356954c12j31k089k37J145Q69j286R46j254j887N83K992J623j062l53O77j607
357931a383p40K69Q78J065j41r30p16J093J595L20P84r85j494q3r69M49J374N93
$$ plain form
350423 -80 -390 -1180 -2039 -1535 569 1300 1605 307 -407 -1201 195 561 -398 -826 -1252 -1815 -432 -1558
351521 -1558 -936 428 954 775 1626 1102 -555 -2776 -4283 -3649 -2451 -733 219 197 1285 381 176
352559 176 196 745 391 -1091 -781 1557 392 -76 -942 -830 248 -315 609 1551 1472 1692 1279 1621 1990
353719 1990 991 -790 -109 -1258 -1925 -1938 -1934 -286 1847 1303 2 -595 -1372 -2256 -1568 -1911 -1661 -637
354818 -637 -1203 -418 -1572 -1465 -1325 -56 320 2139 2922 1485 678 456 1142 2178 1816 691 -586
355855 -586 363 -821 -1260 -118 376 -131 893 1002 1265 726 425 -1842 -1887 -1228 -28 1668 1199 -312
356954 -312 -443 -2532 -2769 -1624 -755 -2041 -1095 -2349 -4236 -3653 -661 962 -100 -453 224 -1383
357931 -1383 -2123 -1854 -976 89 -52 -982 -1698 -605 990 1310 2094 1109 -385 -468 -1437 -988 386 979
359029I79M82n61J00O19K07j318j103m91J114j520R4L42J636J546j555j573K377
360067A375J271j881j515N12j271J517m65l76r52o13J070L80l77j47P4j81Q56
361105g23R23k04L28p87j418o09P96J022j98M16J21k07P99O55k26j36m87q23N23
362264b35N35O50P82r46L54L14j175l37l48L74p83P76j207Q92J223J033M10k011
363363C01m3J731J347j956j577q28O25j68J605J146q0j893j963j699J379J712
364340c61N8j495j14J389p12j302r7m3R3R81K356Q10j527r46j498p52j79R88K086
365500b65K21j98J3p70J84M43J692j364o96q66j6J469Q97M98j1j259j337J73Q30
366659c62J76j401J706P74Q20j320L86K3K85J084k30o63o7l27j93k69m87j511
$$ plain form
359029 979 1461 900 1000 1619 1826 508 -595 -1086 28 -1492 -1398 -1056 580 2126 571 -1002 1375
360067 1375 2646 765 -750 -238 -1509 8 -457 -833 -1785 -2398 -1328 -948 -1325 -1472 -1398 -1579 -723
361105 -723 200 -4 324 -463 -1881 -2490 -1694 -672 -870 -454 -333 -540 259 914 688 552 65 -758 -235
362264 -235 300 950 1732 786 1140 1454 279 -58 -406 -32 -815 -39 -1246 -354 869 1902 2312 301
363363 301 258 1989 3336 1380 -197 -1025 -400 -568 1037 2183 2103 210 -1753 -3452 -2073 -361
364340 -361 -303 -1798 -1912 -523 -1235 -2537 -2634 -2677 -2584 -1603 753 1563 36 -910 -2408 -3160 -3339 -2351 -265
365500 -265 -44 -242 -229 -999 -815 -372 1320 -44 -740 -1606 -1622 -153 744 1242 1231 -28 -1365 -1192 -362
366659 -362 -186 -1587 119 893 1713 393 779 802 1087 2171 1941 1278 1211 884 691 422 -65 -1576
367758a576K67r14P42M33J09P40j66o01j25K286J259k304j159P88K59l30r08j277
368857b477k574J416J805l65L31J53L46J078n51l34L67J533Q18j211k006R50K51
369894d70j084n56M62K13J238R69j703k89J007N05n56p91L47k01N1j09J7J532
370993E82M3J572j43j322r31J17m94k50q68M56J132m56j136j31k38M50L64O9R42
372153b42p47q3j400j09K489n88q91q5k26M55j220o61J34J756J520L69n37R32
373251H66Q33j872r96J738O25J29K5p55n24K46j394P85j74j568N69Q35J55M24
374350e3j52j162O20J710J474j402o17p7r44j233R80j018o59m87O68j96m44m98
375449c490O99K202P06j717M63NM41k32O69J840J76j208j297m51m5J057j21m17
$$ plain form
367758 -1576 -1309 -2223 -1481 -1048 -939 -199 -365 -966 -1091 1195 2454 150 -1009 -221 38 -292 -1200 -2477
368857 -2477 -5051 -3635 -1830 -2195 -1864 -1711 -1365 -287 -838 -1172 -805 728 1546 335 -1671 -721 -470
369894 -470 -1554 -2110 -1648 -1435 -197 772 -931 -1220 -213 292 -264 -1055 -708 -909 -858 -967 -950 582
370993 582 625 2197 2054 732 -199 -82 -576 -826 -1694 -1238 -106 -562 -1698 -1829 -2067 -1617 -1253 -1184 -242
372153 -242 -989 -1072 -2472 -2581 -92 -680 -1571 -1656 -1882 -1427 -2647 -3308 -3174 -1418 102 471 -66 866
373251 866 1699 -173 -1169 569 1194 1323 1348 593 69 315 -1079 -294 -468 -2036 -1467 -632 -477 -53
374350 -53 -205 -1367 -747 963 2437 1035 418 341 -603 -1836 -856 -1874 -2533 -3020 -2352 -2548 -2992 -3490
375449 -3490 -2791 -589 117 -1600 -1137 -1132 -691 -923 -254 1586 1762 554 -743 -1194 -1239 -182 -303 -720
376548g20J098l04J81K49K02L66L64M30q08j277O79m59k185P45P39L25O4P62N77
377707A028N8p46q12p65m45K562q45j717r1P5L18K063R5j439q14P95l59j882J96
378867b725P55j019N94R21J7m68R32K59m0L9J999j015O3M28L06q63k71J229K86
380027A427R6m01k52n18j41j483j077N54m27J209O17R8N67J997O91j797K81J298
381126B739j549j529Q6j52j55J35m78N11L39K84q38j273n98J110L36p27O92J098
382224C1n22l23r90R14K012O85q37j701K39J256Q34j366k205j84K094O02k26M
383323C17j70j24K59j5n03j073r66j71J261J089q15K078J243n7j050J76k054L46
384421b29J049j240J185O59j691j370M89J493M5l81n80j74O44N04N32J809j4j200
$$ plain form
376548 -720 378 74 255 504 706 1072 1436 1866 1058 -219 460 1 -2184 -1439 -700 -375 -311 451 1028
377707 1028 1086 340 -472 -1237 -1682 880 35 -1682 -1773 -1698 -1380 683 778 -661 -1475 -680 -1039 -2921 -2725
378867 -2725 -1970 -2989 -2395 -1474 -1457 -1925 -993 -734 -774 -735 1264 249 312 740 1046 183 -88 1141 1427
380027 1427 1523 1122 870 352 211 -1272 -2349 -1795 -2222 -1013 -396 -298 269 2266 2957 1160 1441 2739
381126 2739 1190 -339 -253 -405 -560 -425 -903 -392 -53 231 -607 -1880 -2478 -1368 -1032 -1759 -1067 31
382224 31 -491 -814 -1804 -890 1122 1807 970 -731 -492 764 1598 232 -1973 -2157 -63 539 313 317
383323 317 147 23 282 267 -236 -1309 -2275 -2446 -1185 -96 -911 1167 2410 2353 1303 1479 -575 -229
384421 -229 820 -420 765 1424 -267 -1637 -1148 345 390 9 -571 -745 -101 403 935 2744 2730 1530
385520A530l4J236k464j325j116O58P8L14O08N15J099m16k243k0J033O63J221
386558A337l10K07j29l95n78j10j69n59K49p40K15J561l40k34Q01n56o24m17P00
387718i1O51l45j003m00M99o62p86O56M13j1J193o07J797L17j537k20J799j016
388816F47j166q01N4J099L33J77k392J92N72O41o55l55J217r56O44L63k87K05
389915d68J039l6l9J570Q38k015m5J593j332j693q10o79M62m24N95J681J875M2
391014B154q14j576p12P47n60n72o02n38O05J692J798n34j123m57O7k73N41k169
392113b326L35N65J840K34j093j119rO92J418k00m33n32j33M69O2j64j90m15R67
393272c2K26j424J381J317l35N40j079k719Q31O71j359K181L199r25r45r6j448
$$ plain form
385520 1530 1496 2732 268 -1057 -2173 -1515 -1437 -1123 -515 0 1099 683 -1560 -1580 -547 116 1337
386558 1337 1027 1234 1105 710 132 22 -147 -706 -457 -1197 -982 579 239 5 806 250 -374 -791 -91
387718 -91 560 215 -788 -1188 -689 -1351 -2137 -1481 -1068 -1079 114 -493 1304 1621 84 -136 1663 647
388816 647 -519 -1320 -1266 -167 166 343 -2049 -1857 -1285 -644 -1299 -1654 -437 -1393 -749 -386 -673 -468
389915 -468 571 535 496 2066 2904 889 844 2437 1105 -588 -1398 -2077 -1615 -2039 -1444 237 2112 2154
391014 2154 1340 -236 -948 -201 -761 -1333 -1935 -2473 -1868 -176 1622 1088 -35 -492 -425 -698 -157 -2326
392113 -2326 -1991 -1426 414 648 -445 -1564 -1573 -881 537 337 -96 -628 -761 -292 -230 -394 -584 -999 -32
393272 -32 194 -1230 151 1468 1133 1673 594 -2125 -1294 -623 -1982 199 3398 2473 1528 1432 -16
394310a6j742j78Q94K160J17q38l13o40K13Q82J7J53j373K57q06L68m1J490j669
395469a065q90M67J446k06o24Q2R50O75j555n29J296J30L45K57p84J167Q93l53
396568A702j93p93q17K604q58k284j410M23J361j9j814L43L65o26M82J736J32
397606C34l05j376L63O87K40Q88l04j665j5J01o79J180R03j643J88j357n40J070
398705a930P07J124j582Q51J073p99r3n35J299l75p51q57P54o9m50n41J018N89
399803e67q27N20J6Q28L32j257Q20R47p27K3n59j259n4K83L59O91N5l15J093K27
401024F29j480j034J527k31J338r10j524n07L90Q96j6m26m25Q92q14j505J492
402062a708K67p40K489j19O07J180j38j481J047J37J2L01j000j018r21j719J225
$$ plain form
394310 -16 -1758 -1936 -1042 1118 1235 397 84 -556 -343 539 556 709 -664 -407 -1213 -845 -886 604 -1065
395469 -1065 -1955 -1488 -42 -248 -872 -790 160 835 -720 -1249 47 177 522 779 -5 1162 2055 1702
396568 1702 1509 716 -101 2503 1645 -639 -2049 -1626 -265 -284 -2098 -1755 -1390 -2016 -1534 202 334
397606 334 29 -1347 -984 -297 -57 831 527 -1138 -1153 -1052 -1731 -551 352 -1291 -1103 -2460 -3000 -1930
398705 -1930 -1223 -99 -1681 -830 243 -556 -649 -1184 115 -260 -1011 -1868 -1114 -1183 -1633 -2174 -1156 -567
399803 -567 -1394 -874 -858 -30 302 -955 -135 812 85 108 -451 -1710 -1764 -1481 -1122 -431 -376 -691 402 629
401024 629 -851 -1885 -358 -589 749 -161 -1685 -2192 -1802 -906 -922 -1348 -1773 -881 -1695 -3200 -1708
402062 -1708 -1441 -2181 308 189 796 1976 1838 357 1404 1541 1553 1854 854 -164 -1085 -2804 -1579
403100a579J811L77j330r75p25k51N97j73N90J053l9l80o9K579p12k335L43J48
404198a070R86J013j198K09L37p34L75R50o78j97j230O34J261J603R0O11k058
405236I04j862l51j334J436J266J083j641m72Q68M06J235j179J7n56J356o76p22
406273b22J20J016l12J8M36k231q74J231N60k14k80K245R90j054j516p31m87K74
407372a031k017Q81j97Q07Q84J804J010m61l174k384J779J71P71n14K17J44l67
408410a677k07O30M24J61Q82J59N88j492l19o78j354N77Q3L82O20p38M63J427
409508f9m48L1n53P26j50J523m53o12j60J57r86P49k53Pp01Q22M03P03P9j6R91
410790A790j375k280K24P58K77l14J52J076M03p55j005O27P24P85J30L42r41R8
$$ plain form
403100 -1579 232 609 -721 -1696 -2421 -2672 -2075 -2248 -1658 -605 -644 -1024 -1093 1486 774 -1561 -1218 -1070
404198 -1070 -84 929 -269 -60 277 -457 -82 868 190 -7 -1237 -603 658 2261 2351 2962 904
405236 904 -958 -1309 -2643 -1207 59 1142 -499 -971 -103 303 1538 359 376 -180 1176 500 -222
406273 -222 -102 914 602 620 1056 -1175 -2049 -818 -258 -472 -752 1493 2483 1429 -87 -818 -1305 -1031
407372 -1031 -3048 -2167 -2364 -1557 -673 1131 2141 1680 -1494 -3878 -2099 -1928 -1157 -1671 -1454 -1310 -1677
408410 -1677 -1884 -1254 -830 -669 213 372 960 -532 -851 -1529 -2883 -2306 -2223 -1841 -1221 -1959 -1496 -69
409508 -69 -517 -486 -1039 -313 -463 1060 607 -5 -165 -8 -994 -245 -498 -491 -1192 -370 33 736 815 799 1790
410790 1790 415 -1865 -1641 -883 -606 -920 -768 308 711 -44 -1049 -422 302 1087 1217 1559 618 716
411889G16l64k79q57q76k56R97R16P26j157K4m30r13J54J588N82O6J080k92r9
413049A326r29k032j74k15K039P40L11p18j284R91j643K02p28L19n98O05J178
414087f10K128P49l95l86m71j404J843P54q15j005N95J6j839j04j854j531K090
415124b239L77J49J046J506k55j066j73R56M14l19j839P0Q00R70qj468r3l67J10
416284a429J399Q01K46P92J34q74kr16l86j114J087J439J702l52q39o90n44o0
417382C94n9N90M52k784J59N17L90j89j508J398O03r02M77J685j904L24J56k31
418481d32k06n57l54J626n85k61n97N84M82l63Q17p25O52N01m88n48N31j20p95
419641h38P20j290N0L8k82L86L95j75o07N01J470N14m00q70J820j041j063p78
$$ plain form
411889 716 352 73 -784 -1660 -1916 -919 -3 723 -434 -410 -840 -1753 -1599 -11 571 637 1717 1425 1326
413049 1326 397 -1635 -1809 -2024 15 755 1066 348 -936 55 -1588 -1386 -2114 -1795 -2393 -1788 -610
414087 -610 1518 2267 1872 1486 1015 -389 1454 2208 1393 388 983 999 -840 -944 -2798 -4329 -2239
415124 -2239 -1862 -1713 -667 839 584 -482 -655 301 715 396 -1443 -1373 -573 397 389 -1079 -1172 -1539 -1429
416284 -1429 -30 771 1017 1809 1943 1069 1067 151 -235 -1349 -262 1177 2879 2527 1688 998 454 394
417382 394 335 925 1377 -1407 -1248 -731 -341 -530 -2038 -640 -37 -939 -462 1223 -681 -357 -201 -432
418481 -432 -638 -1195 -1549 77 -508 -769 -1366 -782 -300 -663 154 -571 81 582 94 -454 77 -43 -838
419641 -838 -118 -1408 -1358 -1320 -1602 -1216 -821 -996 -1603 -1102 368 882 482 -388 1432 391 -672 -1450
420740a450N07j8j126l03P9K01Q70R48j30j222m13R53J046J34m10J583J56L05
421838A710l82o64M95m56M20j02K45O51J378j086O67l08j764p04j203l75M65j467
422937b480J820J83K74l74K53J086o20r36k36l07J092J477j47j269J693p24j061
423975b76M68L6N14o6o11j90L00r44J28j385k41J142K0Q5P72o41J079O83N35j537
425196a29M15J541l12k01r28J42K86q63k183j067J616J348j757n1RJ198p92Q00
426294i28P88j016M32J95j168j190O17K092j822r23L11P49J169J373k83k79R27
427332A044l88k114q20Q03P4K74J04J47J623o68K72J750O42q75k484j327q80j232
428430d055k41K85J659O2j39N75O54J816L68j075j602J305R19l88K25P97r01j93
$$ plain form
420740 -1450 -943 -961 -2087 -2390 -2311 -2110 -1240 -292 -422 -1644 -2057 -1104 -58 76 -334 1249 1405 1710
421838 1710 1328 664 1159 703 1123 1021 1266 1917 3295 2209 2876 2568 804 100 -1103 -1478 -1013 -2480
422937 -2480 -660 -477 -203 -577 -324 762 142 -794 -1030 -1337 -245 1232 1085 -184 1509 785 -276
423975 -276 192 228 742 676 65 -125 175 -769 -641 -2026 -2267 -1125 -1105 -1020 -248 -889 190 873 1408 -129
425196 -129 286 1827 1515 1314 386 528 814 -49 -2232 -3299 -1683 -335 -2092 -2143 -2134 -936 -1728 -928
426294 -928 -140 -1156 -724 -529 -1697 -2887 -2270 -178 -2000 -2923 -2612 -1863 -694 679 396 117 1044
427332 1044 656 -1458 -2278 -1475 -1401 -1127 -1023 -876 747 79 351 2101 2743 1868 -616 -1943 -2823 -4055
428430 -4055 -4296 -4011 -2352 -2290 -2429 -1854 -1200 616 984 -91 -1693 -388 531 143 368 1165 264 71
429529G1N59O63j72J25j9j42p8K51M6n04M33l81j336j598Q7j87j500K55J615Q45
430750i67J743Q55j428l46k17j3j062j057J105n7J04R35j010R65J484q04J022
431788A252N9J604m55m446q30j88q29J826K968J52N43m0q24j389n41R59p08m15
432886a302K669q59K08K62K33k076J179J414l90j307j527p17P09J128j77j362
433863a915L67Q34K5o80N90J183l98K5l07o78K6o49l42J389J945j154l75J46P61
435023G93l36M8p76k2J233j13L27j133j171J41r31Q74J527J091R3r62M14K54j17
436183A234k15L90R0p81k665K223N35r70r64J211m16O97M75m37l19j116Q16j930
437281b142m55J656K66N8m03l72J45K65m76N8J290N85J26p30j515p78M62N59M03
$$ plain form
429529 71 630 1293 1121 1246 1227 1085 1007 1258 1304 800 1233 852 -484 -2082 -1995 -2182 -3682 -3427 -1812 -967
430750 -967 776 1631 203 -143 -360 -373 -1435 -2492 -1387 -1444 -1340 -405 -1415 -450 1034 230 1252
431788 1252 1311 2915 2460 -1986 -2816 -3004 -3833 -2007 961 1113 1656 1616 792 -597 -1138 -179 -887 -1302
432886 -1302 1367 508 716 978 1211 -865 314 1728 1338 31 -1496 -2213 -1504 -376 -553 -1915
433863 -1915 -1548 -714 -689 -1369 -779 404 6 31 -276 -954 -928 -1577 -1919 -530 1415 261 -114 32 793
435023 793 457 505 -271 -293 940 827 1154 21 -1150 -1009 -1940 -1066 461 1552 1645 683 1097 1351 1234
436183 1234 1019 1409 1499 718 -1947 276 811 -159 -1123 88 -328 369 844 407 88 -1028 -212 -2142
437281 -2142 -2597 -941 -675 -617 -1020 -1392 -1247 -982 -1458 -1400 -110 475 601 -129 -1644 -2422 -1960 -1401 -998
438441i98r91o03O12p18j04J952M23j239p9J056J100J25j794J00r8m65M42O51
439540f28j75J090l00m9j58n48j638N70K79J59j284K4J600J768J713l49K3j230
440638H67k145N39j34O74J092j52M73N38j78j302o54P74j532j850J067L68J110
441676d45J37O52L58O63n45j784l93k23K11J995o0o63o21p31O65k50n19j119M3
442836b629J320J205K64q53j58J184m99k71J23R97m5p04j63L2q21J238m59k103
443934b342J599K179p2p52J64J360j382j263j224N27jq69R18r13J403K2M58J452
445033A264j176n82N08N74k188k03K120J070K83j175N0J64r39K14K63n22o31r77
446132a883O58Q59L40n93L74j217j40j166M43P6J150J552l99n93J567M09O39j256
$$ plain form
438441 -998 -1989 -2592 -1980 -2698 -2802 -850 -427 -1666 -1745 -689 411 536 -1258 -1158 -1256 -1721 -1279 -628
439540 -628 -803 287 -13 -62 -220 -768 -2406 -1836 -1557 -1398 -2682 -2658 -1058 710 2423 2074 2097 867
440638 867 -1278 -739 -873 -199 893 741 1214 1752 1574 272 -382 392 -1140 -2990 -1923 -1555 -445
441676 -445 -308 344 702 1365 820 -964 -1357 -1580 -1369 626 566 -97 -718 -1449 -784 -1034 -1553 -2672 -2629
442836 -2629 -1309 -104 160 -693 -851 333 -166 -437 -314 683 638 -66 -229 -197 -1018 220 -239 -2342
443934 -2342 -743 1436 1364 612 776 2136 754 -509 -1733 -1206 -1207 -2076 -1158 -2071 -668 -646 -188 1264
445033 1264 88 -494 14 588 -1600 -1803 317 1387 1670 495 545 709 -230 -16 247 -275 -906 -1883
446132 -1883 -1225 -366 -26 -619 -245 -1462 -1602 -2768 -2325 -2249 -1099 453 54 -539 1028 1437 2076 820
447230H20p61m59j418P09J348o36r95j64J376K30R23o23j032l36l6n92J647O84
448329F85r11P86n0j583n30K80J337M84Q69m9m18p27j91Q6m57l85k096O59J160
449489a051l42p34J359P14n94J416K3o03r3l51m45n60l3K83R47N51m48l72L37
450649DQ89O99l17J705j284k536j315J079l6M22K19Q47M24n6j203R51n5Q63O85
451809A985j601j654k39o11P56J995j411j39k504m4M52K279N26MM56L78n45q17
452907g34P80k69Q64R15p04o79r24M96J96o06p81L00R81J40J19j07L69J005m14
454067I47k254p94N76R80r03J118O67K078q11q73j004m05p13R28K01K84o17l71
455165i66L48J35j748q09l64J960K132J24r91Q62j282r22r50K0l48O63P18R05
$$ plain form
447230 820 59 -400 -1818 -1109 239 -397 -1392 -1556 -180 50 973 350 -682 -1018 -1054 -1646 1 685
448329 685 -226 560 510 -1073 -1603 -1323 14 498 1367 1318 900 173 -18 68 -389 -774 -2870 -2211 -1051
449489 -1051 -1393 -2127 -768 -54 -648 768 791 188 95 -256 -701 -1261 -1294 -1011 -64 487 39 -333 4
450649 4 893 1592 1275 2980 1696 -840 -2155 -1076 -1112 -690 -471 376 800 744 -459 492 437 1300 1985
451809 1985 384 -1270 -1509 -2120 -1364 631 -780 -919 -3423 -3467 -3015 -736 -210 -206 250 628 83 -734
452907 -734 46 -223 641 1556 852 173 -751 -255 -59 -665 -1446 -1146 -165 -25 94 -13 356 1361 947
454067 947 -1307 -2101 -1525 -545 -1448 -330 337 2415 1604 731 -273 -678 -1391 -463 -262 22 -595 -966
455165 -966 -618 -483 -2231 -3040 -3404 -1444 688 812 -179 683 -599 -1521 -2471 -2451 -2799 -2136 -1418 -513
456264e13N89m70q93Q19j62N82n75l20J144P50K64p63n04J44n89J47J080R41m88
457424A183j097j702L0N73O94J04q31j242j04J498m09k08o89j073j103J228j70
458462c318N95J321j101J72Q24O63J137J853q22j530r31J52j174J175J436L12
459438G64j45p46J127m33k255J090K251j878j515K2R37q81r42n6M24Q97R07p3
460537e05j475J733j40k153k52N01J371N86J389M3j363k550j080K484J875J50
461514F14j068m37l44M8m19P2R94J556j314q90R31j136r24j55P99l55K303K641
462612B916P15r87j827o65K74K96r58K79J814o40j273l53n9J233m44l33j743J924
463711A69l25j460o23K62J451o83J27K638o11r24n10o35j751L02J80J078R99r20
$$ plain form
456264 -513 76 -394 -1287 -468 -630 -48 -623 -943 201 951 1215 452 -52 92 -497 -350 730 1671 1183
457424 1183 86 -1616 -1586 -1013 -319 -215 -1046 -2288 -2392 -894 -1303 -1511 -2200 -3273 -4376 -3148 -3318
458462 -3318 -2723 -1402 -2503 -2331 -1507 -844 293 2146 1324 -206 -1137 -985 -2159 -984 452 764
459438 764 619 -127 1000 567 -1688 -598 1653 -225 -1740 -1718 -781 -1662 -2604 -2660 -2236 -1339 -432 -505
460537 -505 -1980 -247 -387 -2540 -2792 -2291 -920 -334 1055 1098 -265 -2815 -3895 -1411 464 614
461514 614 -454 -891 -1235 -1187 -1606 -1534 -540 1016 -298 -1188 -257 -1393 -2317 -2472 -1673 -2028 275 2916
462612 2916 3631 2644 817 152 426 722 -236 43 1857 1217 -56 -409 -468 765 321 -12 -1755 169
463711 169 -156 -1616 -2239 -1977 -526 -1209 -1082 1556 945 21 -489 -1124 -2875 -2573 -2393 -1315 -316 -1236
464810a236L8j37j80K016J793k164j855M89M52n42P56P85K30R66L128O27j992
465847C174j515j416K6J4o78M70M6K46j937j437J801J477r86j048J427m03O44
466885i5p32P25P81j251q65P91J244q43k475k0J618Q92J099O72O08o53O01J532
467984C629m29j140j256oK34P15r64q82N10n23J20L84P98Mj491j062j00M96k45
469143a208j068R31Q1L03k26P58P16j425m81p4J37J51K03O40K71k09J735k851
470242a616j434j35J420J760K3o67K20K86q36l21K17O15k811j95J146r79J101
471280b206J634K5K07J150L43J95j119K96M21q6n13j694J558m35j694r49J509
472317a358K59Qm04l53L52O90L58J883m88j002L59l00k01J76N80j968J489R54
$$ plain form
464810 -1236 -1198 -1335 -1515 501 2294 130 -1725 -1236 -784 -1326 -570 215 445 1411 4539 5166 3174
465847 3174 1659 243 269 283 -395 75 121 367 -1570 -3007 -1206 271 -715 -1763 -336 -739 -95
466885 -95 -827 -102 679 -572 -1437 -646 598 -245 -2720 -2740 -1122 -230 869 1541 2149 1496 2097 3629
467984 3629 3200 2060 804 798 1032 1747 783 -99 411 -112 8 392 1190 1194 -297 -1359 -1459 -963 -1208
469143 -1208 -2276 -1345 -1264 -961 -1187 -429 287 -1138 -1619 -1693 -1556 -1405 -1202 -562 -291 -500 1235 -1616
470242 -1616 -3050 -3185 -1765 -5 18 -649 -429 -143 -979 -1300 -1083 -468 -3279 -3474 -2328 -3307 -2206
471280 -2206 -572 -547 -340 810 1153 1348 229 525 946 860 347 -1347 211 -224 -1918 -2867 -1358
472317 -1358 -1099 -1091 -1495 -1848 -1496 -806 -448 1435 947 -55 304 4 -197 -21 559 -1409 80 1034
473416A034q43j261J73O01N62m07N07p1K64J446j556M22J64j731J11P3P51l55
474515a16j102k95l83P46K559r61j146P36j473M6M15o34K19Q21q53n1J090p78
475614a160j22k85J191J623P41q98j70k30j699N15N37J659k98k857P81j23q87
476651a682L09J686j10kj460%R64K93m61j47K320k88o7k93j21J32j681K089J167
477811B648k40o49n46j281q92R46m85n67j0K42j051P2J023k90l22R9R93J553k28
478971A015j466P63O70r55r43L46N11l57r2J023m76r07R59j171o76J204m73q44
480069a869j292P81L26K239j38j096m33j070Q46m46p46J3j0J076J014r18o87N78
481168a832Q19j75l49M97L03J732m82j961J357p54O4r27K32R10Q93N99r83j078
$$ plain form
473416 1034 191 -1070 -897 -296 266 -141 366 295 559 2005 449 871 1035 -696 -585 -512 239 -116
474515 -116 -1218 -1513 -1896 -1150 1409 448 -698 38 -1435 -1389 -974 -1608 -1389 -568 -1421 -1472 -382 -1160
475614 -1160 -1282 -1567 -376 1247 1988 1090 920 690 -1009 -494 43 1702 1404 -1453 -672 -795 -1682
476651 -1682 -1373 313 203 201 -1259 -1259 -295 -2 -463 -610 1710 1422 1355 1062 941 1073 -608 1481 2648
477811 2648 2408 1759 1213 -68 -960 -14 -499 -1066 -1076 -834 -1885 -1813 -790 -1080 -1402 -1303 -310 1243 1015
478971 1015 -451 312 982 27 -916 -570 -59 -416 -508 515 39 -868 91 -1080 -1756 -552 -1025 -1869
480069 -1869 -3161 -2380 -2054 185 47 -1049 -1482 -2552 -1706 -2152 -2898 -2885 -2895 -1819 -805 -1723 -2410 -1832
481168 -1832 -1013 -1188 -1537 -1040 -737 995 513 -1448 -91 -845 -781 -1708 -1476 -566 327 926 -57 -1135
482267a135K32j289j06K749P34R32j252p71N08jk24m59J18j929j39O11J195K63
483365C7o11J60r56O35J126N2p93j32j805O40J20l82L0K804K267n54j360O16r04
484525I90j773N22%k14m12J995M59o47k341r78J275j14K24K105m42j461M42L37
485624c3j058K60N73n34O41J88o16J86J134j147k168j246j69J689K859R33j004
486662D88j261r33r31J339K851j279m97q60J254k236n82L39J939J300N36j845
487638c78j629j105J71J348K66J55K145l9j66j211K39Q93j654J420l64O94L53
488676A138p3J21o42m37o0O37j131m94k72N60K16O50M40N57j13p25K52l90l34
489836a00J81J296j038j253j557N86k22R84j29R51j51P7n09K80K096j42n80J54
$$ plain form
482267 -1135 -903 -2192 -2298 451 1185 2117 865 94 602 601 377 -82 36 -1893 -2032 -1421 -226 37
483365 37 -574 -414 -1370 -735 391 443 -350 -482 -2287 -1647 -1527 -1909 -1879 925 3192 2638 1278 1894 990
484525 990 -783 -261 -261 -475 -887 1108 1567 920 -1421 -2399 -1124 -1238 -1014 1091 649 -812 -370 -33
485624 -33 -1091 -831 -258 -792 -151 37 -579 -393 741 -406 -2574 -3820 -3989 -2300 559 1492 488
486662 488 -773 -1706 -2637 -1298 1553 274 -223 -1083 171 -2065 -2647 -2308 -369 931 1467 -378
487638 -378 -2007 -3112 -2941 -1593 -1327 -1172 973 934 768 -443 -204 689 -965 455 91 785 1138
488676 1138 1065 1186 544 107 47 684 -447 -941 -1213 -653 -437 213 653 1210 1097 372 624 234 -100
489836 -100 81 1377 339 -914 -2471 -1885 -2107 -1123 -1252 -301 -452 -375 -884 -604 1492 1350 770 924
490934I24j0M20k52j24l99L09O42J422p64n61N86o21n81k163k43L39R78P73k90
492094C85j663k17J361J481n37N37q38j767o63K06l63R8j682K621K525j058P89
493132A215q94L46N25K84L64n54j767j233J60P22p02J51j904n16K654o47R93J036
494230B33L57k15L19l35r26M86p50j998J620J484J283L03j943P03N93M99p91n82
495329C40q68J152L04M44n27k841m84J291k03j132J637J120j035n46J371j047
496306a024Q32J273j007p18n52j18k322k73J716K446k97l78n48J86j337K58J24
497343a739o76q16N44J422R27L38M84k79l53j153j227J0J035m02n54J501L18l88
498442a008j6Q02J638J589j784k77k555r73O43P88Q51M95o69Q73r97J31o03M61
$$ plain form
490934 924 914 1334 1082 958 559 868 1510 2932 2168 1607 2193 1572 991 -1172 -1415 -1076 -98 675 385
492094 385 -1278 -1495 -134 1347 810 1347 509 -1258 -1921 -1715 -2078 -1980 -3662 -1041 1484 426 1215
493132 1215 321 667 1192 1476 1840 1286 -481 -1714 -1554 -832 -1534 -1383 -3287 -3803 -1149 -1796 -803 233
494230 233 590 375 694 359 -567 -81 -831 -2829 -1209 275 1558 1861 -82 621 1214 1713 922 340
495329 340 -528 624 928 1372 845 -1996 -2480 -1189 -1392 -2524 -887 233 -802 -1348 23 -1024
496306 -1024 -192 1081 74 -644 -1196 -1314 -3636 -3909 -2193 253 -44 -422 -970 -784 -2121 -1863 -1739
497343 -1739 -2415 -3231 -2687 -1265 -338 0 484 205 -148 -1301 -2528 -2518 -1483 -1885 -2439 -938 -620 -1008
498442 -1008 -1024 -222 1416 3005 1221 944 -1611 -2584 -1941 -1153 -302 193 -476 397 -600 -469 -1072 -611
499541f11O59O41L33p05k3J110q03M03j58PJ128P95j55M26k25m66l62r32q70j440
500762a248l38P3n42M45l78L20J56R01jJ485l80r9o93J252j4K31N06K45j632j70
501982A19q4O24m39j1r51n27J724P07j131j071J934q46k44J03m67N64P29j194
503081d61j133n31j818p48k3K038K152P46l53m75j62J272J49j673O20P24l62J669
504180A631p8j071O49j361K109K086j446k835j038j070J315O11R97N26J76k100
505156h99q1M71o2R14K87o46J70J30K06O01q04m3q07Q85j99J240K474R85k423
506316B399l106o50J806K80o15P27rl13J312j188j146K57k64N04R97o00K43J243
507415A877r8r86l39q02j872P80N90q55m11K073L079P78j195j507j335l42l23
$$ plain form
499541 -611 48 689 1022 317 294 1404 601 1004 846 853 1981 2776 2621 3047 2822 2356 1994 1062 192 -1248
500762 -1248 -1586 -1513 -2055 -1610 -1988 -1668 -1512 -611 -612 873 493 394 -299 953 939 1170 1676 1921 289 119
501982 119 35 659 220 209 -742 -1269 455 1162 31 -1040 894 48 -196 -93 -560 4 733 -461
503081 -461 -1594 -2125 -3943 -4691 -4714 -2676 -524 222 -131 -606 -768 504 653 -1020 -400 324 -38 1631
504180 1631 1553 482 1131 -230 1879 3965 2519 -316 -1354 -2424 -1109 -498 499 1025 1201 -899
505156 -899 -980 -509 -571 343 630 -16 154 284 490 1091 287 244 -563 322 123 1363 3837 4822 2399
506316 2399 -707 -1357 449 729 114 841 832 519 1831 643 -503 -246 -510 -6 991 391 634 1877
507415 1877 1779 793 454 -348 -2220 -1440 -850 -1705 -2116 -43 3036 3814 2619 1112 -223 -565 -888
508452h88J356l80j880j154l85J809o05l97k25J038J025N38j235j478J095J837
509429G1Q8j673l40J268J769j042r04J77O80M29M4k37j761j79M85L77j803r39
510528c490j29J361L76l87j013J130J778N13M84m63o51J13O33j781l64Q60n28
511566a558J747P42R07n17r55O45O87k295q69J413J953L57l22O10j473k084k17
512603a229L25K064p78J098l67J30K143J30j724r57N54j088j513M38K44L69l29
513641d90j311N04m7K151q55k598P86K000N56j57l33r25J0K149J205p44k164j067
514739a330K2j79j393K99K034L62K5L56K070K75j509n36j17R54q54k125K34J584
515838A72J037p40J90J023R75k378N82j004o01Q9r85J034J328j085q70N13K146
$$ plain form
508452 -888 468 88 -1792 -2946 -3331 -1522 -2127 -2524 -2749 -1711 -686 -148 -1383 -2861 -1766 71
509429 71 159 -1514 -1854 -586 1183 141 -763 -586 94 523 567 330 -1431 -1610 -1125 -748 -2551 -3490
510528 -3490 -3619 -2258 -1882 -2269 -3282 -2152 -374 139 623 160 -491 -378 255 -1526 -1890 -1030 -1558
511566 -1558 189 931 1838 1321 366 1011 1698 -597 -1466 -53 1900 2257 1935 2545 1072 -1012 -1229
512603 -1229 -904 1160 382 1480 1113 1243 3386 3516 1792 835 1389 301 -1212 -774 -530 -161 -490
513641 -490 -1801 -1297 -1344 807 -48 -2646 -1860 140 696 539 206 -719 -709 1440 2645 1901 -263 -1330
514739 -1330 -1308 -1487 -2880 -2581 -547 -185 -160 196 2266 2541 1032 496 379 1333 479 -1646 -1412 172
515838 172 1209 469 659 1682 2657 279 861 -143 -744 -655 -1640 -606 722 -363 -1233 -720 1426
516876A426j585j018k31j33Q95J176k94M68P41j829l64J593j331M69o30O97p08
517914f58k81N70q57L80o4q98M68j156Q27J370j060k491J371k53J724J227kk360
519012b143J042J67j591J679L02m9j408K169J11j341o16m74l88K117r58J082K62
520050c7q14k47j28j102j250J994K162p98o32J031m19l76J09Q07j688J06K53K17
521149h12k32j573M06N36J559K02l49J425L72k217O66J302j77q89N51j15q47r77
522247a169P96J792o23r59j522j84P55N71M89p64M04O27j232q71J203k96J231
523285B48J104j129J59o97m31o95o20j46l0J258R7q15M28J160nq61p40M13J000
524445c02l18k211J845L16j78N35j20o36Lq61M15m42j628N0K145J103K97K85R5
$$ plain form
516876 1426 -159 -1177 -1408 -1541 -646 530 236 704 1445 -384 -748 845 -486 -17 -647 50 -658
517914 -658 -939 -369 -1226 -846 -910 -1808 -1340 -2496 -1669 -299 -1359 -3850 -2479 -2732 -1008 219 217 -2143
519012 -2143 -1101 -934 -2525 -846 -544 -593 -2001 168 279 -1062 -1678 -2152 -2540 -423 -1381 -299 -37
520050 -37 -851 -1098 -1226 -2328 -3578 -1584 578 -220 -852 179 -240 -616 -507 300 -1388 -1282 -1029 -812
521149 -812 -1044 -2617 -2211 -1675 -116 86 -263 1162 1534 -683 -17 1285 1108 219 770 655 -192 -1169
522247 -1169 -373 1419 796 -163 -1685 -1869 -1114 -543 -54 -818 -414 213 -1019 -1890 -687 -983 248
523285 248 1352 223 382 -315 -746 -1441 -2061 -2207 -2237 -979 -882 -1697 -1269 -109 -114 -975 -1715 -1302 -302
524445 -302 -620 -2831 -986 -670 -848 -313 -433 -1069 -1066 -1927 -1512 -1954 -3582 -3532 -1387 -284 13 298 393
525604C93Q27j247r80l8O92O36l50m04k43J02L39J162R54k054L06N04l3K28j328
526764e34j683J108l12K463J850j216j606J79J22j484Q42M68m62q75O36J852q31
527802E17j882Q10J96J38o61o64j39P62J431p41k80M60J143K96j164m63j643q45
528900b729M87K773J367o18j910r17J57J165l28j00p23j68N81J76K57K52j445
529938a723p0N96J860N28j613M41J61j133O6l34L34J246j85o46J295N7o34n44
531037b98m47j356l0L36J228O22n84Q76k093r87r04L82J345K735j45q44n95Ok2
532197g75J334n41j225N59L36O14J067j206m4J003m34P8r37o09k264M03J512Q97
533295b32n28n09m13j512L67J640J903J233l22k187J65J300n02o46j596r28j392
$$ plain form
525604 393 1220 -27 -1007 -1045 -353 283 -67 -471 -714 -612 -273 889 1843 -211 95 599 566 794 -534
526764 -534 -2217 -1109 -1421 1042 2892 1676 70 249 371 -1113 -271 197 -265 -1140 -504 1348 517
527802 517 -1365 -555 -359 -221 -882 -1546 -1685 -923 508 -233 -513 -53 1090 1386 222 -241 -1884 -2729
528900 -2729 -2242 531 1898 1280 -630 -1547 -1390 -225 -553 -653 -1376 -1544 -963 -787 -530 -278 -1723
529938 -1723 -1793 -1197 663 1191 -422 19 180 -953 -887 -1221 -887 359 174 -472 823 880 246 -298
531037 -298 -745 -2101 -2131 -1795 -567 55 -529 347 -1746 -2733 -3637 -3255 -1910 825 680 -164 -759 -753 -775
532197 -775 559 18 -1207 -648 -312 302 1369 163 119 1122 688 766 -171 -780 -3044 -2641 -1129 -232
533295 -232 -760 -1269 -1682 -3194 -2827 -1187 716 1949 1627 -560 -395 905 403 -243 -1839 -2767 -4159
534333d159R2O35J402J159L57j26Q82J68m72M06L5o13J230l58M21m2K2q07j015
535493g83j024M24M92m37k12n17K66J549M70j543r12N63Q96k1m3K61L12l65k443
536652c067J738J393j082j847Lj224K337L91q61r27J425K180J219k278M89m56
537629e67j278m90p5Q21K2o03l00J201l22j909P35J336K353J731j026r95o44m60
538728d70n37O69N20L17o26m52j257m59J95M64J66J547J355r72l54j833L48O34
539826g45m88K97K36L68R80J24K14j378j193L97J289K70J911q27j825J028L72
540864A030J462m81n72M85j18k606n24q51r3l54J474Q09Q02J331m84j375k296
541902b361l85j50P95M06j17m23L53K406K0p12M43N7N7l11Q48n21q87n39j115
$$ plain form
534333 -4159 -4067 -3432 -2030 -871 -514 -640 242 410 -62 344 379 -234 996 638 1059 1017 1039 232 -783
535493 -783 -1807 -1383 -891 -1328 -1540 -2057 -1791 -242 228 -1315 -2227 -1664 -768 -789 -832 -571 -259 -624 -3067
536652 -3067 -1329 64 -1018 -2865 -2862 -4086 -1749 -1358 -2219 -3146 -1721 459 1678 -600 -111 -567
537629 -567 -1845 -2335 -2410 -1589 -1567 -2170 -2470 -1269 -1591 -3500 -2765 -1429 924 2655 1629 634 -10 -470
538728 -470 -1007 -338 182 499 -127 -579 -1836 -2295 -2100 -1636 -1470 77 1432 460 106 -1727 -1379 -745
539826 -745 -1233 -936 -700 -332 648 772 986 -392 -1585 -1188 101 371 2282 1455 -370 658 1030
540864 1030 2492 2011 1439 1924 1806 -800 -1324 -2175 -2268 -2622 -1148 -339 463 1794 1310 -65 -2361
541902 -2361 -2746 -2896 -2101 -1695 -1812 -2235 -1882 524 544 -168 275 332 389 78 926 405 -482 -1021 -2136
543061b136M9K82J203J037J23Q31qk031M78q38j373j221P86J218M52J001j419
544099a566j125J891r7K57J101j220L65j53k51O07J330n0K26j56q23L89J74j019
545198a20J101J50p71r22L90J26p10K82P85p37k02K53M77L32l0L6P90n69l54j88
546419A19j661p82N38m62j689O68K668R42N39j472J38J170j005N94L12Q18k92
547456A143q48K92J282p63q73n06n28P7q87J986r83j642o08j006Q31N87P35J935
548555B24J00o16o01j078l13R94P95L22o83o55q40M77J276M63K010O79p52L41
549654B143j766l356K31J967M46o93O67MM58n39J064M22N31K34j277k295k60N42
550752a477J149K86j114O12P48j65j283M85R77J648l5L23o79j315p29r75r32M23
$$ plain form
543061 -2136 -2087 -1805 -602 435 558 1389 1381 -650 -172 -1010 -2383 -3604 -2818 -1600 -1148 -147 -1566
544099 -1566 -2691 -800 -897 -640 461 -759 -394 -547 -798 -191 1139 1089 1315 1159 336 725 899 -120
545198 -120 981 1131 360 -562 -172 -46 -756 -474 311 -426 -628 -375 102 434 404 440 1230 661 307 119
546419 119 -1542 -2324 -1786 -2248 -3937 -3269 -601 341 880 -592 -454 716 -289 305 617 1435 1143
547456 1143 295 587 1869 1106 233 -273 -801 -724 -1611 375 -608 -2250 -2858 -3864 -3033 -2446 -1711 224
548555 224 324 -292 -893 -1971 -2284 -1290 -495 -173 -856 -1511 -2351 -1874 -598 -135 1875 2554 1802 2143
549654 2143 377 -2979 -2748 -781 -335 -1028 -361 -357 101 -438 626 1048 1579 1813 536 -1759 -2019 -1477
550752 -1477 -328 -42 -1156 -544 204 39 -1244 -759 218 1866 1831 2154 1475 160 -569 -1544 -2476 -2053
551851b053K95Q7Q74R33L11p08L63M76p9j660l15P47l04J1K371M20p86M25J20
553011A528O96k088j084J938M34l26j454k59N2j305L38N2J681K920p31j975O28
554049A045j871m55l55J178P29m26j148k71K57K44r54m3N55K94J145R26n49J052
555147A353M0j707q81p0O04Q9j67l34J851J554j06q74j58J28j161n87j093J44
556246a375L16Q42n02j478j207p69J851L93N35N40M47rj541m63J098J238O74K52
557345H42j165J320P67q70J562J7m96j987m41J348n51j071o40o30O98J393J07
558382B03p35m11M44j99r8P72n02j695p65J821M6Q80M7J601K86j890j472j080
559481b747O87K73q25L57j44J69K716j26j480Q79J526n78m78k89j106l96J410
$$ plain form
551851 -2053 -1758 -1671 -797 136 447 -261 102 578 499 -1161 -1476 -729 -1033 -1022 1349 1769 983 1408 1528
553011 1528 2224 136 -948 990 1424 1098 -356 -615 -563 -1868 -1530 -1478 203 3123 2392 417 1045
554049 1045 -826 -1281 -1636 -458 271 -155 -1303 -1574 -1317 -1073 -2027 -2070 -1515 -1221 -76 850 301 1353
555147 1353 1393 -314 -1195 -1265 -661 -572 -739 -1073 778 2332 2226 1352 1194 1322 161 -426 -1519 -1375
556246 -1375 -1059 -217 -719 -2197 -3404 -4173 -2322 -1929 -1394 -854 -407 -416 -1957 -2420 -1322 -84 590 842
557345 842 -323 997 1764 894 2456 2473 1977 -10 -451 897 346 -725 -1365 -1995 -1297 96 203
558382 203 -532 -943 -499 -698 -796 -24 -526 -2221 -2986 -1165 -1119 -239 -192 1409 1695 -195 -1667 -2747
559481 -2747 -2060 -1787 -2612 -2255 -2399 -2230 486 360 -1120 -241 1285 707 229 -60 -1166 -1562 -152
560519a52O30Q51o97k285kJ19J526M11K10Q43o52P36o3O03k89q7J79j314k130
561678a563P09J105m58r76M71m93n02N37j073L10J716n79o58J54K74N46K39j33
562777c74j169O16J670j589j903M17O02%q90j049O72R68P92j467j126J686Q96
563815a248l97P38K856m66K61j215L11M1j327l59Q7J71q19L76j042j730K752K448
564913A438n35p38M10j187o57K270k1J032r01N43M90j839j016J024n7m65J18K25
566012A34P90k92j213k20p35l27J893j4j184m28O88R85j127j296M81O98j2q33
567111b012m69K248P17J03j868L90N71R86J10l19O90J321k58k045m37j955M28
568148a799J840K87j250J648k12k64p52n24K202K95r97R31L6j022N8j098R48M32
$$ plain form
560519 -152 478 1329 632 -1653 -1655 -1536 -10 401 611 1454 802 1538 1475 2078 1789 1702 1881 567 -1563
561678 -1563 -854 251 -207 -1183 -712 -1205 -1707 -1170 -2243 -1933 -217 -796 -1454 -1300 -1026 -480 -241 -374
562777 -374 -1543 -927 743 -846 -2749 -2332 -1730 -1730 -2620 -3669 -2997 -2029 -1237 -2704 -3830 -2144 -1248
563815 -1248 -1645 -907 1949 1483 1744 529 840 881 -446 -805 -718 -547 -1366 -990 -2032 -3762 -1010 1438
564913 1438 903 165 575 -612 -1269 1001 980 2012 1111 1654 2144 305 -711 313 256 -209 -91 134
566012 134 924 632 -581 -801 -1536 -1863 30 16 -1168 -1596 -908 77 -1050 -2346 -1865 -1167 -1179 -2012
567111 -2012 -2481 -233 484 587 -1281 -891 -320 666 776 457 1147 2468 2210 165 -272 -2227 -1799
568148 -1799 41 328 -922 726 514 250 -502 -1026 1176 1471 474 1405 1441 419 477 -621 327 759
569247G59P6j01J085k012j317O25j033J070Q83L90N02Q6O02m78j110J41N67k485
570346a750l86J786N48p36J07p27l72l79J122o29J43j46J128n11J460J958q37
571384A779N58j117n55m25Q21l24n16m0O72k18p80j610Q78J264r09m91j150R41
572482a222K41J91o97j60L52J55j11j299N90K120l69k221L45J201j061J61J339
573520d45N53l00m44K53n60n60K42N03O51k47R05M04k265o94K82m63J616q74p17
574680b160L17R43J814K98K02j273j015J045k12m42l58N69j618r38J83R04J236
575717e05r29j04Q52n38n19J525M10J798j525k255J061o04m51J591l84N52M08
576755C83K277p63j775o98J288M16k95k80R89j476N44j069O50J514P20j364q10
$$ plain form
569247 759 835 734 1819 -193 -1510 -885 -1918 -848 35 425 927 1013 1615 1137 27 168 735 -1750
570346 -1750 -2136 -350 198 -538 -431 -1158 -1530 -1909 -787 -1416 -1273 -1419 -291 -802 658 2616 1779
571384 1779 2337 1220 665 240 1061 737 221 181 853 635 -145 -1755 -877 387 -522 -1013 -2163 -1222
572482 -1222 -981 -790 -1487 -1647 -1295 -1140 -1251 -2550 -1960 160 -209 -2430 -2085 -884 -1945 -1784 -445
573520 -445 108 -192 -636 -383 -943 -1503 -1261 -758 -107 -354 551 955 -1310 -2004 -1722 -2185 -569 -1443 -2160
574680 -2160 -1843 -900 914 1212 1414 141 -874 171 -41 -483 -841 -272 -1890 -2828 -2645 -1741 -505
575717 -505 -1434 -1538 -686 -1224 -1743 -218 192 1990 465 -1790 -729 -1333 -1784 -193 -577 -25 383
576755 383 2660 1897 122 -576 712 1128 833 553 1542 66 610 -459 191 1705 2425 1061 251
577793B51q74P36M05m4K81N07j518P16n97P65l80O75j316m19M4R2P33P13r63q99
579013a092R68J471j227l76N31j053J712K116p28r86k042o02R01J14j29P47o83
580051c58N7j77R28k92p8J911q48J12K3j899m72J08k36M42R53j10N14R35j930
581211d17q43o15o5Nj11J103K60j119J194M24R81J58j068M63o84l42P27M76J508
582371B035j517j497K65J475r6k054j70K12P96k50N96k10q41J443O94k75j060
583408d54J73n84J190k21j01R56k36j879p14N0J875N05M84J263j83k80n90o70
584507E84j050J184J555l03k240l85l79Q54J131j120p23L8p37O61L08Q5N57j069
585605a049p28K27j57k3O60m61p48k43P68R49j22J241K205j04j063M3q64j652
$$ plain form
577793 251 -623 113 518 474 755 1262 -256 460 -137 628 248 923 -393 -812 -768 -676 57 770 -193 -1092
579013 -1092 -124 1347 120 -256 275 -778 934 3050 2322 1336 -706 -1308 -407 -293 -422 325 -358
580051 -358 -301 -478 450 158 80 1991 1143 1255 1278 -621 -1093 -985 -1221 -779 174 64 578 1513 -417
581211 -417 -1260 -1875 -1940 -1935 -2046 -943 -683 -1802 -608 -184 797 955 -113 350 -334 -676 51 527 2035
582371 2035 518 -979 -714 761 665 -1389 -1559 -1347 -551 -801 -205 -415 -1256 187 881 606 -454
583408 -454 -281 -865 325 104 3 959 723 -1156 -1870 -1820 55 560 1044 2307 2124 1844 1254 584
584507 584 -466 718 2273 1970 -270 -655 -1034 -180 951 -169 -892 -854 -1591 -930 -622 -537 20 -1049
585605 -1049 -1777 -1550 -1707 -1730 -1070 -1531 -2279 -2522 -1754 -805 -927 314 2519 2415 1352 1395 531 -1121
586704a121j39P95n86P60P01N97O35j637M01l12j851k56K187L55%J78N40k04r07
587864A36k9O23l82L4q3m17m59n02j087j313L25M60K99K009J459J55r1j403P66
589024E00j100P55P39L11n46M12k95J34K00P94o32p73J72J272J291q37p23o29
590122A045O6J8P36k525M5Q7k01j005Q92j214P90P06k30j61J92Q10J730J85k009
591282d3k752J29O21j12R00J576j81l61l29L79J6k370L14K830j220m42O16K07
592381b22k78j196J790J015n98o06J308j751j879n94O50J679PR67J059k042j35
593419h26M45j39p57R79k5j16K06l05m93M12Q7J39K46M56O3q66j358j928R24N58
594639b298p18N15R79J689P87J918p37j036L37n27J024j607o21J266j922k238
$$ plain form
586704 -1121 -1260 -465 -1051 -291 410 1007 1642 5 406 94 -1757 -2013 174 529 529 707 1247 1043 136
587864 136 107 730 348 382 299 -118 -577 -1079 -2166 -3479 -3154 -2694 -2395 -386 1073 1228 1137 -266 500
589024 500 -600 155 894 1205 659 1071 776 910 1110 1904 1272 499 671 1943 3234 2397 1674 1045
590122 1045 1111 1129 1865 -660 -615 -528 -729 -1734 -842 -2056 -1266 -560 -790 -951 -759 51 1781 1966 -43
591282 -43 -2795 -2666 -2045 -2157 -1257 319 138 -223 -552 -173 -157 -2527 -2213 617 -603 -1045 -429 -222
592381 -222 -500 -1696 94 1109 511 -95 1213 -538 -2417 -3011 -2361 -682 -675 292 1351 -691 -826
593419 -826 -381 -520 -1277 -298 -323 -439 -233 -538 -1031 -619 -532 -393 -147 309 372 -494 -1852 -3780 -2856 -2298
594639 -2298 -3016 -2501 -1522 167 954 2872 2135 1099 1436 909 1933 326 -295 971 -951 -3189
595616c189J520J120o24k54M31l46q64PN61Q59J351P55j510M33Q92J608q42k818
596715i10R2M91m20L08lM28m59o60N3p93n54N36K19m52P3Q41J561m57Q95N90j171
597997B08n72m96q82l94M93J690R81r70m83q14P14L67J170J6P41k138r09J11n14
599156a681k6J445P05j368J1N27j61j090L33O03J338j240p80p5LJ80p88J549l92
600316i07M60P4K41r6J38k07j27O36r31P27O7q16J70J106J147K03l235R13J847
601476A410k46j471Q72p04o3P72n37O18K13r14n88m41j13l5n49M07R96J51k40
602635d62M79l4L67j249n56K67Q79o63J35J502n46k3N28J04j095j29l90R30j517
603795a473J42J071O35j418J593K79k98j358j216j15J586J001j21J46O01M19J058
$$ plain form
595616 -3189 -1669 -549 -1173 -1427 -996 -1342 -2206 -2199 -1638 -779 572 1327 -183 250 1142 2750 1908 -910
596715 -910 -818 -327 -747 -439 -442 -14 -473 -1133 -1080 -1873 -2427 -1891 -1672 -2124 -2051 -1210 351 -106 789 1379 208
597997 208 -364 -860 -1742 -2136 -1643 47 1028 58 -425 -1239 -525 -158 1012 1028 1769 -369 -1278 -1167 -1681
599156 -1681 -1707 -262 443 -925 -914 -387 -548 -1638 -1305 -702 636 -604 -1384 -1459 -1456 -1276 -2064 -515 -907
600316 -907 -447 -373 -132 -228 -90 -297 -424 212 -719 8 75 -741 -571 535 1682 1885 -1350 -437 1410
601476 1410 1164 -307 565 -139 -202 570 33 651 864 -50 -638 -1079 -1192 -1227 -1776 -1369 -373 -222 -462
602635 -462 17 -17 350 -899 -1455 -1188 -309 -972 -837 665 119 96 624 728 -367 -496 -886 44 -1473
603795 -1473 -1331 -260 375 -1043 550 829 531 -827 -2043 -2158 -572 429 308 454 1055 1474 2532
604833B532q03J540j259j178j207m20p0J99L69K482n25j864j341J585J10p5O82
605870G57n51k300M86L11j28N78J037n62k58q99n37J867L31M59K30j184q74k12
606969a449R06r15L29J467q51j78M65k37O66N94O84J14n95p34O15L27p22n75O03
608129E14o10o39Q72j834j610L69K22N67J889p56j245j87q8M45M35k22j63J193
609228h48J057l23j237j015j145q09J079J420P28j6l05Q20J103m06R66k65l18
610265D86P23K12L13k094p70j89R80N00j538q56K159j62K5J140j391k7n64j365
611364b418N34Q52m09k40N95J065K5k31n46K36R64l06n54q74J737j649R00J378
612463A059o54j813o60p29k15J503K757j915j278J418Q04p46K04N49J920n46k732
$$ plain form
604833 2532 1729 3269 2010 832 -375 -795 -865 -666 -297 2185 1660 -204 -1545 40 150 75 757
605870 757 206 -2094 -1608 -1297 -1425 -847 190 -372 -630 -1529 -2066 -199 132 591 821 -363 -1237 -1449
606969 -1449 -543 -1458 -1129 338 -513 -691 -226 -463 203 797 1481 1595 1000 266 881 1208 486 -89 514
608129 514 -96 -735 137 -1697 -3307 -2938 -2716 -2149 -260 -1016 -2261 -2448 -2536 -2091 -1656 -1878 -2041 -848
609228 -848 209 -114 -1351 -2366 -3511 -4320 -3241 -1821 -1093 -1109 -1414 -594 509 103 1069 804 486
610265 486 1209 1421 1734 -360 -1130 -1319 -339 161 -1377 -2233 -74 -236 -211 929 -462 -489 -1053 -2418
611364 -2418 -1884 -1032 -1441 -1681 -1086 -21 4 -227 -773 -537 427 121 -433 -1307 430 -1219 -319 1059
612463 1059 405 -1408 -2068 -2797 -3012 -1509 1248 -667 -1945 -527 277 -469 -265 284 2204 1658 -1074
613501a074k58k80R11J133P43m85m88o11q22L05L29P55r26O8k9L06l16p62k55
614660a756J442j90l28J7J090j447m43k55K94M23p78j65Q22O67Q06m64K139k49
615759A625j607o14O81L37o58L62J499O89J982L37k291j520m00j322l63j510K56
616796b517K46R71J615j044l80o49Q10n16q45P29O26Q56O02j191j873K84l36J123
617895a489m35L74m0L84J97j85J065k740K06J540N47J030O46J337j120n69k38
618933E10j27M11N68r70m00J238J261p07k487k42J171J067r4l38n26J55k6K02
620032F66p17p72J478J209q30L69P80j123q02M92p21o89k5q8o49J202J74O14J431
621191A999j042Q36j115j195p61L55K28m53L04j41R98L96q8k025r13j026P69L2
$$ plain form
613501 -1074 -1332 -1612 -701 432 1175 690 202 -409 -1231 -926 -597 158 -768 -700 -729 -423 -739 -1501 -1756
614660 -1756 -314 -504 -832 -815 275 -1172 -1615 -1870 -1576 -1153 -1931 -2096 -1274 -607 199 -265 1874 1625
615759 1625 18 -596 85 422 -236 126 1625 2314 4296 4633 2342 822 422 -900 -1263 -2773 -2517
616796 -2517 -2271 -1300 315 -729 -1109 -1758 -948 -1464 -2309 -1580 -954 -98 504 -687 -2560 -2276 -2612 -1489
617895 -1489 -1924 -1550 -1590 -1206 -1009 -1194 -129 -2869 -2663 -1123 -576 454 1100 2437 1317 748 510
618933 510 383 794 1362 392 -8 1230 2491 1784 -703 -945 226 1293 1199 861 335 490 464 666
620032 666 -51 -823 655 1864 1034 1403 2183 1060 258 750 29 -660 -685 -773 -1422 -220 -46 568 1999
621191 1999 957 1793 678 -517 -1278 -923 -695 -1148 -844 -985 13 409 321 -1704 -2617 -3643 -2874 -2842
622290b842N55K37M25J162N22N84j563j188J519N57j190L2J045M06j96j266N19
623327f82j020Q76J143P30o00j99j142L1p08J347J38J60J033m62o99om44N64M24
624488D84k14l04N10Kk96K03r90K0k24j118O72J055K741P87j720j978j9J31J126
625647H68r3j679n80r36k11J45K447j23N10n62j22j215j286O85J77k49j104K63
626746c065J964M32j186J330R55O60P99r57r62O69o38j349O77l17q52k86l45L31
627844b140q01J067J208Q20Q9o02J054J31j159j095N65N4n15N12J607j021J306
628882A080R75k268j34M29K56j103k29k11j036M1K060J088p52K61J019r31l78
629920A67L17p7j066L83j67o1J238k97P88J28o95o73n21k150q29J379J397q48
$$ plain form
622290 -2842 -2287 -2050 -1625 -463 59 643 -920 -2108 -589 -32 -1222 -1190 -145 261 65 -1201 -682
623327 -682 -1702 -826 317 1047 447 248 -894 -863 -1571 -224 -86 74 1107 645 -54 -60 -504 60 484
624488 484 270 -34 476 478 182 385 -605 -585 -809 -1927 -1255 -200 2541 3328 1608 -370 -389 -258 868
625647 868 775 -904 -1484 -2420 -2631 -2486 -39 -162 348 -214 -336 -1551 -2837 -2152 -1975 -2224 -3328 -3065
626746 -3065 -1101 -669 -1855 -525 430 1090 1889 932 -30 639 1 -1348 -671 -988 -1840 -2126 -2471 -2140
627844 -2140 -2941 -1874 -666 154 243 -359 695 826 -333 -1428 -863 -809 -1324 -812 795 -226 1080
628882 1080 2055 -213 -347 82 338 -765 -994 -1205 -2241 -2200 -140 948 196 457 1476 545 167
629920 167 484 407 -659 -276 -443 -504 734 437 1225 1353 658 -15 -536 -2686 -3515 -2136 -739 -1587
631019a587q9J800j04o08r0m45N22J401j249o51O52J68n43r60q26J063J215k6
632117c57J115J0N19j291r77Q57p34q55O04J130N54j598k204L68P84L12Q6q9K136
633277C70P06k175j696l16J847J160j126K70K93r8J806j638n73N57J610m74J171
634314A694j385j460n16L8Q89j569j272K081J821m43N61J26j269n17M99P51O09
635352F38N64k123m32J073N87q93j098M73Q97Q98k87O65nj37L41n50n52o27m36
636512a004N63j50l24O9R01j062L25R36R84j462M12j530j331K114K21P30k48N05
637611F49r95r04L67Q63o29q05p14P2J351R34J28J0q54j220J123Q66j252k55k69
638770a534n1J388J176N7m50k38j213j082M66O04L05Q9J478l76j10J393l44o59
$$ plain form
631019 -1587 -1676 124 20 -588 -678 -1123 -601 800 -449 -1100 -448 -280 -823 -1783 -2609 -1546 -331 -357
632117 -357 758 768 1287 -4 -981 -124 -858 -1713 -1109 21 575 -1023 -3227 -2859 -2075 -1763 -1677 -1766 370
633277 370 1076 -1099 -2795 -3111 -1264 -104 -1230 -960 -667 -765 1041 -597 -1170 -613 997 523 1694
634314 1694 309 -1151 -1667 -1629 -740 -2309 -3581 -1500 321 -122 439 565 -704 -1221 -722 29 638
635352 638 1202 -921 -1353 -280 307 -586 -1684 -1211 -314 584 297 962 957 820 1161 611 59 -568 -1004
636512 -1004 -441 -591 -915 -846 55 -1007 -682 254 1238 -224 188 -1342 -2673 -559 -338 392 144 649
637611 649 -346 -1250 -883 -20 -649 -1454 -2168 -2096 -745 189 317 327 -527 -1747 -624 242 -1010 -1265 -1534
638770 -1534 -1585 -197 979 1036 586 348 -865 -1947 -1481 -877 -572 -483 995 619 509 1902 1558 899
639869H99m86o09p10M20l08J084J326L62q87j264j37J019R2j216o70O4J178K16
640968C73o35q68o54r05J072J098l26p33o81L28k96P02K22k97M61M00N65N09j426
642128a091P98l14j285j908J114J293o67Q47J256L53l6j843j012J247J740p08
643104b16n81Q72o52L70O55J295q19N11j909j52l6j311q17J1P72L408N27j473
644203D55K92q54j045L77K0j365j207P82J216j88J181O60p05o27J100R28L45j0
645301A355j128k83o05M83l62Q4j130p02O56m2J564J348m93j462Q25M12r32L39
646400g3O10l15p41J342O13j00L27j516q50k36j147r61K19J603K0J188P71M45
647499A199L70M9j35k29L41k681K7J610o71j710k059N32n12O98j80R02P1K75p06
$$ plain form
639869 899 413 -196 -906 -486 -794 290 1616 1978 1091 -173 -310 709 801 -415 -1085 -1021 157 373
640968 373 -262 -1130 -1784 -2689 -1617 -519 -845 -1578 -2259 -1931 -2227 -1525 -1303 -1600 -1139 -739 -174 335 -1091
642128 -1091 -293 -607 -1892 -3800 -2686 -1393 -2060 -1213 43 396 360 -1483 -2495 -1248 492 -216
643104 -216 -797 75 -577 -207 448 1743 924 1435 -474 -626 -662 -1973 -2790 -2779 -2007 1401 1928 455
644203 455 747 -107 -1152 -775 -755 -2120 -3327 -2545 -1329 -1517 -336 324 -381 -1008 92 1020 1365 1355
645301 1355 227 -56 -661 -178 -540 -456 -1586 -2288 -1632 -1674 -110 1238 745 -717 108 520 -412 -73
646400 -73 537 222 -519 823 1436 1336 1663 147 -703 -939 -2086 -3047 -2828 -1225 -1205 -17 754 1199
647499 1199 1569 1618 1483 1254 1595 -1086 -1059 551 -120 -1830 -3889 -3357 -3869 -3171 -3351 -2449 -2378 -2103 -2809
648659b809K060J724J93r56r89p70M5J786O59p95p18J17q62R55M58Q29L11N55
649757A793j43n44q14J997O08K0j180p57l77j160M48p65Q96L040q73k349j416
650795a576Q21O6L78L10M52k75p02n20o49J517M05R8l12k12l84j26o1J208L32
651955G70o44r18J925M53k104o17R42Q45m76Q20P25o89R19O62l60j386p95J31
653054B03N88Q47p95L23o0j19j501L80M27N83M27p40J97j745K96K18q07m50N82
654213a146P70J254p94o71n01J216l17J130j488P52N5r07K98j023P39j14j577
655251b324K105J661J391j983o25j309L95N71q05r88J091Q27J248p73j171l50
656227a039K374q99j891o43j086L39J293P81M3j509J16J182L79j280m36N15J402
$$ plain form
648659 -2809 -749 975 1168 212 -777 -1547 -1502 284 943 148 -570 -453 -1315 -360 98 927 1238 1793
649757 1793 1650 1106 292 2289 2897 2917 1737 980 603 -557 -109 -874 22 3062 2189 -160 -1576
650795 -1576 -755 -689 -311 -1 451 176 -526 -1046 -1695 -178 227 325 13 -199 -583 -709 -770 438 770
651955 770 126 -792 1133 1586 -518 -1135 -193 652 176 996 1721 1032 1951 2613 2253 867 72 203
653054 203 791 1638 843 1166 1106 987 -514 -134 293 876 1303 563 760 -985 -689 -471 -1278 -1728 -1146
654213 -1146 -376 878 84 -587 -1088 128 -189 941 -547 205 260 -647 -349 -1372 -633 -747 -2324
655251 -2324 -219 1442 2833 850 225 -1084 -689 -118 -923 -1911 -820 7 1255 482 -689 -1039
656227 -1039 1335 436 -1455 -2098 -3184 -2845 -1552 -771 -728 -2237 -2121 -939 -560 -1840 -2276 -1761 -359
657265c59n81Q33m20o52m49K8j047J529J511L36Q94j354j163J421N02O42l22R88
658364B337j588k057j217J023J626O81j589Q00J547j153j707o0m0l7K99L87r96
659402a744Q66R08J36Q78J559k671k323K865Q5N7k02j846j090K411J441k29NJ96
660500A302j131K75j66r61j79j814r65M75K013J487R07R29p24K56J24j439R22
661538A311q47k269J8J683K95j772M07N03k49m44k1p57J89P48P29M44l73N73K01
662698C69l75m37k085k334K53O28P97K271J243m27q28k97k209J662J326L72J437
663735A366o49k185K79j185n48j06O71o54J657J415j197L0J732k43j024K01n27
664773i67k26l66Q62N51j149J469N42p75j274J062Q67j316L00P15J039n25p07
$$ plain form
657265 -359 -940 -107 -527 -1179 -1628 -1600 -2647 -1118 393 729 1623 269 -894 527 1029 1671 1349 2337
658364 2337 749 -1308 -2525 -1502 124 805 -784 16 1563 410 -1297 -1357 -1397 -1434 -1135 -748 -1744
659402 -1744 -878 30 166 1044 2603 -68 -2391 474 559 616 414 -1432 -2522 -111 1330 1101 1106 1302
660500 1302 171 446 280 -681 -860 -2674 -3639 -3164 -1151 336 1243 2172 1448 1704 1828 389 1311
661538 1311 464 -1805 -1787 -104 191 -1581 -1174 -671 -920 -1364 -1385 -2142 -1953 -1205 -476 -32 -405 168 369
662698 369 -6 -443 -2528 -4862 -4609 -3981 -3184 -913 330 -97 -925 -1222 -3431 -1769 -443 -71 1366
663735 1366 717 -1468 -1189 -2374 -2922 -3028 -2357 -3011 -1354 61 -1136 -1106 626 383 -641 -440 -967
664773 -967 -1193 -1559 -697 -146 -1295 174 716 -59 -1333 -271 596 -720 -420 295 1334 809 102
665811A02K81O95p06J257j020m93n33N21j299J56p3P51k25OO86j518o84O0k23
666970b259k65Q3n78K03K600J163l7P4j110p74r83l65J470O86q1j73k97O81J246
668130A284J603o63j907J099J40k73m29Q7P94J13l82k607q68K49O73N63j17L07
669229c34j925j30J456M25k66j74l94j488J065K46J463Q44r26j871N98P58O27
670266b6j778K85J17J718J181j009r50j978nJ673L4P45k98r05q92N74O92L33j123
671426a612R18Q66K88o47R68P80p77n93L42j306j763k73J986M24m96N02o61k44
672525a298m21j100J79K800j57n90o23J198j148j546l78J065J031J025O77J76
673502H90L33L62o97l71O61O01q8r86l28k030J14J56J014l48L15o18k2j276j213
$$ plain form
665811 102 383 1078 372 1629 609 116 -417 104 -1195 -1039 -1112 -361 -586 -580 106 -1412 -2096 -2036 -2259
666970 -2259 -2524 -2441 -3019 -2816 -216 947 910 984 -126 -900 -1883 -2248 -778 -92 -173 -346 -643 38 1284
668130 1284 2887 2224 317 1416 1556 1283 854 941 1735 1848 1466 -1141 -2009 -1760 -1087 -524 -641 -334
669229 -334 -2259 -2389 -933 -508 -774 -948 -1342 -2830 -1765 -1519 -56 788 -138 -2009 -1411 -653 -26
670266 -26 -1804 -1519 -1402 316 1497 488 -462 -2440 -2445 -772 -738 7 -291 -1196 -2088 -1514 -822 -489 -1612
671426 -1612 -694 172 460 -187 781 1561 784 191 533 -773 -2536 -2809 -823 -399 -895 -393 -1054 -1298
672525 -1298 -1719 -2819 -2640 160 3 -587 -1210 -12 -1160 -2706 -3084 -2019 -988 37 714 890
673502 890 1223 1585 888 517 1178 1779 1691 705 377 -1653 -1539 -1383 -369 -717 -402 -1020 -1042 -2318 -3531
674661c531j37J170J635o10p06Q74O6n79m46K391J17J097j678q3L46r87j207K696
675760D28j011p87M14k33m3M91k92J471J32p45M18k876m5m26R89L001R0M39p81
676920F34j95K39j691r42l01N67L1Q74M03K0J4l70J367J313O05L67j270L60K98
678079B323m43j133j046o11o0n27r08j450L84O64p82L15O47P09J442o53k65J80
679178a214Q45r88M83J633M22k27R35M02j74r0j28j190P91Q38J483J138j751j168
680277B040j269k56j308r22k40L80n49l75jj54L21N26J203L38p10j097m46k29
681376b748J263J087J088q51j104R72J56N55J939p09p66m35M66j017q25k0J578
682413F29J302K57p46o21j115r82l65L48n48J239R79j115m32J520p82k10j187
$$ plain form
674661 -3531 -3668 -2498 -863 -1473 -2179 -1305 -1239 -1818 -2264 127 244 1341 -337 -420 -74 -1061 -2268 428
675760 428 -583 -1370 -956 -1189 -1232 -741 -1033 438 570 -175 243 -2633 -2678 -3104 -2115 886 976 1415 634
676920 634 439 678 -1013 -1955 -2256 -1689 -1658 -784 -381 -361 -347 -717 650 1963 2568 2935 1665 2025 2323
678079 2323 1880 747 -299 -910 -970 -1497 -2405 -3855 -3471 -2807 -3589 -3274 -2627 -1918 -476 -1129 -1394 -1214
679178 -1214 -369 -1357 -874 759 1181 954 1889 2291 2117 2027 1899 709 1500 2338 3821 4959 3208 2040
680277 2040 771 515 -793 -1715 -1955 -1575 -2124 -2499 -2500 -2654 -2333 -1807 -604 -266 -976 -2073 -2519 -2748
681376 -2748 -1485 -398 690 -161 -1265 -293 -137 418 2357 1648 882 447 913 -104 -929 -949 629
682413 629 1931 2188 1442 821 -294 -1276 -1641 -1293 -1841 -602 377 -738 -1170 350 -432 -642 -1829
683451a829K5J588N58n9K559Q71q18N00j296j315r20p23k57l80J558o32O79k092
684550a983j325M27J589N20K99L34n63m18K465L27n69r51O53K85j113k086J09
685587b000J057j059L97M32M17p66Q96J493L9l71l0j082j00Q97P98P08o94j168
686686a36p46j845J013K154n55k92o53j74K64q50p85J295J950p60k83l99j38J039
687785I9j89J171R2o45o05m74q92R79K32n62N81q75l5K253J09k186k05M94M33
688944b25Q63j067j609n16J080J485j089OL23ql88K8K02J50q23q93O99J197k61
690104h46k19P33j094j17J481N25P65K43n42m27R77k12P9j198j231n15J94l18
691203a722O96J251K94l0J297M3j376O35o12r28m76k099J090j008R97Q24L19N59
$$ plain form
683451 -1829 -1804 -216 342 283 2842 3713 2895 3395 2099 784 -136 -859 -1116 -1496 62 -570 109 -1983
684550 -1983 -3308 -2881 -1292 -772 -473 -139 -702 -1120 1345 1672 1103 152 805 1090 -23 -2109 -2000
685587 -2000 -943 -2002 -1605 -1173 -756 -1522 -626 867 906 535 505 -577 -677 220 1018 1726 1032 -136
686686 -136 -882 -2727 -1714 440 -115 -407 -1060 -1234 -970 -1820 -2605 -1310 640 -120 -403 -802 -940 99
687785 99 -90 1081 1173 528 -77 -551 -1443 -464 -232 -794 -213 -1088 -1123 1130 1239 -947 -1152 -658 -225
688944 -225 638 -429 -2038 -2554 -1474 11 -1078 -1072 -749 -757 -1145 -1117 -915 -765 -1588 -2481 -1782 -585 -846
690104 -846 -1065 -332 -1426 -1543 -62 463 1228 1471 929 502 1479 1267 1346 148 -1083 -1598 -1404 -1722
691203 -1722 -1026 225 519 489 1786 1829 453 1088 476 -452 -928 -3027 -1937 -2945 -1948 -1124 -805 -246
692301b46R11p92L82K13o20O47j113K89j85J138p8L47M14k33l51K47K3k02j054
693461b63l36O37K046j55j165K40O40j46j583j343j70mJ77l65j55R74j17N7J068
694621C7j436N32j617j156R53K074l66q41M2k34K59J83J168R6q19K06M12l55N45
695781c17n08J545N44r71j036n88Q7J258P45j595l14j25K62L41j97J329L31j364
696880e73r16J585P89r8j182o20j77q71l77r70Q46K267k41n77L41L06J702J20
697978A354n96l75n56n12r02L42Q84o09K75O10Q98L46l34P36j24J32n83m51j913
699138a378J391P85j069j164P68l71R49K65p82j006k092J214K416J035k185J61
700114a063K38K39O65n44O60J109L96k26n4j084k147K14O18j110N69K36J008q3
$$ plain form
692301 -246 665 -127 255 468 -152 495 -618 -329 -514 624 546 893 1307 1074 723 970 993 791 -263
693461 -263 -599 38 2084 1929 764 1004 1644 1498 -85 -1428 -1598 -1602 -1425 -1790 -1945 -971 -1088 -1031 37
694621 37 -1399 -867 -2484 -3640 -2687 -613 -979 -1820 -1778 -2012 -1753 -1570 -402 -306 -1125 -919 -507 -862 -317
695781 -317 -825 720 1264 293 -743 -1331 -1244 14 759 -836 -1150 -1275 -1013 -672 -869 460 791 -573
696880 -573 -1489 96 885 787 -395 -1015 -1192 -2063 -2440 -3410 -2564 -297 -538 -1115 -774 -468 1234 1354
697978 1354 758 383 -173 -685 -1587 -1245 -361 -970 -695 -85 813 1159 825 1561 1437 1569 986 535 -1378
699138 -1378 13 798 -271 -1435 -667 -1038 -89 176 -606 -1612 -3704 -2490 -74 961 -1224 -1063
700114 -1063 -825 -586 79 -465 195 1304 1700 1474 1420 336 -1811 -1597 -979 -2089 -1520 -1284 -276 -359
701213c59N51R78L62q07J681j274j209m49r40K34N02J552K49L79j05J97J60j058
702312F44q73n26q56P55K461K70k689j069R78K46q73q00O20Q19k64R95j88L69
703411A9j355P09J61j315P2R64K54j21k79L77l84K25m63L19J172p58q49j160L18
704570b094K72L12J918N36k578j637O00J081%J349J360m74j561J298j273k074
705547b965l3J793K019J91j449N77J69J08q50P33J037q47j341j043j778N22j79
706585c336J381N13k37M34Q81P0N7J90R8o30m44J222j583p6j012k37N11q78r98
707744d074J672k17J161J518P7j93M16K02o42n48P56q78L37j5j391J737Q54r9
708843F73j024J412j393k096o14j46J705L88K04j00j617j426p2J020K68R92L105
$$ plain form
701213 -359 192 1170 1532 725 2406 1132 -77 -526 -1466 -1232 -730 822 1071 1450 1345 1542 1702 644
702312 644 -229 -755 -1611 -856 1605 1875 -814 -1883 -905 -659 -1532 -2332 -1712 -893 -1157 -162 -350 19
703411 19 -1336 -627 -466 -1781 -1709 -745 -491 -612 -891 -514 -898 -673 -1136 -817 355 -403 -1252 -2412 -2094
704570 -2094 -1822 -1510 408 944 -1634 -3271 -2671 -1590 -1590 -241 1119 645 -916 382 -891 -2965
705547 -2965 -2998 -1205 814 1005 -444 133 302 410 -440 293 1330 483 -858 -1901 -3679 -3157 -3336
706585 -3336 -1955 -1442 -1679 -1245 -364 -294 -237 -47 51 -579 -1023 199 -1384 -1460 -2472 -2709 -2198 -3076 -4074
707744 -4074 -2402 -2619 -1458 60 137 -56 360 562 -80 -628 128 -750 -413 -428 -1819 -82 772 673
708843 673 -351 1061 -332 -2428 -3042 -3188 -1483 -1095 -891 -991 -2608 -4034 -4106 -3086 -2818 -1826 1279
709881A279p17J501p78p3j381q24l93J42K40m44j685L46K245R00r96J552L61J06
710980A381k10r98m75J31m79n23o31j008M74%PJ331L39NM34J841j459p30N55l28
712200c43j329J505O62o11M91J726p5j633k392J060J216o58o12j419O76J540J683
713238A487k70p24j288J414O75j712M25R02j162l57K6J177j92R74N73r33M77O61
714337B153j139o61n26m72p18R27l90p03j054m36M69n93n12M93N62P64O57N47
715435f32m43j64r65J157J544M92j275q49M76R43J352k16j790j324K39R0K3K32
716534a110j54j38K29J186J465m46Q56Q52j237j764j665K84r70M87k21J189n89
717572a746m65m61J132Q31p20k001l94J770M21p15N28M68L52p81J327N32P03m37
$$ plain form
709881 1279 562 2063 1285 1212 -169 -993 -1386 -1244 -1004 -1448 -3133 -2787 -542 358 -638 914 1275 1381
710980 1381 1171 173 -302 -171 -650 -1173 -1804 -2812 -2338 -2338 -2331 -1000 -661 -656 -222 1619 160 -570 -15 -343
712200 -343 -1672 -167 495 -116 375 2101 2026 393 -1999 -939 277 -381 -993 -2412 -1736 -196 1487
713238 1487 1217 493 -795 619 1294 -418 7 909 -253 -610 -584 593 401 1375 1948 1015 1492 2153
714337 2153 1014 353 -173 -645 -1363 -436 -826 -1529 -2583 -3019 -2550 -3143 -3655 -3162 -2600 -1836 -1179 -632
715435 -632 -1075 -1239 -2204 -1047 497 989 -286 -1135 -659 284 1636 1420 -370 -1694 -1455 -1365 -1342 -1110
716534 -1110 -1264 -1402 -1173 13 1478 1032 1888 2740 1503 -261 -1926 -1642 -2612 -2125 -2346 -1157 -1746
717572 -1746 -2211 -2672 -1540 -709 -1429 -3430 -3824 -2054 -1633 -2348 -1820 -1352 -1000 -1781 -454 78 781 344
718670C44m05M5O42j29N64M57l95j023k36M50m03N94R95q13j166j375j39R59j9
719830a053n59j28K205L92j029r71n54k96J475n77j631J37J941q79p54M3J234
720868a004J273R26j050L07Lj067k94r21O56j32m33J186n83N1O10n92o52j648
721967c364J973L143k52R2L93k141j199nR27J78J05j249Q5K440j184j828J98J329
723065c59j01j180K60Q38q1n36j425R25J560j18p05m31Q53o37M03n29L00N85m1
724225d19j252K04J138J500k248j192J3P37O10N97J404r46o99M59R41k30j311
725262f94p81J587k55M32J726l87o88j161k759n02R27J133O80K028q83k676n73
726300b846J410R51j017J182L92r61N20o01j90j136j06N55J400M64j765J375j956
$$ plain form
718670 344 -61 -16 626 497 1061 1518 1123 100 -136 314 -89 505 1500 687 -479 -1854 -1993 -1034 -1053
719830 -1053 -1612 -1740 465 857 -172 -1143 -1697 -1993 -518 -1095 -2726 -2589 -648 -1527 -2281 -2238 -1004
720868 -1004 269 1195 145 452 455 -612 -906 -1827 -1171 -1303 -1736 -550 -1133 -1082 -472 -1064 -1716 -3364
721967 -3364 -1391 1752 1500 1592 1985 -156 -1355 -1360 -433 -255 -150 -1399 -1314 1126 -58 -1886 -1688 -359
723065 -359 -460 -1640 -1380 -542 -623 -1159 -2584 -1659 -99 -217 -922 -1353 -500 -1137 -734 -1263 -963 -378 -419
724225 -419 -1671 -1467 -329 1171 -1077 -2269 -2256 -1519 -909 -312 1092 146 -553 -94 847 617 -694
725262 -694 -1475 112 -143 289 2015 1628 940 -221 -2980 -3482 -2555 -1422 -742 1286 403 -2273 -2846
726300 -2846 -1436 -485 -1502 -320 72 -889 -369 -970 -1160 -2296 -2402 -1847 -447 17 -1748 -373 -2329
727338b329k93N31J862M04k90l36Q54Q73P12k29q23q03o70j093K85m23L51p19
728437b136Q4M28Q9J557Q94L54J785k09r34j779l48k600P04O25j369O38K98o77
729535b596j238P78J173J346n83q3m52J158J40K56J467O67o82O97q9k388N45K95
730634D11J56M2j021k88j80k2Q61m71R45j559N46J152JN31J325j402l03K34r21
731793C7o65l09J229j139m58J24j39k71K03P82l65k188O80J011l27J136R17l19
732893f1K84J112j236p56M79j0p29q9k67q16J435J923L30k976r91O8O38J721j430
734052a371K62J431k058l42P15J177m04J803o16n88q21n96J64J516O37J84L97
735090A490j24r4j891N98N87q91J319K71k342j550N9P69L08j63J245J353K70K11
$$ plain form
727338 -2329 -2622 -2091 -229 175 -115 -451 403 1276 1988 1759 936 133 -537 -1630 -1345 -1768 -1417 -2136
728437 -2136 -2052 -1624 -1535 22 916 1270 3055 2846 1912 133 -215 -2815 -2111 -1486 -2855 -2217 -1919 -2596
729535 -2596 -3834 -3056 -1883 -537 -1120 -1203 -1655 -497 -357 -101 1366 2033 1351 2048 1959 -429 116 411
730634 411 567 609 -412 -700 -880 -902 -41 -512 433 -1126 -580 572 573 1104 2429 1027 724 958 37
731793 37 -628 -937 292 -847 -1305 -1181 -1320 -1591 -1388 -606 -971 -3159 -2479 -1468 -1795 -659 258 -61
732893 -61 223 1335 99 -657 -178 -188 -917 -1006 -1273 -2089 -654 1269 1599 -1377 -2368 -2300 -1662 59 -1371
734052 -1371 -1109 322 -1736 -2078 -1363 -186 -590 1213 597 9 -812 -1408 -1244 272 909 1093 1490
735090 1490 1366 1272 -619 -21 566 -325 994 1265 -1077 -2627 -2568 -1799 -1491 -1654 -409 944 1214 1425
736188A425N72J353q56q46j122n72J549P1m02Q89n75j139j188M83j91j216P18
737226a047O46j19j83J084P23j28J129r72P54K81K21j156l94n08k7p98j277J711
738325f0o57j333J577k6k6J791m78j14J338J35j686j154j254k31L10L52Q62j457
739424b111p88J557K14n10L03J987j561n06O14O51L86p30k471K77O89J781J197
740461I79m53p90o01m29l73Q50p40J38J250j77j226K501R63m35j742J29L96p00
741560d60r20r2J143J88o74K9M99J614N73j618j4L5o91k80J417l67j374k94Q00
742719d86j571J84M39M42k26Q9P91K69M53m13j320k46Q26L28j093L88J036P77
743818F67j214j319M94M59r56N33L20K99Q93J77o2l18L39j40k64l92j264J74Q50
$$ plain form
736188 1425 1997 3350 2494 1648 526 -46 1503 1574 1172 2061 1486 347 -841 -358 -549 -1765 -1047
737226 -1047 -401 -520 -703 381 1104 976 2105 1133 1887 2168 2389 1233 839 331 304 -494 -1771 -60
738325 -60 -717 -2050 -473 -499 -525 1266 788 674 2012 2147 461 -693 -1947 -2178 -1868 -1516 -654 -2111
739424 -2111 -2899 -1342 -1128 -1638 -1335 652 -909 -1415 -801 -150 236 -494 -2965 -2688 -1999 -218 979
740461 979 526 -264 -865 -1294 -1667 -817 -1557 -1419 -169 -346 -1572 929 1892 1457 -285 -156 240 -460
741560 -460 -1380 -1472 -329 -141 -815 -786 -287 1327 1900 282 268 303 -388 -668 749 382 -992 -1286 -486
742719 -486 -2057 -1873 -1434 -992 -1218 -1129 -338 -69 384 -29 -1349 -1595 -769 -441 -1534 -1146 -110 667
743818 667 -547 -1866 -1372 -913 -1869 -1336 -1016 -717 176 353 291 -27 312 172 -92 -484 -1748 -1574 -724
744978g24r32J298J011M90n00j57q71o72m46O62K528o01N0Q88m89j490o41j568
746077b164l08J657o07j094j06Q43J573J800K1j975o77Q20q68j704J030K1o58
747114b396j189J336J191m62m37k99J140R96J282R90k006j477p15J040O07M06
748091GK28K052N20n90j809N20k42j940j498Q04J648J5O28l79j062l15J960o41
749190i4M49j302m12K24q95O28J396J397l53j65n78P66P07K62j662j492J866J013
750289A755j065l09P79j91j79n30N85ko5L86P42M99j049K60n27l47j389J05m52
751448i94k78J017J083k15k161q67P92M66q51J926J523m29r36p49j105N64p83
752486a997M76j13p29M5J490O32J96j391j249O10J34R29K303Q32j844r23n82M36
$$ plain form
744978 -724 -1656 -358 653 1143 643 486 -385 -1057 -1503 -841 1687 1086 1136 2024 1535 45 -596 -2164
746077 -2164 -2472 -815 -1422 -2516 -2622 -1779 -206 1594 1615 -360 -1037 -217 -1085 -2789 -1759 -1738 -2396
747114 -2396 -3585 -2249 -1058 -1520 -1957 -2256 -1116 -120 1162 2152 146 -1331 -2046 -1006 -399 7
748091 7 235 2287 2807 2217 408 928 686 -1254 -2752 -1948 -300 -285 343 -36 -1098 -1413 547 -94
749190 -94 355 -947 -1359 -1135 -2030 -1402 -6 1391 1038 873 295 1061 1768 2030 368 -1124 742 1755
750289 1755 690 381 1160 969 790 260 845 843 778 1164 1906 2405 1356 1616 1089 742 -647 -542 -994
751448 -994 -1272 -255 828 613 -1548 -2415 -1623 -1157 -2008 -82 1441 1012 76 -673 -1778 -1214 -1997
752486 -1997 -1521 -1634 -2363 -2318 -828 -196 0 -1391 -2640 -2030 -1896 -967 1336 2168 324 -599 -1181 -745
753584g45m40M5J592j20j072J11J474k14o31p40j57k6J830J690q67j653r77n53
754683a453k44p4J060o66N12l56o73L34N92j258J565L05n05k84J53J144j593p08
755782b149N72N09o60N84K047M55j263q84k19j016K7J310K69m73k87M17J3J380
756881F32l47q86p67m71K023n19j882n46J532K04l13P86K62R29j526n2K066j287
757979a62o62q37o43O39J64j087J62J407N54pp66j82j383p23J167J976J334m50
759078E01M8L72m54Q2p46l1o08J256j329j280j24P02K24J638L6O85J728k66k04
760238B230N87j097j069l67K43q60m97O08R31M39J522K461j144k436n44o07J77
761276E77j051M98N69Q45J61K01j470n55N23J318j510j810j609r91l12N02K489
$$ plain form
753584 -745 -1185 -1140 452 332 -740 -629 845 631 0 -740 -897 -923 907 2597 1730 77 -900 -1453
754683 -1453 -1697 -1771 -711 -1377 -865 -1221 -1894 -1560 -968 -2226 -661 -356 -861 -1145 -992 152 -1441 -2149
755782 -2149 -1577 -1068 -1728 -1144 903 1358 95 -789 -1008 -2024 -1997 -687 -418 -891 -1178 -761 -748 632
756881 632 285 -601 -1368 -1839 184 -335 -2217 -2763 -1231 -1027 -1340 -554 -292 637 -889 -941 1125 -162
757979 -162 -824 -1661 -2304 -1665 -1501 -2588 -2426 -1019 -465 -472 -1238 -1420 -2803 -3526 -2359 -383 951 501
759078 501 549 921 467 549 -197 -228 -836 420 -909 -2189 -2313 -1611 -1387 251 287 972 2700 2434 2230
760238 2230 2817 1720 651 284 527 -333 -830 -222 709 1148 2670 5131 3987 1551 1007 400 577
761276 577 -474 24 593 1438 1599 1800 330 -225 298 1616 106 -1704 -3313 -4304 -4616 -4114 -1625
762313a625J863J005j267o91J102j783j345n85J238J330m78N2P48J220L99P56
763290A939j911j036n36l03k47q37J578Q0J708m91j306Q86K47J71J150j110l73
764327c91m53N73r59R87j854j327J270J036P02J50l61k57J025K195J24j210k25
765365A025l39K086N71q20p5P50j133JP53j320M7j255m57m24j319J493l84J196
766464C96J021r71l02j314n69M13j894N3J311j515j93J382N66m67J10j075L39
767501b709m86J009J143n54J24N06j318R2N55l67J030K98K14J9J096K41N62m79
768600I76n92K33l66l59J397L42k767J39Q95K54q64J532L67m711n47K563k56N37
769699a227R19k18R46J5r69m35q54l55R39n6J513K402n78j101j668q80k70J198
$$ plain form
762313 -1625 238 1243 -24 -715 387 -1396 -2741 -3326 -2088 -758 -1236 -1184 -436 784 1183 1939
763290 1939 28 -1008 -1544 -1847 -2094 -2931 -1353 -1273 435 -56 -1362 -476 -229 -58 1092 -18 -391
764327 -391 -844 -271 -1230 -243 -2097 -3424 -2154 -1118 -416 -266 -627 -884 141 2336 2460 1250 1025
765365 1025 686 2772 3343 2523 2448 3198 2065 2066 2819 1499 1546 291 -166 -590 -1909 -416 -800 396
766464 396 1417 446 144 -1170 -1739 -1326 -3220 -3167 -1856 -3371 -3564 -2182 -1616 -2083 -1973 -3048 -2709
767501 -2709 -3195 -2186 -1043 -1597 -1473 -967 -2285 -2193 -1638 -2005 -975 -677 -463 -444 652 893 1455 976
768600 976 384 617 251 -108 1289 1631 -1136 -997 -102 152 -712 820 1187 -3524 -4071 -1508 -1764 -1227
769699 -1227 -308 -526 420 435 -534 -969 -1823 -2178 -1239 -1295 218 2620 2042 941 -727 -1607 -1877 -679
770797f79J394K38j501p09l33J321J086O44o01k22J109q55q58r37l99J219j93
771835b76j111n3R19J953R43j563n3Q16j75o67j745o78O77M42j552R28J277j87
772934a05L75j756M74J033L65j02m35n44L06j572Q39J121l96M95J033j282o74
773971h25j067m67J18J257J618Q65j768k52m40P90j142P34o4L16K42j587P90K71
775070f11M22j173o44J38J154Q36j048n16q18K14P07o20J962j111o7J079O64n39
776169B9k72m34q3L38j184j065o56K447j3L28Q3Q21P7J111j11m00j082j163O70
777329e59j814j2o09P5J303r05P47J208j10J71j214j174J585J179M78K77l17r2
778427B17j147L49J511K49j435j045m7R32j222l43O64K7M30J172Q29L98M20J99
$$ plain form
770797 -679 715 953 -548 -1257 -1590 -269 817 1461 860 638 1747 892 34 -903 -1302 -83 -276
771835 -276 -1387 -1440 -521 1432 2375 812 759 1575 1400 733 -1012 -1690 -1013 -571 -2123 -1195 82 -105
772934 -105 270 -1486 -1012 21 386 284 -151 -695 -389 -1961 -1122 -1 -397 98 1131 -151 -825
773971 -825 -1892 -2359 -2241 -984 634 1499 -269 -521 -961 -171 -1313 -579 -643 -327 -85 -1672 -882 -611
775070 -611 -189 -1362 -2006 -1868 -714 122 -926 -1442 -2260 -2046 -1339 -1959 3 -1108 -1175 -96 568 29
776169 29 -243 -677 -760 -422 -1606 -2671 -3327 -880 -893 -565 -482 339 416 1527 1416 1016 -66 -1229 -559
777329 -559 -2373 -2385 -2994 -2919 -1616 -2521 -1774 -566 -676 -505 -1719 -2893 -1308 -129 349 626 309 217
778427 217 -930 -581 930 1179 -256 -1301 -1348 -416 -1638 -1981 -1317 -1290 -860 312 1141 1539 1959 2158
779526B158K40J80J061m89q22j117K1P01j615j354r86K21k03m53J556J887J060
780564B046j809Q6m70J8p50q32M2K27j037R2J069J947j32q66j098j074J71j94
781663b564m41LJ189J915J298j620K92k09m87K91n05P39k26M7l66j8J890J469
782761B697K94j393k94p35q78r24J72n41J319K417l96j193m17L74q00o40o0m98
783860a496r51J497J16J30N04j112J304K79k67J6o26n61Q70L4J098n8l017m3K32
785020b051K89n22n64J399n09K21pk89K24n05k83n04K643j16q41j456r11j008
786118d790M16K008J54l0N61J749q65j386q92J624J012n2P02o23p34K188j8q04
787217B20j58l6kl63k03R79J115L8p51j512j342J002J3J87q22m04J163J345m20
$$ plain form
779526 2158 2398 2578 3639 3150 2328 1211 1232 1933 318 -1036 -2022 -1801 -2004 -2457 -901 986 2046
780564 2046 237 323 -147 -129 -879 -1711 -1669 -1442 -2479 -2387 -1318 629 497 -369 -1467 -2541 -2370 -2564
781663 -2564 -3005 -3002 -1813 102 1400 -220 72 -137 -624 -333 -838 -99 -325 -278 -644 -662 1228 2697
782761 2697 2991 1598 1304 569 -309 -1233 -1061 -1602 -283 2134 1738 545 128 502 -298 -938 -998 -1496
783860 -1496 -2447 -950 -834 -704 -200 -1312 -8 271 4 20 -606 -1167 -297 -263 835 777 -2240 -2283 -2051
785020 -2051 -1762 -2284 -2848 -1449 -1958 -1737 -1744 -2033 -1809 -2314 -2597 -3101 -458 -574 -1415 -2871 -3782 -4790
786118 -4790 -4374 -2366 -2212 -2242 -1681 68 -797 -2183 -3075 -1451 -439 -491 211 -412 -1146 1042 1024 220
787217 220 62 26 24 -339 -542 437 1552 1590 839 -673 -2015 -1013 -1000 -813 -1635 -2039 -876 469 49
788377D9K87m04J015j27r28r60M60L50p16j68k309J63J571o81O78l0K62J113k48
789536f23O43o38O91k52j784n1O21P3l0J174M73r0R77M05j545o92J04P9P59J296
790757A590j583M6p81o94k00l28m41L78J757J430n34j113j955N23J675J193l122
791795b159J279J051p58K66J734n8j254r18L55j85J404j032j252J37m03k59O7
792833a985N16J195R24j948k137n00P50J263o28j34J247Q18R28J53j331q89n8
793870a816Q97j3L72m89K39J717O38R67r38j212p49L49j127j000J194Q59j97l14
794969f23p78J417l44M47k91M95N72L46j187r48k79J220j573k2q81j066J705J340
796068d50q06l6P12j568r18L63J297K75n61j582J916j67j584K35L50J25j56J62
$$ plain form
788377 49 336 -68 947 820 -108 -1068 -608 -258 -974 -1142 -3451 -3288 -1717 -2398 -1720 -1750 -1488 -375 -623
789536 -623 20 -618 73 -179 -1963 -2014 -1393 -1320 -1350 -176 297 207 1184 1589 44 -648 -544 -465 294 1590
790757 1590 7 53 -728 -1422 -1622 -1950 -2391 -2013 -256 1174 640 -473 -2428 -1905 -230 963 -2159
791795 -2159 -880 171 -587 -321 1413 1355 101 -817 -462 -647 757 -275 -1527 -1390 -1793 -2052 -1985
792833 -1985 -1469 -274 650 -1298 -3435 -3935 -3185 -1922 -2550 -2684 -1437 -619 309 462 -869 -1758 -1816
793870 -1816 -919 -932 -560 -1049 -810 907 1545 2512 1574 362 -387 -38 -1165 -2165 -971 -112 -309 -623
794969 -623 -1401 16 -328 119 -172 323 895 1241 54 -894 -1173 47 -1526 -1548 -2429 -3495 -1790 -450
796068 -450 -1256 -1292 -580 -2148 -3066 -2703 -1406 -1131 -1692 -3274 -1358 -1525 -3109 -2874 -2524 -2399 -2555 -2393
797166b393J071j32J104K36K18j912J87J04p15L70O64j12r29k78j97p09m61K19
798265c665r4p2J563K706Q752K1650R279l858o115l623l342k419k751k573k817
799181A2621k266p50j583j854m72j76m82k42k91j537j245j976k05J716J055M77
800157B790o77J141n06j083j027n0J5L90J290M15p81q89J702m20p34k457m37K057
801256G39J466J795r49j924o5o4K32J4N63K68N74j003n80K8k263L49k1r49R74
802415h16O37j087p16K535O91N97J56j129r58L05J176j031p08J042J313o3k023
803453g9k234p43J1J457J181J582O13p26j283J088n87l21o51k06Q81O72j070L96
804552a9N5K27k2J673K027j546o68kj41j069J7J005k210j371J469Q52O42P71o75
$$ plain form
797166 -2393 -1322 -1454 -350 -114 104 -1808 -1621 -1517 -2232 -1862 -1198 -1310 -2239 -2517 -2714 -3423 -3884 -3665
798265 -3665 -3759 -3831 -2268 438 9190 30840 40119 36261 30146 26523 23181 20762 18011 15438 12621
799181 12621 10355 9605 8022 6168 5696 5520 5038 4796 4505 2968 1723 -253 -458 1258 2313 2790
800157 2790 2113 3254 2748 1665 638 588 603 993 2283 2698 1917 1028 2730 2310 1576 -881 -1318 739
801256 739 2205 4000 3051 1127 1062 998 1230 1244 1807 2075 2649 1646 1066 1094 -1169 -820 -841 -1790 -816
802415 -816 -179 -1266 -1982 553 1244 1841 1997 868 -90 215 1391 360 -348 694 2007 1944 -79
803453 -79 -2313 -3056 -3045 -1588 -407 1175 1788 1062 -221 867 280 -41 -692 -898 -17 655 -415 -19
804552 -19 36 263 241 1914 3941 2395 1727 1725 1584 515 532 1537 -673 -2044 -575 277 919 1690 1015
805712A015j266j228j96j052K22K81L73k72N65K82L25p57M10J522j15o07o0J482
806810I24J57n44r85r72O6K01O34P85R2r10k56l67m26M14J360P85j64M22j415
807970a99q29o9k99J490J878M75l15k69n54Q45l42K40m40o10j107j787r24M10
809069b406M0M80J201K69j00k24q22R1J03P66K306Q27k294j705J309j295k42m32
810168b128p12K05J200L36Q5P81J368n92N98n67n92l05P79O57l19L03J268N60
811266B925L64k553j359p18j297L57k21l90k56Q77R34L60n83J991J993q80m66
812304A078M05j271q61n6J659Q46j129k4O54j114j513J62O4J029l47k78P27k0
813402A1j58j023n81J52l66O85L77j94M93k14J9Q33k13k63K08j430q36r60P61
$$ plain form
805712 1015 -251 -1479 -1675 -2727 -2505 -2224 -1851 -2123 -1558 -1276 -951 -1708 -1298 224 109 -498 -558 924
806810 924 1081 537 -448 -1420 -1354 -1153 -519 266 358 -552 -808 -1175 -1601 -1187 173 958 794 1216 -199
807970 -199 -1028 -1097 -1396 94 1972 2447 2132 1863 1309 2154 1812 2052 1612 1002 -105 -1892 -2816 -2406
809069 -2406 -2366 -1886 -685 -416 -516 -740 -1562 -1471 -1368 -602 1704 2531 237 -1468 -159 -1454 -1696 -2128
810168 -2128 -2840 -2635 -1435 -1099 -1014 -233 1135 543 1141 574 -18 -323 456 1113 794 1097 2365 2925
811266 2925 3289 736 -623 -1341 -2638 -2281 -2502 -2892 -3148 -2271 -1337 -977 -1560 431 2424 1544 1078
812304 1078 1483 212 -649 -705 954 1800 671 647 1301 187 -1326 -1164 -1100 -71 -418 -696 31 11
813402 11 -147 -1170 -1751 -1599 -1965 -1280 -903 -1097 -604 -818 -799 34 -179 -442 -234 -1664 -2500 -3460 -2699
814562b699J696J610J035M20p51j342j99J30P71M35r24J17J96o06r32R07J844
815600A708o84J577K90l93J59j797q28l83M28j83j962j453J458J568n25l47p57
816638b124J465K70J89m22j551J235R55n23r3j434k77J043L39R67j413K137j500
817675g37o40J165m57j244o48Q22J894j241j290O39k57K12l6k45O30N82j458l71
818774b680K080K41K65n3k56o04L69po76j87l66J647J381O18j677j217L42m31
819873a211M70K048J29k488j682L39J53J524J454Q70k05J22M00k67k18L43K08
820910A989N31q80M01q23j004l82n53J264J216j772j370R09R30P69M04n26k264
821948a161p37K18N32N26K156j25r94j705p37J86J319J692r59k27k86N56O70O95
$$ plain form
814562 -2699 -1003 607 1642 2062 1311 -31 -230 -100 671 1106 182 299 495 -111 -1043 -136 1708
815600 1708 1024 2601 2891 2498 2657 860 32 -351 77 -106 -2068 -3521 -2063 -495 -1020 -1367 -2124
816638 -2124 -659 -389 -200 -622 -2173 -938 17 -506 -599 -2033 -2310 -1267 -928 39 -1374 763 -737
817675 -737 -1377 -212 -669 -1913 -2561 -1739 155 -1086 -2376 -1737 -1994 -1782 -1818 -2063 -1433 -851 -2309 -2680
818774 -2680 -600 -359 -94 -147 -403 -1007 -638 -645 -1321 -1508 -1874 -227 1154 1772 95 -1122 -780 -1211
819873 -1211 -741 1307 1436 -1052 -2734 -2395 -2242 -718 736 1606 1401 1523 1923 1656 1438 1781 1989
820910 1989 2520 1640 2041 1218 214 -168 -721 543 1759 -13 -1383 -474 456 1225 1629 1103 -1161
821948 -1161 -1898 -1680 -1148 -622 1534 1409 415 -1290 -2027 -1841 -522 1170 211 -16 -302 254 924 1619
823047A619j898q76J372l43p06k46q01N59l21L04L59lK37M6Q32r45Q25k98m04
824206f88p91k60k67J09K810j67l57N52n80j447j85k53M89K64M81n28m29L05n79
825366a521L02R02M95J221p9j66j967J61L41K93j196K69m16M3K833j15l97K46
826465A249j382j474K108O67k42j609j112P50P63k65n19j24J59j41k628j087J398
827503c489J536r39J293J202J235p34r19q68N71Q24P3O64m6j332p70J66j70J360
828601c43K622k441k006O75M13J167O76j09J316O26q78P80r27j739k6M71K40j681
829700a164n48Q44j32J77J420J180m41r11p87k002q60J156N78j818J95P97K01
830738b115K46R2j44J682L25J38L85j042l30R61K13Q05p43O25p4N09j077M79n03
$$ plain form
823047 1619 -279 -1155 217 -126 -832 -1078 -1879 -1320 -1641 -1337 -978 -981 -744 -698 134 -811 14 -284 -688
824206 -688 -1479 -1739 -2006 -1897 913 746 389 941 361 -1086 -1271 -1524 -1035 -771 -290 -818 -1247 -942 -1521
825366 -1521 -1219 -317 178 1399 1320 1154 -813 -652 -311 -18 -1214 -945 -1361 -1318 1515 1400 1003 1249
826465 1249 -133 -1607 501 1168 926 -683 -1795 -1045 -282 -547 -1066 -1190 -1031 -1172 -3800 -4887 -3489
827503 -3489 -1953 -2892 -1599 -397 838 104 -815 -1683 -1112 -288 -215 449 403 -929 -1699 -1533 -1703 -343
828601 -343 2279 -162 -2168 -1493 -1080 87 763 654 1970 2596 1718 2498 1571 -168 -194 277 517 -1164
829700 -1164 -1712 -868 -1000 -823 597 1777 1336 425 -362 -2364 -3224 -2068 -1490 -3308 -3113 -2316 -2115
830738 -2115 -1869 -1777 -1921 -239 86 224 609 -433 -763 198 411 1216 473 1098 1024 1533 456 935 432
831898D32o46M04j45J028O31J61j782L01L75O2r79p72qJ068p08j59j910J543J684
833057E80o51M81O32l82j091o64j217j460J05R24J670n27K89m5J265Q00L56L81
834156A446j993j490j48P45m22J466J277P69J312n8j380m60j375j187m15j078
835132b991j36L171K06q5n33p22R57J89j166L27J558N2K63j489k083o56J181Q91
836231a066J122j091J480j66o37p48j363J173P21k183j92n45M01L10M15l65K274
837269d60R20M01j711q8m70N59m07P4m96K24R03O32j822k69K412o68K063r76o8
838428G53k8r37Q38m49j013j186J517L25j097q13l89K058P92n73j073j154R3P21
839527a615J284l04K07j623q62J410n2k0N06J130l63n41J220J169r21j021m41
$$ plain form
831898 432 -214 190 45 1073 1704 1865 83 384 759 821 -158 -930 -938 130 -578 -737 -2647 -1104 580
833057 580 -71 410 1042 660 -431 -1095 -2312 -3772 -3667 -2743 -1073 -1600 -1311 -1356 -91 709 1065 1446
834156 1446 -547 -2037 -2185 -1440 -1862 -396 881 1650 2962 2904 1524 1064 -311 -1498 -1913 -2991
835132 -2991 -3127 44 250 165 -368 -1090 -133 56 -1110 -783 775 827 1090 -399 -2482 -3138 -1957 -1066
836231 -1066 56 -1035 445 279 -358 -1106 -2469 -1296 -575 -2758 -2950 -3495 -3094 -2784 -2369 -2734 -460
837269 -460 460 861 -850 -938 -1408 -849 -1256 -1182 -1678 -1454 -551 81 -1741 -2010 402 -266 1797 821 753
838428 753 725 -212 626 177 -836 -2022 -505 -180 -1277 -2090 -2479 -421 371 -202 -1275 -2429 -2336 -1615
839527 -1615 -331 -635 -428 -2051 -2913 -1503 -1555 -1575 -1069 61 -302 -843 377 1546 625 -396 -837
840565h37j810j5o4R69J745M78O40N21j0j854m57K059R23k4j539k69l10q55P1
841725f38J245J208P30j531r76q16k08n6k35j289j0l53J123m4J14J76J802O17
842823H59J756j369k013n7j24r77P33O30k8R63Q72p12p83J059p2r4q42M4j071
843983a226q76k82m76J120L18P8O84J049j742q10J262j99N41J097n90L02n9L76
845082E67J299j46n14m63j35K93l07q23k22P28k78k23J48r11r15j055k91N36J19
846241b593Q22R27Q26o94j397p30j868Q34N93n04P25o79o05R0K276J434L85m58
847340f16l77J311j167o27N02n37p7K229J4K62o99j003p02K91J198J209k97R77
848439A891Q44p49o37j351q83m61J521J770j473n36r59j39k329j157J350J82O79
$$ plain form
840565 -837 -2647 -2662 -2726 -1757 -12 466 1106 1627 1617 -237 -694 1365 2288 2264 725 456 146 -709 -638
841725 -638 607 1815 2545 1014 38 -778 -986 -1042 -1277 -2566 -2576 -2929 -1806 -1850 -1736 -1560 242 859
842823 859 2615 1246 -767 -824 -948 -1925 -1192 -562 -590 373 1245 533 -250 809 737 643 -199 -155 -1226
843983 -1226 -2102 -2384 -2860 -1740 -1422 -1344 -660 389 -1353 -2163 -901 -1100 -559 538 -52 250 191 567
845082 567 1866 1720 1206 743 608 901 594 -229 -451 277 -1 -224 -76 -987 -1902 -2957 -3248 -2712 -2593
846241 -2593 -1771 -844 -18 -712 -2109 -2839 -4707 -3873 -3280 -3784 -3059 -3738 -4343 -4253 -1977 -543 -158 -616
847340 -616 -993 318 -849 -1476 -974 -1511 -1588 641 655 917 218 -785 -1487 -1196 2 1211 914 1891
848439 1891 2735 1986 1349 -2 -885 -1346 175 1945 472 -64 -1023 -1162 -3491 -4648 -3298 -3116 -2437
849477b437l52J233K55k112K3L240r34j251n44m85j02K568K399j825q68j313K27
850514b278K99L22L9J191l87q20L73l18M68Q18J909j776q37J65R56M98j78l20
851613A24O19o66m80J190R52j720j081K452R92o64j853k06J060n56j424p28j673
852651c662J306J148L24M02j111m01J31Q40M91Q3J147N51j140j899R32J132P08
853688I82k99m22q59j53m39j47j26l40M92O1p84L56L88m08J149j04L27L92r56
854848h90k15P98n86P71O08Q54J106j119j646p29M63M74r36Q23R51J98p61n92
855947d28r63R03N82M79m25m41j046P37p12o32J745r0r79K303P00j124j472o9
857045i32J052J79Q37l3L8l97j549R3K44K000j806j052M79O80L51o09k16om43
$$ plain form
849477 -2437 -2789 -1556 -1301 -3413 -3390 -150 -1084 -2335 -2879 -3364 -3466 -898 1501 -324 -1192 -2505 -2278
850514 -2278 -1979 -1657 -1618 -427 -814 -1634 -1261 -1579 -1111 -293 1616 -160 -997 -832 124 622 444 124
851613 124 743 77 -403 787 1739 19 -1062 1390 2382 1718 -135 -341 719 163 -1261 -1989 -3662
852651 -3662 -2356 -1208 -884 -482 -1593 -1994 -1863 -1023 -532 -449 698 1249 109 -1790 -858 274 982
853688 982 683 261 -598 -751 -1190 -1337 -1463 -1803 -1311 -1250 -2034 -1678 -1290 -1698 -549 -653 -326 66 -890
854848 -890 -1105 -307 -893 -122 486 1340 2446 1327 -319 -1048 -585 -111 -1047 -224 727 925 164 -428
855947 -428 -1391 -488 94 573 148 -293 -1339 -602 -1314 -1946 -201 -291 -1270 1033 1733 609 -863 -932
857045 -932 120 299 1136 1103 1141 744 -805 -712 -468 1532 -274 -1326 -847 -167 184 -425 -641 -647 -1090
858205a090J249j04j801k77J027k08J34n01j491o60L511J057j02q08r31Q98m36
859243e33n51K73J365o76l59j00r2K44P42j56l11q54j183k36J927K96J08m43J725
860402A186j64n84Lk12l46Q45k98K147m92o03k08o69l19k080P11J922o47p2o2
861562E8j489l93L15N75n85Q22m08j944L32J927j66j066m35N12p89j7R82O00P49
862722d20J42R80o32q34j525Q19j5M20J544j124J0O27L59M52J774p27r92l45O30
863882A143M84k79J021n71r0j8R72j428j96r26J61K13N96k76j7R39O94k49p82
865042A391p17k058mJ764j0K71N13q80K47J044j760j124p62Q56j8j069J010P65
866140e41L03J067p45j430J428J881J12j976p61K40k33n5J85J394k018n3M39Q28
$$ plain form
858205 -1090 159 55 -1746 -2023 -996 -1204 -1070 -1571 -3062 -3722 -211 846 744 -64 -995 -97 -533
859243 -533 -1084 -811 554 -122 -481 -581 -673 -429 313 157 -154 -1008 -2191 -2427 -500 -204 -96 -539 1186
860402 1186 1022 438 441 229 -117 728 430 2577 2085 1482 1274 605 286 -1794 -1083 839 192 120 58
861562 58 -1431 -1824 -1509 -934 -1519 -697 -1105 -3049 -2717 -790 -956 -2022 -2457 -1945 -2734 -2751 -1769 -1169 -420
862722 -420 -278 702 70 -764 -2289 -1470 -1485 -1065 479 -645 -635 -8 351 803 2577 1850 858 513 1143
863882 1143 1627 1348 2369 1798 1708 1690 2662 1234 1038 112 273 486 1082 806 789 1728 2422 2173 1391
865042 1391 674 -1384 -1388 376 366 637 1150 270 517 1561 -199 -1323 -2085 -1229 -1247 -2316 -1306 -541
866140 -541 -238 829 84 -1346 82 1963 2075 99 -662 -422 -655 -710 -525 869 -1149 -1202 -763 65
867239F5p75k78j80J93K10J075j57Q37J52p58%o95m29o45M45J259J074N91j387
868399E97J370k01k476P86J067L1o19J838p72q82o93j041J19j492J522J867J4
869436A035Oj16j542L08J2J161k53j399j006L62k051N5J683J520O34r23n50P79
870535b85K28p86k37Q24Q43J015p97k99j172J028j189k4J53p74K181O96L39j552
871634A92l45M1N50m04J735n04j082O27j000k710N09J765Q48L10m26K28j645k82
872732a593K10J66O70l80o43O71J300R45O6n05J82j113M61K72j63p05o75N14j311
873892a631N58J090n88j13j376n37J79k91N6J295L12J420N23j011L28j62m74j272
874991a694r35O05N59J542R23P01j501L44J5j71O16j04q26L36p36j530o21N90
$$ plain form
867239 65 -710 -988 -1168 -975 -765 310 153 990 1142 384 384 -311 -740 -1385 -940 319 1393 1984 597
868399 597 1967 1766 -710 76 1143 1174 555 2393 1621 739 46 -995 -876 -2368 -846 1021 1035
869436 1035 1041 925 -617 -309 -297 864 611 -788 -1794 -1432 -3483 -3428 -1745 -225 409 -514 -1064 -285
870535 -285 -57 -843 -1080 -256 587 1602 805 506 -666 362 -827 -851 -698 -1472 709 1405 1744 192
871634 192 -153 -112 438 34 1769 1265 183 810 -190 -2900 -2391 -626 222 532 106 334 -1311 -1593
872732 -1593 -1383 -1217 -547 -927 -1570 -899 401 1346 1412 907 1089 -24 437 709 546 -159 -834 -320 -1631
873892 -1631 -1073 17 -571 -684 -2060 -2597 -2418 -2709 -2653 -1358 -1046 374 897 -114 214 52 -422 -1694
874991 -1694 -2629 -2024 -1465 77 1000 1701 200 544 559 388 1004 900 74 410 -326 -1856 -2477 -1887
876090a887J728P4k022j548M86K59O07P91J76K79q45n31O35K78n90J526P57N0
877188B23r83l10J356N84q75j020o66Q45J07K20l95j04R75J483m57j118P17m35
878287A47p01L7J006J94K18O2j836r23N76O04R3m5K73N44NJ161p21n06j376O99
879507d89o52J653j22k892J81J41J323L342O01n33k53j865p03o03o71j47J514
880545a75J913J150j430n86K71J190o25p33L92N86J56n30J78k961j872N71J104
881583a401R04K2q41L81m20J088o62j496O82J890J213k626j052n14K337J04l87
882621g78J123r79j97n68O47L67l34J988m90o90J189J090J314j463j997k26m64
883658d68n09J248k65r70Q10K97O28O40l45j514r18J010P23k13m67K89O02n84
$$ plain form
876090 -1887 -159 -85 -2107 -3655 -3169 -2910 -2303 -1512 -1336 -1057 -1902 -2433 -1798 -1520 -2110 -584 173 223
877188 223 -760 -1070 286 870 -5 -1025 -1691 -846 -739 -519 -914 -1018 -43 1440 983 -135 582 147
878287 147 -554 -517 489 683 901 963 -873 -1796 -1220 -616 -523 -568 -295 249 254 1415 694 188 -1188 -489
879507 -489 -1141 512 390 -2502 -2321 -2180 -857 2485 3086 2553 2300 435 -268 -871 -1542 -1689 -175
880545 -175 1738 2888 1458 872 1143 2333 1708 975 1367 1953 2109 1579 1757 -1204 -3076 -2505 -1401
881583 -1401 -497 -475 -1316 -935 -1355 -267 -929 -2425 -1743 147 1360 -1266 -2318 -2832 -495 -391 -778
882621 -778 345 -634 -831 -1399 -752 -385 -719 1269 779 89 1278 2368 3682 2219 222 -4 -468
883658 -468 -977 271 6 -964 -154 143 771 1411 1066 -448 -1366 -356 367 154 -313 -24 578 -6
884757fM14k16r76q99K75p14m9M51O88K49q67M35P78j121q05J083o12O94k08l39
885978a745L23o52M64J105J46M26L20l01j722j143K207J259O46N76q09l53o69
887015G8P94k1m20m14q19m34J179o31j06l15j577J731J580q98N1o21j4L90J126
888175F59K52k212j060M30k12J111J290N62O06j098p65k30o25k24R62m23m63O31
889274h09K64J207Q49k65j366o87n85o60J766K35Q69J38r17J45k84N0L7j136p93
890434a942j89N10j63o32N84J398K448n28j601j65J771L6o27o7j016M5J11o51
891532f78j716l46K90J327K76J099R73j05j522k68J268o81j47L01m86J387J046
892570B018j859j883N16J04J515r98k47L25L49P76r8p32M8j421J72P80K88j66
$$ plain form
884757 -6 408 192 -784 -1683 -1408 -2122 -2171 -1720 -1032 -783 -1650 -1215 -437 -1558 -2363 -1280 -1892 -1198 -1406 -1745
885978 -1745 -1422 -2074 -1610 -505 -359 67 387 86 -1636 -2779 -572 687 1333 1909 1100 747 78
887015 78 872 851 431 17 -802 -1236 -57 -688 -794 -1109 -2686 -955 625 -273 -222 -843 -857 -467 659
888175 659 911 -1301 -2361 -1931 -2143 -1032 258 820 1426 328 -437 -667 -1292 -1516 -554 -977 -1440 -809
889274 -809 -545 662 1511 1246 -120 -807 -1392 -2052 -286 -51 818 956 39 184 -100 -50 -13 -1149 -1942
890434 -1942 -2131 -1621 -1784 -2416 -1832 -434 2014 1486 -115 -280 1491 1527 900 833 -183 -138 -27 -678
891532 -678 -2394 -2740 -2450 -1123 -847 252 1225 1120 -402 -670 598 -83 -230 71 -415 972 2018
892570 2018 159 -1724 -1208 -1104 411 -587 -834 -509 -160 616 518 -214 -166 -1587 -1415 -635 -347 -513
893669e13q54J723N7j421K41J252j73j58Q97k67l18n72k619N3M392n3k678o45
894767a656M52K549p89j852R14N34q03P59l79K85m40k90N55P68J29J148j92j860
895866a68K6R47j145J81O34R65P66k220o97j188m06O34J031Q12q95L59o39p4J664
897026E87n48j018r09L83m68J928Q00l51r7K7J083j86j524M93P18j69M18j67Q6
898186A086O03L34Q9n86r01P26q30J252n91J228j550k032k45O36J455q90m79K81
899284d14q4N40R11o90j093M49J108j042p45j200j297O19J791j84Q68O5Q47q78
900383d29n84N92P01M51p0N23j64J05n60n82k2o63N1J75J51J350q99j367K049
901543H08J993o0l143j729Q21m30N3M37K43j169O99J305N5O19p75N6J835n59j302
$$ plain form
893669 -513 -1367 356 413 -1008 -767 485 312 154 1051 784 466 -106 -2725 -2672 1720 1667 -1011 -1656
894767 -1656 -1204 1345 556 -1296 -382 152 -651 108 -271 14 -426 -716 -161 607 736 1884 1692 -168
895866 -168 -142 805 -340 -159 475 1440 2206 -14 -711 -1899 -2305 -1671 -640 172 -723 -364 -1003 -1077 587
897026 587 39 -979 -1888 -1505 -1973 -45 755 404 307 334 1417 1231 -293 200 918 749 1167 1000 1086
898186 1086 1689 2023 2112 1526 625 1351 521 1773 1182 2410 860 -1172 -1417 -781 674 -216 -695 -414
899284 -414 -498 42 953 263 -830 -381 727 -315 -1060 -2260 -3557 -2938 -1147 -1331 -463 -398 449 -429
900383 -429 -1013 -421 280 731 661 1184 1020 1125 565 -17 -39 -702 -651 -476 -325 1025 126 -1241 808
901543 808 2801 2741 -402 -2131 -1310 -1740 -1687 -1250 -1007 -2176 -1477 -172 -117 502 -273 -217 1618 1059 -243
902703b43m14Q04Q00l76j80N4L25j643k16R40l57r45P0k15L69Q07Q93K01j67P42
903923A249j191n38p13j85J17J167l73j014j06R69k97Q86j567Q9m70L17J014J17
905022e29m19j365L5J123K566j018K15p49p97Q19R06j38k955m61J555j020p39
906060b971J436K56m2K440m99o2j37k93J17O41N5N00p28n4j232n48L06N63P90
907219E38k78j90Q99r62r17j611J479J821J53j474J53O07J92o43k01J001o92j272
908318a397q07J092Q39K91J31L6K204p3j922J480O45k223n53r70O31Q11N89j336
909417e32P80m93j199p28J68N09N89J51P04p83J25M50j425o5J481j622q68J413
910515a345J541n82j120P97j17M16K31j254J38q79m93R64m16j380j721J158J425
$$ plain form
902703 -243 -657 147 947 571 391 445 770 -873 -1089 -149 -506 -1451 -1381 -1596 -1227 -420 473 674 507 1249
903923 1249 58 -480 -1193 -1378 -1261 -94 -467 -1481 -1587 -618 -915 -29 -1596 -1507 -1977 -1660 -646 -529
905022 -529 -948 -2313 -2278 -1155 1411 393 608 -141 -938 -119 787 649 -2306 -2767 -1212 -2232 -2971
906060 -2971 -1535 -1279 -1321 1119 620 558 421 128 245 886 941 1441 713 659 -573 -1121 -815 -252 538
907219 538 260 70 969 7 -910 -2521 -1042 779 932 -542 -389 218 410 -233 -434 567 -125 -1397
908318 -1397 -2204 -1112 -273 18 149 185 2389 2316 394 1874 2519 296 -257 -1227 -596 215 804 -532
909417 -532 248 -245 -1444 -2172 -2004 -1495 -906 -755 -51 -834 -709 -259 -1684 -1749 -268 -1890 -2758 -1345
910515 -1345 196 -386 -1506 -709 -826 -410 -179 -1433 -1295 -2174 -2667 -1703 -2119 -3499 -5220 -4062 -2637
911553b637J745j16j041j187m1P22L30k62q07N11l34L85M40J475o6K9qM13J466
912713A017m67j474r39j237M4J304J388m69K78P87m39j576q78R3P87J309M18j36
913812a90J1m35N27j59o40j674L28J287J357p35k152p42J222O21N71k25q6J575
914910D61Q87p35l99L24Q19j661r3r47J935K59k12j047N63n32J136j366j764K3
916009b349j78o32J143L220J194j703J29l1K07J760j297j749j168k04l91kq0L379
917108A248J513o40k352p07m8q87j53K17J839J361o47o12k49m95n6j59O05o76
918206h98q19K60r31L33J441J366R94j126r88j735j76O54R70P54l60J3km68j422
919366b140q77J275J875j2J72j190J489k14j401j327Q51M50J69m6O59m28J215
$$ plain form
911553 -2637 -892 -1008 -2049 -3236 -3277 -2555 -2225 -2487 -3294 -2783 -3117 -2732 -2292 -817 -883 -854 -862 -449 1017
912713 1017 550 -924 -1863 -3100 -3056 -1752 -364 -833 -555 232 -207 -1783 -2661 -2568 -1781 -472 -54 -190
913812 -190 -179 -614 -87 -246 -886 -2560 -2232 -945 412 -323 -2475 -3217 -1995 -1374 -803 -1028 -1114 461
914910 461 1348 613 214 538 1357 -304 -397 -1344 591 850 638 -409 154 -378 758 -608 -2372 -2349
916009 -2349 -2527 -3159 -2016 1204 2398 695 824 793 1000 2760 1463 -286 -1454 -1658 -2049 -2051 -2131 1248
917108 1248 2761 2121 -231 -938 -986 -1873 -2026 -1809 30 1391 744 132 -117 -612 -668 -827 -222 -898
918206 -898 -1717 -1457 -2388 -2055 -614 752 1746 620 -368 -2103 -2279 -1625 -655 99 -261 -248 -250 -718 -2140
919366 -2140 -3017 -1742 133 121 293 -897 592 378 -1023 -2350 -1499 -1049 -880 -926 -267 -695 520
920404E20j879P55k42k58j97m14P23J211o89m31M65P82N6o45j310K01K134q04
921502b2L53P26j114l22O96J38O74m63j641L77J053J064o05j142j03l27n25O10
922601e73J046Q2l29j002j48Q18nq38q11K000Q13L84j438j467L88L86J109p78
923700c63K29j091Q39m87J08M39Q91M58n64l70j160M88J627J77j303J005l61n02
924799F0k95j014k43q78l48J760K49M46q99O69r55R13q28M46J918M41k209k06
925897i73K62O90K80J972M07j328q61M56K77m65j385o58Q19L30n62R91o19k029
926996b396o01m90p84K798M49J506M23j5r4J871k606q39J255J138o97j063k492
928034b637k261J111J515J446o48o69Q84P44j56j025l09M18M09p07K50j38N57
$$ plain form
920404 520 -1359 -604 -846 -1104 -1301 -1715 -992 219 -470 -901 -436 346 402 -243 -1553 -1352 782 -22
921502 -22 331 1057 -57 -379 317 455 1129 666 -975 -598 455 1519 914 -228 -331 -658 -1183 -573
922601 -573 473 555 226 -776 -924 -106 -111 -949 -1760 240 1053 1437 -1 -1468 -1080 -694 415 -363
923700 -363 -134 -1225 -386 -873 -765 -326 565 1023 459 89 -1071 -583 1044 1221 -82 923 562 60
924799 60 -235 -1249 -1492 -2370 -2718 -958 -709 -263 -1162 -493 -1448 -535 -1363 -917 1001 1442 -767 -973
925897 -973 -711 -21 259 2231 2638 1310 449 905 1182 717 -668 -1326 -507 -177 -739 252 -367 -2396
926996 -2396 -2997 -3487 -4271 -1473 -1024 482 905 890 796 2667 61 -778 477 1615 918 -145 -2637
928034 -2637 -4898 -3787 -2272 -826 -1474 -2143 -1259 -515 -671 -1696 -2005 -1587 -1178 -1885 -1635 -1773 -1216
929071a216Q43M3j285l65L7K05J872J554j295k045n66j2K6O38o6J032Q94l54j555
930231a615J730M04r27Q3k05r21Pn69R7j15q7n7P31J90j077N17J332Q96j124M84
931452b26mr84N27J602l70O2n30m48p4K5P96J464
$$ plain form
929071 -1216 -373 -330 -1615 -1980 -1943 -1738 134 1688 393 -1652 -2218 -2230 -2204 -1566 -1632 -600 294 -60 -1615
930231 -1615 115 519 -408 -325 -530 -1451 -1444 -2013 -1916 -2031 -2118 -2175 -1444 -1254 -2331 -1814 -482 414 -710 -226
931452 -226 -230 -1214 -687 915 545 607 77 -371 -445 -420 376 1840
##END=
