##TITLE=Unknown
##JCAMP-DX= 5.00 $$From Command Line Converter 1.0
##DATA TYPE= NMR Spectrum
##DATA CLASS=  XYDATA

##ORIGIN= Exported from Command Line Converter 1.0
##OWNER= MS
##$URL= http://wwwchem.uwimona.edu.jm:1104/software/jcampdx.html
##SPECTROMETER/DATA SYSTEM= NUTS EXPORT
##.OBSERVE FREQUENCY= 75.480980
##.OBSERVE NUCLEUS= 13C
##INSTRUMENTAL PARAMETERS= 13C
##XUNITS= PPM
##YUNITS= ARBITRARY UNITS
##XFACTOR= 0.0000976757
##YFACTOR= 25.7256580000
##FIRSTX=   3.322714
##FIRSTY= 112777.000000
##LASTX= 100.998500
##NPOINTS= 12080
##MAXY= 25286320.000000
##MINY= -439338.000000
##DELTAX=   0.008086
##XYDATA= (X++(Y..Y))
$$ plain form
34017 4383 2410 512 -434 -1868 106 4446 7607 10017 13655 16382 14849 13113 13070 11335 7413
35260 7413 4984 5845 7064 7541 7510 5539 3309 65 -5403 -10108 -8549 -1235 3792 2658 -792
36501 -792 -2162 -4966 -4484 332 1248 1020 3161 4747 4776 4156 3766 2922 -128 -315 1302 1839 2750
37909 2750 4035 2241 -2417 -4734 -4908 -3832 -845 2586 4147 3112 1798 657 -2267 -2592 2919
39150 2919 8427 9036 7856 5376 1406 420 2506 7968 11118 10277 10255 12392 17833 23414 26413 24799
40475 24799 19606 11748 6618 6749 6395 4801 3248 2375 1345 4608 10826 15068 16360 15506 13000
41717 13000 10571 11628 15418 15402 11750 7966 2870 824 4464 7585 9326 12343 12807 11360 10908
42959 10908 10901 9554 7821 6412 5066 3840 3545 2802 678 -1043 -3272 -3271 -574 2213 2844 1906 1659
$$ packed form
34017D383j973j898r46j434J974M340L161K410L638K727j533j736m3j735l922
35260G413k429Q61J219M77l1j971k230l244n468m705J559P314N027j134l450
36501g92j370k804M82M816R16k28K141J586K9o20l90q44l050j87J617N37R11
37909B750J285j794m658k317j74J076K987L431J561j035j314j141k924l25N511
39150B919N508O09j180k480l970r86K086N462L150q41k2K137N441N581K999j614
40475B4799n193p858n130J31l54j594j553q73j030L263O218M242J292q54k506
41717A3000k429J057L790j6l652l784n096k046L640L121J741L017M64j447m52
42959A0908pj347j733j409j346j226k95p43k124j721k229JK697K787O31r38k47
$$ plain form
44366 1659 1493 1579 2346 4931 8980 11252 9203 8607 7688 3427 -47 -262 644 -582 161 6387 12356
45774 12356 15275 16030 14519 11194 9545 10586 11712 10384 8319 7602 8581 11746 15594 18270 16830
47015 16830 13370 10888 10603 11406 8807 2984 271 1514 6378 11729 14554 11683 8049 5708 6871
48258 6871 7291 6496 7452 9378 10283 9529 7305 6962 7831 7894 9382 11406 9451 1778 -3850 -3870 36
49664 36 3942 5696 7989 10343 12208 13299 13608 10541 5694 6012 8787 6475 1503 -1703 -2348 309
50990 309 2211 3528 4070 4457 5319 6799 8990 12082 12584 10484 9734 12541 16112 15478 14584 13955 14438
52396 14438 12965 10682 11516 12856 12445 11740 12016 13010 15496 17040 19445 22718 22160 18467 13973 8900
53722 8900 5150 3323 2396 2416 -300 -3566 -2538 4153 11282 14183 15406 18727 20604 20001 20492 21416
$$ packed form
44366A659j66Q6P67K585M049K272k049n96r19m261l474k15R06j226P43O226N969
45774A2356K919P55j511l325j649J041J126j328k065p17R79L165L848K676j440
47015A6830l460k482k85Q03k599n823k713J243M864N351K825k871l634k341J163
48258F871M20p95R56J926R05p54k224l43Q69O3J488K024j955p673n628k0L906
49664C6L906J754K293K354J865J091L09l067m847L18K775k312m972l206o45K657
50990C09J902J317N42L87Q62J480K191L092N02k100p50K807L571o34q94o29M83
52396A4438j473k283Q34J340m11p05K76R94K486J544K405L273n58l693m494n073
53722H900l750j827r27K0k716l266J028O691P129K901J223L321J877o03M91R24
$$ plain form
55046 21416 20333 20208 21273 20840 16720 10145 5611 7480 11405 14667 14460 9888 5870 3319 3984
56288 3984 6058 9296 12372 11656 8975 7181 6592 7111 9193 11909 11965 11419 10784 8614 6657 4663
57612 4663 -1085 -5697 -7526 -4474 3431 11505 15301 14472 13729 12541 12971 14972 15791 14148 10832
58855 10832 11617 15554 15056 11424 9775 10605 10288 6652 5672 6262 7536 9962 12256 12424 11412 9788
60179 9788 9672 12207 16445 16617 15857 15097 13772 15150 17105 17258 16054 14181 10296 9546 10672 10153
61504 10153 10227 10924 9159 7244 4970 3352 4633 7221 8040 9777 10834 12927 17270 18558 16177
62745 16177 14884 14995 12660 11405 12343 12668 12387 12769 12927 12517 11244 7212 2071 -397 -744 -1401
64070 -1401 -225 813 2547 5577 6289 3026 1546 1078 2408 4128 3338 1290 -300 499 1764
$$ packed form
55046B1416j083j25J065m33m120o575m534J869L925L262k07m572m018k551O65
56288C984K074L238L076p16k681j794n89N19K082K716N6n46o35k170j957j994
57612D663n748m612j829L052P905Q074L796q29p43j188M30K001Q19j643l316
58855A0832P85L937m98l632j649Q30l17l636r80N90J274K426K294J68j012j624
60179I788j16K535M238J72p60p60j325J378J955J53j204j873l885p50J126n19
61504A0153P4O97j765j915k274j618J281K588Q19J737J057K093M343J288k381
62745A6177j293J11k335j255R38L25k81L82J58m10j273m032n141k468l47o57
64070a401J176J038J734L030P12l263j480m68J330J720p90k048j590P99J265
$$ plain form
65312 1764 1727 -1817 -4136 -3765 -3070 -112 6167 12085 12260 10186 9575 12040 14847 13260 8909 6205
66637 6205 5435 7209 9217 8673 6562 3641 22 -43 1936 3082 4017 3901 124 -5284 -7916 -7696
67961 -7696 -6141 -4587 -5880 -7718 -6849 -1240 4496 6200 9897 14719 14623 13658 11284 8346 9244 13750
69286 13750 19095 19208 15850 13720 10930 6579 7357 8881 7256 6410 6992 5576 3057 2211 2606 6522
70610 6522 10531 11307 8416 2619 -718 3324 10209 14534 13844 11537 12127 13516 11361 7758 3811
71852 3811 534 -1174 -2363 -5419 -7810 -8550 -6547 -1951 3014 8488 11460 10117 9301 11057 13262
73094 13262 12673 8581 6953 7654 8286 9581 12184 14136 16046 15627 13599 13814 14691 15800 17235 16282
74419 16282 15459 15137 14100 12506 9885 4434 -1214 -2974 -2258 -2650 -156 1176 1994 3622 4829
$$ packed form
65312A764l7l544k319L71O95K958O279N918J75k074o11K465K807j587m351k704
66637F205p70J774K008n44k111k921l619o5J979J146R35j16l777n408k632K20
67961g696J555J554j293j838Q69N609N736J704L697M822r6r65k374k938Q98M506
69286A3750N345J13l358k130k790m351P78J524j625q46N82j416k519q46L95L916
70610F522M009P76k891n797l337M042O885M325o90k307N90J389k155l603l947
71852C811l277j708j189l056k391p40K003M596M965N474K972j343q16J756K205
73094A3262n89m092j628P01O32J295K603J952J910m19k028K15Q77J109J435r53
74419A6282q23l22j037j594k621n451n648j760P16l92K494J332Q18J628J207
$$ plain form
75660 4829 5136 9011 11681 10102 6202 2467 1567 2143 3153 2181 -21 660 2831 2164 -1000 -3673
76984 -3673 -5533 -4924 -3430 426 3005 4796 6222 5495 8227 10988 11917 11477 7833 4364 6464
78227 6464 11096 11597 8452 4235 -51 -2029 -4256 -7484 -10360 -12192 -11663 -9971 -7390 -3616 8
79468 8 2378 3207 3146 2498 936 1567 3245 5266 8917 11590 12299 12531 11475 6881 4735 6284 4733
80876 4733 1645 -803 -248 1712 3064 6930 10960 12711 11213 8691 7616 7470 6554 4635 4199
82117 4199 6006 9200 10357 10296 9315 10243 8711 7470 10437 14795 12212 6323 4407 6518 11830
83360 11830 15662 12065 6983 6037 9420 12624 12564 13033 11637 6879 2356 1145 1938 1401 623 2345
84684 2345 1968 -281 3438 8127 10681 13191 15699 16780 18487 17561 13295 11862 15460 16622 13820
$$ packed form
75660D829L07L875K670j579l900l735r00N76J010r72k202O81K171o67l164k673
76984c673j860O09J494L856K579J791J426p27K732K761R29m40l644l469K100
78227F464M632N01l145m217m286j978k227l228k876j832N29J692K581L774L624
79468HK370Q29o1o48j562O31J678K021L651K673P09K32j056m594k146J549j551
80876D733l088k448N55J960J352L866M030J751j498k522j075j46r16j919m36
82117D199J807L194J157o1r81R28j532j241K967M358k583n889j916K111N312
83360A1830L832l597n082r46L383L204o0M69j396m758m523j211P93n37p78J722
84684B345l77k249L719M689K554K510K508J081J707r26m266j433L598J162k802
$$ plain form
85926 13820 10193 7971 9340 9370 10221 12815 10591 5979 3984 3132 4329 7282 10607 10495 10661 11921
87250 11921 13119 9494 3342 1567 4798 6564 5801 5873 4933 2297 2345 6740 12902 16978 16265 10639
88576 10639 4112 2125 2641 3053 2297 1978 4117 6617 10339 12112 10771 8889 6089 2956 2969 7710
89900 7710 12267 13709 11409 10029 9671 6652 2977 3952 4426 2427 2917 7208 13086 16245 16114 14977
91225 14977 13430 13933 13625 7714 -24 -1089 2129 6083 8753 8899 8005 9835 9556 6562 4479
92466 4479 4082 3125 2828 3453 7459 10717 8863 6753 6354 6227 5898 6252 6480 10729 14947 17019 18070
93874 18070 18800 19878 22821 24510 19998 12581 9905 9341 9587 10649 10929 11805 11615 9366 8940 10439
95198 10439 12375 13920 12265 9954 11928 14346 15857 17404 16365 16117 18560 19366 16182 10991 8086
$$ packed form
85926A3820l627k222J369L0Q51K594k224m612j995q52J197K953L325j12J66J260
87250A1921J198l625o152j775L231J766p63P2r40k636M8M395O162M076p13n626
88576A0639o527j987N16M12p56l19K139K500L722J773j341j882k800l133J3M741
89900G710M557J442k300j380l58l019l675R75M74j999M90M291N878L159j31j137
91225A4977j547N03l08n911p738j065L218L954K670J46q94J830k79k994k083
92466D479l97r57k97O25M006L258j854k110l99j27l29L54K28M249M218K072J051
93874A8070P30J078K943J689m512p417k676n64K46J062K80Q76j90k249m26J499
95198A0439J936J545j655k311J974K418J511J547j039k48K443Q06l184n191k905
$$ plain form
96440 8086 7551 8387 9754 11813 12850 12433 8600 4832 1663 247 1452 3487 4793 4748 4958 5172
97765 5172 6705 6736 3903 1292 -2192 -3179 -1444 1393 5449 10000 9772 5300 2562 5009 8953
99007 8953 8027 4224 3351 2523 290 111 3216 10548 15514 15372 13264 13448 11770 8561 6747 4566
100331 4566 7145 9664 7866 5797 8137 14780 19557 19403 18225 15978 11387 10978 13083 14650 14681
101574 14681 14847 16656 17049 15111 11087 5469 2683 2875 3012 1032 163 655 3746 8601 10402 9298
102898 9298 6014 5240 6915 5664 583 -1573 282 2 -2184 -2018 -1417 -1540 -1583 -772 -456 -34 484
104305 484 2467 3457 3524 3936 3029 1938 -118 -1550 -3231 -5434 -5952 -4601 96 3871 2894 2930 6100
105712 6100 9607 9747 9365 11293 12514 10323 8151 5359 6572 11573 14858 17464 17897 18390 20442
$$ packed form
96440H086n35Q36J367K059J037m17l833l768l169j416J205K035J306m5K10K14
97765E172J533L1k833k611l484r87J735K837M056M551k28m472k738K447L944
99007H953r26l803q73q28k233j79L105P332M966j42k108J84j678l209j814k181
100331D566K579K519j798k069K340O643M777j54j178k247m591m09K105J567L1
101574A4681J66J809L93j938m024n618k786J92J37j980q69M92L091M855J801j104
102898I298l284p74J675j251n081k156J855k80k186J66O01j23m3Q11L16M22N18
104305D84J983R90O7M12r07j091k056j432j681k203n18J351M697L775r77L6L170
105712F100L507J40l82J928J221k191k172k792J213N001L285K606M33M93K052
$$ plain form
106955 20442 20752 21121 23406 23702 18568 12569 11248 10944 6870 -141 -2795 399 3243 2944 3513 7329
108279 7329 9009 6720 3038 -54 -3515 -5926 -5292 -805 3000 6624 9562 14191 16172 15130 12837
109520 12837 8748 3967 2011 588 -1686 -2610 631 2584 2516 3168 4640 7350 9240 7276 6922
110763 6922 7849 7205 5139 1432 -1748 -3151 -3859 -2062 -567 -487 -1077 -1529 -1528 -1848 1303 4954 6332
112170 6332 6382 8099 12427 15649 13417 9017 7199 5777 4387 1920 -1241 -1235 1252 2977 2246 1913
113495 1913 2304 4268 4439 4614 6364 6913 6508 5167 3136 1882 -381 -3775 -5285 -5124 -1994 3467
114819 3467 5977 6240 6624 5621 6499 7435 9329 10460 7511 6088 4314 2088 2687 4096 5523 11821
116144 11821 17821 17309 13990 11425 10010 10400 10545 8462 5056 3412 2983 988 2118 7336 12330
$$ packed form
106955B0442L10L69K285K96n134n999j321l04m074p011k654L194K844k99N69L816
108279G329J680k289l682l092l461k411O34M487L805L624K938M629J981j042k293
109520A2837m089m781j956j423k274r24L241J953o8O52J472K710J890j964l54
110763F922R27o44k066l707l180j403p08J797J495Q0n90m52Jl20L151L651J378
112170F332N0J717M328L222k232m400j818j422j390k467l161OK487J725p31l33
113495A913L91J964J71J75J750N49m05j341k031j254k263l394j510J61L130N461
114819C467K510K63L84j003Q78R36J894J131k949j423j774k226N99J409J427O298
116144A1821O000n12l319k565j415L90J45k083l406j644m29j995J130N218M994
$$ plain form
117385 12330 12899 9464 5063 1324 -1387 -1820 -2111 -3652 -4314 -665 2456 4525 5577 6884 7489
118627 7489 6881 5078 7177 10837 13443 14349 12533 7251 3668 2917 2286 2740 7480 12634 15613 14776
119952 14776 12323 11351 11221 5027 -2750 -7084 -9514 -8716 -4698 -3494 -5170 -4756 -2534 662 3763
121194 3763 8930 13380 14941 11981 6320 3552 2219 35 -2271 -2238 -2092 -3846 -4448 133 3880
122435 3880 4693 3865 1956 249 2574 5288 7226 9215 9411 8532 7345 6650 3970 1890 1348 2264
123760 2264 5148 6929 5319 4326 4896 4614 3425 5517 8372 9018 8238 10024 11780 11722 11518 12210 13368
125167 13368 14082 13483 12075 9879 9020 10444 9663 3904 -2599 -6854 -6117 -4488 -3761 -3957 -4183 -4961
126493 -4961 -7995 -8606 -3942 2480 4177 737 -278 -654 -1255 1890 7833 13805 13673 10953 9984 10928
$$ packed form
117385A2330N69l435m401l739k711m33k91j541o62L649L121K069J052J307O05
118627G489o08j803K099L660K606R06j816n282l583p51o31M54M740N154K979q37
119952A4776k453r72j30o194p777m334k430P98M018J204j676M14K222L196L101
121194C763N167M450J561k960n661k768j333k184k306L3J46j754o02M581L747
122435C880Q13q28j909j707K325K714J938J989J96q79j187o95k680k080n42R16
123760B264K884J781j610r93N70k82j189K092K855O46p80J786J756n8k04O92J158
125167A3368P14n99j408k196q59J424p81n759o503m255P37J629P27j96k26p78
126493d961l034o11M664O422J697l440j015l76o01L145N943N972j32k720r69R44
$$ plain form
127817 10928 13079 11741 9809 8408 5504 3177 3866 3665 3061 3927 5653 6508 5786 4831 3700 5779
129142 5779 8220 10412 11230 10027 8048 5511 5321 6231 6404 4392 4192 3208 2259 2737 4516 3548 1462
130549 1462 1033 680 979 430 -2120 -4061 -3010 -2048 281 6437 12061 13171 9924 3369 -1899 -3823
131874 -3823 -2557 -685 2795 7431 10525 10374 7299 1663 271 407 -1178 -2068 -997 523 1181
133115 1181 1759 545 -2887 -2928 -189 1040 1690 3660 9774 13754 15295 15080 15854 15914 12895 11542
134440 11542 13402 17094 19538 17903 13726 12131 11973 13715 16464 16333 15087 12238 7101 4385 5720
135682 5720 9242 11383 12264 13403 16048 18065 21164 25447 24206 16552 10213 10459 11344 13790 17144
136924 17144 18232 16627 12423 7825 6163 4802 4108 7939 11209 8372 5330 7024 12930 15495
$$ packed form
127817A0928K151j338j932j401k904k327O89k01o04Q66J726Q55p22r55j131K079
129142E779K441K192Q18j203j979k537j90R10J73k012k00r84r49M78J779r68k086
130549A462m29l53K99n49k550j941J051R62K329O156N624J110l247o555n268j924
131874c823J266J872L480M636L094j51l075n636j392J36j585q90J071J520O58
133115A181N78j214l432m1K739J229O50J970O114L980J541k15P74O0l019j353
134440A1542J860L692K444j635m177j595j58J742K749j31j246k849n137k716J335
135682E720L522K141Q81J139K645K017L099M283j241p654o339K46Q85K446L354
136924A7144J088j605m204m598j662j361o94L831L270k837l042J694N906K565
$$ plain form
138083 15495 16077 16361 16706 15235 10589 4388 1247 -854 -61 1855 3106 6220 9146 12192 16368
139325 16368 13958 10813 13144 15119 17603 19679 19594 17473 15665 14719 14782 13319 10068 5118 4631 7179
140649 7179 11172 13365 9707 5409 3910 2212 279 -507 -830 -262 -1017 -2688 -1726 1357 -55 -1967
141974 -1967 -1689 -1384 185 3985 6170 6451 5915 5273 5773 5475 6342 7843 10578 8562 7269 9301
143298 9301 12943 14096 11007 6097 1975 1198 2544 1954 -762 -679 3898 6157 3798 1701 2232 2757
144623 2757 6733 10751 11171 10350 10916 9241 6274 2812 -208 -2053 -195 1732 3210 8398 10911
145865 10911 8767 8857 11359 11277 7549 4071 3801 7464 10168 10680 12793 11419 5502 1833 1960 4723
147190 4723 6358 6029 5198 6190 7373 6428 3924 2999 6099 10460 12887 14669 15556 14549 11943 10305
$$ packed form
138083A5495N82K84L45j471m646o201l141k101P93J916J251L114K926L046M176
139325A6368k410l145K331J975K484K076q5k121j808r46O3j463l251m950m87K548
140649G179L993K193l658m298j499j698j933p86l23N68p55j671R62L083j412j912
141974a967K78L05J569L800K185K81n36o42N00k98Q67J501K735k016j293K032
143298I301L642J153l089m910m122p77J346n90k716Q3M577K259k359k097N31N25
144623B757L976M018M20q21N66j675k967l462l020j845J858J927J478N188K513
145865A0911k144R0K502q2l728l478k70L663K704N12K113j374n917l669J27K763
147190D723J635l29q31R92J183r45k504r25L100M361K427J782Q87j007k606j638
$$ plain form
148514 10305 9387 8048 7149 4551 2076 -135 2384 8645 12150 12175 9626 6505 4685 1938 1644
149755 1644 3593 6445 6947 7529 8373 9548 9391 7774 5806 3691 5168 8559 9877 8631 6580
150998 6580 5510 5085 6721 9325 7761 5654 8085 10627 7549 5422 3589 1007 -824 -216 1338
152239 1338 294 254 2714 2575 105 -3726 -5684 -2960 736 3650 7055 8654 5983 1722 -1092
153481 -1092 -2959 -4232 -4417 -3751 -1168 2531 3808 1853 -1339 -4675 -3922 -2687 -4236 -8043 -8885
154723 -8885 -4534 1928 5710 4580 3163 5131 7905 8178 8247 10503 11667 11402 11590 10228 7664 7384
156048 7384 10352 15189 19688 18384 13470 10563 10106 10722 10872 9072 9329 8798 10560 13864 14348 10379
157372 10379 5507 3199 2569 -50 -3947 -7118 -7916 -5239 1247 4574 4470 6092 6409 6221 7174 9928
$$ packed form
148514A0305r18j339q99k598k475k211K519O261L505K5k549l121j820k747k94
149755A644J949K852N02N82Q44J175j57j617j968k115J477L391J318j246k051
150998F580j070m25J636K604j564k107K431K542l078k127j833k582j831O08J554
152239A338j044m0K460j39k470l831j958K724L696K914L405J599k671m261k814
153481a092j867j273j85O66K583L699J277j955l192l336P53J235j549l807q42
154723h885M351O462L782j130j417J968K774K73O9K256J164k65J88j362k564k80
156048G384K968M837M499j304m914k907m57O16J50j800K57n31J762L304M84l969
157372A0379m872k308o30k619l897l171p98K677O486L327j04J622L17j88R53K754
$$ plain form
158697 9928 14750 18345 18741 15863 15520 15567 13570 10884 8223 4886 2453 -172 -2284 -2342 -944 3897
160021 3897 6902 4346 177 -2401 -858 708 3134 6859 10443 12507 14351 15861 16575 18099 19353
161264 19353 20674 18172 12233 7930 7945 13763 19710 23703 22125 18379 13817 10575 9777 11680 14546
162505 14546 14407 12041 13274 14868 13746 13570 14972 15901 16650 17428 16063 13346 13906 16089 15293 14534
163830 14534 13207 10840 9737 5314 707 1457 2651 2002 3560 7179 9638 8355 4694 703 -1022
165072 -1022 -1122 1127 3943 6170 5198 2085 938 428 820 2081 1676 -84 504 2560 -716 -5441
166397 -5441 -6900 -5074 -2512 743 3353 1418 -586 -2120 -2607 -2191 848 3460 4690 5511 5830
167638 5830 5950 6789 7705 9190 7582 2805 -3073 -4765 -1682 -233 -1543 -4701 -6285 -3962 -57
$$ packed form
158697I928M822L595L96k878l43M7j997k686k661l337k433k625k112n8J398M841
160021C897L005k556m169k578J543J566K426L725L584K064J844J510P14J524J254
161264A9353J321k502n939m303J5N818N947L993j578l746m562l242p98J903K866
162505A4546j39k366J233J594j122j76J402R29P49P78j365k717N60K183p96p59
163830A4534j327k367j103m423m607P50J194o49J558L619K459j283l661l991j725
165072a022j00K249K816K227r72l113j147n10L92J261m05j760N88K056l276m725
166397e441j459J826K562L255K610j935k004j534m87M16L039K612J230Q21L19
167638E830J20Q39R16J485j608m777n878j692L083J449j310l158j584K323L905
$$ plain form
168880 -57 1455 2129 999 -683 -591 1758 2613 1880 304 -3641 -6169 -5526 -3847 -1793 -231 -347 -3909
170287 -3909 -6440 -3871 -335 2650 4817 6010 7412 7391 5945 7015 9727 11767 8256 5941 5790
171530 5790 7649 10112 11149 12450 14031 12316 8894 4118 -1535 -5157 -8949 -10855 -6863 633
172688 633 7190 10209 6791 3901 2069 -1934 -8102 -10352 -6857 -2389 2848 5832 3979 262 116
173930 116 763 -5065 -13340 -16679 -13948 -11117 -8973 -7967 -6115 -2316 1646 4320 4072 3375 4787
175172 4787 5712 3159 -2008 -3260 -340 3097 4723 5804 5946 5364 3615 4075 7157 11014 11337 8210
176496 8210 6154 4534 4441 8534 13298 12738 13652 18030 18928 17391 16338 13972 11095 5626 2662 4957
177821 4957 6840 6863 4804 1831 1520 5907 10835 11524 10169 9292 7174 3290 -93 -684 585 510
$$ packed form
168880e7J512O74j130j682R2K349Q55p33j576l945k528O43J679K054J562j16l562
170287c909k531K569L536K985K167J193J402k1j446J070K712K040l511k315j51
171530E790J859K463J037J301J581j715l422m776n653l622l792j906L992P496
172688F33O557L019l418k890j832m003o168k250L495M468N237K984j853l717j46
173930A16O47n828q275l339K731K831K144J006J852L799L962K674k48o97J412
175172D787R25k553n167j252K920L437J626J081J42n82j749M60L082L857L23l127
176496H210k056j620r3M093M764n60R14M378Q98j537j053k366k877n469k964K295
177821D957J883K3k059k973l11M387M928O89j355q77k118l884l383n91J269p5
$$ plain form
179145 510 -474 -1735 -531 5602 12296 14925 14075 11643 10103 14864 18579 20160 21051 18447 14402
180388 14402 10756 7939 7435 8506 9691 9430 7515 7958 10603 11524 12412 17272 20056 14956 8915
181629 8915 7779 7459 7827 10165 8397 5703 4985 2324 96 1526 1899 2583 5794 7327 4834 4906
182954 4906 8127 9531 10769 9441 3995 1186 11 -309 1574 2520 2225 3100 5405 7978 8794 9955
184278 9955 9872 10208 11387 13988 15649 13438 12332 15649 17431 13959 6736 -2782 -14217 -17078 -13035
185521 -13035 -9267 -4752 1681 5499 5239 219 -6457 -8595 -6501 -509 5308 5362 4402 4849 3180
186762 3180 3235 1835 -1014 -3183 -5169 -3855 -2070 -1305 -1368 -963 -2624 -3901 -3355 -2407 -566 -151 -859
188170 -859 83 2723 5200 7220 8869 7175 4232 3488 4526 8441 12549 11859 12259 14716 13301 8966
$$ packed form
179145E10r84j261J204O133O694K629q50k432j540M761L715J581Q91k604m045
180388A4402l646k817n04J071J185k61j915M43K645R21Q88M860K784n100o041
181629H915j136l20L68K338j768k694p18k661k228J430L73O84L211J533k493P2
182954D906L221J404J238j328n446k809j175l20J883R46k95Q75K305K573Q16J161
184278I955q3L36J179K601J661k211j106L317J782l472p223r518j1435k861M043
185521a3035L768M515O433L818k60n020o676k138K094N992N817N4r60M47j669
186762C180N5j400k849k169j986J314J785P65o3M05j661j277N46R48J841M15p08
188170h59R42K640K477K020J649j694k943p44J038L915M108o90M00K457j415m335
$$ plain form
189494 8966 2872 -3655 -8255 -7233 413 8275 13773 14801 12605 10945 8611 7784 8951 11812 16052
190736 16052 16941 14542 13568 14211 11308 6157 -1647 -7941 -7883 -4296 -1935 -1726 442 6401 13157 19440
192061 19440 26119 34490 45216 61151 89988 147300 265409 507739 871237 982922 781140
192971 781140 607599 505384 431779 369288 314501 268019 231244 203679 182835 168105 157487
193882 157487 147809 137059 123848 112044 103253 95823 88586 83832 81302 76537 69597 64415 59470
194958 59470 56192 55845 58670 60038 57389 53445 52035 53444 51845 47493 43197 40357 40352 40242 36519
196200 36519 33066 27584 24287 25691 27888 29572 30871 29045 22577 14882 12398 15061 16379 16224
197359 16224 14811 14168 14382 15050 17418 17102 14321 10419 8383 11050 18267 23173 22846 21632 22512 24262
$$ packed form
189494H966o094o527m600J022P646P862N498J028k196j660k334q27J167K861M240
190736A6052Q89k399r74O43k903n151p804o294N8L587K361K09K168N959O756O283
192061A9440O679Q371J0726J5935K8837N7312J18109K42330L63498J11685k01782
192971G81140j73541j02215p3605o2491n4787m6482l6775k7565k0844j4730j0618
193882A57487r678j0750j3211j1804q791p430p237m754k530m765o940n182m945
194958E9470l278l47K825J368k649l944j410J409j599m352m296k840nj10l723
196200C6519l453n482l297J404K197J684J299j826o468p695k484K663J318j55
197359A6224j413o43K14O68K368l16k781l902k036K667P217M906l27j214Q80J750
$$ plain form
198684 24262 24262 23004 20978 18172 16198 15945 15692 14475 13853 13001 11989 10892 14136 19287 22441 21590
200008 21590 22254 24440 25332 22917 20435 21863 23893 22284 20775 20995 19746 16923 12938 10289 8066
201251 8066 6764 6513 6505 4311 2150 4004 8706 16713 20388 20686 20131 16061 10419 7961 8830 9470
202575 9470 9440 11767 16625 19465 17992 17670 19613 24030 23775 19474 16779 17333 18489 19227 20952 19933
203900 19933 16224 13929 12164 9256 5809 4584 6062 8296 10453 13409 16014 16490 13782 6839
205058 6839 3931 4732 7885 14999 20619 21616 18781 10648 3995 2914 4362 5844 5904 3565 -501
206300 -501 -1300 -356 789 4179 6804 5662 1856 556 3131 10052 14656 14556 13420 12549 12570 13348
207625 13348 13166 9866 6157 3759 2497 4586 7843 11793 14520 15558 13434 8642 5272 3242
$$ packed form
198684B4262%j258k026k806j974k53k53j217o22q52j012j097L244N151L154q51
200008B1590O64K186Q92k415k482J428K030j609j509K20j249k823l985k649k223
201251H066j302k51qk194k161J854M702Q007L675K98n55m070n642k458Q69O40
202575I470l0K327M858K840j473l22J943M417k55m301k695N54J156P38J725j019
203900A9933l709k295j765k908l447j225J478K234K157K956K605M76k708o943
205058F839k908Q01L153P114N620R97k835q133o653j081J448J482O0k339m066
206300e01p99R44J145L390K625j142l806j300K575O921M604j00j136q71K1P78
207625A3348j82l300l709k398j262K089L257L950K727J038k124m792l370k030
$$ plain form
208784 3242 2006 1899 4018 3163 3223 5274 6250 5743 5850 6142 9595 13997 17895 20360 21457 21281 19531
210191 19531 17902 15749 11011 5388 763 1400 3345 3844 4805 9040 13669 15093 15891 13667 9502
211433 9502 5833 6700 8718 11210 12921 12575 13237 11954 8441 5453 6573 10106 13165 13981 11775
212675 11775 10996 12168 11146 4797 -880 1562 6739 9467 10219 9073 8566 9371 11904 15873 17559
213917 17559 15316 9399 5061 2287 775 3032 6018 9723 11851 11896 9167 4987 1942 748 -1081
215159 -1081 -2427 -2863 -2399 2564 8701 11595 10973 10004 10805 10912 11956 13487 12620 11439 11633 12368 13188
216566 13188 12081 8915 6034 3875 1678 -853 -3263 -3156 -1617 1326 2755 1938 272 151 1119
217808 1119 886 1427 2461 5395 4547 5571 7466 5614 1971 456 2662 7787 11102 15170 17907
$$ packed form
208784C242j236j07K119q55O0K051R76n07J07K92L453M402L898K465J097j76j750
210191A9531j629k153m738n623m625O37J945M99R61M235M629J424P98k224m165
211433I502l669Q67K018K492J711l46O62j283l513k988J120L533L059Q16k206
212675A1775p79J172j022o349n677K442N177K728P52j146n07Q05K533L969J686
213917A7559k243n917m338k774j512K257K986L705K128M5k729m180l045j194j829
215159a081j346m36M64M963O137K894o22r69Q01J07J044J531q67j181J94P35Q20
216566A3188j107l166k881k159k197k531k410J07J539K943J429q17j666j21R68
217808A119k33N41J034K934q48J024J895j852l643j515K206N125L315M068K737
$$ plain form
219049 17907 18180 18051 17457 14186 10150 8397 8451 7269 5133 5165 7708 7587 7580 8892 11422 14512 17889
220457 17889 20305 19302 16250 11295 4492 266 -601 3282 7824 9318 9025 9826 4609 579 1457
221699 1457 2644 2567 3516 8843 10577 9458 8665 8615 11513 12461 9678 6525 5031 2974 2302 2938 4480
223107 4480 6303 8993 10744 14759 16860 13692 10796 8434 4702 2817 2622 2769 2445 3559 1772
224348 1772 -1906 -1409 4140 10122 13503 17098 18507 13820 6016 2077 1498 -1494 -5263 -4315 1806
225590 1806 8463 13167 15302 12077 4329 -1395 -147 5627 10757 14427 15552 13134 12022 13993
226749 13993 15659 13726 12906 13271 12291 11736 12925 14423 16687 17792 16643 12894 7444 4112 3421
227991 3421 4147 2390 -2377 -2205 -72 -1996 -5214 -6981 -4792 -109 2442 4157 6427 4050 1188
$$ packed form
219049A7907K73j29n94l271m036j753N4j182k136L2K543j21pJ312K530L090L377
220457A7889K416j003l052m955o803m226q67L883M542J494k93Q01n217m030Q78
221699A457J187p7R49N327J734j119p93n0K898R48k783l153j494k057o72O36J542
223107D480J823K690J751M015K101l168k896k362l732j885j95J47l24J114j787
224348A772l678M97N549N982L381L595J409m687p804l939n79k992l769R48O121
225590A806O657M704K135l225p748n724J248N774N130L670J125k418j112J971
226749A3993J666j933q20L65r80n55J189J498K264J105j149l749n450l332o91
227991C421P26j757m767J72K133j924l218j767K189M683K551J715K270k377k862
$$ plain form
229233 1188 3428 6300 8410 11242 10769 9697 7720 5009 6549 13117 17046 17582 16974 17224 16524 15785
230558 15785 17083 18875 17250 15903 13915 9913 4804 1840 1400 4396 7645 9351 12799 13599 11396
231799 11396 11763 11811 9561 8289 9224 7709 5800 4362 2789 3450 4227 6674 10217 11070 10129 8069
233123 8069 6363 5268 5385 7847 9281 11125 15035 16240 13041 12283 12415 9322 5310 6781 12554
234366 12554 19003 22800 21695 19275 15668 15813 17451 18438 17595 16090 15076 18245 24687 29533 29600
235607 29600 26914 21583 17032 12640 7813 7710 9372 8047 5408 2535 1743 6440 9315 7627 7515
236849 7515 9828 9505 7090 5023 3056 2299 -130 -3501 -2526 2079 6355 7484 7011 6698 7273 7317
238174 7317 4743 1955 1712 1067 1138 4030 4883 6792 9001 8585 7888 8160 7386 6425 4895 5329 9159
$$ packed form
229233A188K240K872K110K832m73j072j977k711J540O568L929N36o08K50p00p39
230558A5785J298J792j625j347j988m002n109k964m40K996L249J706L448Q00k203
231799A1396L67M8k250j272R35j515j909j438j573O61P77K447L543Q53r41k060
233123H069j706j095J17K462J434J844L910J205l199p58J32l093m012J471N773
234366A2554O449L797j105k420l607J45J638R87q43j505j014L169O442M846O7
235607B9600k686n331m551m392m827j03J662j325k639k873p92M697K875j688j12
236849G515K313l23k415k067j967p57k429l371R75M605M276J129m73l13N75M4
238174G317k574k788k43o45P1K892Q53J909K209m16o97K72p74r61j530M34L830
$$ plain form
239581 9159 11563 9738 7299 9077 9915 8067 5059 4371 9588 16190 15391 14516 13956 13125 13677 17051
240905 17051 20554 20490 17748 15052 15580 16717 13695 7985 4912 5029 6743 10872 15978 17275 15619
242148 15619 12297 7391 3039 2515 6401 7933 6561 5996 7356 9309 11280 13924 13506 8497 4129
243389 4129 1800 1522 225 3251 7749 9311 8578 6384 5211 5669 6805 11363 16551 15948 9721
244632 9721 1957 -1955 -1634 -1253 -2538 325 3327 2070 1629 2175 4570 9603 13062 11291 6196
245873 6196 4387 3749 3256 4419 6849 10517 14421 12758 8753 6483 5988 7525 9484 9465 9400 12420
247198 12420 17269 16892 10635 5429 3814 3510 2448 4566 7455 9158 9332 7244 3770 3292 6772
248439 6772 7003 6443 5642 6259 6613 5569 7794 8545 6199 6004 6086 2717 -1507 -2917 -669 2029 3638
$$ packed form
239581I159K404j825k439J778Q38j848l008o88N217O602p99q75n60q31N52L374
240905A7051L503o4k742k696N28J137l022n710l073J17J714M129N106J297j656
242148A5619l322m906m352n24L886J532j372n65J360J953J971K644m18n009m368
243389D129k329k78j297L026M498J562p33k194j173M58J136M558N188o03o227
244632I721p764l912L21L81j285K863L002j257m41N46K395N033L459j771n095
245873F196j809o38m93J163K430L668L904j663m005k270m95J537J959j9o5L020
247198A2420M849l77o257n206j615l04j062K118K889J703J74k088l474m78L480
248439F772K31n60q01O17L54j044K225P51k346j95Q2l369m224j410K248K698J609
$$ plain form
249847 3638 618 -2881 -3651 -3021 -977 3344 7463 11412 16708 19413 18541 14173 8806 7493 12291
251089 12291 15290 15803 15882 12681 7700 6763 7380 8467 10989 14172 17057 18767 17514 15083 14472 13517
252414 13517 10572 7585 3647 781 -246 1570 7012 11930 13786 12077 7432 1779 -4666 -7246
253572 -7246 -5154 1047 7741 11243 12803 11720 7978 3929 771 -1110 -1804 -1138 -365 1610 4479
254815 4479 4207 3293 1897 -266 -1287 -2037 -1608 1234 4645 4425 4319 1952 -25 -2033 -1911 2015
256139 2015 3416 2792 4278 5371 4058 3937 2472 1234 663 2137 7145 14175 18116 17222 14863
257380 14863 13908 11069 7110 6247 10340 14015 15422 16112 15534 13488 14503 17398 20396 24702 24264
258623 24264 20637 18602 16429 12140 8661 5217 5742 9616 8501 5210 3831 4869 4646 1614 2164
$$ packed form
249847C638l020l499p70O30K044M321M119L949N296K705q72m368n367j313M798
251089A2291K999N13P9l201m981r37O17J087K522L183K885J710j253k431o11r55
252414A3517k945k987l938k866j027J816N442M918J856j709m645n653o445k580
253572g246K092O201O694L502J560j083l742m049l158j881o94O66P73J975K869
254815D479k72r14j396k163j021p50M29K842L411k20j06k367j977k008J22L926
256139B015J401o24J486J093j313j21j465j238n71J474N008P030L941q94k359
257380A4863r55k839l959q63M093L675J407O90n78k046J015K895K998M306m38
258623B4264l627k035k173m289l479l444N25L874j115l291j379J038k23l032N50
$$ plain form
259864 2164 4005 4999 5726 2687 886 6817 14889 18092 18540 16016 15697 17486 16959 15897 17340 17345
261189 17345 16403 17375 20878 21511 17866 14102 10992 11551 10701 8672 10604 12002 11615 11026 10220 8728
262513 8728 7333 7012 7317 6999 4366 4559 6700 4884 3204 4025 6845 9799 10821 9298 5415 4816
263838 4816 5049 6243 7911 6116 4174 5464 7874 4881 2163 5185 5997 5019 5706 8311 9549
265080 9549 8852 7996 6898 8266 9085 9517 13850 15773 13841 12838 8070 3419 3318 5387 9631 10426
266405 10426 8255 8456 10885 11468 10274 10434 11725 14749 16753 18368 22968 28303 29386 25349 18152
267646 18152 12940 11754 13771 17576 15949 11721 10094 10590 9920 7419 4427 1865 2324 3934 4525
268889 4525 1874 919 2098 4875 8107 8318 8823 8879 7802 5576 6601 8936 5523 1031 830 3164
$$ packed form
259864B164J841R94P27l039j801N931Q072L203M48k524l19J789n27j062J443N
261189A7345r42R72L503O33l645l764l110N59q50k029J932J398l87n89q06j492
262513H728j395l21L05l18k633J93K141j816j680Q21K820K954J022j523l883n99
263838D816K33J194J668j795j942J290K410k993k718L022Q12r78O87K605J238
265080I549o97q56j098J368Q19M32M333J923j932j003m768m651j01K069M244P95
266405A0426k171K01K429N83j194J60J291L024K004J615M600N335J083m037p197
267646A8152n212j186K017L805j627m228j627M96o70k501k992k562M59J610N91
268889D525k651r55J179K777L232K11N05N6j077k226J025K335l413m492k01K334
$$ plain form
270213 3164 3196 2471 6808 13831 15808 11991 9750 12268 16381 16156 12068 7960 6232 8631 15447
271455 15447 20958 23760 22353 17285 11015 10790 15651 15461 10905 8001 7870 5525 2484 4279 8558
272696 8558 9517 7378 2957 -496 -788 -1648 -2197 425 2206 1389 227 519 816 3721 6025 6007 7003
274104 7003 8352 9595 9217 8363 6497 -51 -6794 -7447 -3912 -2100 1908 5514 8930 12009 14372
275346 14372 16858 18823 16782 12167 7603 2269 1931 5674 9841 11539 9948 7389 6719 4525 980
276588 980 -1921 608 6028 9149 11758 13304 11703 8007 7426 7419 2963 -1170 -2204 531 5068 7668
277912 7668 5756 3390 2036 2339 3828 2855 -260 -1641 -48 3183 7017 8340 8614 8789 8521 4425
279237 4425 -160 -2660 -1023 1631 4453 5575 1437 -1127 1563 3425 4493 6192 8474 10377
$$ packed form
270213C164L2p25M337P023J977l817k241K518M113k25m088m108j728K399O816
271455A5447N511K802j407n068o270k25M861j90m556k904j31k345l041J795M279
272696H558R59k139m421l453k92q60n49K622J781q17j162K92K97K905K304j8R96
274104G003J349J243l78q54j866o548o743o53L535J812M008L606L416L079K363
275346A4372K486J965k041m615m564n334l38L743M167J698j591k559o70k194l545
276588I80k901K529N420L121K609J546j601l696n81pm456m133j034K735M537K600
277912G668j912k366j354L03J489r73l115j381J593L231L834J323K74J75k68m096
279237D425m585k500J637K654K822J122m138k564K690J862J068J699K282J903
$$ plain form
280396 10377 12669 11072 5388 1140 4351 6247 6883 8000 7208 7297 10575 10385 4567 1912 3782
281638 3782 5608 5963 8016 8954 7719 6620 8085 10304 11439 11546 10821 8910 6006 1113 -1648
282880 -1648 -4304 -1690 2010 1838 1759 4302 4601 1463 -1875 -3922 -4119 -2038 2097 6174 6712 1759
284204 1759 -2463 -3196 -2405 -1849 -2426 -3557 -963 2402 3202 5964 8943 9461 12570 16047 16541 15657
285529 15657 13423 11248 10248 10335 12076 10678 8715 8717 10374 13669 15809 14648 8935 2505 1515 4611
286853 4611 5463 4511 9088 17842 21705 20236 15389 9893 7307 8210 12559 16048 17827 18856 18378
288095 18378 17542 16831 17240 15796 12207 9854 9139 9952 12957 16089 15535 12745 8810 5793 6396 6563
289419 6563 4594 3489 4898 5119 5553 1929 -5675 -6282 377 8120 14546 18916 22392 20613 15918
$$ packed form
280396A0377K292j597n684m248L211J896O36J117p92Q9L278j90n818k655J870
281638C782J826L55K053R38j235j099J465K219J135J07p25j911k904m893k761
282880a648k656K614L700j72p9K543K99l138l338k047j97K081M135M077N38m953
284204A759m222p33P91N56n77j131K594L365Q00K762K979N18L109L477M94q84
285529A5657k234k175j000Q7J741j398j963KJ657L295K140j161n713o430r90L096
286853D611Q52r52M577Q754L863j469m847n496k586R03M349L489J779J029m78
288095A8378q36p11M09j444l589k353p15Q13L005L132n54k790l935l017O03J67
289419F563j969j105J409K21M34l624p604o07O659P743O426M370L476j779m695
$$ plain form
290662 15918 15337 14181 11683 8934 3761 -2233 -4020 -2892 -1734 422 3206 6867 8900 6236
291820 6236 3912 4432 5659 8213 7781 3068 -747 -1350 287 1153 1335 1053 1775 7380 15354 19286
293146 19286 16822 10596 7725 7872 7037 5280 4807 5812 6655 6559 5818 3921 -867 -2495 -2475 72
294470 72 3126 4039 8869 14710 18458 21114 20680 16828 13015 11730 9663 8407 9819 14291 17078
295712 17078 15786 10716 5548 3848 5727 10290 14824 13688 9439 6744 6454 8809 11477 11614 8624
296953 8624 7314 8133 8186 7504 5291 5449 3382 577 1281 3511 4760 5767 6660 7887 9146 9225 8831
298361 8831 9989 11686 10385 5733 3484 6008 7733 6154 3854 4800 8499 9833 10539 11640 10438
299603 10438 8909 6155 1865 3111 7851 12081 13486 13332 14131 17746 21884 22906 21867 19984 17149
$$ packed form
290662A5918n81j156k498k749n173n994j787J128J158K156K784L661K033k664
291820F236k324N20J227K554m32m713l815o03J637Q66J82k82P22N605P974L932
293146A9286k464o226k871J47q35j757m73J005Q43r6p41j897m788j628K0K547
294470G2L054R13M830N841L748K656m34l852l813j285k067j256J412M472K787
295712A7078j292n070n168j700J879M563M534j136m249k695k90K355K668J37k990
296953H624j310Q19N3o82k213J58k067k805P04K230J249J007Q93J227J259P9l94
298361H831J158J697j301m652k249K524J725j579k300R46L699J334P06J101j202
299603A0438j529k754m290J246M740M230J405j54P99L615M138J022j039j883k835
$$ plain form
300845 17149 14721 11421 7230 5307 6553 7817 5614 3285 3307 6272 10558 13180 15709 14762 12397
302086 12397 12169 10356 6569 6648 8304 9335 6665 6153 8141 6860 3195 72 -819 1810 5148
303328 5148 10803 15403 14941 11504 9831 11939 14888 13876 9864 5576 3507 5719 7814 8885 12475
304570 12475 16076 18004 17008 16010 16963 17495 16172 10473 4773 270 -4401 -6761 -4155 -939 969
305811 969 5780 12410 15224 16432 16479 14054 9821 5581 3886 2537 -546 -1615 1377 5963 11048
307054 11048 14506 17530 16558 10536 2956 -3950 -6021 -2576 1256 2101 3097 3454 3401 1061 -524 -1428
308379 -1428 -6180 -8352 -5219 25 4196 8334 9815 9220 9111 7266 6803 10682 13430 10781 4854
309620 4854 3904 6459 9024 7694 2936 170 2046 8618 12686 13381 13194 12991 10891 8268 6956
$$ packed form
300845A7149k428l300m191j923J246J264k203k329K2K965M286K622K529r47k365
302086A2397k28j813l787P9J656J031k670n12J988j281l665l123q91K629L338
303328E148N655M600m62l437j673K108K949j012m012m288k069K212K095J071L590
304570A2475L601J928r96r98R53N32j323n699n700m503m671k360K606L216J908
305811I69M811O630K814J208M7k425m233m240j695j349l083j069K992M586N085
307054A1048L458L024r72o022p580o906k071L445L832Q45R96L57n3k340j585r04
308379a428m752k172L133N244M171M138J481n95j09j845m63L879K748k649n927
309620D854r50K555K565j330m758k766J876O572M068O95j87k03k100k623j312
$$ plain form
310862 6956 5969 5487 5945 6817 8432 10850 12747 15368 19795 23059 22985 21027 15061 8134 2289 -3912
312187 -3912 -7189 -5882 -3700 -1544 673 3936 8899 11959 8316 2489 72 -980 -2374 -51
313345 -51 4135 8161 13750 15940 11363 2430 -2409 -397 1237 1361 -418 -3167 -2165 528 5245
314588 5245 13204 22159 30045 47194 87268 165242 255187 246924 191707 156010 132150 112305
315581 112305 96529 82504 66848 52702 45052 44438 45854 42957 35628 30171 29964 32688 34537
316657 34537 36231 37476 38476 36526 32406 29671 29456 29791 32656 35325 35321 29496 23628 20150 14839
317899 14839 11952 13687 15790 16469 15408 12556 8834 4186 1839 4072 6522 7454 6459 4108 2787
319140 2787 4546 7110 10270 14148 13103 10355 8794 8435 8068 8687 9882 12128 14093 17784 16908
$$ packed form
310862F956r87m82M58Q72J615K418J897K621M427L264p4j958n966o927n845o201
312187c912l277J307K182K156K217L263M963L060l643n827k417j052j394K323
313345e1M186M026N589K190m577q933m839K012J634J24j779k749J002K693M717
314588E245P959Q955P886J7149M0074P7974Q9945q263n5217l5697k3860j9845
315581A12305j5776j4025j5656j4146p650o14J416k897p329n457k07K724J849
316657C4537J694J245J000j950m120k735k15L35K865K669mn825n868l478n311
317899A4839k887J735K103O79j061k852l722m648k347K233K450R32r95k351j321
319140B787J759K564L160L878j045k748j561l59l67O19J195K246J965L691q76
$$ plain form
320383 16908 11587 13143 17838 19548 18738 16100 13826 10789 9402 11846 13813 16112 16615 12667 11714
321624 11714 11792 10689 9814 10062 10942 12712 15902 19159 20759 18411 15522 14018 15451 15629 12022 9951
322949 9951 8643 6175 3926 5573 5935 5074 7077 10024 12311 16370 21475 21309 19712 19251 20906
324191 20906 21578 21151 19143 13966 12428 14556 16199 15353 13567 7686 2870 5897 12697 15669 12033
325433 12033 4138 -727 -868 -232 534 62 -90 2966 7729 12860 14644 11715 8534 8090 6659 5142
326757 5142 4368 4043 2670 3100 4380 6959 10776 12263 13700 16943 15901 10900 9219 9582 8635 5718
328082 5718 777 -3067 -4883 -3254 -742 2584 7470 9738 6007 1812 -891 -309 3633 7927 10697
329324 10697 11650 11885 8936 7387 8746 10820 14647 17092 16640 11790 7161 5614 5662 4971 2937 2065
$$ packed form
320383A6908n321J556M695J710q10k638k274l037j387K444J967K299N03l948r53
321624A1714P8j103q75K48Q80J770L190L257J600k348k889j504J433J78l607k071
322949I951j308k468k249J647L62q61K003K947K287M059N105j66j597m61J655
324191B0906O72m27k008n177j538K128J643q46j786n881m816L027O800K972l636
325433A2033p895m865j41O36P66m72j52L056M763N131J784k929l181m44j431j517
326757E142p74l25j373M30J280K579L817J487J437L243j042n001j681L63r47k917
328082E718m941l844j816J629K512L326M886K268l731m195k703N82L942M294K770
329324A0697R53K35k949j549J359K074L827K445m52m850m629j547M8o91k034q72
$$ plain form
330649 2065 5213 9045 11934 12257 10385 11498 16202 22494 26996 26066 21291 18355 18094 20257 21042
331890 21042 18782 15887 11853 10786 11967 15038 17739 20008 20940 19164 16525 13723 11764 11454 12568
333133 12568 16030 17144 14043 11534 12437 15597 18471 20296 21974 19803 14498 10124 5436 5008 8135
334374 8135 10609 11317 9791 8242 10162 13032 10207 6675 6566 8171 9899 10085 11586 11796 10130
335615 10130 9503 11558 11128 7865 8065 9595 10153 11498 13261 15181 15834 15239 16379 16682 16172 17181
336940 17181 16734 13703 11334 9727 9287 10355 11134 11871 14487 15356 11345 8188 6642 2773 575
338183 575 1362 -358 -4486 -6168 -6667 -7978 -6798 -3667 -1061 1196 3195 5712 6790 8412 8448 5360
339507 5360 3890 3900 6702 11657 15536 18310 17341 13130 8883 7063 6098 6683 8023 7869 7329 4781
$$ packed form
330649B065L148L832K889L23j872J113M704O292M502r30m775k936k61K163P85
331890B1042k260k895m034j067J181L071K701K269R32j776k639k802j959l10J114
333133A2568L462J114l101k509R03L160K874J825J678k171n305m374m688m28L127
334374H135K474P08j526j549J920K870k825l532j09J605J728J86J501K10j666
335615A0130o27K055m30l263K00J530N58J345J763J920O53n95J140L03n10J009
336940A7181m47l031k369j607m40J068P79P37K616Q69m011l157j546l869k198
338183E75P87j720m128j682m99j311J180L131K606K257J999K517J078J622L6l088
339507E360j470J0K802M955L879K774r69m211m247j820r65N85J340j54n40k548
$$ plain form
340832 4781 3580 2263 508 -1224 -2083 719 4832 8182 9770 9384 7014 6019 5091 5762 8221 7756
342156 7756 3291 1821 5006 6871 6625 3017 -1687 -3755 -579 3235 6438 9920 10197 3388 -3242
343397 -3242 -1829 4133 6298 6449 5133 4634 5797 8789 11606 15089 15882 12510 11347 12710 14866
344640 14866 14976 10104 2620 -272 -181 -618 -2941 -2611 2967 8282 11648 17415 20717 16934 10868
345881 10868 5931 4849 8045 10411 12945 16048 17076 15729 10470 5816 7088 10659 10731 10928 11666
347123 11666 8826 7987 10836 12323 14229 16906 20287 22403 23186 21079 18642 17542 18227 21180 22671
348365 22671 18385 13290 10766 11261 10435 7620 5778 4421 2141 2982 5849 10857 17065 20901 23964
349607 23964 23710 19689 16205 12249 8901 5388 3612 3232 3777 4147 4808 6879 7944 5978 5725 3541
$$ packed form
340832D781j201j317j755j732q59K802M113L350J588l86k370r95r28O71K459m65
342156G756m465j470L185J865k46l608m704k068L176L814L203L482K77o809o630
343397c242J413N962K165J51j316m99J163K992K817L483P93l372j163J363K156
344640A4866J10m872p484k892R1m37k323L30N578N315L366N767L302l783o066
345881A0868m937j082L196K366K534L103J028j347n259m654J272L571P2J97P38
347123A1666k840q39K849J487J906K677L381K116P83k107k437j100O85K953J491
348365B2671m286n095k524M95q26k815j842j357k280Q41K867N008O208L836L063
349607B3964k54m021l484l956l348l513j776l80N45L70O61K071J065j966k53k184
$$ plain form
350931 3541 -942 -1790 2125 6717 8129 4515 118 -2040 -4443 -6007 -2897 2739 5995 4564 2573
352174 2573 2722 5080 9761 13855 12088 7483 3356 91 320 3854 7767 6880 3206 4992 9385
353415 9385 10735 7621 3627 3673 9241 15836 18440 16767 12442 10494 9708 9526 12491 14484 13154
354657 13154 10031 4199 -180 -703 -2443 -4855 -7367 -5924 -272 6529 11237 10100 9020 7951
355816 7951 5548 7185 11081 14328 16317 14844 10999 9048 6374 4743 5179 5380 4991 5991 9290
357058 9290 15636 20172 20045 16444 9625 3971 2733 5701 7131 7197 7416 7715 7008 4451 2126 202
358383 202 -3099 -4403 -2435 2190 6764 10785 12237 11098 12476 13611 10100 6498 5739 5285 5027
359625 5027 8587 14528 20632 23447 24775 27660 29453 27178 22475 17621 13816 12721 13503 12688 11994
$$ packed form
350931C541m483q48L915M592J412l614m397k158k403j564L110N636L256j431j991
352174B573J49K358M681M094j767m605m127l265K29L534L913q87l674J786M393
353415I385J350l114l994M6N568O595K604j673m325j948p86j82K965J993j330
354657A3154l123n832m379n23j740k412k512J443N652O801M708j137j080j069
355816G951k403J637L896L247J989j473l845j951k674j631M36K01l89J000L299
357058I290O346M536j27l601o819n654j238K968J430O6K19K99p07k557k325j924
358383B02l301j304J968M625M574M021J452j139J378J135l511l602p59m54k58
359625E027L560N941O104K815J328K885J793k275m703m854l805j095P82q15o94
$$ plain form
360866 11994 13230 13158 11590 12467 15506 19206 17964 15255 16117 16376 13144 10559 9346 9232 12172 12802
362190 12802 10936 8036 5391 6978 10232 10620 10659 7122 3049 2412 4201 5030 2398 1558 4794 6079
363515 6079 3335 2700 3019 1932 878 -2336 -5199 -3322 524 5323 8826 10749 11368 11391 11558 10513
364840 10513 6030 2152 -16 165 1998 2246 1768 2377 2362 1696 3313 4569 3269 -239 -1354 -1089
366165 -1089 -1021 -273 1110 1169 3415 4081 3918 5610 6987 6878 7779 9958 9891 8589 8673 8333 10079 14088
367654 14088 15121 13895 13647 12895 9837 6794 5635 4077 2925 176 -3856 -5075 -2371 2306 6273
368897 6273 8472 9856 12695 17416 19906 16538 13533 12065 9288 5019 2331 -210 -4367 -857
370055 -857 5774 9344 9788 12391 16063 19834 21243 20386 21153 21733 19490 15669 11764 7646 6027 3748
$$ packed form
360866A1994J236p2j568Q77L039L700j242k709Q62K59l232k585j213j14K940O30
362190A2802j866k900k645J587L254L88L9l537m073o37J789Q29k632q40L236J285
363515F079k744o35L19j087j054l214k863J877L846M799L503J923O19K3J67j045
364840A0513m483l878k168J81J833K48m78O09j5o66J617J256j300l508j115K65
366165a089O8P48J383N9K246O66j63J692J377j09R01K179o7j302Q4l40J746M009
367654A4088J033j226k48p52l058l043j159j558j152k749m032j219K704M677L967
368897F273K199J384K839M721K490l368l005j468k777m269k688k541m157L510
370055h57O631L570M44K603L672L771J409q57P67N80k243l821l905m118j619k279
$$ plain form
371381 3748 -980 -5062 -6300 -6484 -6240 -4730 -1662 2170 5187 3385 1710 3518 8514 10103 9347
372622 9347 10742 10094 2811 -5128 -9035 -9115 -6087 -1740 2648 3899 1647 2289 5264 7645 7535 7509
373947 7509 10747 14851 17339 16912 14923 12042 9086 6760 6261 5069 6027 8718 10563 9458 6388
375188 6388 3880 2996 3064 3302 3957 4171 4211 2093 -1025 -2207 -2157 -1736 1277 4354 5165 4770 4410 5313
376679 5313 6823 9020 11515 12337 14505 16394 18318 20406 19784 16722 13506 14297 14888 15450 17125 16839
378003 16839 11310 6180 3344 -2137 -5483 -3856 -2365 751 401 -4075 -6967 -3615 -2009 -2616 1785
379245 1785 2857 -3732 -10537 -12789 -11106 -7923 -2204 408 1220 2429 5122 6367 6025 4382 942
380487 942 -1086 -877 3235 5418 4763 6727 11265 16008 19010 19346 19651 18243 12499 9827 10500 8933
$$ packed form
371381C748m728m082j238j84K44J510L068L832L017j802j675J808M996J589p56
372622I347J395o48p283p939l907q0L028M347M388J251k252O42K975K381j10k6
373947G509L238M104K488m27j989k881k956k326m99j192R58K691J845j105l070
375188F388k508q84O8K38O55K14M0k118l118j182N0M21L013L077Q11l95l60R03
376679E313J510K197K495Q22K168J889J924K088o22l062l216P91N91N62J675k86
378003A6839n529n130k836n481l346J627J491L116l50m476k892L352J606o07M401
379245A785J072o589o805k252J683L183N719K612Q12J209K693J245l42j643l440
380487I42k028K09M112K183o55J964M538M743L002L36L05j408n744k672O73j567
$$ plain form
381812 8933 6227 5736 5103 4518 5963 5979 3117 3904 7799 9098 8024 5486 3830 3581 3893 5180
383136 5180 7166 6990 5579 6745 6064 4509 3882 3721 5742 7710 7729 7486 6371 6297 9093 11823 11741
384544 11741 10261 9220 5554 3677 3850 4524 9362 14357 14699 14568 14388 12598 12801 13542 9072 5816
385868 5816 6803 6301 4491 4275 6141 9162 11523 13178 13112 14719 17111 17227 14622 10444 6328 2269
387193 2269 1951 4381 3759 1325 -130 -230 3071 4640 3500 370 -967 1182 5444 10345 11708
388434 11708 10132 10834 12584 15292 17627 15280 8952 2339 1437 5207 9295 10558 7622 6935 10138
389677 10138 12690 13398 10897 8625 10154 14092 16387 17378 15577 13503 12532 9707 4829 2132 3550
390918 3550 3058 1674 1305 330 -193 -2065 -3073 -292 2767 3761 5653 7395 8590 9432 8969 10293
$$ packed form
381812H933k706m91o33n85J445J6k862P87L895J299j074k538j656k49L12J287
383136E180J986j76j411J166o81j555o27j61K021J968J9k43j115p4K796K730q2
384544A1741j480j041l666j877J73O74M838M995L42j31j80j790K03P41m470l256
385868E816R87n02j810k16J866L021K361J655o6J607K392J16k605m178m116m059
387193B269l18K430o22k434j455j00L301J569j140l130j337K149M262M901J363
388434A1708j576P02J750K708K335k347o328o613r02L770M088J263k936o87L203
389677A0138K552P08k501k272J529L938K295R91j801k074r71k825m878k697J418
390918C550m92j384l69r75n23j872j008K781L059R94J892J742J195Q42m63J324
$$ plain form
392243 10293 13351 16073 14903 10380 7868 7690 9004 8136 7561 6160 3099 1101 -1292 -2040 1869
393485 1869 8803 12093 11617 13108 12880 10467 9139 5858 462 -2692 -377 5298 9856 9929 5921
394726 5921 3290 1370 -1607 -4053 -5850 -6532 -1992 1921 6488 9178 5260 254 -1046 137 -1244
395968 -1244 -3378 -3990 -2957 -386 3244 4516 5106 8448 11934 12089 7794 2807 1256 1332 398 -1709
397293 -1709 -3156 -1750 -775 1841 6975 11091 11615 12713 13237 9792 6857 5863 5345 5593 5456 4913
398618 4913 2249 -13 -856 -1737 1143 4458 3916 2276 3159 5976 7238 7616 5233 1603 -2336 -3850
399942 -3850 -2671 -539 -379 1925 4775 7101 6482 4547 1634 -1484 -678 3310 8916 12791 13384
401184 13384 14460 13798 10355 7228 6049 7551 10167 12504 13116 12131 13348 15465 16157 15458 16934
$$ packed form
392243A0293L058K722j170m523k512j78J314q68n75j401l061j998k393p48L909
393485A869O934L290m76J491k28k413j328l281n396l154K315N675M558P3m008
394726E921k631j920k977k446j797o82M540L913M567K690l918n006j300J183j381
395968a244k134o12J033K571L630J272N90L342L486J55m295m987j551P6r34k107
397293a709j447J406R75K616N134M116N24J098N24l445k935r94n18K48j37n43
398618D913k664k262q43q81K880L315n42j640Q83K817J262L78k383l630l939j514
399942c850J179K132J60K304K850K326o19j935k913l118Q06L988N606L875N93
401184A3384J076o62l443l127j179J502K616K337O12r85J217K117O92o99J476
$$ plain form
402425 16934 17645 17223 15378 11590 5271 84 1738 5273 6211 6897 7333 9063 12799 17012 16302 14064
403751 14064 11607 9598 8772 7098 2566 -2604 -1786 1172 -394 -2607 -1371 1710 642 -3992 -5136
404992 -5136 -4379 -2012 1068 3313 6724 8070 5870 4937 4482 4242 5564 6487 3452 1105 2309 2276
406317 2276 881 2956 7262 8750 8391 10570 9117 6554 6170 6241 8507 10721 7233 1553 2124 6888
407641 6888 9518 9793 9506 8429 8508 10847 10644 10322 8711 8076 9352 8904 6547 7718 10941 13673
408966 13673 16390 17174 15026 10806 8294 7673 8134 8970 9270 8529 5915 4610 6293 11341 13645 12725
410290 12725 12391 12932 9587 6984 9784 15742 17147 11360 4793 2406 3491 4156 2948 1918 -2260
411533 -2260 -3374 -2557 -2903 -1899 1563 6592 10074 11905 11761 8347 4719 3579 7052 9047 7181
$$ packed form
402425A6934P11m22j845l788o319n187J654L535R38O86M36J730L736M213p10k238
403751A4064k457k009q26j674m532n170Q18K958j566k213J236L081j068m634j144
404992e136P57K367L080K245L411J346k200r33m55k40J322R23l035k347J204l3
406317B276j395K075M306J488l59K179j453k563l84P1K266K214l488n680N71M764
407641F888K630K75k87j077P9K339k03l22j611o35J276m48k357J171L223K732
408966A3673K717P84k148m220k512o21M61Q36L00p41k614j305J683N048K304r20
410290A2725l34N41l345k603K800N958J405n787o567k387J085O65j208j030m178
411533b260j114Q17l46J004L462N029L482J831j44l414l628j140L473J995j866
$$ plain form
412774 7181 1960 -5639 -9669 -9449 -5809 -342 2751 2665 1700 4073 8899 11024 12178 15515 15637 11991
414099 11991 7824 4393 2617 2328 3799 4476 4641 215 -3010 -4509 -4444 -3867 -3760 -1324 1621 3272
415423 3272 5083 5325 7104 8311 6349 5499 6130 5872 6107 6010 6777 8966 7915 6619 9826 11781
416749 11781 9515 7617 8009 8789 9462 9031 8623 11582 17446 21221 22660 23314 25010 24172 18457 12182
418073 12182 9023 7901 8896 9050 6472 4956 3511 6011 11449 12021 10147 8292 8721 10683 13781
419315 13781 17809 18274 15737 9627 5653 7253 8897 8177 5231 -310 -3773 -6024 -7728 -7187 -4822
420557 -4822 851 9165 13788 14032 14089 15747 15286 14214 13631 15967 20372 20332 13776 6973 5616 8156
421882 8156 12351 14584 10126 3188 2262 1048 -2729 -1512 3223 4725 1764 -1991 -1426 2017 2105
$$ packed form
412774G181n221p599m030K20L640N467L093q6r65K373M826K125J154L337J22l646
414099A1991m167l431j776k89J471O77J65m426l225j499O5N77J07K436K945J651
415423C272J811K42J779J207j962q50O31k58K35r7P67K189j051j296L207J955
416749A1781k266j898L92P80O73m31m08K959N864L775J439O54J696q38n715o275
418073A2182l159j122R95J54k578j516j445K500N438N72j874j855M29J962L098
419315A3781M028M65k537o110l974J600J644p20k946n541l463k251j704N41K365
420557d822N673Q314M623K44N7J658m61j072n83K336M405m0o556o803j357K540
421882H156M195K233m458o938r26j214l777J217M735J502k961l755N65L443Q8
$$ plain form
423123 2105 -254 -1005 -2121 -4829 -8464 -12832 -13617 -10900 -5448 2360 8557 10303 9235 6319 4384
424365 4384 5747 8659 8521 6295 4276 2462 4882 9899 10531 11260 12112 9515 3545 164 398 -563
425689 -563 -4428 -5510 -2964 981 3340 4330 5242 6456 5652 1625 1813 4918 5414 5093 6451 5907
427014 5907 5880 7750 8656 7253 6983 5257 -248 -5797 -7287 -3442 1002 7321 8922 5210 2328
428256 2328 1685 3144 4305 7715 17265 24767 23581 18960 13945 10024 9470 10986 11677 12491 11485
429497 11485 9650 8530 8961 8225 5345 6220 8326 9971 10961 10345 15108 20062 19880 18088 13485 11606
430822 11606 11964 12152 12053 10271 5657 3464 713 -2650 -3138 -3419 -617 2602 4654 6209 5312 4594
432146 4594 7398 10153 7595 5328 7263 10364 9826 9505 10782 11520 13396 14566 11453 5203 681
$$ packed form
423123B105k359p51j116k708l635m368p85K717N452P808O197J746j068k916j935
424365D384J363K912j38k226k019j814K420N017O32P29Q52k597n970l381K34r61
425689e63l865j082K546L945K359R90R12J214q04m027J88L105M96l21J358n44
427014E907k7J870R06j403k70j726n505n549j490L845M444O319J601l712k882
428256B328o43J459J161L410R550P502j186m621n015l921n54J516O91Q14j006
429497A1485j835j120M31p36k880Q75K106J645R90o16M763M954j82j792m603j879
430822A1606L58J88r9j782m614k193k751l363m88k81K802L219K052J555q97p18
432146D594K804K755k558k267J935L101n38l21J277P38J876J170l113o250m522
$$ plain form
433389 681 492 3844 9598 13511 13052 7240 3848 7795 12898 13318 10928 8774 7923 8953 10929 11411
434713 11411 12813 12025 9660 5867 921 -188 2790 3066 1289 3369 7575 7039 5214 3671 -1074
435955 -1074 -4527 -3309 770 4004 6572 8789 10216 8532 8589 12039 12995 10196 9011 7144 3588
437197 3588 4352 8137 9245 7444 5965 5256 4183 3263 3424 805 735 6612 11710 11296 8335 5500
438522 5500 6246 6685 4039 -611 -2812 -1917 -483 938 3818 5528 5912 3658 -428 -4587 -2010
439763 -2010 -231 -2235 -750 1986 6182 6921 5531 5974 7776 9195 11243 13182 11432 10718 14466
441005 14466 18880 20262 18190 16356 15246 13955 13011 13571 15348 17236 18316 17757 13216 8256 8650
442247 8650 11528 12943 12498 11747 10264 6930 3605 6642 7784 6771 8063 9284 11393 13303 13408
$$ packed form
433389F81j89L352N754L913m59n812l392L947N103M20k390k154q51J030J976M82
434713A1411J402p88k365l793m946j109K978K76j777K080M206n36j825j543m745
435955a074l453J218M079L234K568K217J427j684N7L450R56k799j185j867l556
437197C588P64L785J108j801j479p09j073r20J61k619p0N877N098m14k961k835
438522E500P46M39k646m650k201Q95J434J421K880J710L84k254m086m159K577
439763b010J779k004J485K736M196P39j390M43J802J419K048J939j750p14L748
441005A4466M414J382k072j834j110j291r44N60J777J888J080n59m541m960L94
442247H650K878J415m45p51j483l334l325L037J142j013J292J221K109J910J05
$$ plain form
443489 13408 14184 13146 11008 10336 9007 7915 5531 6006 9605 11617 11549 13651 15146 12057 8183
444731 8183 4185 1072 -533 -1491 -3970 -3735 757 3925 2340 -1472 -4707 -6565 -5829 -4455 -3528
445973 -3528 -2464 -864 1126 6834 12674 13532 12748 12952 12674 11429 13421 16940 18472 16783 12202
447214 12202 9179 6088 7029 13675 15041 10826 7399 7670 13349 22838 27006 22585 17941 17647 15635
448457 15635 13965 14492 14121 12921 11111 9295 7051 5472 5339 5970 2988 525 1949 6402 9301
449698 9301 7005 2988 -351 -1569 146 1194 1629 4976 8231 10940 12775 12312 10466 7971 7461
450939 7461 7848 6024 3247 441 -804 2241 5843 7854 10157 10533 13373 16813 17101 17758 17114 16212
452265 16212 19737 23931 24244 20984 18267 17643 16095 14727 14882 15302 13044 9808 7222 9132 12639
$$ packed form
443489A3408P76j038k138o72j329j092k384M75L599K012o8K102J495l089l874
444731H183l998l113j605r58k479K35M492L168j585l812l235j858P36J374R27
445973c528J064J600J990N708N840Q58p84K04k78j245J992L519J532j689m581
447214A2202l023l091R41O646J366m215l427K71N679R489M168m421m644k94k012
448457A5635j670N27l71j200j810j816k244j579j33O31k982k463J424M453K899
449698I301k296m017l339j218J715J048M35L347L255K709J835m63j846k495n10
450939G461L87j824k777k806j245L045L602K011K303L76K840L440K88O57o44r02
452265A6212L525M194L13l260k717o24j548j368J55M20k258l236k586J910L507
$$ plain form
453506 12639 14060 11774 8226 8648 11038 12138 9620 4375 2315 3708 6521 8128 6231 1634
454666 1634 -2658 -5028 -3544 -1740 -1387 -2854 -4900 -2922 -76 -1383 -5108 -6776 -4649 -1495 -1214
455907 -1214 311 2954 3669 3791 5507 7581 7247 6132 4520 1212 -1881 -3580 -4350 -3367 -1070 1755
457232 1755 3666 1130 -1415 -1890 53 1268 791 4226 7036 5313 5529 8796 11672 14924 16455
458473 16455 16222 16428 18147 18578 16730 16019 15067 15815 19635 20138 16294 15411 17213 17006 16093 16820 16465
459881 16465 15203 12709 9159 2546 -636 1783 2776 1391 1277 1119 3011 5941 7464 8676 9116
461123 9116 9169 10273 13550 14996 13215 13269 14003 14700 15979 20460 24563 25438 23837 20804 18124 16149
462448 16149 14309 12555 12097 11945 11635 11516 9160 6124 1930 -3715 -5823 -4985 -2757 -865 -316 -672
$$ packed form
453506A2639J421k286l548M22K390J100k518n245k060J393K813J607j897m597
454666A634m292k370J484J804L53j467k046J978K846j307l725j668K127L154K81
455907a214J525K643P15J22J716K074l34j115j612l308l093j699p70R83K297K825
457232A755J911k536k545m75J943J215m77L435K810j723K16L267K876L252J531
458473A6455k33K06J719M31j848p11r52P48L820N03l844q83J802k07r13P27l55
459881A6465j262k494l550o613l182K419R93j385j14j58J892K930J523J212M40
461123I116N3J104L277J446j781N4P34O97J279M481M103Q75j601l033k680j975
462448A6149j840j754m58j52l10j19k356l036m194n645k108Q38K228J892N49l56
$$ plain form
463772 -672 -380 -86 233 -759 -1635 -127 1066 1030 1393 3196 6232 7320 10289 13359 12837 7408 2322
465180 2322 2534 3818 5710 8330 12388 15682 15705 16795 18354 18001 16858 14310 12559 13774 13257 12564
466504 12564 14034 13493 13509 12046 7358 5980 7119 7787 11183 10853 6649 4876 3307 4850 7126
467746 7126 9391 9405 7472 7338 9133 7663 4576 3533 3831 2440 4326 7066 8043 9265 11159 13613
469070 13613 15873 14184 10212 4025 -2739 -7243 -9949 -9867 -8800 -8201 -6374 -4330 -2806 -2293 -1736
470313 -1736 -1438 -189 -210 -1399 -414 1547 2630 1685 1854 5033 4591 457 -1296 604 4615 6175
471637 6175 8682 9143 6027 6078 7853 6525 2976 847 1030 4166 5785 4710 4321 1929 -2835 -6718
472962 -6718 -6464 -4938 -3689 -4070 -4463 -3132 -3717 -3335 -3448 -4695 -3824 -1844 -461 1164 1407 824 1046
$$ packed form
463772f72K92K94L19r92q76J508J193l6L63J803L036J088K969L070n22n429n086
465180B322K12J284J892K620M058L294K3J090J559l53j143k548j751J215n17o93
466504A2564J470n41J6j463m688j378J139O68L396l30m204j773j569J543K276
467746G126K265J4j933j34J795j470l087j043K98j391J886K740R77J222J894K454
469070A3613K260j689l972o187o764m504k706Q2J067N99J827K044J524N13N57
470313a736K98J249k1j189R85J961J083r45J69L179m42m134j753J900M011J560
471637F175K507M61l116N1J775j328l549k129J83L136J619j075l89k392m764l883
472962f718K54J526J249l81l93J331n85L82j13j247Q71J980J383J625K43n83K22
$$ plain form
474369 1046 1976 3108 2738 2567 5850 8930 11795 13318 14064 15873 14315 10414 9306 11137 9012
475611 9012 5918 5805 6503 9419 10208 5833 3562 4600 5144 3073 23 -2520 -3130 -2384 278 2419
476935 2419 1360 1316 2155 3658 3948 3250 2496 1193 -248 1626 4310 3362 -316 -3869 -3679 -1579
478260 -1579 2563 6488 8772 9195 7411 1616 -3421 -5838 -1646 4808 8901 9565 6676 3401 2105
479502 2105 -941 -3159 -1798 -2092 -1369 1635 2587 504 -3896 -5757 -4798 -307 4845 7570 8897
480744 8897 7884 8223 9940 13621 16703 18136 16140 10022 5747 4299 5357 5820 3544 1353 1459
481986 1459 567 -944 533 819 -2281 -6120 -7041 -4945 815 5554 3789 -744 -606 837 1351 2574
483310 2574 4890 8615 10743 9503 5248 3734 7237 9848 9739 8910 6423 3741 3403 3347 4287 4866
$$ packed form
474369A046R30J132l70j71L283L080K865J523P46J809j558l901j108J831k125
475611I012l094j13O98K916P89m375k271J038N44k071l050k543o10P46K662K141
476935B419j059m4Q39J503K90o98p54j303j441J874K684r48l678l553J90K100
478260a579M142L925K284M23j784n795n037k417M192O454M093O64k889l275j296
479502B105l046k218J361k94P23L004R52k083m400j861R59M491N152K725J327
480744H897j013L39J717L681L082J433j996o118m275j448J058M63k276k191J06
481986A459q92j511J477K86l100l839r21K096N760M739j765m533J38J443N14J223
483310B574K316L725K128j240m255j514L503K611j09q29k487k682l38n6R40N79
$$ plain form
484635 4866 4735 5971 7105 3770 -2024 -4392 -2309 1963 2745 1443 2303 3469 3235 -296 -3471
485876 -3471 -2439 72 3946 7863 7568 7083 10336 14274 13314 12994 12879 10163 9900 10592 12280 14581
487201 14581 15546 15519 14720 15903 16165 15681 13666 10769 9389 10542 15471 17139 14641 10434 6757 3220
488525 3220 -1411 -3158 405 5014 7712 10343 14209 13774 8299 6600 8934 9038 8624 13626 20869
489768 20869 21970 21806 19498 13430 5556 1027 484 740 1220 3149 3313 3272 3057 4307 7005 9914
491092 9914 12988 14284 16738 17824 13496 7619 7619 11006 10222 6671 7379 10888 12654 12956 14839 16598
492417 16598 14981 10536 9007 10971 14987 18215 17815 14201 7767 4854 8691 14944 15243 13680 14736
493658 14736 16822 18804 18346 16545 15962 16223 16224 14601 12546 12748 11888 11049 7821 4900 5857 6636 6640 8253
$$ packed form
484635D866j31J236J134l335n794k368K083M272P82j302Q60J166k34l531l175
485876c471J032K511L874L917k95m85L253L938r60l20j15k716k63O92J688K301
487201A4581R65k7p99J183K62m84k015k897j380J153M929J668k498m207l677l537
488525C220m631j747L563M609K698K631L866m35n475j699K334J04m14N002P243
489768B0869J101j64k308o068p874m529n43K56M80J929J64m1k15J250K698K909
491092I914L074J296K454J086m328n877%L387p84l551P08L509J766L02J883J759
492417A6598j617m445j529J964M016L228m00l614o434k913L837O253K99j563J056
493658A4736K086J982m58j801n83K61Jj623k055K02q60q39l228k921R57P79MJ613
$$ plain form
495149 8253 10380 11773 13052 13075 13307 13634 15463 17930 16864 12693 9728 9730 7382 4447 5180 9205
496473 9205 12837 13471 13554 15354 16870 13839 12369 12470 11202 9817 7797 6192 2867 1220 1313 1262
497798 1262 -476 -4593 -7330 -4296 1432 3851 2609 2512 4316 3427 955 31 2340 5169 5087 4454
499122 4454 6120 8919 9316 8681 8453 9137 10820 14956 19496 21372 20700 21151 20518 18894 17524 17424
500448 17424 17294 15300 11487 7338 1718 -384 1121 3435 5102 3220 2766 1265 -1085 2077 4519
501689 4519 2451 1611 4384 5668 3623 4928 5780 4141 3099 2953 4533 4779 6576 9894 10917
502931 10917 10973 14519 20819 21069 15986 12075 9711 4420 -2189 -2845 595 5482 7423 9477 11410
504173 11410 12409 9117 7854 10360 9519 5561 6159 11075 14664 14126 12182 11744 12757 13515 10786 8074
$$ packed form
495149H253K127J393J279K3K32L27J829K467j066m171k965Kk348k935P33M025
496473I205L632O34Q3J800J516l031j470J01j268j385k020j605l325j647R3n1
497798A262j738m117k737L034N728K419j242r7J804q89k472r24K309K829q2o33
499122D454J666K799L97o35k28O84J683M136M540J876o72M51o33j624j370j00
500448A7424j30j994l813m149n620k102J505K314J667j882m54j501k350L162K442
501689D519k068q40K773J284k045J305Q52j639j042j46J580K46J797L318J023
502931A0917N6L546O300K50n083l911k364n291o609o56L440M887J941K054J933
504173A1410R99l292j263K506q41l958N98M916L589n38j944m38J013P58k729k712
$$ plain form
505498 8074 5769 3888 4468 6495 8188 3732 1023 1062 1369 957 845 4686 8853 9446 8914 7477
506822 7477 6527 3936 2847 2487 2344 5108 10206 12469 10320 7537 7969 7300 8556 8948 9272 8132
508147 8132 4191 3312 2880 1901 1687 3290 5985 7362 7265 6570 4386 2585 2291 2688 326 873 1824
509554 1824 176 -95 -2591 -8783 -9993 -8740 -10707 -10624 -7214 -2353 1183 772 -2303 -1849 4420 4793
510879 4793 675 -505 -356 1043 2229 2007 4577 7567 6889 3404 2344 4436 7196 8395 9499
512120 9499 13128 15739 15603 10464 5044 4553 5017 5860 7680 7598 5909 3444 2714 3649 1408 -2951
513446 -2951 -5036 -3633 1583 5423 3993 977 -1071 -817 1984 7442 13950 19625 20799 18444 13463
514687 13463 6972 581 -535 2022 4574 5893 5453 6733 9471 11777 11202 9580 3996 -2589 -4380
$$ packed form
505498H074k305j881N80K027J693m456k709L9L07m12j12L841M167N93n32j437
506822G477r50k591j089l60j43K764N098K263k149k783M32o69J256L92L24j140
508147H132l941q79m32r79k14J603K695J377r7o95k184j801k94L97k362N47R51
509554A824j648k71k496o192j210J253j967Q3L410M861L536m11l075M54O269L73
510879D793m118j180J49J399J186k22K570K990o78l485j060K092K760J199J104
512120I499L629K611j36n139n420m91M64Q43J820q2j689k465p30R35k241m359
513446b951k085J403N216L840j430l016k048K54K801N458O508N675J174k355m981
514687A3463o491o391j116K557K552J319m40J280K738K306n75j622n584o585j791
$$ plain form
515928 -4380 -2280 900 3716 7370 7166 4064 2147 1593 4312 7789 7040 1209 -4323 -3148 -2169
517171 -2169 -3044 -2451 -499 -400 448 78 -2214 -4891 -5665 -2759 -913 -1423 854 3217 3250 3941 6362
518578 6362 6951 3315 -1813 -6522 -9155 -8774 -6674 -2590 1905 5163 4617 1590 1981 4621 6997
519820 6997 7769 6398 6079 5525 5490 3828 -2134 -7003 -9098 -10731 -10292 -7404 -5250 -1462 3482 7295
521145 7295 8892 8088 6082 4492 1489 -74 -618 -1774 -1687 -1125 -552 723 177 -367 979 0 -4060
522552 -4060 -5837 -2429 1995 4873 5694 4899 4713 4001 940 -1466 -123 524 -247 -1490 -2101 -566
523876 -566 3762 8001 7450 3156 2411 6149 7969 7946 8241 8972 9558 7707 3398 1627 4166 6387
525201 6387 7953 9649 9863 9832 8074 3712 2823 5251 9684 12696 15537 17497 16161 12383 10930
$$ packed form
515928d380K100L180K816L654k04l102j917n54K719L477p49n831n532J175R79
517171b169q75N93J952R9Q48l70k292k677p74K906J846n10K277K363L3O91K421
518578F362N89l636n128m709k633L81K100M084M495L258n46l027L91K640K376
519820F997P72j371l19n54l5j662n962m869k095j633M39K888K154L788M944L813
521145G295J597q04k006j590l003j563n44j156Q7N62N73J275n46n44J346r79m060
522552d060j777L408M424K878Q21p95j86p12l061k406J343O47p71j243o11J535
523876e66M328M239n51m294p45L738J820k3K95P31N86j851m309j771K539K221
525201F387J566J696K14l1j758m362q89K428M433L012K841J960j336l778j453
$$ plain form
526443 10930 11600 9139 6000 2522 434 1047 1904 2367 259 -1495 154 2472 384 -4125 -5227
527685 -5227 -2474 821 1678 1343 2609 3650 -1529 -7236 -5162 -268 1849 85 -1714 -3276 -4667
528926 -4667 -6544 -6328 -2589 972 2752 -2 -3270 -1730 -3321 -5110 -1729 2525 5005 7897 10530
530168 10530 11679 10138 8756 9622 12849 14719 12656 10346 10826 10193 7605 8334 11710 15590 16485
531410 16485 14259 12969 14072 13352 12738 10942 8881 9827 11507 12239 10537 7560 10549 14534 12577
532652 12577 9777 5820 1404 -631 -2454 -542 3600 7453 9041 8125 5041 3725 7972 10488
533811 10488 6611 -556 -1635 677 -1630 -1440 529 2819 7657 11551 11547 10282 8210 5206 3366
535053 3366 5375 6675 8238 9539 8705 6485 1422 -2184 -1867 1533 4627 7735 8564 7284 5487
$$ packed form
526443A0930O70k461l139l478k088O13Q57M63k108j754J649K318k088m509j102
527685e227K753L295Q57l35J266J041n179n707K074M894K117j764j799j562j391
528926d667j877K16L739L561J780k754l268J540j591j789L381M254K480K892K633
530168A0530J149j541j382Q66L227J870k063k310M80o33k588P29L376L880Q95
531410A6485k226j290J103p20o14j796k061R46J680P32j702k977K989L985j957
532652A2577k800l957m416k035j823J912M142L853J588r16l084j316M247K516
533811A0488l877p167j079K312k307J90J969K290M838L894mj265k072l004j840
535053C366K009J300J563J301q34k220n063l606L17L400L094L108Q29j280j797
$$ plain form
536295 5487 5289 6139 7203 7049 6088 6382 7593 7892 2421 -2160 -1247 86 -1038 -1528 -787 296 3533
537702 3533 8998 13436 12093 8797 6655 5865 5576 6195 4397 2807 2147 4239 2644 52 1595
538944 1595 8494 12842 13862 15765 17284 16932 16253 12373 6710 1557 -3668 -6791 -4638 -2197 -2183
540186 -2183 -3346 -2659 -666 2444 4619 4238 2212 -738 -1271 1683 5301 8357 10071 10627 10447 8909
541510 8909 4338 1832 2267 1124 -344 -3183 -5853 -7799 -6223 -4057 -1903 -990 -1639 -3623 -2838
542752 -2838 -1160 -2865 -4507 -422 3655 326 -3713 -4326 -6367 -8360 -6685 -3374 2676 9434 13628
543994 13628 14104 10802 6861 5680 4731 4126 3162 3703 5099 8411 12437 13790 13128 14628 13704 10992
545319 10992 8544 4424 823 1172 3102 505 -1540 -1854 -5333 -7507 -4133 205 854 -3225 -4904
$$ packed form
536295E487j98Q50J064j54r61K94J211K99n471m581R13J333j124m90P41J083L237
537702C533N465M438j343l296k142p90k89O19j798j590o60K092j595k592J543
538944A595O899M348J020J903J519l52o79l880n663n153n225l123K153K441J4
540186b183j163O87J993L110K175l81k026k950n33K954L618L056J714N56j80j538
541510H909m571k506M35j143j468k839k670j946J576K166K154R13o49j984P85
542752b838J678j705j642M085M077l329m039o13k041j993J675L311O050O758M194
543994A3628M76l302l941j181r49o05r64N41J396L312M026J353o62J500r24k712
545319A0992k448m120l601L49J930k597k045l14l479k174L374M338O49m079j679
$$ plain form
546560 -4904 -1712 4594 10723 11780 11736 10770 7548 682 -2079 2787 7132 8711 9533 12745 13982
547802 13982 12158 12555 13396 14220 12593 9035 7113 4601 4840 7090 7729 8031 7624 6655 4229 409
549127 409 93 2442 5284 6935 4314 942 -405 -1297 476 967 2029 6197 7839 9009 9006 6768
550451 6768 5027 4739 5106 3104 -114 -899 -1110 -1405 952 3942 6858 7315 5002 3781 7489 10714
551776 10714 9059 5866 3777 3318 3745 3078 -714 -5774 -9708 -9516 -6194 -3307 946 6179 8040
553018 8040 8524 10815 12282 10847 9268 3869 -5417 -9735 -8322 -5392 -4048 -5318 -6131 -2138 3158
554260 3158 5560 6913 8019 6865 5032 5037 7241 9297 10523 10165 7290 6274 9970 13701 13219 12533
555584 12533 11906 9459 5278 2028 56 -2934 -4781 -5702 -4006 -316 3643 5042 2857 933 -578
$$ packed form
546560d904L192O306O129J057m4r66l222o866k761M866M345J579Q22L212J237
547802A3982j824L97Q41Q24j627l558j922k512K39K250O39L02m07r69k426l820
549127D09l16K349K842J651k621l372j347q92J773M91J062M168J642J170lk238
550451F768j741k88L67k002l218p85k11k95K357K990K916M57k313j221L708L225
551776A0714j655l193k089m59M27o67l792n060l934J92L322K887M253N233J861
553018H040M84K291J467j435j579n399r286m318J413K930J344j270q13L993N296
554260C158K402J353J106j154j833NK204K056J226l58k875j016L696L731m82o86
555584A2533o27k447m181l250j972k990j847r21J696L690L959J399k185j924j511
$$ plain form
556826 -578 11 1595 3844 5171 6295 5919 5658 5542 3650 1954 2127 1369 -643 -2896 -4412 -5040
558151 -5040 -4208 -5408 -8206 -9723 -11087 -12261 -13220 -12349 -11657 -10096 -6955 -1926 2478 4129 3077
559393 3077 2843 3203 1363 -1487 -2457 -3918 -9686 -14020 -12862 -9327 -4009 -340 2384 7125 7490
560634 7490 5480 3169 818 -205 -728 1700 5293 4901 4129 4748 3199 1748 4494 6701 7570 8093
561959 8093 9158 9922 8223 6614 4340 2052 3014 5298 4173 -301 -6254 -7847 -7657 -9690 -7681
563201 -7681 -485 5892 9785 13785 14701 12074 11654 12682 13432 13590 10719 4467 -2895 -5422 -2059
564443 -2059 -1023 -3027 -2253 1739 5840 4459 2666 5599 9394 9296 7051 7773 9186 9766 9741 8234
565767 8234 7050 9103 10366 8508 7879 9340 9702 10336 10434 10878 10436 8590 9138 9462 9642 10738 10950
$$ packed form
556826e78N89J584K249J327J124l76k61j16j892j696J73p58k012k253j516o28
558151e040Q32j200k798j517j364j174r59Q71O92J561L141N029M404J651j052
559393C077k34L60j840k850r70j461n768m334J158L535N318L669K724M741L65
560634G490k010k311k351j023n23K428L593l92p72O19j549j451K746K207Q69N23
561959H093J065P64j699j609k274k288R62K284j125m474n953j593J90k033K009
563201g681P196O377L893M000R16k627m20J028P50J58k871o252p362k527L363
564443b059J036k004P74L992M101j381j793K933L795r8k245P22J413N80k5j507
565767H234j184K053J263j858o29J461L62O34R8M44m42j846N48L24J80J096K12
$$ plain form
567175 10950 9945 6622 3137 3195 2856 1286 466 2573 5618 7724 10589 13990 14765 12489 12169 16007
568499 16007 20813 21532 20503 15908 9180 5355 2491 459 1497 6787 11006 13358 16056 17966
569659 17966 14939 9202 3884 -1815 -5098 -3596 1362 5853 7541 8387 9637 10511 7035 4587 4207
570900 4207 3256 3909 8099 11716 11794 10373 7565 6213 9813 12525 10710 8885 6827 4631 5182 10887
572225 10887 13953 10756 5595 2893 1060 -1179 -2591 -3910 -4648 -2077 3804 8676 10914 10019 7189
573467 7189 4477 5021 7525 6167 5099 6724 8231 8736 7538 3084 -845 331 4050 9174 11161
574708 11161 12432 13268 13241 13065 12059 9065 9915 11110 7390 3730 3098 2347 784 2562 7213 6428
576033 6428 2458 80 1377 5899 8665 8404 6881 7688 6757 2404 666 2559 6910 7550 6575 5775
$$ packed form
567175A0950j005l323l485N8l39j570q20K107L045K106K865L401P75k276l20L838
568499A6007M806P19j029m595o728l825k864k032J038N290M219K352K698J910
569659A7966l027n737n318n699l283J502M958M491J688Q46J250Q74l476k448l80
570900D207r51O53M190L617P8j421k808j352L600K712j815j825k058k196N51N705
572225A0887L066l197n161k702j833k239j412j319p38K571N881M872K238q95k830
573467G189k712N44K504j358j068J625J507N05j198m454l929J176L719N124J987
574708A1161J271Q36k7j76j006k994Q50J195l720l660o32p51j563J778M651p85
576033F428l970k378J297M522K766k61j523Q07r31m353j738J893M351O40r75q00
$$ plain form
577357 5775 4870 7566 12519 14803 12199 6294 35 -3283 -3828 -204 7029 15295 19020 15474 11684
578600 11684 11003 10799 11314 10907 7388 3305 -50 598 4825 8268 8104 4979 3391 2208 1421 2021
579924 2021 4589 7030 6553 5210 5459 6624 7568 6314 7496 8594 7228 6602 4526 1959 647
581166 647 1354 4602 7060 7008 6537 5324 3637 3401 6539 11313 12860 10586 6074 3467 4259 2872
582490 2872 868 -581 -4562 -5622 -1872 -320 -1322 -662 1799 5546 11308 11968 9204 8463 8978
583733 8978 10183 8293 2257 -3999 -7215 -8180 -5132 64 3211 1804 -2304 -4667 -5822 -6240 -3843
584974 -3843 -1497 -1131 -521 1313 4369 2011 -704 -1188 -2482 -2865 667 2535 1313 490 -318 -1139
586299 -1139 -1739 -460 1077 -762 -1580 -30 -2731 -6648 -7620 -5287 -4842 -5794 -3189 221 -666 -610
$$ packed form
577357E775r05K696M953K284k604n905o259l318n45L624P233Q266L725l546l790
578600A1684o81k04N15m07l519m083l355O48M227L443j64l125j588j183p87O00
579924B021K568K441m77j343K49J165R44j254J182J098j366o26k076k567j312
581166F47P07L248K458n2m71j213j687k36L138M774J547k274m512k607P92j387
582490B872k004j449l981j060L750J552j002O60K461L747N762O60k764p41N15
583733H978J205j890o036o256l216r65L048N196L147j407m108k363j155m18K397
584974c843K346L66O10J834L056k358k715m84j294l83L532J868j222q23q08q21
586299a139o00J279J537j839q18J550k701l917r72K333M45r52K605L410q87N6
$$ plain form
587623 -610 1979 1186 370 -632 -864 -594 750 2519 4569 4824 4574 5345 3828 1715 -435 -482 -340
589031 -340 -1510 -1924 877 3850 5082 4437 3395 4637 5419 6971 7736 4113 980 -770 -986 165
590355 165 980 3680 7623 10389 11233 9844 7122 2993 -908 657 7755 9271 4019 -1311 -1795
591598 -1795 3400 8846 13451 18085 17434 13981 12112 12265 11738 10810 10778 8662 5743 6140 4328 -584
592922 -584 -3487 -3622 -1185 1437 6096 10132 11114 14012 17743 17290 14997 14584 15546 18309 19286 17388
594247 17388 13541 9158 4019 308 -610 -678 -1021 806 2029 5175 7489 8362 6641 3170 2154
595488 2154 3110 4321 2254 -375 -2604 -4265 -4472 -7607 -8849 -6551 -1498 4136 9847 13453 13577
596731 13577 9882 4689 -1100 -3492 -1680 2721 8919 10968 9269 7610 3614 3592 7989 10154 10540
$$ packed form
587623f10K589p93q16j002k32K70J344J769K050K55k50P71j517k113k150m7J42
589031c40j170m14K801K973J232o45j042J242P82J552P65l623l133j750k16J151
590355A65Q15K700L943K766Q44j389k722m129l901J565P098J516n252n330m84
591598a795N195N446M605M634o51l453j869J53n27r28l2k116k919L97j812m912
592922e84k903j35K437K622M659M036R82K898L731m53k293m13R62K763R77j898
594247A7388l847m383n139l711r18o8l43J827J223L146K314Q73j721l471j016
595488B154R56J211k067k629k229j661k07l135j242K298N053N634N711L606J24
596731A3577l695n193n789k392J812M401O198K049j699j659l996k2M397K165L86
$$ plain form
597972 10540 9178 6950 6471 8598 11191 13127 14203 15698 13789 9420 4254 264 -1431 -996 -2065
599213 -2065 -653 -101 514 3227 5307 5791 4822 5317 7931 10845 12021 10243 5345 1153 3667 7462
600538 7462 7095 5068 4573 1817 479 467 -187 3599 8839 10013 4430 -2416 -3180 -229 1723 2652
601863 2652 2812 899 -2937 -4037 -637 3654 3300 3452 8713 11329 10288 9574 9806 8688 7109 5773
603188 5773 2957 1328 2469 5367 9179 10199 8851 9256 8191 7852 9671 11429 6719 -286 -4095
604430 -4095 -822 4561 8456 11609 16016 17386 13158 8484 7550 7146 6856 9121 10585 8027 4692
605671 4692 2066 1894 4002 6502 5876 679 -3624 -2555 1571 1248 -1262 445 2566 3636 2660
606913 2660 -745 -3936 -2307 3896 10176 14474 16292 14915 14320 13720 14320 14280 9711 4194 4175 4320
$$ packed form
597972A0540j362k228m79K127K593J936J076J495j909m369n166l990j695M35j069
599213b065J412N52O15K713K080M84r69M95K614K914J176j778m898m192K514L795
600538G462l67k027m95k756j338j2o54L786N240J174n583o846p64K951J952R29
601863B652J60j913l836j100L400M291l54J52N261K616j041p14K32j118j579j336
603188E773k816j629J141K898L812J020j348M05j065l39J819J758m710p005l809
604430d095L273N383L895L153M407J370m228m674r34m04k90K265J464k558l335
605671D692k626j72K108K500o26n197m303J069M126l23k510J707K121J070r76
606913B660l405l191J629O203O280M298J818j377n95o00O00m0m569n517j9J45
$$ plain form
608238 4320 3194 3402 2766 3135 4466 7241 7993 7704 6027 5837 7789 8536 6857 4710 1671 3708
609562 3708 9458 12644 12268 12958 13732 13544 12102 10672 7232 3916 1405 -254 832 2704 999
610804 999 1704 3798 3933 3886 5297 9003 12903 12823 9716 6559 7458 8271 6895 7303 9494 11791 12106
612211 12106 13052 12511 11342 9914 8627 8580 9300 11509 12752 11104 8533 6827 3648 1638 676 -1632
613536 -1632 -5078 -8438 -8354 -3064 5494 10069 5167 1540 2730 4383 6086 10360 12380 11193 8244
614778 8244 3688 -1522 -1179 4753 7333 4467 3565 6215 8227 7269 5892 4033 2776 1241 -517
616020 -517 377 607 -614 920 2988 3764 6017 8695 12950 16278 16503 13740 11651 10024 7532 3079
617344 3079 -815 909 6296 7351 6820 9179 10497 7382 6558 7125 5166 1872 265 3107 5188
$$ packed form
608238D320j126K08o36L69J331K775P52k89j677j90J952P47j679k147l039K037
609562C708N750L186l76O90P74j88j442j430l440l316k511j659J086J872j705
610804I99P05K094J35m7J411L706L900q0l107l157Q99Q13j376M08K191K297L15
612211A2106R46n41j169j428j287m7P20K209J243j648k571j706l179k010r62k308
613536a632l446l360Q4N290Q558M575m902l627J190J653J703M274K020j187k949
614778H244m556n210L43N932K580k866r02K650K012r58j377j859j257j535j758
616020e17Q94K30j221J534K068P76K253K678M255L328K25k763k089j627k492m453
617344C079l894J724N387J055n31K359J318l115q24N67j959l294j607K842K081
$$ plain form
618587 5188 2486 557 2690 5529 8539 11311 12059 12792 15740 20354 21894 17321 11797 8415 6512
619828 6512 6971 9877 10764 5808 142 -1341 634 4112 5620 1911 -3155 -4008 -1109 1984 5214
621070 5214 6569 4119 2682 6350 8736 7279 7249 9831 12662 12492 10472 6848 5206 2548 -787
622312 -787 -1555 -3075 -4675 -1881 2758 4318 2317 -3162 -7248 -4943 -2796 -2424 501 2914 1287
623554 1287 -1538 -5499 -8721 -9651 -9469 -8409 -5177 1820 7561 5730 1416 345 272 772 1114 1096
624878 1096 943 -307 1308 4288 4474 5790 8556 8367 8481 6751 6312 7849 8056 9780 13566 14227
626202 14227 14519 15182 14109 9954 9240 12739 11466 8473 7180 6108 7797 7884 5736 6920 11049
627445 11049 14850 15935 14535 14618 13344 7034 2123 3235 6029 7239 5771 1914 -1426 -3390 -3559
$$ packed form
618587E188k702j929K133K839L010K772P48P33K948M614J540m573n524l382j903
619828F512M59K906Q87m956n666j483J975L478J508l709n066q53K899L093L230
621070E214J355k450j437L668K386j457l0K582K831j70k020l624j642k658l335
622312g87p68j520j600K794M639J560k001n479m086K305K147L72K925K413j627
623554A287k825l961l222r30J82J060L232O997N741j831m314j071p3N00L42j8
624878A096j53j250J615K980J86J316K766j89J14j730m39J537K07J724L786O61
626202A4227K92O63j073m155p14L499j273k993j293j072J689Q7k148J184M129
627445A1049L801J085j400Q3j274o310m911J112K794J210j468l857l340j964j69
$$ plain form
628686 -3559 -1727 2375 2785 1397 1259 2063 3463 2333 -1124 -2210 -520 3069 5083 3444 361
629928 361 -1161 -1421 -895 -918 -1958 -2975 -5483 -7295 -4677 -299 3129 2220 882 1839 4209 6335
631253 6335 7514 10148 11210 9983 10261 10644 9334 7918 8297 10481 14976 17755 16975 14129 9348
632495 9348 6285 2955 1319 1980 4067 5187 4422 725 -3253 -3461 -4406 -6889 -4906 -1154 4458
633736 4458 10965 15171 15961 14687 14285 15715 15548 13724 12512 11518 6508 1526 -3174 -5804 -3542
634979 -3542 -1347 -13 5026 9527 7950 3695 220 -1857 -1184 1878 7258 8757 3543 329 361
636220 361 2385 5068 5024 3448 3017 3607 2688 1147 3388 9260 13637 14060 9868 2724 -549 2384
637545 2384 7454 7786 9339 11373 11792 12442 16299 18761 17934 18233 16071 9465 5563 3941 3415 3193
$$ packed form
628686c559J832M102M10j388j38Q04J400j130l457j086J690L589K014j639l083
629928C61j522k60N26k3j040j017k508j812K618M378L428r09j338R57K370K126
631253F335J179K634J062j227K78L83j310j416L79K184M495K779p80k846m781
632495I348l063l330j636O61K087J120p65l697l978k08r45k483J983L752N612
633736D458O507M206P90j274m02J430j67j824j212r94n010m982m700k630K262
634979c542K195J334N039M501j577m255l475k077O73L062N380J499n214l214L2
636220C61K024K683m4j576m31N90r19j541K241N872M377M23m192p144l273K933
637545B384N070L32J553K034M19O50L857K462q27K99k162o606l902j622n26k22
$$ plain form
638869 3193 616 631 3479 6489 6009 2978 543 -1489 -846 3737 6924 8883 9937 9480 10267 12986
640194 12986 12541 11971 12450 12779 15856 19565 18164 12719 8414 8295 9180 8835 6616 5457 4895 4272
641518 4272 4566 6204 4005 432 -1214 -2923 -3869 -4099 -2912 954 4274 6950 11024 13589 13524 13541
642844 13541 14357 14249 11930 13658 16644 14662 9911 3716 -2622 -7389 -11299 -11376 -6410 -4031 -4469
644085 -4469 -3579 211 3600 7218 10875 13097 14192 15175 15176 12642 10304 10507 12667 12546 9602 3967
645410 3967 -2770 -6828 -7909 -8655 -6779 -2968 -485 798 152 508 3371 6956 9483 9803 8828 5607
646734 5607 5896 10544 12703 12425 12298 11952 12370 11207 7745 6162 9450 10313 6671 2978 992 158
648059 158 122 -935 -3771 -6973 -5275 4252 10229 7183 3472 2658 4704 6027 2290 -418 782
$$ packed form
638869C193k577J5K848L010m80l031k435k032O43M583L187J959J054m57P87K719
640194A2986m45n70M79L29L077L709j401n445m305j19Q85l45k219j159n62o23
641518D272K94J638k199l573j646j709r46k30J187L866L320K676M074K565o5J7
642844A3541Q16j08k319J728K986j982m751o195o338m767l910p7M966K379m38
644085d469Q90L790L389L618L657K222J095R83Jk534k338K03K160j21k944n635
645410C967o737m058j081p46J876L811K483J283o46L56K863L585K527L20r75l221
646734E607K89M648K159k78j27l46M18j163l462j583L288Q63l642l693j986q34
648059A58l6j057k836l202J698R527N977l046l711q14K046J323l737k708J200
$$ plain form
649301 782 1774 4674 8116 9685 10444 10011 10824 10385 9542 9209 8674 10423 11623 11314 7700 1816 -303
650708 -303 649 -591 -2584 -3267 -716 4119 8768 11193 14993 17657 16277 15135 15400 14453 9656 3219
652033 3219 2110 4178 8406 13233 13562 11117 5073 484 -2099 -1410 1276 464 -2452 -2348 3057
653275 3057 7221 6247 4500 3785 4857 7013 10714 12755 9773 5377 3548 3903 4568 4383 3323 5204
654599 5204 7370 6726 1125 -1477 2365 6498 5639 488 1004 3371 4952 8020 9100 5586 1707
655842 1707 -390 -1705 -1501 -122 -20 1361 7134 9638 8817 11452 16250 14549 5417 -1549 -3991
657083 -3991 -2790 -221 58 -1902 -4943 -8478 -9293 -7388 -3818 589 3296 7207 13590 21303 27515
658325 27515 26655 21624 16563 14575 11451 8375 8621 11043 13146 15632 16362 14723 12169 9374 6446
$$ packed form
649301G82R92K900L442J569P59m33Q13m39q43l33n35J749J200l09l614n884k119
650708c03R52j240j993o83K551M835M649K425L800K664j380j142K65r47m797o437
652033C219j109K068M228M827L29k445o044m589k583O89K686q12k916J04N405
653275C057M164r74j747p15J072K156L701K041k982m396j829L55O65j85j060J881
654599E204K166o44n601k602L842M133q59n151N16K367J581L068J080l514l879
655842A707k097j315K04J379J02J381N773K504q21K635M798j701r132o966k442
657083c991J201K569K79j960l041l535q15J905L570M407K707L911O383P713O212
658325B7515q60n031n061j988l124l076K46K422K103K486P30j639k554k795k928
$$ plain form
659566 6446 2190 -967 -680 1563 2521 5083 7105 6069 5513 7731 9823 11111 10194 10698 9998 5294
660891 5294 2794 3327 2106 1866 4435 6462 6140 4847 3418 2040 -172 -2238 -3849 -2603 1291
662133 1291 6869 9935 9806 7256 4517 5603 10134 9811 5556 2078 1146 1162 52 686 1574 2170
663457 2170 1783 428 2482 5956 7831 10734 15532 16756 16359 15076 13762 13533 12722 7671 2015
664700 2015 -2518 -4489 -4353 -1749 -16 912 4318 6076 752 -3322 -1694 -432 -2210 -1608 2925
665941 2925 8990 10608 7826 3471 -480 681 6606 10478 10803 8510 6482 4134 -45 -2435 2567
667183 2567 9039 12381 12159 10602 9260 7652 7858 8313 7104 5073 1991 3028 9343 14065 12423
668425 12423 11161 11504 12963 13069 11320 10621 7984 4722 4856 8122 13585 17833 16459 11655 8149
$$ packed form
659566F446m256l157K87K243R58K562K022j036n56K218K092J288r17N04p00m704
660891E294k500N33j221k40K569K027l22j293j429j378k212k066j611J246L894
662133A291N578L066j29k550k739J086M531l23m255l478r32J6j110O34Q88N96
663457B170l87j355K054L474J875K903M798J224l97j283j314k29q11n051n656
664700B015m533j971J36K604J733R28L406J758n324m074J628J262j778O02M533
665941B925O065J618k782m355l951J161N925L872L25k293k028k348m179k390N002
667183B567O472L342k22j557j342j608K06M55j209k031l082J037O315M722j642
668425A2423j262L43J459J06j749o99k637l262J34L266N463M248j374m804l506
$$ plain form
669667 8149 6569 4805 3531 5093 10095 14906 17956 17524 15170 10006 6126 5407 3704 1641 2123
670908 2123 3350 2684 -2246 -4802 -5017 -4028 474 2794 4204 4994 5454 5491 7260 10806 12588 13250
672234 13250 13540 12915 9535 4297 228 1888 5763 8916 9644 11147 13196 13086 9946 7973 10276
673475 10276 10300 10458 11399 10342 9059 11208 14013 14290 12497 14064 16670 16464 15016 14185 11028 5089
674800 5089 -524 -4326 -1348 2499 1890 886 1021 5083 8365 7821 8750 10865 11456 11025 11005 12198
676124 12198 17057 20352 15938 8507 4720 4465 6392 6355 6336 7710 7595 4943 4959 5942 5847 6986 8094
677532 8094 5669 1870 1917 4734 8367 9627 8223 5968 3184 3932 8513 9796 5267 2847 4420
678773 4420 4777 6709 9094 9600 8972 10143 13849 18219 18090 14599 13642 13815 14305 17324 18025 16396
$$ packed form
669667H149j580j764j274J562N002M811L050m32k354n164l880p19j703k063M82
670908B123J227o66m930k556k15R89M502K320J410P90M60L7J769L546J782O62
672234A3250K90o25l380n238m069J660L875L153P28J503K049j10l140j973K303
673475A0276K4J58R41j057j283K149K805K77j793J567K606k06j448q31l157n939
674800E089n613l802K978L847o09j004J35M062L282n44R29K115N91m31k0J193
676124A2198M859L295m414p431l787k55J927l7j9J374j15k652J6R83r5J139J108
677532H094k425l799M7K817L633J260j404k255k784P48M581J283m529k420J573
678773D420L57J932K385N06o28J171L706M370j29l491r57J73M90L019P01j629
$$ plain form
680098 16396 14118 8189 5196 5819 7118 5487 859 288 4576 6238 5673 4412 5528 7464 10043
681340 10043 12135 9784 1975 -6125 -7033 -4595 -5788 -7188 -6680 -8376 -7359 -2519 1131 2361 2363
682582 2363 2114 3490 5226 4590 1701 -1047 -2465 -6207 -8829 -9580 -8948 -6941 -6481 -5785 -7458 -5991
683906 -5991 -3413 -3061 -5398 -6418 -7156 -8516 -5271 -3222 -2315 630 2832 1704 -1162 -2029 901
685148 901 4469 4055 3268 4195 3511 1235 2099 4454 4569 2684 1721 172 -2122 -987 2210 5779
686473 5779 8033 4911 2793 3295 1882 -1254 -3988 -3694 577 4844 2086 -3981 -8070 -7173 -4041
687714 -4041 -1792 -1021 -162 -391 -1122 -2343 -3573 2061 9460 12542 14589 14583 12979 10109 8146 3047
689039 3047 -772 1755 6580 8762 8468 8749 8931 10035 9243 6784 4197 3344 3503 4571 9299 15387
$$ packed form
680098A6396k278n929k993O23J299j631m628n71M288J662n65j261J116J936K579
681340A0043K092k351p809q100r08K438j193j400N08j696J017M840L650J230K
682582B363k49J376J736o36k889k748j418l742k622p51O32K007M60O96j673J467
683906e991K578L52k337j020p38j360L245K049R07K945K202j128k866q67K930
685148I01L568m14p87R27o84k276Q64K355J15j885r63j549k294J135L197L569
686473E779K254l122k118N02j413l136k734K94M271M267k758o067m089Q97L132
687714d041K249P71Q59k29p31j221j230N634P399L082K047oj604k870j963n099
689039C047l819K527M825K182k94K81J82J104p92k459k587q53J59J068M728O088
$$ plain form
690363 15387 15600 13361 11640 13155 16451 17794 14009 10618 5916 85 -1960 562 3527 5642
691523 5642 7627 9011 7891 5149 4481 7920 9928 6737 587 -580 3072 3429 1770 1352 856
692764 856 1419 3412 6292 10233 11476 8039 4788 3314 3332 3680 4843 6440 5816 1611 -2988 -1737
694090 -1737 3978 8209 10886 10145 9046 9177 8890 7942 7101 4330 2124 3701 4609 2534 1610 2367
695414 2367 1686 1449 5767 7621 5500 3042 2483 2952 5484 10188 11439 9348 6862 7717 8779 8701
696739 8701 7258 4999 3925 3835 4524 5514 6285 4622 -257 -3781 -1237 1277 -801 -3518 -975 1643
698063 1643 2485 4027 4305 2327 517 543 1060 5216 10106 11245 10888 9180 4019 374 607 3420
699388 3420 5617 6938 6450 5741 7920 7099 5576 6074 5041 4804 4438 3492 4300 7415 10093 9958 8839
$$ packed form
690363A5387K13k239j721J515L296J343l785l391m702n831k045K522K965K115
691523E642J985J384j120k742o68L439K008l191o150j167L652L57j659m18m96
692764H56N63J993K880L941J243l437l251j474J8L48J163J597o24m205m599J251
694090a737N715M231K677p41j099J31k87r48q41k771k206J577R08k075r24P57
695414B367o81k37M318J854k121k458n59M69K532M704J251k091k486Q55J062p8
696739H701j443k259j074r0O89R90P71j663m879l524K544K514k078k717K543K618
698063A643Q42J542K78j978j810K6N17M156M890J139l57j708n161l645K33K813
699388C420K197J321m88p09K179q21j523M98j033k37l66r46Q08L115K678j35j119
$$ plain form
700795 8839 11176 13398 14166 9294 955 -389 4285 7055 6068 5551 4780 5109 6663 6890 5535 4953
702120 4953 6253 5993 4687 4949 2616 672 1902 3047 3305 -483 -5021 -5228 -3886 -3238 -1186 3328
703444 3328 4523 3002 709 1147 1549 1482 4537 5838 3976 3536 5527 12224 19480 21671 20421 14723
704769 14723 7950 6892 9184 9185 9344 10296 10259 11311 14089 18288 17500 9239 2141 -2373 -4514 -3358
706093 -3358 -1877 -707 2889 4246 5022 5461 3985 2274 2903 3117 2099 1568 730 -304 61 1357
707418 1357 3508 5839 4902 3434 1727 -775 -2290 -3866 -4176 -1666 294 966 488 1322 3489 9139
708742 9139 15195 16116 13362 13196 11870 9053 8094 5446 1513 379 2199 4902 2042 -2515 -3792
709985 -3792 -2110 1629 6863 10135 10316 8199 3496 326 -624 1471 3354 6277 9912 12176 10965
$$ packed form
700795H839K337K222P68m872q339j344M674K770r87n17p71L29J554K27j355n82
702120D953J300k60j306K62k333j944J230J145K58l788m538k07J342O48K052M514
703444C328J195j521k293M38M02o7L055J301j862m40J991O697P256K191j250n698
704769A4723o773j058K292JJ59R52l7J052K778M199p88q261p098m514k141J156
706093c358J481J170L596J357P76M39j476j711O29K14j018n31q38j034L65J296
707418A357K151K331r37j468j707k502j515j576l10K510J960O72m78Q34K167N650
708742I139O056R21k754j66j326k817r59k648l933j134J820K703k860m557j277
709985c792J682L739N234L272J81k117m703l170r50K095J883K923L635K264j211
$$ plain form
711226 10965 5235 604 -2106 -1705 1305 2080 3235 5498 5886 7349 11428 13818 13625 12869 10994
712469 10994 5785 6881 12612 19991 30960 45097 63872 91272 148149 265566 436280 474975
713462 474975 378305 299215 250472 217376 188475 159317 133991 115998 104295 95438 85846 76833
714455 76833 65220 54991 48520 45839 46370 47629 45873 41159 39147 37516 35560 33317 30356 30914
715615 30914 34422 35890 35528 34644 31113 26775 25124 23860 22870 20087 20085 23995 24439 21923 20492 19131
716939 19131 19333 18619 16792 16698 17357 17175 14912 9449 4343 5974 13814 22465 25676 24052 19840 15771
718264 15771 13395 12586 12441 13247 13172 10450 8740 8598 8615 9391 12585 14268 15098 15589 14467 11062 10176
719670 10176 12047 10167 7554 9040 10917 10804 11168 11773 11650 11379 10902 7449 3332 1708 2410 1686
$$ packed form
711226A0965n730m631k710M01L010P75J155K263L88J463M079K390j93p56j875
712469A0994n209J096N731P379J0969J4137J8775K7400N6877J17417J70714L8695
713462D74975r6670p9090m8743l3096k8901k9158k5326j7993j1703q857r592r013
714455G6833j1613j0229o471k681N31J259j756m714k012j631j956k243k961N58
715615C0914L508J468l62q84l531m338j651j264r90k783kL910M44k516j431j361
716939A9131K02p14j827r4O59j82k263n463n106J631P840Q651L211j624m212m069
718264A5771k376q09j45Q06p5k722j710j42J7P76L194J683Q30M91j122l405q86
719670A0176J871j880k613J486J877j13L64O05j23k71m77l453m117j624P02p24
$$ plain form
720996 1686 2051 5377 10325 12551 10740 5330 2512 4990 10953 14592 15367 12298 8702 7256 6146
722237 6146 5157 3931 4894 3989 1991 2166 4785 6501 8349 11010 12306 16628 19774 17369 13439
723479 13439 14055 16035 12702 10634 8888 7101 11945 19914 22294 18324 12846 9360 6883 8348
724638 8348 9255 6711 8112 10603 9275 9447 10783 10865 11852 13181 13432 14189 15958 19128 19256 16598
725963 16598 12297 9412 9798 10958 12036 12951 12606 13177 13607 11618 9298 6203 2106 -1210 -2231
727204 -2231 -223 4446 5552 6990 8185 7054 5138 4166 2994 2568 2193 -509 -2228 -90 5508
728447 5508 7728 5622 5336 5920 6250 7031 6411 1538 -3506 -3996 -1770 283 -2239 -6289 -5629 -1791
729771 -1791 1686 2718 3011 1988 136 -1296 -428 934 2649 4582 6381 11000 13346 10859 5711
$$ packed form
720996A686L65L326M948K226j811n410k818K478N963L639P75l069l596j446j110
722237F146r89j226R63r05j998J75K619J716J848K661J296M322L146k405l930
723479A3439O16J980l333k068j746j787M844P969K380l970n478l486k477J465
724638H348R07k544J401K491j328J72J336Q2R87J329K51P57J769L170J28k658
725963A6598m301k885L86J160J078R15l45N71M30j989k320l095m097l316j021
727204b231K008M669J106J438J195j131j916r72j172m26l75k702j719K138N598
728447E508K220k106k86N84L30P81o20m873n044m90K226K053k522m050O60L838
729771a791L477J032K93j023j852j432Q68J362J715J933J799M619K346k487n148
$$ plain form
731012 5711 3370 4943 6307 3915 -86 -2086 -176 644 844 2270 5841 9072 10067 8126 3520
732255 3520 1512 6183 15853 20091 15897 9924 5770 4846 6024 5903 7123 11219 16781 20279 16969
733496 16969 11271 6938 4206 2488 1492 4265 6385 2763 -936 2374 9110 14036 14964 12316 10671
734738 10671 8194 4319 2159 1986 2265 1994 3558 7677 8382 8383 6881 2340 1574 1619 1551 4414 6906
736145 6906 5343 2324 1809 1951 4777 9002 12750 13793 9585 9048 13706 14819 10698 8186 7723
737388 7723 7299 6813 8479 8767 7358 5504 3810 5806 6915 4908 2822 1590 497 310 1364
738629 1364 3742 2792 1613 2651 7367 8780 5782 2105 989 3661 8944 12273 10391 6310 4445
739871 4445 6848 8725 6443 3704 2629 1462 -477 -494 1131 3415 7157 8652 9433 9088 9012 10205
$$ packed form
731012E711k341J573J364k392m001k000J910Q20K00J426L571L231R95j941m606
732255C520k008M671R670M238m194n973m154r24J178j21J220M096N562L498l310
733496A6969n698m333k732j718r96K773K120l622l699L310O736M926R28k648j645
734738A0671k477l875k160j73K79k71J564M119P05Jj502m541p66M5o8K863K492
736145F906j563l019n15J42K826M225L748J043m208n37M658J113m121k512m63
737388G723m24m86J666K88j409j854j694J996J109k007k086j232j093j87J054
738629A364K378r50j179J038M716J413k998l677j116K672N283L329j882m081j865
739871D445K403J877k282k739j075j167j939j7J625K284L742J495P81l45p6J193
$$ plain form
741196 10205 10267 8302 7882 7616 6159 5643 8474 9544 6090 3620 3557 1567 625 1485 1795 1877 2935
742603 2935 4781 5972 5467 6190 5307 3149 6447 11733 16115 19631 18302 15714 14562 13616 14246 14078
743928 14078 10427 8868 10500 10686 7846 3304 2451 4885 4495 1584 2172 6313 9704 10635 8215
745170 8215 8017 9695 8344 3074 -80 -2092 -3399 -1114 1986 5562 8269 9991 12766 14479 14072
746411 14072 12102 8586 4356 2289 3544 7272 12061 12756 7725 2782 447 1136 2058 -973 -4581
747654 -4581 -5114 -1500 4221 9561 10180 4701 4382 7280 8841 10324 12518 13742 10977 8448 11009
748895 11009 11896 8805 3141 -136 -14 -2146 -6579 -7053 -3934 -4191 -9440 -11950 -8515 -1924 2076
750137 2076 1292 -116 392 188 202 1401 1501 1011 2606 5244 8563 9918 8372 11015 14757 14413
$$ packed form
741196A0205O2j965m20k66j457n16K831J070l454k470o3j990r42Q60L10Q2J058
742603B935J846J191n05P23q83k158L298N286M382L516j329k588j152r46O30j68
743928A4078l651j559J632J86k840m542q53K434l90k911N88M141L391R31k420
745170H215j98J678j351n270l154k012j307K285L100L576K707J722K775J713m07
746411A4072j970l516m230k067J255L728M789O95n031m943k335O89R22l031l608
747654d581n33L614N721N340O19n479l19K898J561J483K194J224k765k529K561
748895A1009Q87l091n664l277J22k132m433m74L119k57n249k510L435O591M000
750137B076p84j408N08k04J4J199J00m90J595K638L319J355j546K643L742l44
$$ plain form
751461 14413 11664 11374 12969 12772 10954 7371 3925 3267 4485 3568 1441 -345 -2300 -2191 -711
752704 -711 -2355 -3872 -2984 -3281 -6737 -7802 -7425 -7022 -6894 -7555 -7453 -7195 -3488 3214 7330 8074 9652
754111 9652 8526 5480 5807 9184 9782 7476 6324 9525 14981 16745 15661 12160 7665 6679 8301
755352 8301 6477 2740 2200 4932 8577 9390 9483 10558 8452 4387 1959 2322 3155 5718 9772 6295
756677 6295 814 -2101 -1769 -2661 -4875 -4710 -1914 240 449 181 81 2983 6243 6166 5398 4329 3065
758085 3065 1887 269 2194 5915 6410 5211 3862 2625 350 -646 1691 3961 4401 3459 3540 6266
759409 6266 6955 2681 -3717 -7051 -5298 -2064 110 3133 6553 8409 9849 14479 16250 15318 13683
760651 13683 11406 9127 4522 -1164 -5391 -9331 -12408 -13661 -12855 -10387 -6502 -1582 311 -86 -922
$$ packed form
751461A4413k749k90J595j97j818l583l446o58J218r17k127j786j955J09J480
752704g11j644j517Q88k97l456j065L77M03J28o61J02K58L707O702M116P44J578
754111I652j126l046L27L377N98k306j152L201N456J764j084l501m495r86J622
755352H301j824l737n40K732L645Q13R3J075k106m065k428L63Q33K563M054l477
756677F295n481k915L32q92k214J65K796K154K09k68j00K902L260p7p68j069j264
758085C065j178j618J925L721M95j199j349j237k275r96K337K270M40r42Q1K726
759409F266O89m274o398l334J753L234K174L023L420J856J440M630J771r32j635
760651A3683k277k279m605n686m227l940l077j253Q06K468L885M920J893l97q36
$$ plain form
761893 -922 -900 -2240 -3794 -1268 1568 3033 2985 1311 860 394 557 1936 3480 6422 6943 6527 8392
763300 8392 10239 10158 8347 4198 4722 6329 7647 7586 7307 6003 3109 57 -1802 -2875 -10260 -16335
764625 -16335 -16614 -14590 -11532 -7388 -1762 1313 2044 2586 5189 9738 12228 8089 2086 1134 4250
765867 4250 2489 -1993 -3438 -966 5084 7939 7507 8107 8574 7260 4053 931 354 563 -1210 -1919
767191 -1919 -694 3827 8244 10002 9678 10776 11778 10338 9360 11457 12152 9286 8421 11273 11965 12527
768516 12527 14273 15946 14484 9298 3330 138 1197 3024 6839 8435 6767 7374 9544 10277 12013
769758 12013 16500 21786 22885 22047 20457 16635 11830 8723 5893 4945 7126 6117 4386 5417 4816
770999 4816 5025 4656 4355 5432 4884 4316 5540 5856 5136 3820 5269 8524 9245 10143 11793 11336 11166
$$ packed form
761893i22K2j340j554K526K836J465m8j674m51m66J63J379J544K942N21m16J865
763300H392J847q1j811m149N24J607J318o1k79j304k894l052j859j073p385o075
764625a6335k79K024L058M144N626L075P31N42K603M549K490m139o003r52L116
765867D250j761m482j445K472O050K855m32O00M67j314l207l122n77K09j773p09
767191a919J225M521M417J758l24J098J002j440r78K097O95k866q65K852O92N62
768516A2527J746J673j462n186n968l192J059J827L815J596j668O07K170P33J736
769758A2013M487N286J099q38j590l822m805l107k830r48K181j009j731J031o01
770999D816K09l69l01J077n48n68J224L16p20j316J449L255P21Q98J650m57j70
$$ plain form
772407 11166 12646 11149 8828 7639 7189 6524 5796 6704 8448 10127 8817 7143 8288 7886 3511
773649 3511 1468 2722 2353 872 -1622 97 4723 7435 4238 -1814 -4123 -1450 4189 6936 7441
774891 7441 7220 9760 11329 7969 3712 672 -1889 -3297 -2486 1111 5857 6964 4204 1393 2630
776132 2630 5638 10572 10770 7693 5776 5036 7359 10309 12515 14009 12288 10442 12487 15961 16349
777375 16349 14407 9413 7615 8385 10297 10347 8055 6512 3539 2271 2104 -1716 -4247 -2965 -2364
778616 -2364 -2584 -1985 1057 5704 6745 7090 10181 9686 6912 5651 2329 688 2989 6288 5661 5199
779941 5199 8569 9373 8673 9094 10100 10030 8166 6377 8368 12145 12731 12940 12078 9449 9387 9657 10594
781348 10594 11698 13315 13355 12697 13579 11757 4871 -3707 -6593 -1949 3117 4471 4707 4322 5282 6789
$$ packed form
772407A1166J480j497k321j189m50o65p28R08J744J679j310j674J145m02m375
773649C511k043J254l69j481k494J719M626K712l197o052k309K673N639K747N05
774891G441k21K540J569l360m257l040k561j408Q11L597M746J107k760k811J237
776132B630L008M934J98l077j917p40K323K950K206J494j721j846K045L474L88
777375A6349j942m994j798P70J912N0k292j543k973j268j67l820k531J282O01
778616b364k20N99L042M647J041L45L091m95k774j261l322j641K301L299o27m62
779941E199L370Q04p00M21J006p0j864j789J991L777N86K09q62k629o2K70R37
781348A0594J104J617M0o58Q82j822o886q578k886M644N066J354K36l85R60J507
$$ plain form
782673 6789 8973 8409 4140 1828 2309 5733 9289 7839 1525 -3940 -5067 383 6295 11869 16372
783914 16372 24517 43413 73170 108678 138788 151044 143495 130667 119786 109811 96486 84989
784909 84989 73621 64588 60205 57155 53467 48448 42260 36831 33293 27906 22854 20568 19873 22755
786067 22755 24093 22857 23513 25916 27343 28508 24819 21561 19572 17758 17738 20091 24411 25466 22116
787308 22116 18301 14841 15294 18091 21626 21617 20996 23738 27959 32489 37060 41607 50728 69778 99781
788551 99781 133456 154100 150291 132458 115182 100386 88579 79125 73245 67506 61571 58997 57963
789627 57963 54616 48790 45257 45861 48867 49216 45886 42592 40949 36404 30230 27320 26938 27672 28224
790869 28224 28895 31443 30301 27521 25182 20693 17425 19451 26443 29385 24957 22419 21712 21522 20588
$$ packed form
782673F789K184n64m269k312M81L424L556j450o314n465j127N450N912N574M503
783914A6372Q145J8896K9757L5508L0110J2256p549j2828j0881r975j3325j1497
784909H4989j1368r033m383l050l688n019o188n429l538n387n052k286o95K882
786067B2755J338j236O56K403J427J165l689l258j989j814k0K353M320J055l350
787308B2116l815l460M53K797L535ro21K742M221M530M571M547R121J9050L0003
788551I9781L3675K0644l809j7833j7276j4796j1807r454n880n739n935k574j034
789627E7963l347n826l533O04L006L49l330l294j643m545o174k910l82P34N52
790869B8224O71K548j142k780k339m489l268K026O992K942m428k538p07j90r34
$$ plain form
792111 20588 19018 19481 21217 23871 28092 34608 46630 66057 92487 124239 149564 151126 139415
793187 139415 126610 113636 101205 89546 77484 66864 58205 49655 45139 45710 46531 44751 45303
794263 45303 46987 46550 45452 45719 42416 36540 33185 29985 26685 24923 28199 31123 26909 21584 19112
795505 19112 16071 13280 15266 18862 19487 14287 12153 17571 23301 25026 21733 16914 12787 11065
796664 11065 13107 14810 16031 18506 19091 18582 14346 7911 6086 7972 10155 9839 8986 10303 12558
797906 12558 13653 15963 17350 16581 14582 14182 17060 17111 13681 13295 14037 14122 16267 17408 12996 8251
799231 8251 5752 3687 3809 5411 7751 11312 15854 18548 19603 19203 17793 17270 12425 6223 2792
800472 2792 741 638 3661 7267 9461 11414 11749 12758 16933 15637 11969 11500 12656 13770 16817
$$ packed form
792111B0588j570M63J736K654M221O516J2022J9427K6430L1752K5325J562j1711
793187A39415j2805j2974j2431j1659j2062j0620q659q550m516N71Q21j780N52
794263D5303J684m37j098K67l303n876l355l200l300j762L276K924m214n325k472
795505A9112l041k791J986L596O25n200k134N418N730J725l293m819m127j722
796664A1065K042J703J221K475N85n09m236o435j825J886K183l16q53J317K255
797906A2558J095K310J387p69j999m00K878N1l430l86P42Q5K145J141m412m745
799231H251k499k065J22J602K340L561M542K694J055m00j410n23m845o202l431
800472B792k051j03L023L606K194J953L35J009M175j296l668m69J156J114L047
$$ plain form
801714 16817 19220 19165 17006 15349 13618 15142 18351 18978 20208 20775 18382 14536 9600 7915 10314
802956 10314 13034 13807 11272 6330 7895 11857 14626 14750 11252 7185 3934 3711 4077 3086 2720 4902
804281 4902 7534 10102 12509 16003 17330 13964 9174 6894 8785 12821 16510 20001 21212 23601
805439 23601 24077 21127 18540 19176 20716 19902 15858 11852 12765 11471 8129 6432 6235 6660 6039 4161
806765 4161 4638 9821 14081 11968 7579 6377 5735 3078 -799 -2568 141 4126 4900 4497 5060 8488
808089 8488 10261 6905 3027 5770 10275 14392 13904 13979 17320 18055 14924 11402 11787 12995 13215 12613
809414 12613 11416 9788 12135 13999 13052 7762 5753 10364 14467 13972 12439 11523 9277 6662 7596
810655 7596 3440 -221 1421 6574 10142 10707 7102 4467 6234 8971 8272 8513 11134 13362 12582
$$ packed form
801714A6817K403n5k159j657j731J524L209O27J230N67k393l846m936j685K399
802956A0314K720P73k535m942J565L962K769J24l498m067l251k23L66r91l66K182
804281D902K632K568K407L494J327l366m790k280J891M036L689L491J211K389
805439B3601M76k950k587O36J540q14m044m006R13j294l342j697j97M25o21j878
806765D161M77N183M260k113m389j202o42k657l877j769K709L985P74m03N63L428
808089H488J773l356l878K743M505M117m88P5L341P35l131l522L85J208K20o02
809414A2613j197j628K347J864r47n290k009M611M103m95j533r16k246k615R34
810655G596m156l661J642N153L568N65l605k635J767K737o99K41K621K228p80
$$ plain form
811898 12582 12830 12950 9955 8846 13852 22232 25923 26139 22316 18169 17160 15678 11995 10106 8491
813139 8491 7109 5824 5725 4116 21 -3792 -6477 -7392 -5885 -4499 -6065 -6018 -1791 664 1720 5198
814463 5198 5992 2228 360 -956 -125 5179 8210 9447 8915 8264 8594 9603 10212 13773 15519 12424
815788 12424 11832 15253 16152 13308 8950 7945 6306 4796 7233 11270 13740 14247 12495 10507 7097
817030 7097 2966 1639 4536 7745 5798 3130 3092 2556 2676 4962 3514 1807 2181 1882 -1119 -2607
818355 -2607 -991 1206 3711 2544 906 2512 4479 4996 4000 3898 6293 11019 11443 8365 6223
819596 6223 6518 8955 8417 4544 513 538 2027 4234 8034 9817 9130 9097 13219 17796 17809 14152 10120
821004 10120 11658 15425 13680 12342 13903 12205 8114 748 -5075 -4361 3260 9857 12898 9623
$$ packed form
811898A2582K48J20k995j109N006Q380L691K16l823m147j009j482l683j889j615
813139H491j382j285r9j609m095l813k685r15J507J386j566M7M227K455J056L478
814463E198P94l764j868j316Q31N304L031J237n32o51L30J009O09L561J746l095
815788A2424n92L421Q99k844m358j005j639j510K437M037K470N07j752j988l410
817030G097m131j327K897L209j947k668l8n36J20K286j448j707L74k99l001j488
818355b607J616K197K505j167j638J606J967N17r96j02K395M726M24l078k142
819596F223K95K437n38l873m031K5J489K207L800J783o87l3M122M577J3l657m032
821004A0120J538L767j745j338J561j698m091p366n823P14P621O597L041l275
$$ plain form
822162 9623 3017 -824 169 4514 4646 3194 3327 3534 5441 6847 9746 11137 7881 7491 10686 10720
823488 10720 8822 8334 8985 8659 8087 6454 5281 4041 2476 169 604 2881 2339 1644 -703 -5249
824812 -5249 -6399 -4414 -1542 3164 5124 3838 3298 6825 11163 12767 11185 10449 13691 16332 19690
826054 19690 26737 28679 28389 27067 22070 20583 24549 24733 20182 17479 18301 15274 11055 7829 6046
827295 6046 4332 5123 8737 10883 9839 5984 1579 607 3142 5500 7387 4766 3489 5566 5025
828538 5025 3511 528 -1582 3571 10258 12670 10999 9873 9396 10083 11775 14651 16799 14693 10328
829779 10328 8815 9988 11063 11046 7577 7257 9091 10208 11147 14050 18644 20517 18894 18515 18320 16881
831104 16881 15889 16140 18850 19712 16762 12458 10753 12268 17282 23310 27406 30071 30072 28345 23236 17620
$$ packed form
822162I623o606l841R93M345J32j452J33K07J907J406K899J391l256l90L195L4
823488A0720j898m88O51l26n72j633j173j240j565k307M35K277n42o95k347m546
824812e249j150J985K872M706J960j286n40L527M338J604j582p36L242K641L358
826054A9690P047J942k90j322m997j487L966J84m551k703Q22l027m219l226j783
827295F046j714P91L614K146j044l855m405r72K535K358J887k621j277K077n41
828538E025j514k983k110N153O687K412j671j126m77O87J692K876K148k106m365
829779A0328j513J173J075j7l469l20J834J117R39K903M594J873j623l79j95j439
831104A6881r92K51K710Q62k950m304j705J515N014O028M096K665Jj727n109n616
$$ plain form
832428 17620 16038 16106 14321 10263 6886 5209 1417 2418 8260 11472 9798 6686 4695 3483 2000
833671 2000 1776 2288 1715 1615 4206 6824 9062 10142 10785 9315 9206 10713 10807 12309 12637 12484 13735
835078 13735 13211 12305 9705 6570 5570 5043 3111 2214 5253 8330 6434 3122 565 3378 6742
836320 6742 7590 6975 6203 7842 9853 9884 10352 10051 8953 9767 11725 15176 17309 18384 19978 16619
837644 16619 8927 3239 1481 552 1803 4511 7475 8934 7019 5038 3232 3338 5725 6040 4951
838886 4951 3786 -1220 -6801 -5462 -2576 -1366 2379 4924 4099 5667 6071 5467 4865 3047 790
840128 790 -308 -666 -1947 -1859 1005 6050 10286 13072 12386 7821 2446 1762 4585 7813 11447 12053
841453 12053 8488 1892 -3184 -5206 -4879 -1274 90 -1107 448 6652 11878 14725 16988 19732
$$ packed form
832428A7620j582O8j785m058l377j677l792J001N842L212j674l112j991j212j483
833671B000k24N12n73j00K591K618K238J080O43j470j09J507R4J502L28j53J251
835078A3735n24r06k600l135j000n27j932q97L039L077j896l312k557K813L364
836320F742Q48o15p72J639K011L1M68l01j098Q14J958L451K133J075J594l359
837644A6619p692n688j758r29J251K708K964J459j915j981j806J06K387L15j089
838886D951j165n006n581J339K886J210L745K545q25J568M04o04o02j818k257
840128G90j098l58j281Q8K864N045M236K786o86m565n375o84K823L228L634O06
841453A2053l565o596n076k022L27L605J364j197J555O204N226K847K263K744
$$ plain form
842612 19732 19778 14782 9528 3661 -156 -212 931 1699 4731 8545 6482 4167 6296 8703 10984
843854 10984 13615 16454 17265 14816 12299 11973 10972 6998 4435 -238 -2772 -987 1121 6534 9036
845095 9036 8647 10609 12156 13365 13124 11794 10475 10898 11433 11930 12001 12107 12843 13024 11689 10473 7902
846502 7902 1892 -3802 -4679 -229 4519 6235 8368 9666 6625 -804 -3972 -382 6155 9146 9514
847745 9514 8368 6785 3215 601 -870 -249 218 1319 2763 2877 5886 11924 14096 13551 15805
848986 15805 14357 12870 11993 10892 8601 5280 7019 9792 11473 11364 8389 3749 2808 3650 3735 5151
850311 5151 9967 12409 12335 15114 18482 19579 20537 22223 21613 20199 19158 15029 9804 8647 12752
851552 12752 14845 14834 16034 16803 13681 6849 2936 139 -1600 556 1403 2197 3574 3813 3444 1601
$$ packed form
842612A9732M6m996n254n867l817n6J143P68L032L814k063k315K129K407K281
843854A0984K631K839Q11k449k517l26j001l974k563m673k534J785K108N413K502
845095I036l89J962J547J209k41j330j319M23N35M97P1J06P36J81j335j216k571
846502G902o010n694q77M450M748J716K133J298l041p429l168L590O537K991L68
847745I514j146j583l570k614j471O21M67J101J444J14L009O038K172n45K254
848986A5805j448j487q77j101k291l321J739K773J681j09k975m640r41Q42Q5J416
850311E151M816K442p4K779L368J097R58J686o10j414j041m129n225j157M105
851552A2752K093j1J200P69l122o832l913k797j739K156Q47P94J377K39l69j843
$$ plain form
852877 1601 1329 2524 3074 2923 3388 4959 6871 7771 8844 4701 2442 3774 3947 2672 -683 2510
854202 2510 11182 13820 9197 2266 -976 -552 1879 3452 2549 -263 395 1253 -1483 -3342 -210
855444 -210 3853 6711 8778 10390 12266 12731 12762 13421 11614 9411 8631 7427 5066 969 -2292 -2385
856768 -2385 -1640 -387 147 165 1154 2339 5192 6749 8118 9930 13834 18865 21137 17044 12520 9477
858093 9477 5433 517 -2554 -3056 1252 8871 14782 17486 16437 13137 10081 8228 7776 7125 4661
859335 4661 1992 489 -3200 -7269 -5098 -2587 -4449 -4585 507 7969 14554 14033 8981 2564 -445
860577 -445 -423 -2133 -4113 -3394 -1130 270 1058 3189 4793 3791 2314 788 -1937 -3857 -2357 1009
861901 1009 3222 1241 -1979 -2965 -5390 -7059 -4637 -2024 232 2070 4896 7001 5431 1985 360
$$ packed form
852877A601k72J195N50j51M65J571J912R00J073m143k259J332J73j275l355L193
854202B510Q672K638m623o931l242M24K431J573r03k812O58Q58k736j859L132
855444b10M063K858K067J612J876M65L1O59j807k203p80j204k361m097l261r3
856768b385P45J253N34J8R89J185K853J557J369J812L904N031K272m093m524l043
858093I477m044m916l071n02M308P619N911K704j049l300l056j853m52o51k464
859335D661k669j503l689m069K171K511j862j36N092P462O585n21n052o417l009
860577d45K2j710j980P19K264J400P88K131J604j002j477j526k725j920J500L366
861901A009K213j981l220r86k425j669K422K613K256J838K826K105j570l446j625
$$ plain form
863144 360 3619 8985 12107 15042 15117 9075 3023 2112 1177 1306 1532 4102 9555 12175 9915 5503
864468 5503 3879 4285 3156 2987 4889 7346 8553 5830 496 -3053 -3206 -3773 -6278 -6352 -5035 -5008
865793 -5008 -6172 -4929 -942 2877 6843 6809 1650 -2205 -3849 -3440 -2890 -5015 -8472 -6989 -1910
867034 -1910 -572 -1013 -1108 -973 -921 -927 -2349 -6306 -8360 -6910 -4104 -1440 -100 -1721 -2078 3159 8387
868442 8387 9480 9918 9084 7205 4450 3268 4645 7144 8959 6726 4095 2980 3715 6163 8761
869683 8761 10610 10419 8063 5716 5152 3407 1616 3458 5419 5808 5458 4336 2162 -458 -1161 2066
871007 2066 4116 4374 6072 10235 10945 10325 11841 13259 11019 8562 7630 6124 5663 7113 5608 477
872333 477 -3002 -5350 -6928 -4426 727 5261 8809 12133 12652 13646 14116 10493 8915 6604 3625
$$ packed form
863144C60L259N366L122K935P5o042o052r11r35J29K26K570N453K620k260m412
864468E503j624M06j129j69J902K457J207k723n334l549j53n67k505p4J317K7
865793e008j164J243L987L819L966l4n159l855j644M09N50k125l457J483N079
867034a910J338m41r5J35N2oj422l957k054J450K806K664J340j621l57N237N228
868442H387J093M38q34j879k755j182J377K499J815k233k631j115P35K448K598
869683H761J849j91k356k347n64j745j791J842J961L89l50j122k174k620p03L227
871007B066K050K58J698M163P10o20J516J418k240k457r32j506m61J450j505n131
872333D77l479k348j578K502N153M534L548L324N19R94M70l623j578k311k979
$$ plain form
873574 3625 3955 5255 6419 8011 7596 7873 6257 3343 2253 2773 4158 4977 3012 1754 4938 8136
874899 8136 8050 3752 1130 3065 5424 8148 10314 10526 9307 8441 9086 10362 9175 4716 3369 9066
876223 9066 13291 10868 7636 5274 2828 1339 1173 1410 652 952 2691 1369 -738 361 813 250
877548 250 -2966 -8190 -12373 -14230 -13529 -12034 -6833 -1740 -324 585 5790 11763 17660 19463 14854
878790 14854 9365 5204 2131 99 -3144 -7668 -9624 -7822 -3309 -1125 -2523 -3589 -2150 -2102 -2029
880032 -2029 -2112 -531 3571 10773 18090 22384 24448 27479 27590 25792 24880 20916 14274 8107 1959
881273 1959 -2147 -2310 2211 6091 9793 8490 6172 5969 6114 5996 6192 7452 9868 11278 10719 5559
882598 5559 -3426 -7207 -3684 -297 667 2004 569 -1394 695 5005 9052 13040 14828 10485 4732
$$ packed form
873574C625L30J300J164J592m15K77j616k914j090N20J385Q19j965j258L184L198
874899H136q6m298k622J935K359K724K166K12j219q66O45J276j187m459j347N697
876223I066M225k423l232k362k446j489j66K37p58L00J739j322k107J099M52n63
877548B50l216n224m183j857P01J495N201N093J416R09N205N973N897J803m609
878790A4854n489m161l073k032l243m524j956J802M513K184j398j066J439M8P3
880032b029q3J581M102P202P317M294K064L031J11j798r12l964o642o167o148
881273A959m106j63M521L880L702j303k318k03J45j18J96J260K416J410n59n160
882598E559q985l781L523L387R64J337j435j963K089M310M047L988J788m343n753
$$ plain form
883840 4732 5718 8136 6444 2363 -590 -1035 703 2028 5024 7734 10282 9457 6363 4765 4319
885082 4319 2454 1598 5467 7181 8246 10004 10540 9952 3785 -1171 -2237 1226 6091 7777 8125
886324 8125 6070 4063 4799 5074 5373 6484 4041 -1387 -6170 -6878 -2993 2153 5786 6524 5044 5322
887649 5322 7372 9679 8897 5134 2111 -268 -4678 -7920 -6286 823 8850 12388 10516 8170 5502
888890 5502 1942 -4094 -5163 -1174 1492 434 -1840 -3528 -5015 -7737 -12734 -14738 -10328 -3781
890050 -3781 96 4703 7783 5771 5233 5083 2199 953 1511 1972 2922 6044 7381 5523 1218 -1826
891374 -1826 469 7425 10057 8072 5585 3856 2729 1813 3965 5151 4357 4191 4741 6977 9646
892616 9646 12005 14543 12496 9809 7557 4307 3391 6755 6500 2150 -1192 358 4637 6158 7524
$$ packed form
883840D732R86K418j692m081k953m45J738J325K996K710K548q25l094j598m46
885082D319j865q56L869J714J065J758N36n88o167m956j066L463M865J686L48
886324H125k055k007P36K75K99J111k443n428m783p08L885N146L633P38j480K78
887649E322K050K307p82l763l023k379m410l242J634P109Q027L538j872k346k668
888890E502l560o036j069L989K666j058k274j688j487k722m997k004M410O547
890050c781L877M607L080k012n38j50k884j246N58M61R50L122J337j858m305l044
891374a826K295O956K632j985k487j729j127r16K152J186p94j66N50K236K669
892616I646K359K538k047k687k252l250r16L364k55m350l342J550M279J521J366
$$ plain form
893858 7524 9906 9577 7829 5079 1377 -261 3050 5536 5705 4772 3319 -1751 -5748 -7349 -8090
895100 -8090 -7716 -6219 -4162 -1883 -427 -3752 -6323 -5596 -4898 -4255 -1827 2270 5758 6308 5747 4691
896424 4691 4103 5498 4917 4889 9007 13516 18335 20839 20929 19345 16712 12627 11253 12054 11770 12611 11497
897831 11497 6577 3768 4181 6580 7336 6955 6916 8687 10415 14224 16346 15803 14108 13445 12223 12494
899156 12494 13510 11599 7815 5524 5623 6677 6124 4127 3040 4717 8581 11094 11871 10904 7379
900397 7379 3213 210 782 1083 356 1961 1583 -565 -2287 -5242 -7974 -6451 -2486 121 1375
901640 1375 1855 2931 4850 7018 8615 11308 12784 14769 13973 9455 7610 7414 5655 1267 -2546
902881 -2546 -1993 -1115 -3458 -7468 -10582 -9154 -4888 1360 8269 10987 12243 14359 15366 17211 19346
$$ packed form
893858G524K382l29j748k750l702j638L311K486J69r33j453n070l997j601p41
895100h090L74J497K057K279J456l325k571P27O98O43K428M097L488N50n61j056
896424D691n88J395n81k8M118M509M819K504R0j584k633m085j374Q01k84Q41j114
897831A1497m920k809M13K399P56l81l9J771J728L809K122n43j695o63j222K71
899156A2494J016j911l784k291R9J054n53j997j087J677L864K513P77r67l525
900397G379m166l003N72L01p27J605l78k148j722k955k732J523L965K607J254
901640A375M80J076J919K168J597K693J476J985p96m518j845j96j759m388l813
902881b546N53Q78k343m010l114J428M266O248O909K718J256K116J007J845K135
$$ plain form
904123 19346 16425 13058 12570 10392 8924 8944 8712 8169 6401 4314 3105 2013 3907 8982 10665
905365 10665 6470 1808 649 3353 6747 10114 12327 10883 8344 7081 5178 4163 4009 1810
906524 1810 -1265 -3219 -4250 -2017 1579 5529 5452 4680 3373 34 -3894 -5078 -1836 2460 3726
907766 3726 2939 355 -4947 -8273 -6425 -1181 3076 1152 -106 834 1624 2190 142 -4510 -6086
909008 -6086 -3576 -2378 -6629 -12238 -12418 -11331 -10430 -9453 -5156 4170 11099 16528 19519 17987 15697
910250 15697 12725 6985 1358 -110 -1730 -4285 -6937 -9149 -9060 -7261 -5381 -3397 -3596 -4957 -7335
911492 -7335 -7095 -4714 -2628 -1965 -4015 -3862 1291 9349 12054 10531 10537 12442 12676 9392 7496 8239
912816 8239 10150 11642 12316 11796 9767 6423 2720 -1289 -5639 -7533 -6088 -5226 -7598 -9381 -5075
$$ packed form
904123A9346k921l367m88k178j468K0k32n43j768k087j209j092J894N075J683
905365A0665m195m662j159K704L394L367K213j444k539j263j903j015j54k199
906524A810l075j954j031K233L596L950p7p72j307l339l928j184L242M296J266
907766C726p87k584n302l326J848N244M257j924j258R40P90N66k048m652j576
909008f086K510J198m251n609j80J087R01R77M297R326O929N429K991j532k290
910250A5697k972n740n627j468j620k555k652k212Q9J799J880J984j99j361k378
911492g335K40K381K086O63k050J53N153Q058K705j523OJ905K34l284j896P43
912816H239J911J492O74n20k029l344l703m009m350j894J445Q62k372j783M306
$$ plain form
914058 -5075 2192 7808 9574 11252 11145 10296 8827 8420 8180 6406 5680 7272 10472 11419 11441 11585 12311
915465 12311 10000 6178 4835 7128 8971 10562 10178 5849 3650 3842 2460 900 1289 5404 11962
916707 11962 14766 14703 13673 13504 12252 10087 7499 7080 7882 8345 8521 10114 9534 10287 14803 18956
918032 18956 19355 19863 18251 15402 14157 15152 14668 12435 10662 10034 9138 7268 7867 7875 7576 8448 10688
919440 10688 10946 6316 1953 2483 2490 4218 6854 6826 4831 2715 350 -3326 -8376 -9184 -6274 -130
920764 -130 7047 9648 11891 14966 13403 9934 8673 9254 8803 9358 10977 9111 5415 4950 7030 6434
922088 6434 5886 6068 7307 9415 8818 7089 8080 8089 7864 8873 10047 9067 8376 8780 5843 2885 3347
923496 3347 3615 4732 9569 13613 13462 10120 5600 3864 3439 3739 6732 11562 14406 15185 14190 12078
$$ packed form
914058e075P267N616J766J678j07q49j469m07k40j774p26J592L200R47K2J44P26
915465A2311k311l822j343K293J843J591l84m329k199J92j382j560L89M115O558
916707A1962K804o3j030j69j252k165k588m19Q02M63J76J593n80P53M516M153
918032A8956L99N08j612k849j245R95m84k233j773o28q96j870N99Qk99Q72K240
919440A0688K58m630m363N30PJ728K636k8j995k116k365l676n050q08K910O144
920764a30P177K601K243L075j563l469j261N81m51N55J619j866l696m65K080n96
922088F434n48J82J239K108n97j729R91Rk25J009J174r80o91M04k937k958M62
923496C347K68J117M837M044j51l342m520j736m25L00K993M830K844P79r95k112
$$ plain form
924821 12078 12186 13984 14833 12710 6792 2509 436 -1301 -3483 -2219 1487 4059 2839 -1873 -5061
926062 -5061 -5829 -4367 -660 5006 9108 8232 2995 1271 4005 9120 13765 18887 19977 18784 16511
927305 16511 15518 15621 12898 11514 14050 15745 15200 12217 9781 8183 9635 15649 19734 18870 17125
928546 17125 14395 13046 10001 3047 -4268 -8879 -9696 -5911 -492 1858 -1431 -3456 -1010 999
929705 999 4597 7152 10937 16067 18542 16021 10969 10040 8908 4927 3878 5751 6879 11811 16858
930947 16858 18750 19874 19438 13455 7723 5035 3891 3932 6047 9598 11974 13596 17349 21027 21248
932188 21248 24510 30153 32878 30842 25252 21238 16009 11248 5452 -3155 -7346 -3645 639 4265
933348 4265 5853 5029 4632 4492 5674 6184 5231 4230 5793 10055 12663 13539 13055 11142 10820 8032
$$ packed form
924821A2078J08J798Q49k123n918m283k073j737k182J264L706K572j220m712l188
926062e061p68J462L707N666M102q76n237j724K734N115M645N122J090j193k273
927305A6511r93J03k723j384K536J695n45k983k436j598J452O014M085q64j745
928546A7125k730j349l045o954p315m611q17L785N419K350l289k025K446K009
929705I99L598K555L785N130K475k521n052r29j132l981j049J873J128M932N047
930947A6858J892J124m36n983n732k688j144M1K115L551K376J622L753L678K21
932188B1248L262N643K725k036n590m014n229m761n796q607m191L701M284L626
933348D265J588q24l97j40J182N10r53j001J563M262K608Q76m84j913l22k788
$$ plain form
934672 8032 4976 5298 6104 6641 5890 6363 7553 8085 8896 9068 8438 6997 7666 8855 8757 9597 13454 19327
936163 19327 20398 17109 14153 11732 10445 8534 6245 1896 -1288 -370 3972 7264 9151 10294
937321 10294 8119 5563 6642 9818 11662 10212 8360 9399 12725 14848 13784 13728 15745 16098 14535
938564 14535 14859 14434 12002 10830 8508 9327 11653 13635 13997 10872 8561 10211 11428 8301 5677
939805 5677 7211 5706 -78 -4968 -5323 -3223 -2982 -3728 -3209 -3780 -3357 3500 11686 14289 12824 13201
941130 13201 11169 6057 4034 7594 7935 4884 4146 3395 3190 2623 1744 3936 11769 14826 10734 9748
942454 9748 10096 9691 8596 9524 13732 14266 10118 7997 9410 12351 16060 17101 16043 14675 14845 14437
943779 14437 14175 14272 14214 13573 12454 11089 12134 14932 15722 13515 11958 10731 8371 7424 5459 5625
$$ packed form
934672H032l056L22Q06N37p51M73J190N32Q11J72o30j441O69J189r8Q40L857N873
936163A9327J071l289k956k421j287j911k289m349l184R18M342L292J887J143
937321A0294k175k556J079L176J844j450j852J039L326K123j064n6K017L53j563
938564A4535L24m25k432j172k322Q19K326J982L62l125k311J650J217l127k624
939805E677J534j505n784m890l55K100K41p46N19n71M23O857Q186K603j465L77
941130A3201k032n112k023L560L41l051p38p51k05n67q79K192P833L057m092r86
942454I748L48m05j095R28M208N34m148k121J413K941L709J041j058j368J70m08
943779A4437k62R7n8o41j119j365J045K798P90k207j557j227k360r47j965J66
$$ plain form
945104 5625 7590 8292 6509 6110 7154 8529 8610 7931 8757 12553 15673 17349 18061 15963 11701 11276
946429 11276 13020 15294 16325 17406 15189 8534 4775 4945 7113 8671 9412 8484 6656 5096 6257
947670 6257 12112 18035 17028 13367 10943 9242 7494 5396 3732 550 -4860 -6718 -2039 1337
948830 1337 2053 53 -535 2913 4901 3685 3150 3209 4489 7740 9272 7767 7358 9650 10980 7046
950154 7046 3465 1904 2376 2195 3753 4748 5927 6964 7587 6938 3957 1786 5981 14738 18228 15559
951478 15559 12500 12109 12370 9331 3659 -717 962 6045 10431 12574 14506 16897 17304 15543 13524
952720 13524 10076 4044 -576 -1251 901 552 -164 795 2242 4173 6249 7352 9150 10082 8180
953962 8180 7660 9424 13789 19051 19686 15489 9543 6398 5943 5839 4455 5903 10110 14105 18329
$$ packed form
945104E625J965P02j783l99J044J375Q1o79Q26L796L120J676P12k098m262m25
946429A1276J744K274J031J081k217o655l759J70K168J558P41r28j828j560J161
947670F257N855N923j007l661k424j701j748k098j664l182n410j858M679L376
948830A337P16k000n88L448J988j216n35N9J280L251J532j505m09K292J330l934
950154G046l581j561M72j81J558R95J179J037O23o49k981k171M195Q757L490k669
951478A5559l059l91K61l039n672m376J679N083M386K143J932K391M07j761k019
952720A3524l448o032m620o75K152l49p16R59J447J931K076J103J798R32j902
953962H180n20J764M365N262O35m197n946l145m55j04j384J448M207L995M224
$$ plain form
955204 18329 15868 11980 12786 15931 15067 12400 10168 9558 10350 15052 19157 15449 9375 6883 9012
956445 9012 12688 15907 18165 16367 12810 10774 11860 13686 14228 14457 13700 13829 15185 17484 22188
957688 22188 23316 19049 16036 13569 8379 5074 5304 5737 6974 12221 16849 20481 21432 18968 19212
958929 19212 19572 19697 22564 24133 23416 22358 19401 14373 10428 8591 9014 8678 9007 12176 11779 8661
960254 8661 8433 6365 1857 -1311 -2698 -4727 -7574 -7008 -2901 -121 -430 -1816 -45 4887 9493
961496 9493 13893 14727 13330 11900 12170 14524 15856 12986 5743 2156 5095 8953 10435 9886 11753
962738 11753 13520 11451 8199 5987 3571 2625 5169 9304 6024 307 -314 -140 -1391 -2306 -464
963979 -464 4462 8025 10998 13054 10782 5916 5328 7250 9990 10482 8971 8200 6915 9138 14029
$$ packed form
955204A8329k461l888Q06L145q64k667k232o10P92M702M105l708o074k492K129
956445I012L676L219K258j798l557k036J086J826N42K29p57J29J356K299M704
957688B2188J128m267l013k467n190l305K30M33J237N247M628L632R51k464K44
958929A9212L60J25K867J569p17j058k957n028l945j837M23l36L29L169l97l118
960254H661k28k068m508l168j387k029k847N66M107K780l09j386J771M932M606
961496I493M400Q34j397j430K70K354J332k870p243l587K939L858J482n49J867
962738A1753J767k069l252k212k416r46K544M135l280n717o21J74j251r15J842
963979d64M926L563K973K056k272m866n88J922K740M92j511p71j285K223M891
$$ plain form
965222 14029 16034 14824 13250 15478 17248 16307 16243 16867 12474 6908 3301 2923 4282 6412 7601
966463 7601 7673 11832 16091 13091 6268 2663 5546 7655 7573 8336 10109 10582 9683 6250 3069 1407
967787 1407 1187 1793 2846 3418 3819 3444 5277 7068 3567 -3571 -7755 -5843 -2036 -54 -375 66
969112 66 1876 1056 1936 -32 -1715 1895 5952 5652 3919 3372 4442 6435 8138 9083 8839 6848
970436 6848 1560 -3541 -4106 -702 2388 2182 -1359 -4648 -3278 2860 9859 12900 11562 8068 7778
971679 7778 8909 10393 11099 9547 7669 3757 -135 -1930 -2828 -1531 2554 5608 6962 11126 12536
972920 12536 10681 8615 10039 12537 14155 15064 17692 20164 22376 23103 21629 16633 10315 5882 3323
974162 3323 950 551 3260 2526 -394 -1774 565 5929 8100 9033 9268 4739 1190 2142 4752 6376
$$ packed form
965222A4029K005j210j574K228J770r41o4O24m393n566l607l78J359K130J189
966463G601P2M159M259l000o823l605K883K109q2P63J773M73q99l433l181j662
967787A407k20O06J053N72M01l75J833J791l501p138m184J912L807J982l21M41
969112F6J810q20Q80j968j683L610M057l00j733n47J070J993J703R45k44j991
970436F848n288n101n65L404L090k06l541l289J370O138O999L041j338l494k90
971679G778J131J484P06j552j878l912l892j795q98J297M085L054J354M164J410
972920A2536j855k066J424K498J618R09K628K472K212P27j474m996o318m433k559
974162C323k373l99K709p34k920j380K339N364K171R33K35m529l549R52K610J624
$$ plain form
975486 6376 10096 13669 13177 11882 11256 10698 8734 3617 -915 1014 7779 12356 17820 21694 21564
976729 21564 20488 17693 13977 11976 14387 16443 15879 9180 2584 3182 6543 7010 5828 6707 9806
977970 9806 9454 8259 6654 1794 -2216 -2740 148 2651 2377 1305 3051 2599 726 1794 3882
979213 3882 3545 2465 1211 948 2535 4345 3451 349 -1130 -27 6193 10924 9333 7854 7343
980454 7343 9123 10256 10010 11844 12812 10599 8817 7789 7433 6784 3451 -1217 -6510 -7642 -5752
981696 -5752 -3328 -1648 -639 -1475 -4080 -8937 -10300 -8327 -4147 -1612 2954 10312 14729 14216 10848
982938 10848 5464 1757 1184 2334 3788 4984 3963 2603 2119 93 -516 -31 390 3021 7428
984180 7428 8558 6536 4849 3691 4853 8703 10253 9912 11053 11411 10529 9115 7331 5235 2524
$$ packed form
975486F376L720L573m92j295o26n58j964n117m532J929O765M577N464L874j30
976729B1564j076k795l716k001K411K056n64o699o596N98L361M67j182Q79L099
977970I806l52j195j605m860m010n24K888K503k74j072J746m52j873J068K088
979213C882l37j080j254k63J587J810q94l102j479J103O220M731j591j479n11
980454G343J780J133k46J834R68k213j782j028l56o49l333m668n293j132J890
981696e752K424J680J009q36k605m857j363J973M180K535M566P358M417n13l368
982938A0848n384l707n73J150J454J196j021j360m84k026o09M85M21K631M407
984180G428J130k022j687j158J162L850J550l41J141L58q82j414j784k096k711
$$ plain form
985421 2524 749 1966 5017 6570 3522 -2036 -6509 -6152 -2453 1957 4555 8715 12913 12306 10250
986664 10250 9222 6468 5012 6224 8139 10552 11975 9548 5361 1393 -891 -1216 1247 5638
987822 5638 7631 6064 3009 383 -2055 -615 3693 6118 8417 9989 4641 -794 739 3549
988981 3549 5404 5379 5949 3781 -1056 -3931 -3779 -4209 -4141 1679 5828 5091 3644 2333 381 -518 1710
990389 1710 6803 8570 7566 2708 -5533 -9743 -6377 1694 8340 8464 7363 7650 7696 8210 9321 8633
991713 8633 7866 8107 10673 13848 13233 10779 7838 3289 -266 -1527 -2994 -4681 -4879 -696 2545
992955 2545 3308 2714 600 -632 1815 4810 6044 5726 7547 9312 6759 3734 1538 3404 5571
994197 5571 1484 -6268 -9264 -7192 -1127 2489 -196 -3510 -2817 367 762 250 2737 8255 12412
$$ packed form
985421B524j775J217L051J553l048n558m473L57L699M410K598M160M198o07k056
986664A0250j028k754j456J212J915K413J423k427m187l968k284l25K463M391
987822E638J993j567l055k626k438J440M308K425K299J572n348n435J533K810
988981C549J855k5N70k168m837k875J52m30O8N820M149p37j447j311j952q99K228
990389A710N093J767j004m858q241m210L366Q071O646J24j101K87M6N14J111o88
991713H633p67K41K566L175o15k454k941m549l555j261j467j687j98M183L241
992955B545P63n94k114j232K447K995J234l18J821J765k553l025k196J866K167
994197E571m087p752k996K072O065L616k685l314O93L184L95n12K487N518M157
$$ plain form
995439 12412 12010 8168 6549 12431 19390 20674 18498 14769 9776 6839 5827 5283 8165 13358 17182
996680 17182 14659 7494 4550 4779 4659 5314 6826 8196 9711 10884 11425 11664 11302 7344 1580 -1518
998006 -1518 -610 476 -453 -1199 -92 966 -34 -627 1472 2638 2459 2392 2512 4196 5416 3690
999330 3690 3166 5737 5164 1751 3507 7321 8884 9662 8697 6415 7298 8418 7986 5740 3993 1933
1000655 1933 -72 268 3486 6242 8162 8785 4862 309 -2810 -4227 -6294 -6351 -2285 2341 6903
1001896 6903 7720 6153 4693 8750 10190 10981 12341 13987 13608 10917 7581 8878 11137 9114 4703
1003139 4703 -1249 -4183 -3253 35 4472 6385 7035 7970 6464 6668 8615 12994 15507 14317 13202
1004380 13202 12867 13968 18595 23317 20614 14855 10832 7721 6613 6727 8119 10294 10498 7519 5822
$$ packed form
995439A2412m02l842j619N882O959J284k176l729m993k937j012n44K882N193L824
996680A7182k523p165k944K29j20O55J512J370J515J173N41K39l62l958n764l098
998006a518R08J086r29p46J107J058j000n93K099J166j79o7J20J684J220j726
999330C690n24K571n73l413J756L814J563P78r65k282Q83J120m32k246j747k060
1000655A933k005L40L218K756J920O23l923m553l119j417k067n7M066M626M562
1001896F903Q17j567j460M057J440P91J360J646l79k691l336J297K259k023m411
1003139D703n952k934R30L288M437J913O50R35j506K04J947M379K513j190j115
1004380A3202l35J101M627M722k703n759m023l111j108J14J392K175K04k979j697
$$ plain form
1005622 5822 6460 5301 4881 6323 7956 10736 12275 9329 6818 7938 8917 10407 10670 9311 7366
1006864 7366 5111 2784 2850 5286 5154 2807 524 -792 -2578 -3233 -4419 -5422 -4255 -2957 -2114 -3807
1008188 -3807 -6644 -5858 -6093 -7035 -7567 -5299 -2383 -954 -752 -979 1314 3697 2056 -104 472 5335
1009513 5335 11487 13487 11778 9661 10135 12557 16014 17801 17357 17812 20261 19461 17081 15448 17532
1010755 17532 19131 19810 20036 19511 17128 10997 4418 2647 1055 -1422 2050 7736 10673 11710 12892
1011997 12892 13058 14054 13964 13357 14368 12992 12336 12746 12629 11157 10211 11421 14255 17176 15030 8740
1013321 8740 4682 3726 3248 2000 1950 4799 7233 5415 2928 -603 -2879 -1223 3946 9011 10809
1014563 10809 9450 6505 7132 10165 12235 12021 10736 10596 13214 11741 4007 -1080 -104 35 349 143
$$ packed form
1005622E822O38j159m20J442J633K780J539k946k511J120R79J490K63j359j945
1006864G366k255k327O6K436j32k347k283j316j786o55j186j003J167J298Q43j693
1008188c807k837P86k35r42n32K268K916J429K02k27K293K383j641k160N76M863
1009513E335O152K000j709k117M74K422L457J787m44M55K449q00k380j633K084
1010755A7532J599O79K26n25k383o131o579j771j592k477L472N686K937J037J182
1011997A2892J66R96r0o07J011j376o56M10j17j472r46J210K834K921k146o290
1013321H740m058r56m78j248n0K849K434j818k487l531k276J656N169N065J798
1014563A0809j359k945O27L033K070k14j285j40K618j473p734n087R76J39L14k06
$$ plain form
1015887 143 -2014 -2690 -2113 1352 5028 6183 5912 5717 3858 1163 -1433 -5204 -7589 -5950 -1032 5572
1017212 5572 9921 7158 868 -2151 1552 5595 5725 5286 4498 1424 -286 263 3693 5258 1158
1018454 1158 -1795 -1204 3804 7674 5775 3385 3842 3285 4284 6671 8554 7942 7241 9892 14777 16320
1019779 16320 14414 19221 21623 17696 12466 11100 9935 8334 5013 -25 -4269 -4245 -986 2375 1925
1021020 1925 -922 -4279 -9073 -11957 -13228 -13682 -12220 -8825 -2490 3194 4646 3687 262 -846 -1182
1022263 -1182 -2747 -2498 -2153 -5402 -8096 -5526 2913 9309 11771 12468 11186 10644 9717 10803 10928 8945
1023587 8945 5742 1330 1004 5239 8980 11271 11640 13664 14913 14299 15509 16306 17396 17583 16079 16373
1024912 16373 16748 14849 11779 9141 8068 5988 4016 277 -3528 -3207 1036 5208 5825 5578 3682
$$ packed form
1015887A43k157o76N77L465L676J155k71j95j859k695k596l771k385J639M918O604
1017212E572M349k763o290l019L703M043J30m39p88l074j710N49L430J565m100
1018454A158k953N91N008L870j899k390M57n57R99K387J883o12p01K651M885J543
1019779A6320j906M807K402l927n230j366j165j601l321n038m244K4L259L361m50
1021020A925k847l357m794k884j271m54J462L395O335N684J452r59l425j108l36
1022263a182j565K49L45l249k694K570Q439O396K462O97j282n42r27J086J25j983
1023587H945l203m412l26M235L741K291L69K024J249o14J210P97J090J87j504K94
1024912A6373L75j899l070k638j073k080j972l739l805L21M243M172O17k47j896
$$ plain form
1026153 3682 293 -1878 1337 3525 2133 4019 10861 12709 11515 11079 10272 13303 17322 16232 12869
1027396 12869 12740 10678 4801 1258 3354 7824 10658 13119 14392 10600 5604 1915 -2486 -5737
1028554 -5737 -8482 -9149 -4244 2461 8426 13515 15023 12262 9087 8551 10673 14838 16359 16018 16187
1029796 16187 14551 11772 13024 18954 19826 15061 10124 7814 5735 6980 7056 6116 8341 11394 13372
1031038 13372 13490 9166 449 -4214 -6580 -7220 -3372 -1567 573 2864 3237 3164 2370 3009 6252 8144
1032363 8144 7359 4669 2963 3259 5062 6508 5225 3917 3323 2244 1729 4115 7762 11909 12322 9809
1033687 9809 9131 10186 11624 14304
$$ packed form
1026153C682l389k171L215K188j392J886O842J848j194m36q07L031M019j090l363
1027396A2869j29k062n877l543K096M470K834K461J273l792m996l689m401l251
1028554e737k745o67M905O705N965N089J508k761l175n36K122M165J521l41J69
1029796A6187j636k779J252N930Q72m765m937k310k079J245P6r40K225L053J978
1031038A3372J18m324q717m663k366o40L848J805K140K291L73p3p94O39L243J892
1032363H144p85k690j706K96J803J446j283j308n94j079n15K386L647M147M13k513
1033687I809o78J055J438K680
##END=
