##TITLE= CW- 2-AminoEthanol
##JCAMP-DX= 5.01
##DATA TYPE= INFRARED SPECTRUM
##DATA CLASS= XYDATA
##ORIGIN= JSpecView Converted
##OWNER= JSpecView Generated
##LONGDATE= Tue, 22 Jul 2014 14:29:33 -0400 $$ export date from JSpecView
##DATA PROCESSING= Ratio against background
Truncated
ElementMultiply or ElementDivide
##XUNITS= 1/CM
##YUNITS= ABSORBANCE
##XFACTOR= 1
##YFACTOR= 3.322272E-06
##FIRSTX= 3.999764E+03
##FIRSTY= 7.686983E-02
##LASTX= 3.992123E+02
##NPOINTS= 1868
##MINY= 6.651935E-02
##MAXY= 3.388791
##XYDATA= (X++(Y..Y))
3999.7637B3138L6q8k2j51L7l1j08r5RP1J7r5N7n4J03O1RJ5J67M8J71B3413
$$ 23138 23174 23086 23064 22913 22950 22919 22811 22716 22725 22796 22813 22718 22775 22721 22824 22885 22894 22909 23076 23124 23295 23413
3955.4082B3525j3JK12L79j87j34L13J6l54j94k71K24J98k44m05J36m3B2797
$$ 23525 23512 23513 23725 24104 23917 23783 24096 24112 23758 23564 23293 23517 23715 23471 23066 23202 23159 22797
3918.7676B2706M9j26m39l04j33r6J86M62J96N3n3r21n73L24N62q19k42B1433
$$ 22706 22755 22629 22190 21886 21753 21657 21843 22305 22501 22554 22501 21580 21007 21331 21893 21074 20832 21433
3882.127B0945Q9K48q49m2L66j47Q33n94k79N80l13m69l46R5J188J334B1412
$$ 20945 21034 21282 20433 20391 20757 20610 21443 20849 20570 21150 20837 20368 20022 20117 21305 22639 21412
3847.414B0665m26K72N02M73N25L67m99k63P9j33K10K93j68J663J36B2908
$$ 20665 20239 20511 21013 21486 22011 22378 21879 21616 21695 21562 21772 22065 21897 23560 23696 22908
3814.6306B3760m22o19m0P31R76n19J027O20p05K31j71l19J55J03K80B5504
$$ 23760 23338 22719 22679 23410 24386 23867 24894 25514 24809 25040 24869 24550 24705 24808 25088 25504
3781.8462B5443L9Q00k22j46r8K96P11jL11o1k57Q18K89k05l04J192J148B9464
$$ 25443 25482 26282 26060 25914 25816 26112 26823 26822 27133 27072 26815 27633 27922 27717 27413 28605 29753 29464
3745.2056B8517K004k43p93q9J131J097j70n79q17M44O64Q8J83p6K9k56C1848
$$ 28517 30521 30278 29485 29396 30527 31624 31454 30875 30058 30502 31166 31254 31437 31361 31390 31134 31848
3710.4937C3465M98n32l06K25J286N37k8N61N73P83J647J949L53j80Q98D3141
$$ 33465 33963 33431 33125 33350 34636 35173 35145 35706 36279 37062 38709 40658 41011 40831 41729 43141
3677.7092D4646J697M487m81R93L341O50N05J605J783J553J729L468P27F7978
$$ 44646 46343 50830 50349 51342 54683 55333 55838 57443 59226 60779 62508 65976 66703 67978
3648.7825G2601M307J483K70J788K534K537K644K932K092J306Q002L187A06442
$$ 72601 76908 78391 78661 80449 82983 85520 88164 91096 93188 94494 102496 105683 106442
3621.7834A08049L028N638L906J745M331L378L773N237K914K322M380A53409
$$ 108049 111077 116715 120621 122366 126697 130075 133848 139085 141999 144321 148701 153409
3596.714A57198M307N618L504K342O601R160M007K805L320M688M543B13383
$$ 157198 161505 167123 170627 172969 179570 188730 192737 195542 198862 203550 208093 213383
3571.6436B17990L770M520R740N797L227M415N773M686M943N402O897B81219
$$ 217990 221760 226280 236020 241817 245044 249459 255232 259918 264861 270263 277160 281219
3546.573B86872P174O304L919M569N068O632M631M483M512N853N715C52113
$$ 286872 294046 300350 304269 308838 313906 320538 325169 329652 334164 340017 345732 352113
3521.5037C57104M077L030N399N960N539M205M889J694L879M296N180D08272
$$ 357104 361181 364211 369610 375570 381109 385314 390203 391897 395776 400072 405252 408272
3496.433D11942L288M584K404M185L607K497J558M409K994L241J582D50464
$$ 411942 415230 419814 422218 426403 430010 432507 434065 438474 441468 444709 446291 450464
3471.3638D52196K391K301L173l55O87K588L883M72K617J312L034Q70D77779
$$ 452196 454587 456888 460061 459706 460393 462981 466864 467336 469953 471265 474299 475169 477779
3444.3647D79675L136O08J012l6J131P79K023k93K162O57M49k80J504D93487
$$ 479675 482811 483419 484431 484395 485526 486305 488328 488035 490197 490854 491303 491023 492527 493487
3415.4382D96745Q45J850q07R65p82J588J670J331n82K122k77J455L22E08546
$$ 496745 497590 499440 498633 499598 498816 500404 502074 503405 502823 504945 504668 506123 506445 508546
3386.5105E10610J482j72J545J025L226O30J401J199L656J843K726K216E33501
$$ 510610 512092 511920 513465 514490 517716 518346 519747 520946 524602 526445 529171 531387 533501
3359.5127E31540j443j21J703k212l46j582O98j014l31j32m58k843l86E23138
$$ 531540 530097 529976 531679 529467 529121 527539 528237 527223 526892 526760 526302 523459 523073 523138
3330.585E24277j609j96L78K022r64k53J46K48K52J731l546M23R45Q77E25390
$$ 524277 522668 522472 522850 524872 523908 523655 523801 524049 524301 526032 522486 522909 523854 524731 525390
3299.73E27850j68J567r04M58n80J004k53J049j736j019k13m2j798E26906
$$ 527850 527682 529249 528345 528803 528223 529227 528974 530023 528287 527268 527055 527013 525215 526906
3270.8022E27626k06k244j309Q86N04j709J031j013m48j748m79j747Q81E20668
$$ 527626 527420 525176 523867 524753 525257 523548 524579 523566 523118 521370 520891 519144 520025 520668
3241.8757E21761j583j447p65J332K90m45j434l26l74J63K16J469j304E18605
$$ 521761 520178 518731 517966 519298 519588 519143 517709 517383 517009 517172 517388 518857 517553 518605
3212.9492E19198r59j450P22J94J166j997l40J057R65J1J603r38j266E17444
$$ 519198 518239 516789 517511 517705 518871 516874 516534 517591 518556 518567 520170 519232 517966 517444
3184.0215E18617j315o49J32n28j233M62l64P75l93J370N84l68k438n14E13386
$$ 518617 517302 516653 516785 516257 515024 515486 515122 515897 515504 516874 517458 517090 514652 514138 513386
3153.1665E13490j033n06o01j16o78M82k92lj048K56n42L3o16J66j101E06821
$$ 513490 512457 511951 511350 511234 510556 511038 510746 510743 509695 509951 509409 509442 508826 508992 507891 506821
3120.3828E07251R30r14p25n89J084l06p64j685k2Q9N74j225m3j019l01E02003
$$ 507251 508181 507267 506542 505953 507037 506731 505967 504282 504260 504349 504923 503698 503655 502636 502335 502003
3087.5981E00996j733J6r28o71r58j01j7J320j033j125j103J01j295o78D92122
$$ 500996 499263 499279 498351 497680 496722 496621 496604 497924 496891 495766 494663 494764 493469 492791 492122
3056.743D92092l95N11n76j464j520o78j026L02l54o37r24r67k246m97D80562
$$ 492092 491697 492208 491632 490168 488648 487970 486944 487246 486892 486255 485331 484364 482118 481621 480562
3025.8877D79988o13j191j618M32r48p18j183p96o73r09j417p03j003D68355
$$ 479988 479375 478184 476566 476998 476050 475332 474149 473353 472680 471771 470354 469651 468648 468355
2996.9602D67280m2M64J76j026l87M19J560J043J559J161J420J626K836D79685
$$ 467280 467238 467702 467878 466852 466465 466884 468444 469487 471046 472207 473627 475253 478089 479685
2968.0337D83062M299L598J209K067L707M233K049K139L131M970J326E16584
$$ 483062 487361 490959 492168 494235 497942 502175 504224 506363 509494 514464 515790 516584
2942.9631E18507J850k28O49p10J98Q22P84n49K57r24p2m61j219k844E14278
$$ 518507 520357 520129 520778 520068 520266 521088 521872 521323 521580 520656 520584 520123 518904 516060 514278
2912.108E13807m91j207j442j499P80n81p69j061N92m01l42R13J305E09100
$$ 513807 513316 512109 510667 509168 509948 509367 508598 507537 508129 507728 507386 508299 509604 509100
2883.1804E10617J742R75O55K549J685p1l44K230K39o82j269J9j304Q3E17324
$$ 510617 512359 513334 513989 516538 518223 518152 517808 520038 520277 519595 518326 518345 517041 517124 517324
2852.3254E16780l086j676n46j34j886j298k048k322j606m90j551n45D98331
$$ 516780 513694 512018 511472 511338 509452 508154 506106 503784 502178 501688 500137 499592 498331
2825.3264D97600j493q45j570j277j651j101j484l55j343j126j316j100D81664
$$ 497600 496107 495262 493692 492415 490764 489663 488179 487824 486481 485355 484039 482939 481664
2798.3284D80668p50l04j287j6j035o25j044n38n05o48n33l56j360J26D71246
$$ 480668 479918 479614 478327 478311 477276 476651 475607 475069 474564 473916 473383 473027 471667 471793 471246
2767.4731D70473j678j309q78k68o87k0r27N3n50j174j356J72r79j138D58589
$$ 470473 468795 467486 466608 466340 465653 465633 464706 464759 464209 463035 461679 461851 460872 459734 458589
2736.617D58141j014p01n29l05j278m48o19j62j159o30o27p95j365p88D46184
$$ 458141 457127 456426 455897 455592 454314 453866 453247 453085 451926 451296 450669 449874 448509 447721 446184
2705.762D45011j633j334j507j134j615r28j806j120j250p43j343j707D27600
$$ 445011 443378 442044 440537 439403 437788 436860 435054 433934 432684 431941 430598 428891 427600
2678.763D27331p47j423j529q70j302q79j075r54j084m35r69p50q03D13879
$$ 427331 426584 425161 423632 422762 421460 420581 419506 418552 417468 417033 416064 415314 414511 413879
2649.8364D12803p30q69r71j071q88j394j451j597q06j216j274j379j098C96401
$$ 412803 412073 411204 410233 409162 408274 406880 405429 403832 403026 401810 400536 399157 398059 396401
2620.9097C95152j639j523j586j112j558j683j569j077j635j714j825C76881
$$ 395152 393513 391990 390404 389292 387734 386051 384482 383405 381770 380056 378231 376881
2595.8394C74940j724j654j072j840j851j589j150j841j727j560j236C56169
$$ 374940 373216 371562 370490 368650 366799 365210 364060 362219 360492 358932 357696 356169
2570.7688C54650j590j362j287j181j720j321j388j224j531j627j836C37153
$$ 354650 353060 351698 350411 349230 347510 346189 344801 343577 342046 340419 338583 337153
2545.6995C35688j326j661j597j789j577j491j323j821j605j784j627C16428
$$ 335688 334362 332701 331104 329315 327738 326247 324924 323103 321498 319714 318087 316428
2520.629C14890j798j867j951j710j903j800j973j822j912j981k119B92214
$$ 314890 313092 311225 309274 307564 305661 303861 301888 300066 298154 296173 294054 292214
2495.559B90275j848k011j890j933j733j846j763j819j676j905j787B68300
$$ 290275 288427 286416 284526 282593 280860 279014 277251 275432 273756 271851 270064 268300
2470.4885B66628j760j705k100j943j949j826j993j917k042j908j823B43931
$$ 266628 264868 263163 261063 259120 257171 255345 253352 251435 249393 247485 245662 243931
2445.419B41918j794j668j632j788j697j791j651j616j525j697j684B21658
$$ 241918 240124 238456 236824 235036 233339 231548 229897 228281 226756 225059 223375 221658
2420.3484B20085j793j654j623j520j655j553j612j354j457j341j376B01874
$$ 220085 218292 216638 215015 213495 211840 210287 208675 207321 205864 204523 203147 201874
2395.279B00601j096j142j008r80q54q46n92n45k71j48o7l5J18j23J78A93145
$$ 200601 199505 198363 197355 196375 195521 194675 194083 193538 193267 193119 193052 193017 193135 193012 193190 193145
2362.4944A93199n1n0n15m46p45r05k023j705P4M07l10m31q43q07q68A83318
$$ 193199 193148 193098 192583 192137 191392 190487 188464 186759 186833 187240 186930 186499 185656 184849 183981 183318
2329.711A82623q02j116r72q91q59j141j173j028q41r60q66r49r51r35A68333
$$ 182623 181821 180705 179733 178842 177983 176842 175669 174641 173800 172840 171974 171025 170074 169139 168333
2298.855A67489p15p56o90o29m97o82o44n87m82n17l96m27m25m16l29A58849
$$ 167489 166774 166018 165328 164699 164202 163520 162876 162289 161807 161290 160894 160467 160042 159626 159297 158849
2266.0715A58417m06k87m02l46l98l25l63k90l70k68l45k37l25k61l13A53243
$$ 158417 158011 157724 157322 156976 156578 156253 155890 155600 155230 154962 154617 154380 154055 153794 153481 153243
2233.288A52887l78m20l37m09l42m54l85m17l05l57k97l89l24l87l11A47030
$$ 152887 152509 152089 151752 151343 151001 150547 150162 149745 149440 149083 148786 148397 148073 147686 147375 147030
2200.5034A46740l85l46l82l10l97k69l20k71l60k63l49k69k58k66l05A41807
$$ 146740 146355 146009 145627 145317 144920 144651 144331 144060 143700 143437 143088 142819 142561 142295 141990 141807
2167.72A41533j85k46j82k61j73k27j63k25j68k38j74k18j65k47j59A38303
$$ 141533 141348 141102 140920 140659 140486 140259 140096 139871 139703 139465 139291 139073 138908 138661 138502 138303
2134.9355A38242j51r0q2J1OJ00J10K02J76K74K61L52L09L62L65M45L00A41528
$$ 138242 138091 138001 137919 137930 137936 138036 138146 138348 138524 138798 139059 139411 139720 140082 140447 140892 141192 141528
2098.295A41818L25K02K40J42J80J2K9l3N4r1k9j34j16k49j92k95k39A41311
$$ 141818 142143 142345 142585 142727 142907 142919 142948 142915 142969 142878 142849 142715 142599 142350 142158 141863 141624 141311
2061.6533A40937m30l53m58l72m28l48m38l35l91k83l06l39l61k28k63A35466
$$ 140937 140507 140154 139696 139324 138896 138548 138110 137775 137384 137101 136795 136456 136095 135867 135604 135466
2028.8689A35186j26j55r5j76r8r0K4k57q6j03k6j19k9j45J8j5Q6j39A33808
$$ 135186 135060 134905 134810 134634 134536 134446 134470 134213 134127 134024 133998 133879 133850 133705 133723 133708 133794 133655 133808
1990.2961A33999p1n4N8O5J47J19K26K00L16K05K45M22M49pJ78J14K19A36832
$$ 133999 133928 133874 133932 133997 134144 134263 134489 134689 135005 135210 135455 135877 136326 136319 136497 136611 136830 136832
1953.6536A36904q0K1j17M9j53L19l5l97j71l9o2lj20k3j24L42K7l34A36521
$$ 136904 136824 136845 136728 136777 136624 136943 136908 136511 136340 136301 136239 136236 136116 136093 135969 136311 136338 136004 136521
1915.0814A36425l78oJ26J07k46q6j39q7j93N0R1k69k4N21l21K0K2J02A35782
$$ 136425 136047 136041 136167 136274 136028 135942 135803 135716 135523 135573 135664 135395 135371 135892 135571 135591 135613 135715 135782
1876.5104A35952PM9k04P70M62o36n60j14j22r7j85p5r5m3M5j11Q51L10A35226
$$ 135952 135959 136008 135804 136574 137036 136400 135840 135726 135604 135507 135322 135247 135152 135109 135154 135043 135894 136204 135226
1837.9386A35186N5Nl80N45P30o84J41N4n73k0J1J24k18N06J78m5k23A35485
$$ 135186 135241 135246 134866 135411 136141 135457 135598 135652 135079 135059 135070 135194 134976 135482 135660 135615 135392 135485
1801.295A35817P40j33r5j23J549L03p14j93P93Q8P32K70P0O3J441J474A41723
$$ 135817 136557 136424 136329 136206 137755 138058 137344 137151 137944 138032 138764 139034 139104 139167 140608 142082 141723
1766.5801A42291q8K64J906L31P40J228q6J441K472J078N66Q15J178J501A57464
$$ 142291 142203 142467 144373 144704 145444 146672 146586 148027 150499 151577 152143 152958 154136 155637 157464
1735.7231A56710L912K845K92J372J313J807K473R45K561N478K573J592A85609
$$ 156710 160622 163467 163759 165131 166444 168251 170724 171669 174230 179708 182281 183873 185609
1708.723A88137K919M866K417J447R456J010N119M056J184M186L906B30346
$$ 188137 191056 195922 198339 199786 209242 210252 215371 219427 220611 224797 228703 230346
1683.6515B39701M712P48K144K002N800Q43J859M119K23j210K061J390B63664
$$ 239701 244413 245161 247305 249307 255107 255950 257809 261928 262151 260941 263002 264392 263664
1656.6514B62798j698O411K943m080J807M574L90J329L059K733R356R665C03186
$$ 262798 261100 267511 270454 266374 268181 272755 273145 274474 277533 280266 289622 299287 303186
1629.6501C09626J0744J0574J0001J5481R899P632J5859J2592O246P570D24012
$$ 309626 320370 330944 340945 356426 366325 373957 389816 402408 408654 416224 424012
1606.5073D30376M716K984K343o6p54k594l325o513o883r434r866j2127C76619
$$ 430376 435092 438076 440419 440353 439599 437005 433680 427167 420284 410850 400984 388857 376619
1579.5073C63032j2137j2305j1973j2360r466r115r089q334p617p350B62918
$$ 363032 350895 338590 326617 314257 304791 295676 286587 278253 270636 263286 262918
1556.3639B56663o306m811m008k789l547k266j135j228K277k404l579B27817
$$ 256663 250357 245546 241538 238749 235202 232936 231801 230573 232850 230446 226867 227817
1531.2924B28829j405P45J930Q06K060M504J87M006J926K105L101K743B61774
$$ 228829 227424 228169 230099 230905 232965 237469 237656 241662 243588 245693 248794 251537 261774
1504.2926B67326L74L250N547P468P052L216N516J0773P932O468M941C35999
$$ 267326 267700 270950 276497 283965 291017 294233 299749 310522 318454 324922 329863 335999
1479.2201C41205L845N996O172R863L139k44J842N152J985l47Q79K313C76617
$$ 341205 345050 351046 357218 367081 370220 369976 371818 376970 378955 378608 379487 381800 376617
1452.2201C70097l701r28J437j604l757o328p856o759n148o507m503l210C17991
$$ 370097 366396 365468 366905 365301 361544 355216 347360 340601 335453 328946 324443 321233 317991
1425.2201C14213k202l906k716j552m139m255l295k808k343j249R35R27B89798
$$ 314213 312011 308105 305389 303837 299698 295443 292148 289340 286997 285748 286683 287610 289798
1398.2196B95265L997M247L074J58N18J900J210M11K191L480N095N922C36355
$$ 295265 299262 303509 306583 306741 307259 309159 310369 310780 312971 316451 321546 327468 336355
1371.2196C43882P746Q952P134O004O775L750J182j606m559p628r383C52187
$$ 343882 351628 360580 367714 373718 380493 384243 385425 383819 379260 371632 362249 352187
1346.1482C42660q387p077n907m921n195m723m323l666l462k965k653B87374
$$ 342660 334273 327196 321289 316368 311173 306450 302127 298461 294999 292034 289381 287374
1321.0762B85860m45k65n46j023k050l750m610n292n376n373m999m956B42306
$$ 285860 285415 285150 284604 283581 281531 277781 273171 267879 262503 257130 252131 247175 242306
1294.076B37277n183n342n096n004m500l925l163k482j686j056k66L35B00866
$$ 237277 232094 226752 221656 216652 212152 208227 205064 202582 200896 199840 199574 199909 200866
1267.0759B02116J618J697J630J223Q89M99M21K60M47M83P59O70N07J5B12735
$$ 202116 203734 205431 207061 208284 209173 209672 210093 210353 210800 211283 212042 212712 213219 213234 212735
1236.218B11465j825k480k777l193l497l885m027m285m223m118l724A70037
$$ 211465 209640 207160 204383 201190 197693 193808 189781 185496 181273 177155 173431 170037
1211.1465A67213k381j697j116l65K02J039J799K765L575M506N262O060A93412
$$ 167213 164832 163135 162019 161654 161856 162895 164694 167459 171034 175540 180802 186862 193412
1184.1464B00357O952O847O226N498M390L099J541J64j392k502l475m119B18916
$$ 200357 207309 214156 220382 225880 230270 233369 234910 235074 233682 231180 227705 223586 218916
1157.1466B14169m882m721m626m040l192j949q31N48J805L091M270N547B11737
$$ 214169 209287 204566 199940 195900 192708 190759 189928 190476 192281 195372 199642 205189 211737
1130.1465B19462Q622R604J0258J0821J1089J1413J1477J1523J0942J0526C35273
$$ 219462 228084 237688 247946 258767 269856 281269 292746 304269 315211 325737 335273
1107.003C44184P149M789K983K501L266O419J0797J4786J5864J4587D39210
$$ 344184 351333 356122 359105 361606 364872 371291 382088 396874 412738 427325 439210
1083.8601D48198N383L385J592k46k432m053n927o513o985p524p748o778D04547
$$ 448198 453581 456966 458558 458312 455880 451827 445900 439387 432402 424878 417130 410352 404547
1056.8591D01279R51N161Q531J0503J0079R230P749N473L999K768J623D68593
$$ 401279 402230 407391 415922 426425 436504 445734 453483 458956 462955 465723 467346 468593
1031.7877D69176j124k377l619n144n847o468n335l665k143j103L17J371D35573
$$ 469176 468052 465675 462056 456912 451065 444597 439262 435597 433454 432351 432668 434039 435573
1004.7877D37176J840P99P0J21L1l26j78K70N49M58J298J770J410J050D47861
$$ 437176 439016 439815 439885 440006 440037 439711 439533 439803 440352 440810 442108 443878 445288 446338 447861
973.9306D48903J128J130R24Q29P45N12J10l18J60M9k51p81k58o75j162D50403
$$ 448903 450031 451161 452085 452914 453659 454171 454281 453963 454123 454172 453921 453140 452882 452207 451045 450403
941.1439D49400j934j746j314k060k329j898k440k607k024j989k409D24269
$$ 449400 447466 445720 444406 442346 440017 438119 435679 433072 431048 429059 426650 424269
916.07245D21763k299k177k304k223k161k037j586j499j427j671j045D01386
$$ 421763 419464 417287 414983 412760 410599 408562 406976 405477 404050 402379 401334 401386
891.00104D01816J356L047L286M046M880M739M065L451J973J329N39l88D31687
$$ 401816 403172 406219 409505 413551 418431 423170 427235 430686 432659 433988 434527 434139 431687
864.00104D27695m456m227l841l246k088j300p14K06J15o90j346j173D02973
$$ 427695 423239 419012 415171 411925 409837 408537 407823 408029 408144 407454 406108 404935 402973
837.D00431k464k602l695l815m183m251m282m445m393l625l109C56382
$$ 400431 397967 395365 391670 387855 383672 379421 375139 370694 366301 362676 359567 356382
811.9286C52873k921k014j474j148o38p55p73o93q02j226j123j280j059C36492
$$ 352873 349952 347938 346464 345316 344678 343923 343150 342457 341655 340429 339306 338026 336967 336492
783.C36515L9r5n84q22j115r00j027q17n03j16l80l25l90m12l77C28157
$$ 336515 336554 336459 335875 335053 333938 333038 332011 331194 330691 330575 330195 329870 329480 329068 328691 328157
750.21436C27389l22j18l17o21l61k63j42j67O4k06j55j93J00J67J95C25362
$$ 327389 327067 326949 326632 326011 325650 325387 325245 325078 325142 324936 324781 324588 324688 324855 325050 325362
717.4276C25786o6J37K64L20L33O83J43K44N33O26K43nj02o5L22P13C30091
$$ 325786 325720 325857 326121 326441 326774 327457 327600 327844 328377 329003 329246 329241 329139 329074 329396 330109 330091
682.7133C29905K38O68J92P9q6L22N85K768j163q24L06N28L31L17N49C35405
$$ 329905 330143 330811 331003 331082 330996 331318 331903 334671 333508 332684 332990 333518 333849 334166 334715 335405
649.9276C35903Q87Q88J236O46N11P14Q38N67M45N90J202J160K68l42C46031
$$ 335903 336790 337678 338914 339560 340071 340785 341623 342190 342635 343225 344427 345587 345855 345513 346031
619.07043C46720R56L37N09K60R2N89R69P97J044J191J206R88J119J147C59812
$$ 346720 347676 348013 348522 348782 348874 349463 350432 351229 352273 353464 354670 355658 356777 357924 359812
588.21234C61509J366J336J578K141K267J150J230J285K366K820K187C82956
$$ 361509 362875 364211 365789 367930 370197 371347 372577 373862 376228 379048 381235 382956
563.1409C86027L019L448L126K305M623N723M114N811N681O000O773D45470
$$ 386027 389046 392494 395620 397925 402548 408271 412385 418196 423877 429877 436650 445470
538.06946D53932J0372J1080J1177R252J1634J1777J3639Q010N750O731E66572
$$ 453932 464304 475384 486561 495813 507447 519224 532863 540873 546623 553354 566572
514.9266E79990J1912J991L14o39L432P169J380J46J9960J7273K722F48314
$$ 579990 591902 593893 594207 593568 597000 604169 605549 605695 625655 642928 645650 648314
489.8553F63412J7902J9490K3480J0821q279K1408J0021j1197K9926G85243
$$ 663412 681314 700804 724284 735105 726826 748234 758255 747058 776984 785243
468.6406H06307L4534n376p837J8138M329O556j812l7934Q1190M9906H28553
$$ 806307 840841 835465 827628 845766 850095 856651 854839 816905 898095 948001 828553
445.49835H01976N4305m9546k5007O7239q48967%R07356m7429m9675m450@
$$ 801976 856281 806735 781728 848967 0 0 907356 859927 810252 805802 0
422.3556A020022k18875k1113K6015P6388q82437R70368k01103j7041H25013
$$ 1020022 801147 780034 806049 882437 0 970368 769265 752224 825013
403.06946G62151H08136
$$ 762151 808136
399.21234G72303  $$checkpoint
##END=