##TITLE=Unknown
##JCAMP-DX= 5.00 $$From Command Line Converter 1.0
##DATA TYPE= NMR Spectrum
##DATA CLASS=  XYDATA

##ORIGIN= Exported from Command Line Converter 1.0
##OWNER= SVB
##$URL= http://wwwchem.uwimona.edu.jm:1104/software/jcampdx.html
##SPECTROMETER/DATA SYSTEM= NUTS EXPORT
##.OBSERVE FREQUENCY= 300.149506
##.OBSERVE NUCLEUS= ^1H
##INSTRUMENTAL PARAMETERS= 1H
##XUNITS= PPM
##YUNITS= ARBITRARY UNITS
##XFACTOR= 0.0000022785
##YFACTOR= 9.0230550000
##FIRSTX=   0.554733
##FIRSTY= 34317.000000
##LASTX=   2.833200
##NPOINTS= 2802
##MAXY= 9010536.000000
##MINY= -12519.000000
##DELTAX=   0.000813
##XYDATA= (X++(Y..Y))
243463C803L0j7n6n2K5J11j63J5J10R2m6k80R1K20Q1j47j5K5J5k0J97k16J61j0
252022C954J69j63j08P6p4M9J15j6j97J20m4K4q6J45M0J04j25j7O4M1l5N8l2j3
260580D049M6k3O6J16J64q0O4j56P2k64J57j40J13LO8J5j32J75j72J79j06O1q6
268817D189P8j34R7J86P9j0R9j21rJ51k26J64j18J45n5j21n8O9j7N7o8k3P6R0
277375D520LK4j9p5k8Q1q1rR3OJ31P3L2J94j24K2k6n5rJ17J9Q7J82J42j4k37n5
287013D994n5K6M9M4l6J3J02J9k19K2J4K2j10K42k7K60j6j16J58j71J92J51J14
295214E672K06J07Q45n78q94J35o8K5j35Q9Q0L1L8R1j45K12n6J62q1j2j5L9N5
303415E803k30J9k9L51j9J32p8M7r2p6j06p2Nq3L74n46P94o29L40j90P4JK7P6
$$ plain form
243463 3803 3833 3816 3760 3708 3733 3844 3681 3696 3806 3898 3852 3572 3663 3883 3964 3817 3802 3827 3842 3822 4019 3803 3964 3954
252022 3954 4123 3960 3852 3928 3854 3903 4018 4002 3805 3925 3881 3905 3819 3964 4004 4108 3983 3966 4030 4071 4036 4094 4062 4049
260580 4049 4095 4072 4138 4254 4418 4338 4402 4246 4318 4054 4211 4071 4184 4187 4255 4270 4138 4313 4141 4320 4214 4275 4189
268817 4189 4267 4133 4230 4416 4495 4485 4584 4463 4454 4605 4379 4543 4425 4570 4515 4394 4336 4405 4388 4445 4377 4354 4430 4520
277375 4520 4523 4547 4528 4453 4425 4506 4425 4416 4509 4515 4646 4719 4751 4945 4821 4843 4817 4762 4753 4870 4889 4976 5158 5300 5286 5049 4994
287013 4994 4939 4965 5014 5058 5022 5035 5137 5156 4937 4959 4973 4995 4885 5127 5100 5360 5344 5228 5386 5215 5407 5558 5672
295214 5672 5878 5985 6830 6252 5358 5493 5425 5450 5315 5404 5484 5515 5553 5644 5499 5711 5655 5817 5736 5724 5709 5748 5803
303415 5803 5573 5592 5563 5914 5895 6027 5949 5996 5904 5828 5722 5650 5655 5572 5946 5400 6194 5565 5905 5715 5789 5790 5817 5893
312017E893Mj2j25J31M1J8J15L7jJ73K67n20j14J44o6J83q2j89K40K3j14m2J63
320210F167n2Q6J17k63J26P7Ko5J07J22k34K05O3p0J4K3j2R9lp6M8P0L9j9Pl2
329491F546Q1J15o2K4K44R2j13J80o9mj2J84j48J30j15L8k55K78J7J36J37K1O1
337692G506j9n6O0J28J60q2J98p7O6R0k7J24OJ91k9o4j7J08J28l2J73Q0n8J48
346294H705J18QJ58R4j08J08l0J24J91o2K79o4J55J83K87J92K1l01J41J09R5M5
354130A0448P4mR1J43J73J01J68k48P2K95J1R7J22J80N1O8L8M00R1R7K52Q5J92
362331A2997N7L1K44o3L07N1L48J34k8L81K80K91L24L50M40l8K17K63O20K94N40
369819A8040N99M75K56Q21N26R93J312J467J200J148Q79R52R34J804J710J662
$$ plain form
312017 5893 5897 5885 5760 5891 5932 5950 6065 6102 6101 6274 6541 6021 5907 6051 5985 6168 6086 5897 6137 6160 6046 6004 6167
320210 6167 6115 6201 6318 6055 6181 6258 6260 6195 6302 6424 6190 6395 6458 6388 6402 6425 6413 6512 6509 6433 6481 6551 6590 6571 6578 6546
329491 6546 6627 6742 6680 6704 6948 7040 6927 7107 7038 7034 7022 7206 7058 7188 7073 7111 6856 7134 7151 7287 7424 7445 7506
337692 7506 7487 7431 7491 7619 7779 7697 7895 7818 7884 7974 7947 8071 8077 8268 8239 8175 8158 8266 8394 8362 8535 8615 8557 8705
346294 8705 8823 8831 8989 9083 8975 9083 9053 9177 9368 9306 9585 9521 9676 9859 10146 10338 10359 10058 10199 10308 10403 10448
354130 10448 10522 10518 10609 10752 10925 11026 11194 10946 11018 11313 11324 11421 11543 11723 11774 11842 11880 12280 12371 12468 12720 12805 12997
362331 12997 13054 13085 13329 13266 13573 13624 13972 14106 14078 14459 14739 15030 15354 15704 16144 16106 16323 16586 17206 17500 18040
369819 18040 18639 19114 19370 20191 20717 21710 23022 24489 25689 26837 27716 28668 29602 31406 33116 34778
375548C4778L454N165R078J1330J2093J0586M488q200k3045j0266k303m395l673
380206C9090j407J147K188J030P51j33o99P47K198K569K923M759K121J843O820
385542F5947N504O221J0910J5626K1229L5399R2927L1058j94925l9220j550K069
389844E1195k096k875L75n89m72K389K074J388L59j450k297J58j48j36m02K963
395537E0436L313k55P19N245N302M204k983j3185j5611r635o458j204J338q84
400552B0342k054l44j262j337r53j202j238o83l39k37m9J37m70m65j14k34j59
406603I339j25m23k59k28k16k49j26O0j6j22p9jj77j47k09j01l84j05k16j42m3
414126F031R3j65N9q1j03j36l2j77j1p8J35j85k9K6k05j15n6K23M7j3p0k1nK20
$$ plain form
375548 34778 38232 43397 52475 63805 75898 86484 90972 82772 59727 49461 47158 42763 39090
380206 39090 37683 38830 41018 42048 42799 42666 41967 42714 44912 47481 50404 55163 57284 59127 65947
385542 65947 71451 77672 88582 104208 125437 160836 253763 284821 89896 50676 49126 51195
389844 51195 49099 46224 46599 46010 45538 47927 50001 51389 51748 50298 48001 48159 48011 47875 47473 50436
395537 50436 53749 53494 54213 59458 64760 68964 65981 52796 37185 27550 21092 19888 21226 20342
400552 20342 18288 17944 16682 15345 14392 13190 11952 11269 10930 10693 10644 10781 10311 9846 9732 9498 9339
406603 9339 9214 8791 8532 8304 8088 7839 7713 7773 7757 7635 7556 7555 7378 7231 7022 6921 6537 6432 6216 6074 6031
414126 6031 6124 5959 6018 5937 5834 5698 5666 5489 5478 5400 5535 5350 5321 5347 5142 5027 4971 5194 5241 5228 5158 5137 5132 5352
422684E352n5R4j9M5J74k19O4j42m7J72J66q3j21j10KN9K4N2L3J37j10Jr3N6q5
431599E347J10m6k9N9J75j31P8r8O0J4oO9j48O9J82q7lr7J87r9m1j03M7O8J1L9
440880E627l82p2J20j54O9j44N5J8J8j53RJ09o0o7j5or0l4J1l2J4N8O0l42K07
449795D824o9K31l43o6j8K1L6R3n9J46j46P7j78Q7j41O3jK1N9l21L26m21M26n3
458397D594r2O6r8K28L7j85M6J80N6j12k5J52o0K00l6q4jJ52j59L05j56K15J1
466599E234L8j33K89j40R9m5j52J83q9J87J81k59J95q7MN3ql30N37k58Q4J78j23
474800E638J27K07j49K56L21k13J43k25K18M60k30o70r2n1l3J79l1p1o0J03LJ3
482636E843q1J17k0K34k28J34Q0O5Mj02K30P2N0j69r8J59jQ7K5j24r7JQ9M5%j14
$$ plain form
422684 5352 5297 5391 5372 5417 5591 5372 5436 5294 5247 5419 5585 5502 5381 5271 5273 5332 5356 5408 5441 5578 5468 5469 5376 5432 5347
431599 5347 5457 5411 5382 5441 5616 5485 5563 5465 5525 5539 5533 5602 5454 5523 5705 5618 5615 5518 5705 5606 5565 5462 5509 5577 5588 5627
440880 5627 5245 5173 5293 5139 5208 5064 5119 5137 5155 5002 5011 5120 5060 4993 4978 4972 4882 4848 4859 4827 4841 4899 4959 4617 4824
449795 4824 4755 4986 4643 4577 4559 4580 4616 4709 4650 4796 4650 4727 4549 4636 4495 4558 4557 4578 4637 4316 4642 4221 4647 4594
458397 4594 4502 4568 4470 4698 4735 4550 4596 4776 4832 4720 4695 4847 4787 4987 4951 4867 4866 5018 4859 5164 5008 5223 5234
466599 5234 5272 5139 5428 5288 5387 5342 5190 5373 5284 5471 5652 5393 5588 5501 5505 5558 5550 5220 5757 5499 5583 5761 5638
474800 5638 5765 5972 5823 6079 6400 6187 6330 6105 6323 6783 6553 5883 5791 5740 5707 5886 5855 5784 5724 5827 5830 5843
482636 5843 5762 5879 5859 6093 5865 5999 6079 6144 6148 6046 6276 6348 6398 6229 6131 6290 6289 6376 6401 6277 6180 6181 6270 6315 6315 6201
491916F201j69P4k4L0k3j41R3jJ17l6j07Q7N0J6j54J96j40K5m2J28J00n5K2Q1
500519F328j57L7J72K6J70J05j14N9j34m6J15J07K4J51%L0j59J11qN7L9L3l0j2
509077F904J18P8P5j16J93J2R8O8J23O9K26J35J60r9N9R0J07l1J72J15J63K23
516913H942L85N18R01M315m434j834K58Q8K0K39L59J5L82pJ33q5L57J67J52K46
524087A1117Q0oK43J33K29M53L38R39L792j117l767J2J54J46j4J98Q1M9P9l4l47
531565A2758l4K20J27K80o5K64K05K87OJ71K68L61K59L89P76O43M3n46R9Q8J60
539053A6759J63K29O75K65J026Q02m70K40N17l6M77O97O07O18R27N1J054R45P02
545861B6248J111J380K169K080M63J263J984J627J713J31L9Q17O37J58K434L462
$$ plain form
491916 6201 6032 6106 6082 6112 6089 5948 6041 6040 6157 6121 6014 6101 6151 6167 6013 6209 6069 6094 6052 6180 6280 6225 6247 6328
500519 6328 6171 6208 6380 6406 6576 6681 6567 6626 6492 6446 6561 6668 6692 6843 6843 6873 6714 6825 6817 6874 6913 6946 6916 6904
509077 6904 7022 7100 7175 7059 7252 7264 7362 7430 7553 7622 7848 7983 8143 8044 8103 8193 8300 8269 8441 8556 8719 8942
516913 8942 9327 9845 10746 15061 10627 8793 9051 9139 9159 9398 9757 9772 10154 10147 10280 10195 10552 10719 10871 11117
524087 11117 11197 11191 11434 11567 11796 12249 12587 13526 17318 16201 12434 12446 12600 12746 12732 12930 13011 13060 13139 13105 12758
531565 12758 12724 12944 13071 13351 13286 13550 13755 14042 14048 14219 14487 14848 15107 15496 16272 16915 16958 16412 16511 16599 16759
539053 16759 16922 17151 17826 18091 19117 19919 19449 19689 20206 20170 20647 21344 21951 22569 23496 23547 24601 25546 26248
545861 26248 27359 28739 30908 32988 33451 34714 36698 38325 40038 40169 40208 41025 41662 41820 44254 47716
551547D7716J774P77J298L388K502P59J902N069Q116J3203J8020R447p68J519
556570A14722L12o396K701j9K771P366J1464J1174R281K761L407O659K3002K1376
561541B10581m551k066J1322L1814J4686k2842k2940k4397j6015r493n202p907
565842A52990j6045j2457r434r167j0857r9L049k163J161N98K079j080m700j796
570858I2079l002l843l571q783j0615n422j757j91J770J005R21M595O779j090
575837F8875n775k855j10m139k434m54n091n468p65k487l436r63m29q03k364k106
581566B9196j374r04j318m74O30J228q97j040q49k65j44m98j075J32J007R47m93
587617B3809M76l12j582k017j751j133j74p04j382o42n10l71k63n29k32L7j01
$$ plain form
551547 47716 49490 50267 51565 54953 57455 58214 60116 65185 73301 86504 104524 113971 113203 114722
556570 114722 115034 108638 111339 111320 114091 121457 132921 144095 153376 156137 159544 166203 189205 210581
561541 210581 206030 203964 215286 247100 261786 238944 216004 191607 175592 166099 160897 152990
565842 152990 136945 124488 115054 105887 95030 94931 97980 95817 96978 97576 99655 98575 93875 92079
570858 92079 89077 85234 81663 72880 62265 56843 55086 54895 56665 57670 58591 63186 69965 68875
575837 68875 63100 60245 60135 55996 53562 53108 48017 42549 41784 39297 35861 34898 34469 33666 31302 29196
581566 29196 27822 26918 25600 25126 25756 26984 26087 25047 24198 23933 23789 23291 22216 22348 23355 24302 23809
587617 23809 24285 23973 22391 20374 18623 17490 17316 16612 15230 14588 14078 13707 13444 12915 12683 12720 12619
593668A2619n03j82m64j56j37j7k08J82M27M96R59j42j382m19m94j66m31O5M0
600476A0087m27k05J12r0m03J17j89k75p8j48m0K78M1L22k05m26k42j6j11J08
607607H210kj26pj13M9o8j06j20p5n1j12K21k90J20k24kJ22p5K7k49j14q9M6O4
616165G036k32k57j53OmP8m69J33L2k86P5j84n07L09J5k82K4Q8j92N7k1l88K52
624402E130r3l75K9j48oJ94lk37r9J07q3K4o0k01J06r2j96o1N5j16lnj09L1j6
633325C773o6k2j5O1j14K4k26K40k29K43m63L90m89L44j19J17j97J13J46J09J4
640804C634n6m4q3J49k45P3m5J75n6L3K6j09K31P7lJ23q2N7p2L3j22p1J0J36J83
649719C952K6J3l1J30o6K55k29J98p5l7J24J87o1oq0Q2J07Q9K22j3Q4K42r0Q6
$$ plain form
593668 12619 12116 11934 11470 11314 11177 11160 10952 11134 11561 12057 13016 12874 11492 11073 10579 10413 9982 10047 10087
600476 10087 9660 9455 9567 9477 9074 9191 9002 8727 8649 8501 8461 8739 8780 9102 8897 8471 8229 8213 8102 8210
607607 8210 8208 8082 8075 7962 8011 7943 7837 7717 7642 7591 7479 7700 7410 7530 7306 7304 7426 7351 7378 7129 7015 6926 6972 7036
616165 7036 6804 6547 6394 6400 6396 6474 6005 6138 6170 5884 5959 5775 5268 5577 5592 5310 5334 5422 5230 5287 5266 4878 5130
624402 5130 5037 4662 4691 4543 4537 4731 4728 4491 4392 4499 4416 4440 4380 4179 4285 4193 3997 3936 3991 3875 3872 3867 3758 3789 3773
633325 3773 3707 3685 3670 3731 3617 3641 3415 3655 3426 3669 3206 3596 3107 3451 3332 3449 3252 3365 3511 3620 3634
640804 3634 3578 3534 3451 3600 3355 3428 3383 3558 3502 3535 3561 3452 3683 3760 3757 3880 3798 3855 3783 3816 3694 3623 3633 3769 3952
649719 3952 3978 3991 3960 4090 4024 4279 4050 4248 4173 4136 4260 4447 4386 4380 4300 4382 4489 4578 4800 4787 4871 5113 5023 5109
658321E109l8L4kK64J59k4Q3K22K2P3L83K82L71R5J88L14K62L84L33J37K54O41
666166I546J417K170K938J493P57k149k995j073P0Q06J227k75j249p65Q9O15O03
672216A3225O54Q61J043K71R6R42J204J527J738J951J230Q03J625M001N199L572
677946C9942P11j313l740k812Nj263k228j707j270m73n31K00L25o33M09J912M63
683996B7997r4M55J131J533J301K255K313Q01R34J517K130L638K666M52k42O65
689734D9452k378o545m932j966p51n31l87j096j892j548k60k41k88l62j76N15
695428B6614r9j59M50J183J597Q82m65n93j79O13K814J337p47j559l534l599j696
701514B2860r64p98k083j402l51j214k01j49k080k47R57r35M51p77q85k043Q10
$$ plain form
658321 5109 5071 5105 5103 5367 5526 5502 5585 5807 5829 5902 6285 6567 6938 7033 7221 7535 7797 8181 8514 8651 8905 9546
666166 9546 10963 13133 16071 17564 18321 16172 13177 12104 12174 12980 14207 13932 12683 11918 12007 12622 13225
672216 13225 13879 14740 15783 16054 16150 17092 18296 19823 21561 23512 24742 25545 27170 31171 36370 39942
677946 39942 40653 39340 35600 32788 32793 31530 29302 27595 26325 25852 25321 25521 25846 25213 25622 27534 27997
683996 27997 27903 28358 29489 31022 32323 34578 36891 37692 38626 40143 42273 45911 48577 49029 48787 49452
689734 49452 47074 40529 35597 33631 32880 32349 31962 30866 28974 27426 27166 26925 26637 26275 26099 26614
695428 26614 26515 26356 26806 27989 29586 30468 30003 29410 29231 29844 32658 33995 33248 31689 28155 24556 22860
701514 22860 21896 21098 19015 17613 17262 16048 15847 15698 13618 13371 14328 13393 13844 13067 12182 10139 10949
707564A0949K62r03P87J67j013L72J14L31N31j310j439j366o23k50k85O8J2m28
714016E976l78n86m56l6j67j76j95j37l90J23j06m0j81R0q5q0K7j48K8r1j52j33
721860B707K0j15j47K1M1J6j80N7j82j6nj70q0J35r0K2j05k7N3j20R0j99J73j71
730418A728J48k15M7l0l8J5j89L1n2J41r8j06k8p6k7k1k7o6M1o9m3J17K0j13K6
739334A116N2l9q4o0J26p2k02K64j21n9m4n6j00L9K8p5K4j45j6m7p0J35l3j02
747892D59j22K29j46r8J04O4q2r4L0j2K7m1L4j96o9J82o5m7m7J30j73L8m5n6j15
756851a11J41k0j17J27Mj53m2Q3k5J50j55R8k47L1K28j08j38J54R1m5j36j27K62
765052e5l19J59O9j77j3j45J90J52j76n4j4j54L32P9l14j44K84j30Q9n3k71J09
$$ plain form
707564 10949 11211 10308 11095 11262 10249 10621 10735 11066 11597 10287 8848 7482 6859 6609 6324 6392 6404 5976
714016 5976 5598 5012 4556 4520 4353 4177 3982 3845 3455 3578 3472 3432 3251 3341 3256 3176 3203 3055 3083 2992 2840 2707
721860 2707 2727 2612 2465 2486 2527 2543 2363 2420 2238 2222 2217 2047 1967 2102 2012 2034 1929 1902 1955 1835 1925 1726 1899 1728
730418 1728 1876 1661 1708 1678 1640 1655 1466 1497 1445 1586 1488 1382 1354 1278 1251 1230 1203 1137 1178 1109 1066 1183 1203 1090 1116
739334 1116 1168 1129 1045 985 1111 1039 837 1101 980 921 877 821 721 760 788 713 737 592 576 529 459 594 561 459
747892 459 337 566 420 322 426 490 408 314 344 332 359 318 352 156 87 269 204 157 110 240 67 105 60 4 -111
756851 -111 30 10 -107 20 24 -129 -171 -88 -113 37 -118 -20 -267 -236 -8 -116 -254 -100 -9 -54 -190 -317 -55
765052 -55 -374 -215 -146 -323 -336 -481 -291 -139 -315 -369 -383 -537 -205 -126 -440 -584 -300 -430 -341 -394 -665 -556
772897e56L11k54j80J83J97k84j42K53J43l77o6M41j41l79K10K45j85K6p7o1J68
780419e25qN0k68J30P6j60J12o0j29M9J9J1j60M27n79L32M8l21L95k21N5J13m9
788621f63q5k3P5O8j91K15j50J54j5l1j09p4K13r6J42j20L1n5j11m3L8j56m7J76
797179h57k3K4m6p5l9R2J9M3j69O7j83J23L04J58O1j9j08k62p1j86k0Q8l5P0P5
806094i69pq7J69o1r9l8l3J78J8j01J29J3j74p2q0J02K53K51J90K96P0k57j10
814295d19j88j45j51p2k7j4J42p7N8n5N3m6P6j58j9J4J04k14J69L6l6j8J74k17
822897a030K56N4K44J71p4K7j49k26j68q4o7Q3J92Nj60M3L8r5J53j22j31J67k
831099h75P6k12R4J28N6J0J35k94J53n9M3n2R3j22Q7KJ32j50o7PQ6K1P5n8n8r5
$$ plain form
772897 -556 -245 -499 -679 -496 -299 -583 -725 -472 -329 -706 -772 -331 -472 -851 -641 -396 -581 -555 -632 -693 -525
780419 -525 -533 -483 -751 -621 -545 -705 -593 -653 -782 -733 -714 -703 -863 -436 -1015 -683 -635 -956 -561 -782 -727 -614 -663
788621 -663 -748 -771 -696 -628 -819 -604 -754 -600 -615 -646 -755 -829 -616 -712 -570 -690 -659 -714 -825 -868 -830 -986 -1033 -857
797179 -857 -880 -856 -902 -977 -1016 -924 -905 -862 -1031 -964 -1147 -1024 -720 -562 -501 -520 -628 -890 -961 -1147 -1167 -1079 -1114 -1044 -969
806094 -969 -976 -1063 -894 -955 -1054 -1092 -1125 -947 -929 -1030 -901 -888 -1062 -1134 -1214 -1112 -859 -608 -418 -122 -52 -309 -419
814295 -419 -607 -752 -903 -975 -1002 -1016 -874 -951 -893 -948 -895 -941 -865 -1023 -1042 -1028 -924 -1138 -969 -933 -969 -987 -813 -1030
822897 -1030 -774 -720 -476 -305 -379 -352 -501 -727 -895 -979 -1046 -963 -771 -766 -926 -883 -845 -940 -787 -909 -1040 -873 -875
831099 -875 -799 -1011 -917 -789 -733 -723 -588 -882 -729 -788 -745 -797 -704 -826 -739 -737 -605 -755 -822 -815 -729 -708 -633 -691 -749 -844
840371h44J25q3J08R7k19J31J39k3M20M1L02P32J604n53K644l532O14k021r6J25
847501b89R1j14O7q1J33J72r7jJ09o1R0n3o9l9J49r2J67j78l09K57j071N61n22
855738a180K63L08j20P0J16r6J68K6j65P4K04k79L52q5p1P4j76R9Nj31K14m6o3
863939d39R0m6K02K41J45M21oO77j082j10m30k25N3o0p8J64K13r1l34K72J7j01
871783e07K49j81j13m1k8J13P7R7j74n8J26R3r1P7j91J89j72M5p7J17J29J25k81
879985d77L33j18R6k08K4K53Q1J09j20L8j44K96n1o2p3o37M15j143M62k2L83M41
887864a24n5O7j11J33%l6N3Np9K35j47pj7J37j9k5J36n2N2J5P7l3K01l7J13J0
897145D92O1N2L59j96J12N0oM99M55p64k23K52J49M10M85j6O37q76j73m32Q3l0
$$ plain form
840371 -844 -719 -802 -694 -597 -816 -685 -546 -569 -149 -108 194 926 2530 1977 4621 1089 1703 -318 -414 -289
847501 -289 -198 -312 -245 -326 -193 -21 -118 -119 -10 -71 19 -34 -103 -142 7 -85 82 -96 -405 -148 -1219 -658 -1180
855738 -1180 -917 -609 -729 -659 -543 -639 -471 -445 -610 -536 -332 -611 -259 -344 -415 -341 -517 -418 -413 -544 -330 -376 -439
863939 -439 -349 -395 -193 48 193 614 608 1285 203 93 -337 -562 -509 -569 -647 -483 -270 -361 -695 -423 -406 -507
871783 -507 -258 -439 -552 -593 -621 -508 -431 -334 -508 -566 -440 -347 -438 -361 -552 -363 -535 -490 -567 -450 -321 -196 -477
879985 -477 -144 -262 -166 -374 -350 -97 -16 93 -27 11 -133 163 112 50 -23 -660 -245 -1388 -926 -948 -565 -124
887864 -124 -179 -112 -223 -90 -90 -126 -73 -68 -147 88 -59 -66 -83 54 35 10 146 94 146 161 238 205 406 369 482 492
897145 492 553 605 964 768 880 930 924 1423 1878 1114 891 1143 1292 1702 2187 2171 2808 1932 1759 1327 1410 1380
904981A380l6J15p5J76L90k03K88p66j59k21j04j1J89m6J42l2J8J06L4J61j03
912512A243K29m6j8L6j0N2N2P7J60O9P47K551l455K51m2JK8o4K4J48n4J70OK55
921070B410l2P9n2m4L8j57K36j74M1m0m7K5J41J59p5L3J69nP4M50J94J37l61J39
929628C338j06k08K40L75M66P4P57M35Q23J227J369K313J313L019M93L57J371
935679A7656Q5L236N460J5660K3395M6460J32163L35669j24938N43766p11947
939623B86665J70613l97725j4850n247j886k954k178J542k557K345m366m74k702
944281B6226l81j43l16J55K11L46O13l31k93j332o01j279r13q83m60m69p39n29
950689A8882m57o97l75m93m46m97j27o25m29l10l31n49k08l95K9p46j77m98Q1
$$ plain form
904981 1380 1344 1459 1384 1560 1950 1747 2035 1269 1110 889 785 774 963 917 1059 1027 1045 1151 1185 1346 1243
912512 1243 1472 1426 1408 1444 1434 1486 1538 1615 1775 1844 2591 5142 1687 1938 1896 1897 1925 1861 1885 2033 1979 2149 2155 2410
921070 2410 2378 2457 2405 2361 2399 2242 2478 2304 2345 2305 2258 2283 2424 2583 2508 2541 2710 2705 2779 3229 3423 3560 3199 3338
929628 3338 3232 3024 3264 3639 4105 4179 4936 5371 6194 7421 8790 11103 12416 15435 15928 16285 17656
935679 17656 17741 20977 26437 42097 65492 111952 244115 579784 454846 998612 286665
939623 286665 457278 59553 44703 39456 37570 34616 32438 33980 31423 33768 29402 28928 26226
944281 26226 25845 25702 25386 25541 25752 26098 26711 26380 26087 24755 24154 22875 21962 21079 20619 20150 19411 18882
950689 18882 18425 17728 17353 16860 16414 15917 15790 15165 14736 14426 14095 13546 13338 12943 12972 12226 12049 11551 11632
957498A1632n2l86q1j94l09r8j93j71p5p1l1j14l08m79m37l92k86k72l89n2k37
964976G005o5k30J87j40J3J26q0On0M7K8k22K02k32Pl39k6j03J47L47O9J02n6
973178F743k9L9JR4P8Q0L2j81k25j45k57PJ3j01j42q2L5J8l1O0M8Rj7j34K26K1
982458F160J29R2K8l4k3r0j44J62j66k4q1l6J9j81L8n1J3j09mj2pN0K15L57%K0
991731F321j40o36o9o19Np1J39k25J58m53J25J64o9On9p4K5l26N1k61J44q4L8
999976D090j71j35k55J08p3J45j23l3PL7Nj05j75J45k35R6j68j60L6J36j7M1l52
1008177B844J34j2P4M3j01k1J45j70Q1m05N4l9q5M6n9L2%M5M8j88O0L3Q2QK42J11
1017449C002N27Q4l01l33J55k87j65%q2L21M0j19R2k4J29l88K99j060M11k58J77
$$ plain form
957498 11632 11580 11194 11113 10919 10610 10512 10319 10148 10073 10002 9971 9857 9549 9070 8633 8241 7955 7683 7294 7242 7005
964976 7005 6940 6710 6897 6757 6770 6896 6816 6822 6772 6819 6847 6625 6827 6595 6602 6263 6237 6134 6281 6628 6697 6799 6743
973178 6743 6714 6753 6754 6848 6926 7006 7038 6857 6632 6487 6230 6237 6250 6149 6007 5925 5960 5978 5947 6007 6055 6064 6047 5913 6139 6160
982458 6160 6289 6381 6409 6375 6352 6262 6118 6280 6114 6090 6009 5973 5992 5811 5849 5798 5811 5702 5698 5686 5679 5729 5944 6301 6301 6321
991731 6321 6181 5545 5476 4857 4862 4791 4930 4705 4863 4410 4535 4699 4630 4636 4577 4503 4528 4202 4253 3992 4136 4052 4090
999976 4090 3919 3784 3529 3637 3564 3709 3586 3553 3560 3597 3602 3497 3322 3467 3232 3328 3160 3000 3036 3172 3155 3196 2844
1008177 2844 2978 2966 3040 3083 2982 2961 3106 2936 3017 2612 2666 2627 2542 2588 2529 2561 2561 2606 2654 2466 2526 2559 2641 2649 2891 3002
1017449 3002 3529 3613 3312 2979 3134 2847 2682 2682 2600 2921 2961 2842 2934 2910 3039 2651 2950 1890 2301 2043 2220
1024972B220m7J46n5J72o7J39Q9K78J0K52j2K04M62J23N17J121k76K448l471R56
1032102E209k297J42k92j04j10J22j30NM5mJ83k13L7k6q2R1L6n5J16q8L5K28nJ1
1040661B854j32l08k31J12j29Q3k4Mk05J26j98Rp8K15p9J87Q7K8L6J98K19L16N01
1048862C591J58M04L96N32L37O65J668L825Q595J7839K1471K6833J4195m037j1635
1054234H4837k9814j9414j5174o378j791o06l06j54q3J39J08Q37O69P79M49K81
1059928A4379j4K1M74N31J705M017P969J3288J9027K7156K5977K7127J3192n225
1064943A49624k1029k9534l4466k0287j3886m944j283r11l32o37o47o72j326n68
1069914A9102o85m40m40Rn0n0J04M45J103K899O815J5144J7991K4131J3182l433
$$ plain form
1024972 2220 2173 2319 2264 2436 2369 2508 2597 2875 2885 3137 3125 3329 3791 3914 4431 5552 5276 7724 4253 5209
1032102 5209 2912 3054 2762 2658 2548 2670 2540 2545 2590 2586 2769 2556 2593 2567 2485 2576 2612 2557 2673 2585 2620 2848 2843 2854
1040661 2854 2722 2414 2183 2295 2166 2249 2225 2229 2024 2150 1952 1961 1883 2098 2019 2206 2293 2321 2357 2555 2774 3090 3591
1048862 3591 3749 4153 4549 5081 5418 6083 7751 11576 20171 38010 59481 86314 100509 96472 84837
1054234 84837 55023 35609 20435 14057 12266 11660 11354 11200 11117 11256 11364 12201 12870 13649 14098 14379
1059928 14379 14365 14386 14860 15391 17096 21113 29082 42370 61397 88553 114530 141657 154849 149624
1064943 149624 128595 99061 64595 44308 30422 25478 24195 23284 22952 22315 21668 20996 19670 19102
1069914 19102 18417 17977 17537 17546 17496 17446 17550 17995 19098 21997 28812 43956 61947 86078 99260 95827
1075651I5827q794k6962j7810j4534o684j952j302q78n03r02n14n84n23p89j35
1080988A2961r0k30m38j29n4r4k24k06M3o01l85p7j39m85n1r3l75M4l09j99k38
1088511H631j59j9k90m6j99l19k98K78j66n16M79l35K4l16K33o20L95j59k44K00
1095633F554k54N1j44j54o0J3R4j6o6k12O6N2q0Kl6j29m5j29m6m9oj73l7J31K6
1104556E353J23r0r1Q5J8j04K3j72j28m6J21l1j78J66r3P9k8j05JK33m9k52j10
1112793D725N5J6j32l3J85n2l49OL94k48p8R6r7nk52N8k36j6m4J63k64P2j06J06
1121351C964j57J22j38O9p9j62K5r0j2O9k02O7J9j65L2mJ7j07j29q5o8J0j97N5
1129910B854o2l5q8k7L5K0k9r1K6j67J24q4J3j08J8m8O2M6j01m6J40l15J31k26
$$ plain form
1075651 95827 87033 60071 42261 27727 21043 19091 17789 16911 16408 15506 14992 14408 13885 13096 12961
1080988 12961 12871 12641 12203 12074 12020 11926 11702 11496 11539 10938 10553 10476 10337 9852 9801 9708 9333 9377 9068 8869 8631
1088511 8631 8472 8453 8163 8117 7918 7599 7301 7579 7413 6897 7376 7041 7065 6749 6982 6362 6757 6598 6354 6554
1095633 6554 6300 6351 6207 6053 5993 6006 6100 6084 6018 5806 5872 5924 5844 5846 5810 5681 5636 5507 5461 5412 5406 5233 5196 5327 5353
1104556 5353 5476 5386 5295 5380 5398 5294 5317 5145 5017 4971 5092 5061 4883 5049 4956 5035 5007 4902 4903 5136 5087 4835 4725
1112793 4725 4780 4796 4664 4631 4816 4764 4415 4421 4815 4567 4489 4585 4488 4483 4231 4289 4053 4037 3993 4156 3892 3964 3858 3964
1121351 3964 3807 3929 3791 3860 3781 3619 3644 3554 3542 3611 3409 3476 3495 3330 3362 3358 3375 3268 3139 3054 2986 2996 2799 2854
1129910 2854 2792 2757 2669 2642 2677 2697 2668 2577 2603 2436 2560 2476 2489 2381 2399 2351 2413 2459 2358 2312 2452 2137 2268 2042
1138468B042K7j57KJ37j04n3M1n9L4R5k0%K11N7J15J18k69j30k8j14Lk8o9J93j60
1147392A884j4O2j01P4l11K42n9k8j88J58J04p6k0K5K03j7mJ32K35K04j26j04J25
1155628B400j47k91j66l7m9J58j51j80J45L0Q4j27J1j01J17j9j60N5o1j50J39J7
1163472A517k06J95J30J7J89Rj2j39K4n4j0l36J57q1n3J94m1j18M59n57J00K68
1171317A652o36m06R08r84P12K33p11O86l74j38M42j51k44O3j88R8K04n5K7o5M4
1178839A117K7j4n6L0j92R8j55p1J15M9m2O0l2M8j2Np6n9PK1p4j09K2J1N4j75O7
1188477F64j42K76k6r2J24p5k9R3j24j2n5J31p5J7lO4r8J58j72n3O3o3L9n7J80
1197392G33o0j87J48N7M2j15m9O1O2j4k8j47J68r8M3l4J37k00K1J33r7j7k0Q0n2
$$ plain form
1138468 2042 2069 1912 1914 2051 1947 1894 1935 1876 1910 2005 1985 1985 2196 2253 2368 2486 2217 2087 2059 1945 1948 1920 1851 2044 1884
1147392 1884 1870 1932 1831 1905 1594 1836 1777 1749 1561 1719 1823 1747 1727 1752 1955 1938 1934 2066 2301 2505 2379 2275 2400
1155628 2400 2253 1962 1796 1759 1710 1868 1717 1537 1682 1712 1796 1669 1680 1579 1696 1677 1517 1572 1511 1361 1500 1517
1163472 1517 1311 1506 1636 1653 1842 1851 1839 1700 1724 1670 1660 1324 1481 1400 1347 1541 1500 1382 1841 1284 1384 1652
1171317 1652 1016 610 1518 534 1246 1479 768 1454 1080 942 1384 1233 989 1052 864 962 1166 1111 1138 1073 1117
1178839 1117 1144 1130 1074 1104 912 1010 855 784 899 948 906 966 934 982 970 975 899 840 847 868 794 685 707 718 772 597 664
1188477 664 522 798 772 680 804 729 700 793 669 657 602 733 658 675 672 736 638 796 624 571 634 571 610 553 733
1197392 733 673 486 634 691 733 618 569 630 692 678 650 503 671 573 616 582 719 519 540 673 576 559 539 619 567
1206308E67K5r4J04k5k8OMK5N7N6jj45K09k11J51j55j7J07j33L4Np2O4p2M7J24
1215580F32R9j55r6L0J3L0m1j04N7j11K04p3r8R8j15J36j34K05m5q0O0j57J07n4
1224182D08J6l3R2j40on6K15rj06L7J1p0K23j41M1o7j10O9k3q8Rj7qK06l8o8Nj24
1234177B28J46r6M4k8o7R3L3o6J37M4j14K1m0J64q9L9KL3k35J97k36L23l34R0o6
1243092B23J17
$$ plain form
1206308 567 592 498 602 577 549 555 559 584 641 697 696 551 760 549 700 545 528 635 502 536 541 469 533 461 508 632
1215580 632 731 576 480 510 523 553 512 408 465 354 558 485 387 485 370 506 372 577 532 452 512 355 462 408
1224182 408 424 391 483 343 337 281 496 487 381 418 429 359 582 441 482 415 305 374 351 263 272 255 247 453 415 347 352 228
1234177 228 374 278 322 294 227 320 353 287 424 468 354 375 335 499 410 449 451 484 249 446 210 533 199 289 223
1243092 223 340
##END=
