##TITLE= S#334376
##JCAMP-DX= 5.00 $$ JEOL NMR v1.10
##DATA TYPE= NMR SPECTRUM
##DATA CLASS= NTUPLES
##NUM DIM= 1
##ORIGIN= DELTA_NMR
##OWNER= organic
##SPECTROMETER/DATA SYSTEM= DELTA_NMR
##.OBSERVE FREQUENCY= 3.00529655924288E+02
##.OBSERVE NUCLEUS= ^1H
##.DELAY= (2.194E+02,2.194E+02)
##.ACQUISITION MODE= SIMULTANEOUS
##.FIELD= 7.0586013
##.FILTER WIDTH= 1.81675738660864
##.ACQUISITION TIME= 3.6339712
##.SPINNING RATE= 13
##.OBSERVE 90= 9.6
##NTUPLES= NMR SPECTRUM
##VAR NAME= FREQUENCY,    SPECTRUM/REAL, SPECTRUM/IMAG, PAGE NUMBER
##SYMBOL=   X,            R,             I,             N
##VAR TYPE= INDEPENDENT,  DEPENDENT,     DEPENDENT,     PAGE
##VAR FORM= AFFN,         ASDF,          ASDF,          AFFN
##VAR DIM=  16384, 16384, 16384, 2
##UNITS= PPM,     ARBITRARY UNITS, ARBITRARY UNITS, 
##FIRST=  1.2501033903057E+01, -1.05868668152423E+01, -3.05241452498909, 1
##LAST=  -2.50011824950436, -9.62958978982148, -5.29430900657194, 2
##FACTOR=  9.1565355261926E-04, 6.00846249884387E-04, 6.00846249884387E-04, 1
##PAGE= N=1
##DATA TABLE=(X++(R..R)), XYDATA
$$ [...]
6986b3012644j583020l21115Q3541O22283l06084j172375J129350l63708J57950l73192
6976b5139014N70537q68603m7487K63750J15361K89723k30755J55143q3439j27618R78793
6965b4123609m59358q4882l20068j28472m43373L89224p57109R53057J7587l71823k04178
6954b5533004P69735k28871O60923m02094k66560q47138Q75173Q9171l48773r84127L00319
6943b5915246J110166K50386l04736n3507j04501j026985P57418J74111N42190j270247
6933b5840951n0208j0418P37256N20127r5107n63626m93370m19523O64119N91303n91760
6922b5552158R070O68809o0704P12642J043726j535414P34920l66025k3026L41870q18277
6911b4844567r36917Q47692o68569p76278O56185M67275j84370M34527q98894K61802
$$ y = [-23012644, -24595664, -24916779, -24833238, -24210955, -24517039, -25689414, -24560064, -24923772, -24765822, -25139014, -24568477, -25437080, -25484567, -25220817, -25105456, -24815733, -25046488, -24891345, -24974784, -25102402, -24123609, -24582967, -24667849, -24987917, -25116389, -25559762, -25170538, -25927647, -24974590, -24957003, -25328826, -25533004, -24763269, -24992140, -24331217, -24733311, -24999871, -25847009, -24971836, -24882665, -25231438, -26215565, -25915246, -24805080, -24554694, -24859430, -24912937, -25017438, -26044423, -25287005, -25112894, -24570704, -25840951, -25891159, -25901577, -25164321, -24644194, -24739301, -25302927, -25796297, -26215820, -25551701, -24960398, -25552158, -25543088, -24874279, -24934983, -24222341, -23178615, -24714029, -23979109, -24345134, -24368160, -24026290, -24844567, -25781484, -24933792, -25602361, -26378639, -25722454, -25255179, -25439549, -25005022, -25903916, -25642114]
6901b5642114Q55680K08243j273609l5015m09253J596273R36326j170750k5754O6971
6891b4893002k189466J662317k59753P80820j57132j15660n4680Q1832l95348J69440
6881b5370632n05016N29389k39389O78564K67152j77287L82049q03370q4721l8898n83440
6870b5945599P76543L84168Q6151j465977M30338O14210j057338P70238J53411K18319
6860b5035536P31950p89358q03228N95916o66734o6346m8837J44899J003369J61825n64554
6849b5336634j075871Q16739m83901m37857J234989o78294q2737P29218o92098l52623
6839b6359069J279250L41444o02319M61334N80993m43269l34704M79308o96595J8127
6829b5275500J50859l13531J264616R9040n54345M18490r15491K0710r88834Q39860J27224
$$ y = [-25642114, -24786434, -24578191, -25851800, -25886815, -26296068, -24699795, -23763469, -24934219, -24959973, -24893002, -27082468, -25420151, -25679904, -24899084, -25056216, -25171876, -25226556, -25144724, -25540072, -25370632, -25875648, -25346259, -25585648, -24907084, -24639932, -24817219, -24435170, -25238540, -25323261, -25362159, -25945599, -25169056, -24784888, -24698737, -26164714, -25734376, -25120166, -26177504, -25407266, -25253855, -25035536, -24303586, -25092944, -25896172, -25300256, -25966990, -26033336, -26082173, -25937274, -24933905, -24772080, -25336634, -26412505, -25595766, -26079667, -26517524, -25282535, -25960829, -26043566, -25314348, -26006446, -26359069, -25079819, -24738375, -25340694, -24879360, -24298367, -24741636, -25076340, -24597032, -25293627, -25275500, -25124641, -25438172, -24173556, -24074516, -24628861, -24210371, -25125862, -25105152, -26093986, -25254126, -25126902]
6818b5126902l04036P46401m94776p85226k50487L54892J155847M01827j159249M64920
6808b4996789k2026l74334K76956Q5947k25440M93948J6540M27020j95205j660890K69221
6797b5905052l7173J008715p79384J23159R60503l31412j524797J86902M79551N24824
6787b5294164q79140J32527J144674k29246K40308m75513n76207J322871j114073N04192
6777b5223771n05968M29197Q5650P84693j914793m68435O6838Q37125P86192O41939r09276
6766b5390609M67024j092501J125178J081137m26479j14831p09475n95416J82413L19777
6756b5153782n52329L19377M42692o48356l7516L53303l0055k63776o48603O87188N44759
6745b4987098j04614l79080N74887p43679J74241N57740n80882m57053j42736J004750
$$ y = [-25126902, -25430938, -24684537, -25179313, -25964539, -26215026, -25860134, -24704287, -24302460, -25461709, -24996789, -25018815, -25393149, -25116193, -25030246, -25255686, -24761738, -24745198, -24318178, -24513383, -26174273, -25905052, -25942225, -24933510, -25712894, -25589735, -24629232, -24960644, -26485441, -26298539, -25818988, -25294164, -26173304, -26040777, -24896103, -25125349, -24885041, -25360554, -25936761, -24613890, -25727963, -25223771, -25729739, -25300542, -25214892, -24430199, -26344992, -26813427, -26746589, -25909464, -25123272, -24481333, -25390609, -24923585, -26016086, -24890908, -23809771, -24236250, -24351081, -25060556, -25655972, -25473559, -25153782, -25706111, -25386734, -24944042, -25592398, -25629914, -25276611, -25306666, -25570442, -26219045, -25531857, -24987098, -25091712, -25470792, -24895905, -25639584, -25465343, -24907603, -25488485, -25945538, -26088274, -25083524]
6735b5083524m21245j95326j80113P21127M16874m46890O22745J32850j544159N77655
6725b5400006n8647R54330j329736O08123j7369J62657r34685Q02989j26460l68905L87666
6714b5320043m43544j00989K03834K6704O29722L60333o49693l16827j30810J73256o53733
6703b6221790l062161L927993J668313j149192o29717j361029M34510O63383R15082k75188
6693b5089796j01470J34975m21743N84543J97483n37938l74712r0338P36436r93489
6683b5956049J221402r42336O69250j51199m00409J008142j220386J097877o98104J53544
6673b5218268L1115j46872Q9410m06936o49482Q79605J224955K73761o65781j20449
6663b4708942j060619P22257k89147k03026j86154J045674p32143R4182K65057j091861
$$ y = [-25083524, -25504769, -25700095, -25880208, -25159081, -24742207, -25189097, -24566352, -24433502, -25977661, -25400006, -25458653, -24504323, -25834059, -25225936, -25243305, -25080648, -26015333, -25212344, -25338804, -25707709, -25320043, -25763587, -25864576, -25660742, -25634038, -25004316, -24643983, -25293676, -25610503, -25741313, -25568057, -26221790, -29283951, -25355958, -23687645, -24836837, -25466554, -26827583, -26393073, -25729690, -24814608, -25089796, -25191266, -25056291, -25478034, -24893491, -24696008, -25233946, -25608658, -25698996, -24962560, -25956049, -24734647, -25676983, -25007733, -25158932, -25559341, -24551199, -25771585, -24673708, -25371812, -25218268, -25187153, -25334025, -25244615, -25651551, -26301033, -25421428, -24196473, -23922712, -24588493, -24708942, -25769561, -25047304, -25336451, -25539477, -25725631, -24679957, -25412100, -25317918, -25052861, -26144722]
6653b6144722M54209o41042O0674L34466P58734M51221l01780l68798M56877J330585
6643b3609576l87736o2742Q6530r38832m84889J103181j458894Q75059L7911q55532Q93192
6632b4802328n20154l49531J3269J10249p4848P23373k15934O08398j125907J022O94038
6621b4938353R3801k22288p03868j141997K012312r66694N64049M71532j79934P67650
6611b4243790r34418R5031j57945L79186l95510M88457P23355j497887J448536k74553
6601b4369538j012211m33964N80939L02666P43743Q028k29091j96438O71237k86968
6591b4221597j793640K99976P00684j22370N43583J10201j144902L83431K46161k62118
6581b5260591m2177J004083k64443j177801M65526K088189q81332j085735K468096j468438
$$ y = [-26144722, -25690513, -26331555, -26270881, -25936415, -25177681, -24726460, -25028240, -25397038, -24940161, -23609576, -23997312, -24060054, -23973524, -24912356, -25397245, -24294064, -25752958, -24877899, -24839988, -25695520, -24802328, -25322482, -25672013, -25658744, -25548495, -25623343, -24899970, -25115904, -24507506, -25633413, -25632391, -24938353, -24844552, -25066840, -25770708, -26912705, -24900393, -25867087, -25303038, -24831506, -25011440, -24243790, -25178208, -25083177, -25241122, -24861936, -25257446, -24768989, -24045634, -25543521, -24094985, -24369538, -25381749, -25815713, -25234774, -24932108, -24188365, -24180337, -24409428, -24605866, -23934629, -24221597, -26015237, -25715261, -25014577, -25136947, -24593364, -24483163, -25628065, -25244634, -24998473, -25260591, -25302768, -24298685, -24563128, -25740929, -25275403, -23187214, -24068546, -25154281, -22686185, -24154623]
6571b4154623r89678M27440J85645N53900K2931J98186n70143P18911n1676j37930R67551
6560b2829486r83232l50666Q82054R5241M58310J315096K771206N125338l1995521
6551d5511660J0444119L287199K522515P16407K8955J424920M37296K7607j02469O00458
6541b6124653K55840j615994R18178P46362r22007J92191J026596k64487o75558J8664
6531b6444868k40632l7590R35925j680967L77620J813870J18062N07870j286284R0846
6521b5846148R3707M47947p62576J48890j577300J625434J08948n73098J185445K96185
6511b4852566k49805O8953j224139N80573N40091K93407j450827P60783k33499L30246
6501b5436783M38699n08560K32242l87336L36448o53893K54844M69862M33315K19303
$$ y = [-24154623, -25144301, -24716861, -24531216, -23977316, -23954385, -23756199, -24326342, -23607431, -23659107, -23797037, -22829486, -23812718, -24163384, -23281330, -23186089, -22727779, -21412683, -18641477, -13516139, -45511660, -35067541, -31780342, -29257827, -28541420, -28512465, -27087545, -26650249, -26622642, -26725111, -26124653, -25868813, -27484807, -26566629, -25820267, -26742274, -26550083, -25523487, -25787974, -26463532, -26444868, -26685500, -26723090, -25787165, -27468132, -27090512, -25276642, -25158580, -24650710, -25936994, -25846148, -25752441, -25304494, -26067070, -25918180, -27495480, -25870046, -25761098, -26334196, -25148751, -24852566, -25102371, -25033418, -26257557, -25676984, -25136893, -24843486, -26294313, -25533530, -25767029, -25436783, -24998084, -25506644, -25274402, -25661738, -25325290, -25979183, -25724339, -25254477, -24821162, -24601859]
6491b4601859n03159m70580K7812K9077n06956R43513L70687k19915m80339k83700P10118
6480b4985301N19971N1436p80155o76295o86368J340037J68411r55267J78849j32306
6470b5956988l34096P39865O8641L92137P94922j220127O77059J23104k80857n09498
6460b5505838M64941P21436j121345R0234j79274N12918K60427K27186m14470J058253
6450b3885532j143903n22794L50085p97877J156363n73033L95481j92720J88241p96795
6440b5822484L87662o01679N19660j62956q62604m39877J395804J239878J38319J070976
6430b3137301j547601j27500P9711q08485j02167q5707m00508J126590J79206m2070n23538
6419b5389370N59202q98905J182036j153464p97957Q57058Q4171j14928L75882K23887
$$ y = [-24601859, -25105018, -25575598, -25547786, -25518709, -26025665, -25082152, -24711465, -24931380, -25411719, -25695419, -24985301, -24465330, -24413894, -25194049, -25870344, -26556712, -25216675, -25048264, -26003531, -25824682, -25956988, -26291084, -25551219, -25482578, -25090441, -24295519, -25515646, -24838587, -24715483, -24996340, -25505838, -25040897, -24319461, -25440806, -25350572, -25529846, -25016928, -24756501, -24529315, -24943785, -23885532, -25029435, -25552229, -25202144, -26000021, -24843658, -25416691, -25021210, -25213930, -25025689, -25822484, -25434822, -26036501, -25516841, -25679797, -26542401, -26982278, -25586474, -24346596, -24208277, -23137301, -24684902, -24812402, -24732691, -25541176, -25643343, -25729050, -26129558, -25002968, -24823762, -24865832, -25389370, -24830168, -25729073, -24547037, -25700501, -26498458, -25641400, -25557229, -25672157, -25296275, -25072388]
6409b5072388m17769L83093m5700r35155l25361K66218J471854L46528l679088M77151
6399b7530617J426207m09877J418457m37721n3439m21207L52192l04592J21214n61697
6389b6401080L14304J90698k40365K4192J595406r80300P7481q85575N50060L57719K65428
6378b5132032m90437Q45106m69274k01085j00485l403j197966O54717j84425Q28273M85267
6367b4965744k49571j91728k91003K167025r73106n11227l43791m81327m79134J622705
6357b4696901p15494k85785M66619J0797r1504p70658O00319L54184m67523k75129J53256
6346b5717819N29441J1232j71290O98896o63717l58052L87222O3859m49701j45557k89866
6335b6105352j266239L870169j698813Q83597j282308M65847o4476n14535J98029P68393
$$ y = [-25072388, -25490157, -25107064, -25152764, -26087919, -26413280, -26147062, -24675208, -24328680, -28007768, -27530617, -26104410, -26514287, -25095830, -25533551, -25586990, -26008197, -25656005, -25960597, -25839383, -26401080, -26086776, -25896078, -26136443, -26112251, -24516845, -25497145, -25419664, -26305239, -25755179, -25397460, -25132032, -25622469, -24777363, -25246637, -25447722, -25548207, -25551610, -26749576, -26094859, -26279284, -25451011, -24965744, -25215315, -25407043, -25698046, -23531021, -24504127, -25015354, -25359145, -25840472, -26319606, -24696901, -25412395, -25698180, -25231561, -25220764, -25312268, -26082926, -25482607, -25128423, -25595946, -25871075, -25717819, -25188378, -25177146, -25348436, -24649540, -25313257, -25671309, -25284087, -25220228, -25669929, -25815486, -26105352, -27371591, -23501422, -25200235, -24316638, -25598946, -25133099, -25197575, -25712110, -25514081, -24745688]
6325b4745688n38893J29304N262M71823K4035j134237L74313J2879J87657L06108j229355
6314b6136792J180949j68259n20017l07893k11593n32446P7531R32429K68437K26334
6304b5191320p07400k68158J059937j313633O42696N15548q31185J37885J073621l50966
6294b5232975l29910P9077l51597J093581m31965j98028k67640N6088Q2151J009591K02339
6283b4289288n90740l56974Q71230j053528k22748J4658O25824r49672J136749j335496
6273b6149985o6287J242476q13120K85899R77317r09293j58991N52207n92800j26945
6263b5759522J061362j041555m08750N95933p07764P10045j52236M02778K0200j459672
6253b6739181J57917O53636J38090J96873m75802J269635N2487M59300j041595J86667
$$ y = [-24745688, -25284581, -25155277, -25150015, -24678192, -24654157, -25788394, -25414081, -25401202, -25213545, -24907437, -26136792, -24955843, -25124102, -25644119, -25952012, -26163605, -26696051, -26618520, -25686091, -25417654, -25191320, -25898720, -26166878, -25106941, -26420574, -25777878, -25262330, -26093515, -25955630, -24882009, -25232975, -25562885, -25483808, -25835405, -24741824, -25173789, -25371817, -25639457, -25583369, -25501218, -24491627, -24289288, -24880028, -25237002, -24365772, -25419300, -25642048, -25627390, -25001566, -25951238, -24814489, -26149985, -26216272, -24973796, -25786916, -25501017, -24523700, -25432993, -25591984, -25039777, -25632577, -25759522, -24698160, -25739715, -26148465, -25552532, -26260296, -25550251, -25702487, -25299709, -25279509, -26739181, -26581264, -25927628, -25789538, -25592665, -26068467, -24798832, -24746345, -24287045, -25328640, -25141973]
6243b5141973j34103j007392J49451J282554J5274Q31835j061932j74099K50388m30701
6233b5420698O71758K53567m78888l14817K34835l87413M93003K94728n41143q31478
6223b6026546N88836M82587L30129L87166k270818l7500J374575M1359J22229m15937n4339
6212b5478259j123316L60466N70724p49816M72664k8101P03190Q624l18415p9541J58197
6201b5503583L85877o53513k82378L80317J73148k50172m91569J211670l08997k40673
6191b5579873P77787j846717J337594p73863K68441N68843n24030R41022k55222k83490
6181b5369508k22091J77680N94529O70901j243200j6228l19959L02355J75126j1479K88833
6170b4973041J98311j149607M25817J041699m78548j42615p0955o86703K03528J20868
$$ y = [-25141973, -25276076, -26283468, -26134017, -24851463, -24836189, -24004354, -25066286, -25240385, -24989997, -25420698, -24748940, -24495373, -24974261, -25289078, -25054243, -25441656, -24948653, -24653925, -25195068, -26026546, -25437710, -24955123, -24624994, -24237828, -26508646, -26546146, -25171571, -25130212, -25007983, -25423920, -25478259, -26601575, -26241109, -25670385, -26420201, -25947537, -25975638, -25272448, -25263824, -25582239, -25661780, -25503583, -25117706, -25771219, -26053597, -25673280, -25500132, -25750304, -26241873, -25030203, -25339200, -25579873, -24802086, -26648803, -25311209, -26085072, -25816631, -25247788, -25771818, -24830796, -25086018, -25369508, -25591599, -25413919, -24819390, -24148489, -25391689, -25407917, -25727876, -25425521, -25250395, -25261874, -24973041, -24774730, -25924337, -25498520, -24456821, -24935369, -25077984, -25148939, -25835642, -25632114, -25511246]
6160b5511246K87541o77270p50731P25670p62070L80160J144642n14097O45557j427309
6150b6459153K596336n55384m59594l40951n7595Q20933l34948K35674n61426o02625
6140b5718733N70097O64208r43974J047420r55172j21046M01572Q91704n17267j275495
6130b5956686J400723O96198k0001j241146L90749N43356k63501m71519l37858K075706
6120b3183979K82333O04114J794083l72369n5791538L7275059Q006097K069625J554319
6111b7762256R9554J31637l56091R99581L35240N59909l18321p08194j178058J090425
6101b7106574J169188k54535m47674L24395k16005O00858M16771o84989q34824O11900
6091b6421489J09332m77596R89957L95861j337772J38487O02980j1594N00634p56396
$$ y = [-25511246, -25223705, -25900975, -26651706, -25926036, -26688106, -26307946, -25163304, -25677401, -25031844, -26459153, -23862817, -24418201, -24877795, -25218746, -25276341, -24455408, -24790356, -24554682, -25116108, -25718733, -25148636, -24484428, -25428402, -24380982, -25336154, -25457200, -25055628, -24163924, -24681191, -25956686, -24555963, -23859765, -23879766, -25120912, -24730163, -24186807, -24450308, -24921827, -25259685, -23183979, -22901646, -22297532, -20503449, -20875818, -76667356, -39392297, -31386200, -29316575, -27762256, -27662702, -27531065, -27887156, -26887575, -26552335, -25992426, -26310747, -27018941, -28196999, -27106574, -25937386, -26191921, -26639595, -26315200, -26531205, -25930347, -25513576, -26198565, -27033389, -26421489, -26312157, -26789753, -25799796, -25403935, -26741707, -26603220, -26000240, -26011834, -25511200, -26267596]
6081b6267596P13514m52408k26730L03317R98536j145691M31668o46736r5172R0322L90915
6070b5906061n12276N96313m41126O77933n26055J53061j81455L37907r9694J07877Q89273
6059b4904303r78573R46915j17578o0235P4253N996p91265J434069j342768j57821l42676
6048b6233986J27779N19674K85790J72477K77392m59970j26323M80338n114q47806J016372
6037b4793377N70588q77712p79310O56347l51394j180390J489262r24123K11063M25995
6027b5553051L89537l99979N00086p98318O87471n20509j98844n068K31398r68991J351771
6016b5284497l6972m18994Q65655j866838M09448P50384J36322p82635N91000M70137
6006b5166990j465649J202036K4959M45674r61423N98152o89935l7049J52844L13394
$$ y = [-26267596, -25554082, -26006490, -26233220, -25929903, -24931367, -26077058, -25645390, -26292126, -26387298, -26296976, -25906061, -26418337, -25822024, -26263150, -25585217, -26111272, -25958211, -26139666, -25801759, -25901453, -25793576, -24904303, -25882876, -24935961, -25053539, -25113774, -25039521, -25033525, -25824790, -24390721, -25733489, -25891310, -26233986, -26106207, -25586533, -25300743, -25128266, -24850874, -25310844, -25437167, -24956829, -24961943, -25809749, -24793377, -24222789, -25100501, -25879811, -25223464, -25574858, -26755248, -25265986, -26190109, -25979046, -25553051, -25163514, -25563493, -25063407, -25861725, -25174254, -25694763, -25893607, -25898675, -25667277, -26636268, -25284497, -25321469, -25740463, -24874808, -26741646, -26332198, -25581814, -25445492, -26228127, -25637127, -25166990, -26632639, -25430603, -25405644, -24959970, -25921393, -25323241, -26013176, -26050225, -25897381, -25583987]
5996b5583987q39408J047243o43165N3168J020760j004107O34756J035646K3627l90859
5986b4646326R01790j801314p40958M98717l46040O87476j25474q08494j00392R90471
5976b5490544q89496k91125J224393l63085K92184L62226l84100L85533M9965M90833
5966b4613216K84672j245191J90967M40679L339153m824605m18186J020261J66440J37609
5956b5521417j261129J076632J8952m62188m86693L51113K85261J527922p98658j000981
5946b6271186J070904n57728M88224j13127K99694j463357q82760R43626J485093j111880
5936b6112497K84442L64732l58779j63487J182933l27098j31841J86272K23553j63583
5926b5015353j068143k89698O35064N92042p26304R59569n94061m90969Q48022n06875
$$ y = [-25583987, -26423395, -25376152, -26019317, -25966149, -24945389, -25949496, -25314740, -24279094, -24255467, -24646326, -23744536, -25545850, -26286808, -25788091, -26134131, -25446655, -25572129, -26380623, -26481015, -25490544, -26380040, -26671165, -25446772, -25809857, -25517673, -25155447, -25539547, -25154014, -25104049, -24613216, -24328544, -25573735, -25382768, -24942089, -21602936, -26427541, -26845727, -25825466, -25659026, -25521417, -26782546, -25705914, -25686962, -26149150, -26635843, -26284730, -25999469, -24471547, -25270205, -26271186, -25200282, -25758010, -25269786, -25382913, -25083219, -26546576, -27429336, -26485710, -25000617, -26112497, -25828055, -25463323, -25822102, -25985589, -24802656, -25129754, -25261595, -25075323, -24851770, -25015353, -26083496, -26373194, -25738130, -25146088, -25872392, -24912823, -25506884, -25997853, -25149831, -25656706]
5916b5656706l5982m49527O26473o36844n68851J148507n42418Q35678k89762J08436
5906b5460996q72295k48275m5904L27946O85107M68233m01510N84703J957174j323637
5896b4329454k72878o87055J26837K74936m21585k54183K64598R7726o214j074809J287642
5885b4994439n22381j013213J598229m22923j079114M57406k18013J96614L91792l94048
5875b6000090J02762q6131P0757K61988j493916J385234j008463J383418N95935r43001
5865b5731507J05426j48125O92281M1410m29689P98420j367867R51059p00065m27895
5855b6216552L88214Q80547L03206l98646o63783P73762k9327l3685l21325p00718n95541
5844b6613848J128642J7474m41281J17333Q92422O1159n57230N40076j553697J279872
$$ y = [-25656706, -25692688, -26142215, -25515742, -26152586, -26721437, -25572930, -26115348, -25279670, -25569432, -25460996, -26333291, -26581566, -26627470, -26299524, -25614417, -25146184, -25547694, -24962991, -23005817, -24329454, -24602332, -25289387, -25162550, -24887614, -25309199, -25563382, -25298784, -25201058, -25207272, -26282081, -24994439, -25516820, -26530033, -24931804, -25354727, -26433841, -25976435, -26194448, -25997834, -25606042, -26000090, -25897328, -25983459, -25912702, -25650714, -27144630, -25759396, -26767859, -25384441, -24788506, -25731507, -25626081, -25774206, -25081925, -25040515, -25470204, -24671784, -26039651, -25088592, -25788657, -26216552, -25828338, -24947791, -24644585, -25043231, -25707014, -24933252, -24962579, -24996264, -25317589, -26018307, -26613848, -25485206, -25467732, -25909013, -25791680, -24899258, -24838099, -25395329, -24855253, -26408950, -25129078]
5834b5129078L32777n92093l01210J34899n77181M67043l27445Q65452j48851n5628
5824b5331315j248530P55647n9478m21618j73333J088194k75944J361384j539233m96963
5814b6341189M46913k70260l22116j31956J18208R58042J08433Q4797n77407L72008k5095
5803b5579622L07334Q6125l3879q51479O33327j470261J503875l76361j01380N7668
5793b5824653j373615O13183N42246l39544L81648p03897P96434L68903n41949R88657
5783b5092587q86110J960692j240225O3624O57504j116402q56100K040239r00493K2523
5773b5347335j10753Q41295j530531q92432L99206O26965k24843m72057J506971n99380
5763b5802894L55956K94696O9883r7669L31813N3500l05849k99232j213843Q389J262687
$$ y = [-25129078, -24796301, -25388394, -25689604, -25554705, -26131886, -25664843, -25992288, -25126836, -25275687, -25331315, -26579845, -25824198, -25883676, -26305294, -26478627, -25390433, -25666377, -24304993, -25844226, -26341189, -25894276, -26164536, -26486652, -26618608, -26500400, -25542358, -25433925, -25349128, -25926535, -25554527, -25579622, -25272288, -25186163, -25220042, -26071521, -25438194, -26908455, -25404580, -25780941, -25882321, -25824653, -27198268, -26585085, -26042839, -26382383, -26000735, -26704632, -25908198, -25539295, -26081244, -25092587, -25978697, -24018005, -25258230, -25194606, -24537102, -25653504, -26509604, -24469365, -25369858, -25347335, -25458088, -24616793, -26147324, -27039756, -26640550, -26013585, -26238428, -26710485, -25203514, -25802894, -25446938, -25152242, -25082359, -25180028, -24848215, -24794715, -25100564, -25399796, -26613639, -26605250, -25342563]
5752b5342563o16872j64446M19366N67870j55655m30764q88649N90633O75195J09735L6453
5741b5199697L24445O24597o79681r00746K53481K41524K00051J121449m79581j834547
5731b6328705M68731M33847j376907L83592M44238l57260J49667l90817j79272M44898
5721b6307988O76701J04614R7147Q2932N5428l31401o1045l0266Q0423K28128K56013
5710b5149314n46327L74739j020907N58622p08139J653844r41633l57388k35144J94414
5700b6177233k73488J081254K68004k98953n94810J559228k99848J02284l65234K16179
5690b4782617M71244o24106j105276R83677J445433j491486O11606j76728j70748j883386
5680b6722387l9353974L4126779M230326j99126P13426K48991J66787m97159J064446O3458
$$ y = [-25342563, -25959435, -26123881, -25704515, -25136645, -25292300, -25723064, -26611713, -26021080, -25345885, -25236150, -25199697, -24875252, -24250655, -24930336, -25831082, -25577601, -25336077, -25136026, -24014577, -24494158, -26328705, -25859974, -25426127, -26803034, -26419442, -25975204, -26332464, -26182797, -26573614, -26752886, -26307988, -25631287, -25526673, -25429526, -25346594, -25291166, -25622567, -25683612, -25713878, -25633455, -25405327, -25149314, -25695641, -25320902, -26341809, -25783187, -26491326, -24837482, -25779115, -26136503, -26371647, -26177233, -26450721, -25369467, -25101463, -25400416, -25995226, -24435998, -24735846, -24633562, -24998796, -24782617, -24311373, -24935479, -26040755, -25057078, -23611645, -25103131, -24491525, -24668253, -24839001, -26722387, -66076361, -31949582, -27719256, -27918382, -27204956, -26955965, -26789178, -27286337, -26221891, -26158433]
5670b6158433P17445l12875J91865j65373N63369n87449J19191P23308m4324j27946j62789
5659b5244011n0411o29163N42404J04910P19095o76311J36020j123420R1054N61666L39267
5648b5228900M36326m67433j614029J606520q96246M16992p88176Q9349K25828P5041r8444
5637b6243172q32195K229089M42q37842m90450J263520O20547j231638M86741k61055
5627b5296013n52091L43048j82769R2521q40897o49116J596012n80225J010300J61652
5617b4897578r96976R59384J84297n1638R5914J582830j541385l452381J839486N44575
5607b5733472R60098j573277J60601N52654j07206l51131j15455j130586Q10541j32749
5597b6659982M02775J665440O70237q92774j570634Q11060L97373J94340j435488R0097
$$ y = [-26158433, -25440988, -25753863, -25561998, -25727371, -25164002, -25751451, -25632260, -24908952, -24953276, -25081222, -25244011, -25294422, -25923585, -25381181, -25276271, -24557176, -25233487, -25097467, -26220887, -26129833, -25568167, -25228900, -24792574, -25260007, -26874036, -25267516, -26163762, -25746770, -26534946, -26445597, -26219769, -26144728, -26243172, -27075367, -24846278, -24845836, -25683678, -26174128, -24910608, -24290061, -25521699, -25034958, -25296013, -25848104, -25505056, -25687825, -25595304, -26436201, -27085317, -25489305, -26069530, -25059230, -24897578, -25894554, -24935170, -24750873, -24802511, -24706597, -23123767, -24665152, -28117533, -26278047, -25733472, -24773374, -26346651, -26186050, -25633396, -25740602, -26091733, -26207188, -27337774, -26527233, -26659982, -26257207, -24591767, -23921530, -24814304, -26384938, -25573878, -25176505, -24982165, -26417653, -26327556]
5587b6327556R04331P30146n73658J168073k78611J82534j647240L63817P25318l76252
5577b5129098M04704K53706m74691L74994n04476o61240M24474j161331n66029J273338
5567b5765649N17687j097465n0296k455023J489921N84609P65931l10168L34646O52392
5557b5333415q26715N77036o39294J080588o79966K83025P32388r15408k98228J34408p579
5546b5893160j03116R4013R64829j064438R8262M58622j307762P523J32282q6294Q98380
5535b5800859J34559L96658n30217L68961L01866K41943j663538J282927M39842j16588
5525b4944446K00941r76030L95771j191681O56695k75478P92313p1175L52842j013021
5515b6073269l64973M21150j16145M35026j05416L94775J77871k83921K98739q12942
$$ y = [-26327556, -25423225, -24693079, -25266737, -24098664, -24377275, -24194741, -25841981, -25478164, -24752846, -25129098, -24724394, -24470688, -24945379, -24570385, -25074861, -25736101, -25311627, -26472958, -27038987, -25765649, -25247962, -26345427, -26395723, -28850746, -27360825, -26776216, -26010285, -26320453, -25985807, -25333415, -26160130, -25583094, -26222388, -25141800, -25821766, -25538741, -24806353, -25721761, -26019989, -25885581, -25893160, -25996276, -25902263, -24937434, -26001872, -25903610, -25444988, -26752750, -26745227, -26612945, -26699239, -25800859, -25666300, -25269642, -25799859, -25430898, -25129032, -24887089, -26550627, -25267700, -24827858, -24944446, -24743505, -25719535, -25323764, -26515445, -25858750, -26134228, -25341915, -25413090, -25060248, -26073269, -26438242, -26017092, -26133237, -25698211, -25803627, -25408852, -25230981, -25514902, -25216163, -26029105]
5505b6029105K36077Q0124m34169K91961m63717O76616r7874K01699J19242N05005k28247
5494b5142388k31869j356492L8427K28701J046230L26364r4498n0994n84797N3113M63050
5483b5305153p78281K19838N74283O56878k10035M40880m63526q65400M17826J81086
5473b5131604J187918j670411J154388M43366P5383j235929q05299K584353k82978m40693
5463b4121506K194671n87800o621601n54194J594438j66852Q99822K17422J380296M68166
5453b5297138m44763L05464N07876j591533n7147R28795O46178j356040J246012l34654
5443b5446950m67168K98118R34384o69286j257486J320111j3308o00721k53580J42871
5433b6013015k57151J469321j59375k14530q08826N85946O53432j477335J77050m822j9485
$$ y = [-26029105, -25793028, -25712904, -26147073, -25855112, -26318829, -25642213, -25740087, -25538388, -25419146, -24914141, -25142388, -25374257, -26730749, -26692322, -26463621, -25417391, -25091027, -25185525, -25236519, -25821316, -25768203, -25305153, -26083434, -25863596, -25289313, -24632435, -24842470, -24401590, -24865116, -25730516, -25312690, -25131604, -23943686, -25614097, -24459709, -24016343, -23940960, -25176889, -25982188, -23397835, -23680813, -24121506, -21926835, -22514635, -29136236, -29690430, -28095992, -28262844, -27363022, -27145600, -25765304, -25297138, -25741901, -25436437, -24928561, -26520094, -26577241, -25648446, -25002268, -26358308, -25112296, -25446950, -25914118, -25616000, -24681616, -25350902, -26608388, -25288277, -25301585, -25902306, -26155886, -26013015, -26270166, -24800845, -24960220, -25174750, -25983576, -25397630, -24744198, -26221533, -26044483, -26049305, -26068790]
5422b6068790K5788Q43669J73690l74908M27239k43171K97252L34962j421749l25353
5412b6331371L74609M01566n50286L00039j10449o35142r2867K91891Q79037L86129
5402b5086844J326192j553832J17262o14565j1475M42166m95145O34574q82338j365935
5392b7489940O27626J545445O81806M57586j522391o72491o25811J234408P78211r7006
5382b5082557J10966M92285m16035l15181m95150L46220M78476k02572m94419P29905
5372b4848062o26858J357586j356955N49179m03235p9574m00252J275325m24578N8074
5362b4899350M56245j66801k718391J515799J25840N30380o09916k71256j060235J233328
5352b5864357M49002J49668N32052K19333j025092k4301M97360m9593q27725M36210P26911
$$ y = [-26068790, -26043002, -25199333, -25025643, -25400551, -24973312, -25216483, -24919231, -24584269, -26006018, -26331371, -25956762, -25555196, -26105482, -25805443, -25915892, -26551034, -26643901, -26352010, -25472973, -25086844, -23760652, -25314484, -25197222, -25811787, -25823262, -25381096, -25876241, -25241667, -26124005, -27489940, -26862314, -25316869, -24635063, -24177477, -25699868, -26372359, -26998170, -25763762, -24985551, -25082557, -24971591, -24479306, -24895341, -25210522, -25705672, -25359452, -24880976, -25083548, -25577967, -24848062, -25474920, -24117334, -25474289, -24925110, -25328345, -25407919, -25808171, -24532846, -24957424, -24899350, -24443105, -24609906, -27328297, -25812498, -25686658, -25156278, -25766194, -26037450, -27097685, -25864357, -25415355, -25265687, -24733635, -24514302, -25539394, -25563695, -25066335, -25115928, -25943653, -25507443, -24780532]
5341b4780532J9851J507274j476233p3393J142103o65388r37664k11464Q68585q16996
5331b5423857l48015R57373O5699o50862j56066R24288M5915j162187l0349J39651m42603
5320b6081013J363159n78040J86526J80391o98352M65221q44661O39250k32317J527172
5310b4072664k368130K20159J304079j335871J706798j508334N37272P38705j4873N31604
5300b4261255q91972O53085q29855O4483m98832J027396j561763R08699J276885j654058
5290b5767187K751O91490q85818L113221j383551m56783p54933O25870k88867p2656J87050
5279b4989413l99108L39755q97142O74548J53063P46628r38764R96786j289903K59719
5269b5343831N02860j468011R55775Q07117K58770l40944l55814p25999J001308Q4104
$$ y = [-24780532, -24760681, -23253407, -24729640, -24803033, -23660930, -24326318, -25263982, -25475446, -24606861, -25423857, -25771872, -24814499, -24748800, -25399662, -25555728, -24631440, -24585525, -25747712, -25778061, -25638410, -26081013, -24717854, -25295894, -25109368, -24928977, -25627329, -25162108, -26006769, -25367519, -25599836, -24072664, -26440794, -26220635, -24916556, -26252427, -24545629, -26053963, -25516691, -24777986, -24792859, -24261255, -25153227, -24500142, -25329997, -25265514, -25764346, -24736950, -26298713, -25390014, -24113129, -25767187, -25764436, -25072946, -25958764, -22845543, -24229094, -24685877, -25440810, -24814940, -25103807, -25176463, -24989413, -25388521, -25048766, -25945908, -25271360, -25118297, -24371669, -25310433, -24313647, -25603550, -25343831, -24840971, -26308982, -25353207, -24546090, -24287320, -24628264, -24984078, -25710077, -24708769, -24624665]
5259b4624665k84082o01535o91771P33551L5384Q55338k35459K70408m60357K29954P61467
5248b4011767N00544o42335o85737Q853980K4392742l5755159K36662m06310K72995L85992
5238b6858393j339740K440529l45537l54783j002341n53515Q64431K57192K06979j20396
5228b6805574J273969L92459k40928k80202P0741o42951K44516q86678J309434r88229
5218b6553443J327815m39973n0946L04407N57015r76923j14772K1423J206454q62434
5208b5581377Q07525p02700m37674j96450N3905M61341J20718J02877j061042J55178
5198b6277699R77083J73037j129012L15331L90949M33408M67494m69227n76369J241824
5188b4453181p65386L62426J84657l73434o15226L72903m48739K32107r55568n5463O7740
$$ y = [-24624665, -24908747, -25510282, -26202053, -25468502, -25433118, -24577780, -24813239, -24542831, -25003188, -24773234, -24011767, -23511223, -24153558, -24839295, -15985315, 8407427, -27347732, -27111070, -27517380, -27244385, -26858393, -28198133, -25757604, -26103141, -26457924, -27460265, -28013780, -27149349, -26892157, -26685178, -26805574, -25531605, -25139146, -25380074, -25660276, -25589535, -26232486, -25987970, -26874648, -25565214, -26553443, -25225628, -25665601, -25716547, -25412140, -24855125, -25832048, -25946820, -25925397, -24718943, -25581377, -24773852, -25476552, -25914226, -26110676, -26056771, -25595430, -25474712, -25371835, -26432877, -26277699, -25300616, -25127579, -26256591, -25941260, -25550311, -25116903, -24649409, -25118636, -25695005, -24453181, -25218567, -24856141, -24671484, -25044918, -25660144, -25287241, -25735980, -25503873, -26459441, -26514904, -26447164]
5177b6447164J120571r37994J023322j135089N71304l73609j12326M25783L23657n19032
5167b6060577K20964J18595L02829o9398j46565m81203l04724M20274L32106p13353M32632
5156b5948420Q3852k23385O50535k36572j193752M51780J01574O27236l69948n51186m5821
5145b6654107O23376m91926M31646J252871n11323q85570O45390m06452R8595N09690
5135b5387810l40192r41025O38489O51659k10434m72622o63423O16544J361517r0301
5125b4837598j124678l54499j24215J148011m0910j18066m15107K56217N61725K00065
5115b4849055p00978J55325r8000m44145O65275k79444K42510P17304l637137J625239
5105b6603106k36274J009208m88575m05977Q55987m95520L88565n48823M05796k38374
$$ y = [-26447164, -25326593, -26264587, -25241265, -26376354, -25805050, -26178659, -26290985, -25865202, -25541545, -26060577, -25839613, -25721018, -25418189, -25487587, -25634152, -26115355, -26420079, -25999805, -25667699, -26381052, -25948420, -25864568, -26087953, -25437418, -25673990, -26867742, -26415962, -26314388, -25687152, -26057100, -26608286, -26654107, -26030731, -26522657, -26091011, -24838140, -25349463, -26235033, -25589643, -25996095, -25897500, -25387810, -25728002, -26669027, -26030538, -25378879, -25589313, -26061935, -26725358, -26108814, -24747297, -24837598, -25962276, -26316775, -26440990, -25292979, -25333889, -25451955, -25867062, -25610845, -25049120, -24849055, -25550033, -25394708, -25492708, -25936853, -25271578, -25551022, -25308512, -24591208, -28228345, -26603106, -26839380, -25830172, -26318747, -26724724, -25868737, -26364257, -25975692, -26524515, -26118719, -26357093]
5095b6357093k73010O8405j631639K940854L41821l47831r59285j475296K019407o40760
5085b6314427L13570l10648j75241N84731Q6438O07792n82239k13480m44756M93390o5601
5074b6020471K57557n15777N07236K67179p43582M20505P57084m0182q37941K14097n99755
5063b6334050q53137J351545j0235m13493O0838j88940L27163O55564q46319O38324M36796
5052b5175944M39750n35682P17034n86599J25328m07156q89216Q20144M19019P1033l09106
5041b5311395n1275L97300n1814p1427K7040l89165P79128p1096o85213p40858O96359
5030b5472416j06652l71334j20669k73851q91727K149464l92776L46769k01590k6451
5020b5361233J633516p67486l21845j481100p2358n23287J103741n75693J462489l45107
$$ y = [-26357093, -26630103, -26561698, -28193337, -25252483, -24910662, -25258493, -26217778, -27693074, -25673667, -26314427, -26000857, -26311505, -26486746, -25902015, -25815577, -25207785, -25790024, -26003504, -26448260, -25954870, -26020471, -25762914, -26278691, -25771455, -25504276, -26247858, -25827353, -25070269, -25110451, -25948392, -25734295, -26334050, -27187187, -25835642, -25845877, -26259370, -26198532, -26387472, -26060309, -25404745, -26251064, -25612740, -25175944, -24736194, -25271876, -24554842, -25141441, -25016113, -25423269, -26312485, -25492341, -25073322, -25002289, -25311395, -25362670, -24965370, -25017184, -25088611, -25061571, -25450736, -24671608, -24742704, -25427917, -26168775, -25472416, -25579068, -25950402, -26071071, -26344922, -27236649, -25087185, -25479961, -25133192, -25334782, -25361233, -23727717, -24495203, -24817048, -26298148, -26370506, -26893793, -25790052, -26365745, -24903256, -25248363]
5010b5248363j9182J62282L87367N52843k63427p42508l99756J179768p81251m62236
5000b5634463N52814l56957Q24936q98653L07943R76787r34457n01037m08232L24451
4990b5746868J440331j778879J29839P46940M20228k55041M46057J034445k067192P54562
4980b4875578q02172k17096M9226Q52734o63599K87373O28433j258867q3235K69828L97214
4969b5415739j048825M50383R10318p47171J1673j120535l23582L280045m95783k70476
4959b4769692O0278j12733k03419n47022l24205P8960J07861M61726j00965r77897O2907
4948b6264201K63405Q28711k08118P12067p50763n87866P97401l77557j57909q6720
4938b5831550J476326J075899j478081k73387J44124j59136o16625L35482M62296r31962
$$ y = [-25248363, -25267545, -25105263, -24717896, -24165053, -24428480, -25170988, -25570744, -24390976, -25172227, -25634463, -25081649, -25438606, -24613670, -25512323, -25204380, -24227593, -25162050, -25663087, -26071319, -25746868, -24306537, -26085416, -25955577, -25208637, -24788409, -25043450, -24597393, -23562948, -25630140, -24875578, -25677750, -25894846, -25845620, -24992886, -25656485, -25369112, -24740679, -25999546, -26082781, -25812953, -25415739, -26464564, -26014181, -25103863, -25851034, -25839361, -26959896, -27283478, -24003433, -24499216, -24769692, -24709414, -24822147, -25025566, -25572588, -25896793, -25817833, -25709972, -25248246, -25349211, -26327108, -26264201, -26000796, -25172085, -25380203, -24668136, -25418899, -26006765, -25209364, -25586921, -25744830, -25831550, -24355224, -23279325, -24757406, -25030793, -24886669, -25045805, -25662430, -25326948, -24864652, -25796614]
4928b5796614P66740J63162j026060p8917q4451R91929q9782k56112m4414Q12207r08423
4917b5550735L22688K98698o79120P89588L9011M84083j733193J67375P29609j053444
4907b6185440P72832m74403M73243R1686O87918l95293n846J00633M22366P5300r97616
4896b5434620j259089J229712j7522L68097j130126P94613j118908Q04055K27339L38979
4886b5197470J73947P01154q54669m6275L09211m11912m73293J170245q35084o6448O35766
4875b4894828j469814Q97579Q7105K83122n76278J125377J46846j367016J773640j861194
4865b5855461q73907J075752Q93233n78691n63503J113479j70347j049094p91589j49140
4855b6949268J260346N13285m18094J148990m68410j894K07929r02630J254115Q3930
$$ y = [-25796614, -25029874, -24866712, -25892772, -25971689, -26056140, -25064211, -25153993, -25410105, -25454519, -24642312, -25550735, -25228047, -24929349, -25608469, -24818881, -24779870, -24295787, -26028980, -25861605, -25131996, -26185440, -25412608, -25887011, -25413768, -25322082, -24634164, -25029457, -25035303, -24934670, -24512304, -24437004, -25434620, -26693709, -25463997, -25481519, -25113422, -26243548, -25448935, -26567843, -25763788, -25536449, -25197470, -25023523, -24322369, -25177038, -25223313, -24914102, -25326014, -25799307, -24629062, -25464146, -25530594, -24894828, -26364642, -25467063, -25379958, -25096836, -25673114, -24547737, -24400891, -25767907, -23994267, -25855461, -26729368, -25653616, -24760383, -25339074, -25902577, -24789098, -24959445, -26008539, -26800128, -26949268, -25688922, -25175637, -25593731, -24444741, -24913151, -24915045, -24707116, -25609746, -24355631, -24271701]
4845b4271701p11602l01345P57659o96229K54468p05j18377P94504n57802J53820M73911
4834b4223399j13152k65868n04059n66116k30826J3086k89380P08334J294763l92926
4824b4569543k75852l07247m53749P23378J33297K72084R00479n38186n47773j50656q6777
4813b4900545O59408J608127M74570J924781M047791K9995023m4912905R96059J803155
4804b8304536N40599K051365o59837R9594P17895m21344M03437q73105l41630K36656
4794b6550906J300648J596335n13202j01472L6531k26241r47884M24112k97916n80641
4784b5860636N11211O09860n51948m76172q46056o0724L61662J648171q56453r34038
4774b6455123j150411K063134K05304o58916N60274J45112M57597n17882L47809K16599
$$ y = [-24271701, -24983303, -25284648, -24526989, -25223218, -24968750, -24969455, -25087832, -24293328, -24851130, -24697310, -24223399, -24336551, -24602419, -25106478, -25672594, -25903420, -25890334, -26179714, -25471380, -24176617, -24569543, -24845395, -25152642, -25606391, -24883013, -24749716, -24477632, -23577153, -24115339, -24663112, -24813768, -24900545, -24241137, -22633010, -22158440, -20233659, -16185868, 13809155, -31103750, -30107691, -28304536, -27763937, -25712572, -26372409, -26272815, -25554920, -25976264, -25572827, -26445932, -26787562, -26550906, -25250258, -23653923, -24167125, -24268597, -24232066, -24458307, -25406191, -24982079, -25279995, -25860636, -25349425, -24739565, -25291513, -25767685, -26613741, -26674465, -26312803, -24664632, -25521085, -26455123, -27605534, -25542400, -25337096, -25996012, -25435738, -25290626, -24833029, -25350911, -25003102, -24786503]
4764b4786503o04433j57120K02356p86051M52405J107959L55300N87786j817327o26322
4754b6071950J215777J07631j83068m09748J27813Q06455o14569Q69445P18288n94740
4744b4028666n51111o03449N89591j380695K68376N18715K11862l44250K67606r9409
4734b5151430j805925J940645L84090J3692k5585q53483M12336k56305L42237J095472
4724b3904256k274116M82043M21640l14681L02486L97468j49139N17206N80043l10423
4714b4251729j152065J02562k54864j47108O42207K10494J006179k57221j075119j038409
4704b6215073K067241o11120m62588k8514j149947N55639Q45298p46969R27286P00608
4694b4118139j17675l94178j24062l44426l3054N52169p32374J42400P72448l80687o14101
$$ y = [-24786503, -25390936, -25548056, -25345700, -26131751, -25679346, -24571387, -24216087, -23628301, -25445628, -26071950, -24856173, -24748542, -24931610, -25341358, -25213545, -24407090, -25021659, -24152214, -23433926, -24028666, -24579777, -25183226, -24593635, -25974330, -25705954, -25187239, -24975377, -25319627, -25052021, -25151430, -26957355, -25016710, -24632620, -24618928, -24644513, -25497996, -25085660, -25341965, -24999728, -23904256, -26178372, -25696329, -25274689, -25589370, -25286884, -24889416, -25038555, -24521349, -23941306, -24251729, -25403794, -25301232, -25556096, -25703204, -25060997, -24850503, -23844324, -24101545, -25176664, -26215073, -24147832, -24758952, -25221540, -25250054, -26400001, -25844362, -24999064, -25746033, -24818747, -24118139, -24235814, -24629992, -24754054, -25098480, -25131534, -24579365, -25311739, -25169339, -24396891, -24777578, -25391679]
4683b5391679K21094m83416N38803K39197k56042N30890n82483N70647P5201o21693k96579
4672b5456060n71767k13126J146646j11434N82900o5091p11193K62431O00246j93174
4662b4729622r33344J331453O8614L99204r12946m31713R02738M4262q48393J062197
4652b4047550m25898q45628Q76347Q4350j92675L0299l64704J88628l88011K19976j45618
4641b5010484k67357J084137l37742k54866k17615K82325L84758n92325n94366Q98887
4631b4624648o07163M16619o8484K91550K05189o51228N61952r73456J784559j287975
4621b4953085o88193j9287O84739o738M83550o34018q37138J330283O83791l21209j74184
4610b4451489p21844J6123R4960l64092j04016O98923j83063M00076k75842P4827m51762
$$ y = [-25391679, -25170585, -25654001, -25115198, -24876001, -25132043, -24601153, -25183636, -24612989, -24537788, -25159481, -25456060, -26027827, -26240953, -25094307, -25205741, -24622841, -24687932, -25399125, -25136694, -24536448, -24729622, -25662966, -24331513, -24262899, -23863695, -24776641, -25208354, -24305616, -24261354, -25109747, -24047550, -24473448, -25319076, -24442729, -24358379, -24551054, -24520755, -24885459, -24696831, -25084842, -24864866, -25010484, -25277841, -24193704, -24531446, -24786312, -25003927, -24721602, -24336844, -24929169, -25523535, -24624648, -25231811, -24815192, -24883676, -24592126, -24386937, -25038165, -24476213, -25449669, -23665110, -24953085, -25641278, -25660565, -24975826, -24982564, -24499014, -25133032, -25970170, -24639887, -23956096, -24277305, -24451489, -25173333, -25157210, -25062250, -25426342, -25530358, -24831435, -25014498, -24614422, -24890264, -24815437, -25267199]
4599b5267199M2774n6963M77675N96567o88674j089121L52679m09556R50507j835336
4589b6926647J880561j93093j67733N7806k05221m40895J423797m29408r77515Q50720
4579b5127628J226702j159375n63639J2356L63102o55285m42141J456018k06946m3914
4569b5140750n29250j24323M13845r30566p89270J674417M00769j70154O18226L31214
4559b4245842j696779m95113J37268L0963K22470O09415j041l96348l65231O67463n5471
4548b5588246j5702O23272j688267j181L21506M32922j464223L26681P76141J56022k32699
4537b6353774K55039M7295L84842R8411n21207J78658K82765O45882k37945k55777j074433
4526b6550244J036197K31802o6383k229500J504734Q58575l81698j984086K259969j242149
$$ y = [-25267199, -25224425, -25281388, -24803713, -24207146, -24895820, -25984941, -25632262, -26041818, -25091311, -26926647, -25046086, -25239179, -25406912, -25349106, -25554327, -25995222, -24571425, -25000833, -25978348, -25127628, -23900926, -25060301, -25623940, -25611584, -25248482, -25903767, -26345908, -24889890, -25096836, -25140750, -25670000, -25794323, -25380478, -26311044, -27100314, -25425897, -25025128, -25195282, -24577056, -24245842, -25942621, -26437734, -26300466, -26269503, -26047033, -25437618, -25438659, -25835007, -26200238, -25532775, -25588246, -25603948, -24980676, -26668943, -26670124, -26348618, -25915696, -27379919, -27053238, -26277097, -26121075, -26353774, -26098735, -26051440, -25666598, -25568187, -26089394, -25910736, -25627971, -24982089, -25220034, -25475811, -26550244, -25514047, -25282245, -25348628, -27578128, -26073394, -25214819, -25596517, -27580603, -25320634, -26562783]
4516b6562783O85201Q58428k37468m64899j70849l9417m72666K04317M23682L22007o81318
4505b6135765J802971j444964k43494O49812j067804P65726J19806n15914J9045j84215
4495b6234796N62799j073428K243545q21566k7790P8263m81334l99089Q92032k69625
4485b5530989m05415l26777O15624L40992q16471Q83003p24309n26303O16227P62715
4475b5111703j15238q0426m03998J72416Q6346N52822k78286j21874j98789m75860q4548
4464b6059138J43495J08696q908o69576J294809J12432n48345m92332M36483N16823o65354
4453b5830915j064084Q11118J452937j087337K00273k60644J193470q518r73854p1274
4443b5638828N00595K10552l77378O59036j257432K61961m40137R1468J337032J864091
$$ y = [-26562783, -25877582, -25019154, -25256622, -25721521, -25892370, -25931787, -26404453, -26200136, -25776454, -25454447, -26135765, -24332794, -25777758, -26021252, -25371440, -26439244, -25673518, -25553712, -26069626, -26050581, -26234796, -25671997, -26745425, -24501880, -25323446, -25351236, -25272973, -25754307, -26153396, -25261364, -25530989, -25936404, -26263181, -25647557, -25306565, -26123036, -25240033, -25964342, -26490645, -25874418, -25111703, -25226941, -25307367, -25711365, -25538949, -25452603, -24899781, -25178067, -25299941, -25498730, -25974590, -26059138, -25915643, -25806947, -25815855, -26485431, -25190622, -25078190, -25626535, -26118867, -25682384, -25165561, -25830915, -26894999, -26083881, -24630944, -25718281, -25518008, -25778652, -24585182, -24593700, -25567554, -25638828, -25138233, -24927681, -25305059, -24646023, -25903455, -25641494, -26081631, -25990163, -24653131, -22789040]
4433b2789040n84365j452151L44204l15543k28900o0212J02608k05610k88817j318063
4423b6795889J140510Q3813R30678n13242K96959R1940n59525J037502J22973r14897
4413b5079178M34475J46965J014267q62626p94220m12332r86445K03531R31368Q11284
4403b4592911l85476n65151N23346l93974O77593l18598J044844m31710k04946L1906
4393b4615077j57617K52028M6015N5737p42048M79082J34529p9368k18038o57719M99413
4382b5003063n80386l9594n3298J103523p96555O63421J181919L4769Q52685K492659
4372b0143920J3076272k2443989K187521J408686K95289K82284o71330k08907L76675
4363b5841419l70270J208778k15001j05471n9765R76350N90035j553051P30538K6588
$$ y = [-22789040, -23373405, -24825556, -24481352, -24796895, -25025795, -25086007, -24983399, -25189009, -25477826, -26795889, -25655379, -25571566, -24640888, -25154130, -24857171, -24765231, -25324756, -24287254, -24164281, -25079178, -24644703, -24497738, -23483471, -24346097, -25140317, -25552649, -26539094, -26335563, -25404195, -24592911, -24978387, -25543538, -25020192, -25414166, -24736573, -25055171, -24010327, -24442037, -24646983, -24615077, -24772694, -24520666, -24474651, -24418914, -25160962, -24681880, -24547351, -24626719, -24844757, -25502476, -25003063, -25583449, -25623043, -25676341, -24572818, -25369373, -24705952, -23524033, -23489264, -22636579, -20143920, -7067648, -29511637, -27324116, -25915430, -25620141, -25337857, -26009187, -26218094, -25841419, -26211689, -25002911, -25217912, -25323383, -25383148, -24406798, -23816763, -25369814, -24639276, -24612688]
4353b4612688O96503o4049j891157J936973j575957n06604K29307m94716M0108Q96777
4343b5345503k41352P25177L30411R6019l8727n57616j8203l45716j90368P61850J78954
4332b4645074j558179P69000M99935M13374J9027o93415L73421O8836O37349k6377k61647
4321b4403750J02262M12896J54362K49550k19472m71467m73953m29413J123147J71340
4311b3784498n36945j20747K82055q06196k00751j17031P1900O06494P09822r9738r15834
4300b4911469J026503K49858o90497J21485j45520L41497P81258m14106j000139R206
4290b4631924J125071m40089K6017q65432R9554M4520m62323L13917K38000O99666L66864
4279b3486159K364463k450240l11296M41988R46474j831359J482153j600785j118067
$$ y = [-24612688, -23916185, -23980234, -25871391, -23934418, -25510375, -26016979, -25787672, -26282388, -26242280, -25345503, -25586855, -24861678, -24531267, -24435248, -24473975, -25031591, -25049794, -25395510, -25585878, -24824028, -24645074, -26203253, -25434253, -24934318, -24520944, -24501917, -25195332, -24821911, -24753075, -24115726, -24142103, -24403750, -24301488, -23888592, -23734230, -23484680, -23704152, -24175619, -24649572, -25078985, -23955838, -23784498, -24321443, -24442190, -24160135, -24966331, -25167082, -25284113, -25212213, -24605719, -23895897, -23995635, -24911469, -23884966, -23635108, -24325605, -24204120, -24349640, -24008143, -23226885, -23640991, -24641130, -24631924, -23506853, -23946942, -23920925, -24786357, -24686803, -24642283, -25104606, -24790689, -24552689, -23853023, -23486159, -21121696, -23571936, -23883232, -23441244, -22494770, -24326129, -22843976, -24444761, -25562828]
4270b5562828K172656p48809l78542o08616j05837O27065K38293k41062j427933O43542
4260b5392071J59250L71008n0822P64108k31206j070827Q15637K72027l80079k58990
4250b5001965n82037O69048o43267R94902m86714m46793P71563l39148M45721l5261K33031
4239b4420920M6469n04701n29209J233607j276578j28860O04011K39028m04581q1550
4229b5223284J016032k23709l57935r30297J851758j517737n58650M52595K345449q81655
4219b4027433j92197p89551J48061p49948K26428O75982r4552J091807p77086p95815
4209b5284304J541928j292987K57324O30221o18278N70118J80785l01112O89995j057365
4199b4683675p4336n95191J72870n80226l55969N31011r0033l21308j66589o8289N89907
$$ y = [-25562828, -23390172, -24138981, -24517523, -25126139, -25231976, -24604911, -24366618, -24607680, -26035613, -25392071, -25232821, -24861813, -24912635, -24148527, -24379733, -25450560, -24634923, -24362896, -24742975, -25001965, -25584002, -24914954, -25558221, -24563319, -25050033, -25496826, -24725263, -25064411, -24618690, -24653951, -24420920, -24374451, -24879152, -25408361, -24174754, -25451332, -25580192, -24976181, -24737153, -25141734, -25223284, -24207252, -24430961, -24788896, -25719193, -23867435, -25385172, -25943822, -25491227, -23145778, -24027433, -24219630, -25009181, -24861120, -25611068, -25384640, -24708658, -24803210, -23711403, -24488489, -25284304, -23742376, -25035363, -24778039, -24147818, -24766096, -24195978, -24015193, -24316305, -23626310, -24683675, -24758011, -25353202, -25180332, -25760558, -26116527, -25585516, -25675549, -25996857, -26163446, -26231735, -25641828]
4188b5641828M64985j36298R03943n13656K15424q19437J336771K36909L81195j099053
4178b4671045l73689l57523l72145J26793J092295L17707q15236O67352n29911j35622
4168b5051024J547318o66385P36766M36490j47658O37337l47797p50947K91771J77979
4158b3136150j190096N49108N25968j62477j959976J804872M1909M89624N0163L31392
4148b2655663m37623K99250k77939p8707N75995J76577j080671L28923L76204j526318
4138b4299972J075564K27402l95630o98753j34954R26100p90440J5519n01919J297977
4128b3279106K36818K89218Q2698l51470J422534r23928j6858r80014o43206R53027l56269
4117b3566556K80809Q07558m57492L893o65297K67109p5701J287702J75543n1812l36069
$$ y = [-25641828, -25176843, -25313141, -24409198, -24922854, -24707430, -25526867, -24190096, -23953187, -23571992, -24671045, -25044734, -25402257, -25774402, -25647609, -24555314, -24237607, -25052843, -24385491, -24915402, -25051024, -23503706, -24170091, -23433325, -22996835, -23144493, -22507156, -22854953, -23605900, -23314129, -23136150, -24326246, -23777138, -23251170, -23413647, -25373623, -23568751, -23526842, -23037218, -22987055, -22655663, -23093286, -22794036, -23071975, -23150682, -22574687, -22398110, -23478781, -23149858, -22773654, -24299972, -23224408, -22997006, -23392636, -24091389, -24226343, -23300243, -24090683, -24075164, -24577083, -23279106, -23042288, -22753070, -22670372, -23021842, -21599308, -22523236, -22540094, -23520108, -24163314, -23210287, -23566556, -23285747, -22478189, -22935681, -22931788, -23597085, -23329976, -23405677, -22117975, -21942432, -21994244, -22330313]
4106b2330313O86121l68780p54448K76575N88852k063484O23826K96498j444868J264149
4096b3225872n24733L55283Q06632n63703J014289K76347q49898J81592J031239l598
4086b1502422J69441J292720j888036q0195P88922j058702P90321n97382q29143R59153
4076b1955323o2843j6704l80151m96804R36794J759989q66220K735K26395K06613N13682
4065b0131837o64260J247433l99406k87974J091312k15438j33288P10737P2205L34431
4055a8376085O97474l2275j849234P07640J17221k88845M59523J30456R72039L25693P2306
4044a7064087k34452N84088o4570K38286m48535J697861k55962j37967N58146m12219M8443
4033a5490968j49462J388181j100978J3461J87472l48496j41269J537581M44278J08153
$$ y = [-22330313, -21644192, -22012972, -22767420, -22490845, -21901993, -23965477, -23341651, -23045153, -24490021, -23225872, -23750605, -23395322, -22588690, -23152393, -22138104, -21861757, -22711655, -22530063, -21498824, -21502422, -21332981, -20040261, -21928297, -22008492, -21219570, -22278272, -21487951, -22085333, -22914476, -21955323, -22018166, -22034870, -22415021, -22911825, -21975031, -20215042, -21081262, -21078527, -20852132, -20645519, -20131837, -20796097, -19548664, -19948070, -20236044, -19144732, -19360170, -19493458, -18782721, -18710516, -18376085, -17678611, -17710886, -19560120, -18852480, -18735259, -19024104, -18564581, -18434125, -17462086, -17136393, -17064087, -17298539, -16714451, -16779021, -16540735, -16989270, -15291409, -15547371, -15685338, -15127192, -15539411, -15490968, -15640430, -14252249, -15353227, -15339766, -15152294, -15500790, -15642059, -14104478, -13660200, -13552047]
4023a3552047J216691p20467p852N34443P22982m93274K2273R46435O63781m89331O54695
4012a0501671J311470L65001p07464P65434Q8291J127369J88370r09409J415146K23006
4002f634457P64694Q19783N68268j139370J754071j828055l26469o7453p51364P87199
3992f053153k32162K869239Q72745J214522j85816K63243M5262J061799o0881N83092
3982C77890J777613J56376N01645l23613j900210j248263o20057j116984M89464p1350
3972a977489Q63627o78400J599933R88632J031020q30237O64987J375344K070660R61398
3962F069475K117639P95407j033259j624828n21997k18041j023931m78585j19591j085460
3952B876829l79708M88191P04819J267861L50718J085867P91638K04624Q99771R52543
$$ y = [-13552047, -12335356, -13055823, -13063675, -12529232, -11806250, -12299524, -12277251, -11330816, -10667035, -11156366, -10501671, -9190201, -8825200, -9532664, -8767230, -8678939, -7551570, -7363200, -8272609, -6857463, -6634457, -5869763, -5049980, -4481712, -5621082, -3867011, -5695066, -6021535, -6088988, -6840352, -6053153, -6285315, -3416076, -2543331, -1328809, -1514625, -1251382, -1206120, -144321, -205202, 377890, 2155503, 2311879, 2813524, 2489911, 589701, -658562, -1278619, -2395603, -1906139, -1977489, -1113862, -1792262, -192329, 796303, 1827323, 997086, 1662073, 3037417, 5108077, 6069475, 8187114, 8982521, 7949262, 6324434, 5802437, 5584396, 4560465, 4081880, 3962289, 2876829, 2497121, 2985312, 3690131, 4957992, 5308710, 6394577, 7186215, 7390839, 8290610, 9243153]
3942I243153J626397R95673J41295n21854j43851L21400M074701n745503j199224Q25651
3932I617838J311730J465730m2673k18345N91989J467036j945869R07978M37869n17626
3922A3075657J263332l12435P61680l58027l45977J458815L63813m87125P67895J166866
3912A7354494R84877l7787J859416j772050K318873M86743l99444J57056J586540P32588
3902B3271306J128225K11616m48980N29754O40784K06318J488294J832874K838062N05375
3892C2203628J926140k40366J29926J596195R43541R43184J515832K767012K844480
3883D4629572J773723O58336J461801J670142K290566J668992K509633K377902K003246
3874F1043913J455852J027526J292303L51485J44434K210600K749287L521141M619700
$$ y = [9243153, 10869550, 11865223, 12006518, 11484664, 11340813, 11662213, 15736914, 9991411, 8792187, 9617838, 10929568, 12395298, 12352625, 12134280, 12726269, 14193305, 12247436, 13155414, 13593283, 13075657, 14338989, 14026554, 14788234, 14430207, 14084230, 15543045, 15906858, 15419733, 16187628, 17354494, 18339371, 18301584, 20161000, 18388950, 20707823, 21194566, 20795122, 20952178, 22538718, 23271306, 24399531, 24611147, 24162167, 24691921, 25332705, 25539023, 27027317, 28860191, 31698253, 32203628, 34129768, 33889402, 34019328, 35615523, 36559064, 37502248, 39018080, 41785092, 44629572, 46403295, 47061631, 48523432, 50193574, 52484140, 54153132, 56662765, 59040667, 61043913, 62499765, 63527291, 64819594, 65171079, 65315513, 67526113, 70275400, 73796541, 78416241]
3865G8416241M386827L098182L706497L652487M565291M247140M045091L876681M729650
3856A14724087M408158M069428L713509K58579l066683p33096L55845L505280M823668
3847A32058775N398531N582647P461307P248205N957095O617923P776540Q581175P881360
3838A94563558P140407Q390996M880346M218058J607157L60149O88806L667342O216348
3829B31733167O805531R891456J1409570J1384109J2526165J2677704J2809656J1293146
3821C20530504J1407551J1953445R552911J0717086J3176296J1454065O546174K852428
3813C98190460N702657Q184295J0262623J4017387J7807222J8950465J9268790J9138208
3805E11522107J6809098J2649216J3234886J4885288J6458227J9574775K0643626J9494387
$$ y = [78416241, 82803068, 85901250, 89607747, 93260234, 97825525, 102072665, 106117756, 109994437, 114724087, 119132245, 123201673, 126915182, 127173761, 124107078, 123373982, 123729827, 127235107, 132058775, 137457306, 143039953, 150501260, 157749465, 163706560, 170324483, 178101023, 186682198, 194563558, 201703965, 210094961, 214975307, 219193365, 220800522, 221160671, 221849477, 225516819, 231733167, 238538698, 248430154, 259839724, 271223833, 283749998, 296427702, 309237358, 320530504, 331938055, 343891500, 353444411, 364161497, 377337793, 388791858, 395338032, 398190460, 403893117, 412077412, 422340035, 436357422, 454164644, 473115109, 492383899, 511522107, 528331205, 540980421, 554215307, 569100595, 585558822, 605133597, 625777223, 645271610]
3797F45271610J2237696P147973L087309M495330P259932J0307375J4975955J9330273
3789G24113453K4090140K2393565K0222840J8416410J8274753J7464936J9778924K4430001
3781H89185022K4495739K3812693J9547421J4696815J0542415J2168189J2079255J3659552
3773A020187101J2097455P413408R757906K0186746K1782667K0954981J8175898K1182833
3765A151738995L2290853M7257409M7236333L6984930M5965605Q0786877J07241548
3758A549502550R3707841O1793582N4030300N6844635M1026499L531012k7532668m074209
3750A828829542N8747524J07178108P2855603o2902979j66793207j66869902j00224255
3743A570820434k7335507K4879436Q9974223J29279254J25781210J04991344O7169106
$$ y = [645271610, 657509306, 664657279, 667744588, 672239918, 679499850, 689807225, 704783180, 724113453, 748203593, 770597158, 790819998, 809236408, 827511161, 844976097, 864755021, 889185022, 913680761, 937493454, 957040875, 971737690, 982280105, 994448294, 1006527549, 1020187101, 1032284556, 1039697964, 1049455870, 1069642616, 1091425283, 1112380264, 1130556162, 1151738995, 1184029848, 1231287257, 1278523590, 1315508520, 1361474125, 1442261002, 1549502550, 1643210391, 1705003973, 1759034273, 1815878908, 1856905407, 1860436419, 1832903751, 1828829542, 1887577066, 1994755174, 2067610777, 2004707798, 1837914591, 1671044689, 1570820434, 1543484927, 1568364363, 1658338586, 1787617840, 1913399050, 2018390394, 2085559500]
3736B085559500J6933167k8657383l9607820j2016555L2645301N4861086P048037p9461453
3728B037303880j70256126k05206399k03566445k09217483j87257797j22760816j3600586
3721I25438228O3247794O7765471L3577770l742508k0941079k8492509m9666223p6506184
3713I10680760n7717189K2418018Q5204455N0217688r2978512k25990025k40279571
3706D51555624j66943601j00106657o4099561k8550969N720731P504736J286773j1368118
3698I4998958k6380600l3328415k4493468q102101o585273j1998708j2597804m730932
3690c3218343M547036J2594846J3417317N635299l326324J745677M47046n00176M313797
3681E656175R838228J0116862M344799M51922l211012p287797q310039j2282634j1235247
$$ y = [2085559500, 2102492667, 2073835284, 2034227464, 2022210909, 2054856210, 2109717296, 2116765333, 2037303880, 1867047754, 1661841355, 1458274910, 1249057427, 1061799630, 939038814, 925438228, 988686022, 1056451493, 1090029263, 1086286755, 1065345676, 1036853167, 987186944, 910680760, 852963571, 875381589, 960586044, 1010803732, 917825220, 691835195, 451555624, 284612023, 184505366, 120405805, 91854836, 97575567, 105080303, 106367076, 94998958, 68618358, 35289943, 10796475, 2694374, -3890899, -15889607, -28487411, -33218343, -28671307, -16076461, -2659144, 2976155, -350169, 1395508, 1842554, 1342378, 5656175, 15494403, 25611265, 29956064, 30407986, 27196974, 19909177, 11599138, -683496, -11918743]
3672a1918743n227115j38428j41408l793548j668011l288711l812950L088447M392658
3663b2507809L282462M022437M917980N396635K524198k358855o108970p756189n783498
3654b4371609m972238l803129P3114J173576J636198k82321q39488k857317l550988
3645c7794202j429046J168721K024125J432470K559446Q91264J352536L309169J665021
3636b4820496j42042j25146J463595K423890J671403J815370L345133k618502k623414
3627a9610209r26203j574807r32988P10792J574442J808841L501440M670540J511806
3618i266346O23439m57541j986482j548953q71293l6542o16162n2631P7058l930374
3608a8065827j510045r89151J594933J008880K414825J637348N214109K718266K514069
$$ y = [-11918743, -17145858, -17284286, -17425694, -21219242, -22887253, -26175964, -29988914, -26900467, -22507809, -19225347, -15202910, -10284930, -4888295, -2364097, -4722952, -10831922, -18588111, -24371609, -29343847, -33146976, -33073862, -31900286, -30264088, -30546409, -31385897, -34243214, -37794202, -39223248, -38054527, -36030402, -34597932, -32038486, -31147222, -29794686, -26485517, -24820496, -24962538, -25087684, -23624089, -21200199, -19528796, -17713426, -14368293, -16986795, -19610209, -20536412, -22111219, -23044207, -22333415, -20758973, -18950132, -15448692, -10778152, -9266346, -8642907, -9100448, -11086930, -12635883, -13507176, -13543718, -14159880, -14212511, -14135453, -18065827, -19575872, -20565023, -18970090, -17961210, -15546385, -13909037, -8694928, -5976662, -3462593]
3599c462593K336926J29745k32831J51384p05716J90480j432851j702696m29355L90264
3589d767243o55185l44512K304708J970130P09468O28405N65661K346075J069515L343187
3579G170209J172687j29435j61407p95967k649705k788447j157852k067752j468063M44332
3569b431400k55042R9535j30249l7637J315746p22088l01718O64265J825854l50532N29614
3558B06348j003708q54098j194013p28991j312517Q36199j87238J76867J28066O13350
3548c319735R08093p85163l92665R61102M19169L07031J415466J469071q5978m65109
3538D31282l96496l28701K66572k13618l34297M2836m21258N04430O06522J632992Q25688
3527B615952o41414J116322o64184J257520P30520R39889J514620P26902l67463J123201
$$ y = [-3462593, -1125667, -995922, -1228753, -1077369, -1783085, -1592605, -3025456, -4728152, -5157507, -4767243, -5422428, -5766940, -3462232, -1492102, -782634, -154229, 411432, 2757507, 3827022, 7170209, 8342896, 8213461, 8052054, 7256087, 4606382, 1817935, 660083, -1407669, -2875732, -2431400, -2686442, -2586907, -2717156, -2754793, -1439047, -2161135, -2462853, -1798588, 27266, -323266, 206348, -797360, -1651458, -2845471, -3574462, -4886979, -4050780, -4238018, -4061151, -3933085, -3319735, -2411642, -3196805, -3589470, -2628368, -2209199, -1902168, -486702, 982369, 896391, 431282, 34786, -293915, -27343, -240961, -575258, -532422, -953680, -449250, 157272, 1790264, 2615952, 1974538, 3090860, 2426676, 3684196, 4414716, 5354605, 6869225, 7596127, 7228664, 8351865]
3517H351865J420963k993708p44029L714697J83483m91290N02528K92246m18454n34981
3507I283320L66588L10698P90616J050951P60277J789219N17077J375675l357105L146694
3497A6034010K584342O08536Q59733P06687J601758l97228J450670j404312r94053j691027
3487A9359116j234291j56261K147809j445199N03332N36985K617826L85207j48966m72482
3477B2093076R65713J777841J157316J271600N0447j872348j062265o3585j852779k399701
3467B0065315l95317J820970j195441J116792j4706Q60650J039531k721053O16736J96983
3457B1390460Q36251j377835M21805O46594M03493k2117m71345o81193m98307j234484
3447A9413322j00629J561371L83757k82174O73372M13414K51988R13002N84409J097936
$$ y = [8351865, 9772828, 6779120, 6035091, 9749788, 9933271, 9441981, 9944509, 10236755, 9818301, 9283320, 9649908, 9960606, 10751222, 11802173, 12562450, 14351669, 14868746, 16244421, 12887316, 16034010, 18618352, 19226888, 20086621, 20793308, 22395066, 21997838, 23448508, 22044196, 21050143, 19359116, 18124825, 17968564, 20116373, 18671174, 19174506, 19711491, 22329317, 22714524, 22565558, 22093076, 23058789, 24836630, 25993946, 27265546, 27315993, 25443645, 24381380, 24317795, 22465016, 20065315, 19669998, 21490968, 20295527, 21412319, 21397613, 22258263, 23297794, 20576741, 21193477, 21390460, 22226711, 20848876, 21270681, 21917275, 22320768, 22298651, 21827306, 21146113, 20647806, 19413322, 19312693, 20874064, 21257821, 20975647, 21649019, 22062433, 22314421, 23227423, 23811832, 24909768]
3437B4909768N22534k62964J238716j279060K053847q55726K165140l38838M14802J098101
3427B9666320Q04321K41299K794909K62317L34121j71116K337672K6174J632176j96626
3417C7731567J56878J482234O56568P01681J42852m29356J101538l88914K401061J033039
3407D4589148J79290P02544R35093N69478J031706J319103M46924J001600J086121Q89400
3397E2750407q13986K044661k15676K507705P91773j4701J208358O70726Q90213J611497
3387F1430977K64986J292413J995326Q49186M53727J266943J322999J040014K79530
3378G0196101J378700L14570J331437K747531l30651J250018J034309J946379K290074
3369H2158468K25023J012505N92382J588237J653405K320902J129621K16365J480482
$$ y = [24909768, 25432302, 25169338, 26408054, 25128994, 27182841, 26327115, 28492255, 28153417, 28568219, 29666320, 30470641, 30711940, 33506849, 33769166, 34103287, 33932171, 36269843, 36296017, 37928193, 37731567, 37888445, 39370679, 40027247, 40728928, 40871780, 40442424, 41543962, 41155048, 43556109, 44589148, 44768438, 45470982, 46406075, 46975553, 48007259, 49326362, 49773286, 50774886, 51861007, 52750407, 51936421, 53981082, 53765406, 56273111, 57064884, 57050183, 58258541, 58929267, 59819480, 61430977, 61695963, 62988376, 64983702, 65832888, 66286615, 67553558, 68876557, 69916571, 70196101, 71574801, 71889371, 73220808, 75968339, 75637688, 76887706, 77922015, 79868394, 82158468, 82383491, 83395996, 83988378, 85576615, 87230020, 89550922, 90680543, 90896908, 92377390]
3360I2377390J261655J702125K230468J145012R93982J418124J305471J488731K446443
3351A06369401J785657J258241J326662J771609J357755K426562J734299J173227K813809
3342A22017222J222992K285455J436800L332883L021880J146678J818353J819655K754718
3333A40856636J922681K929956L647117L692079N75695K215557K492018K882372K363259
3324A63577370L075167L919961L140206L197055L024083L181879K356822M172169L404093
3315A93048805L304550N485577M303388L334932L896482L710701L795732L883511L425719
3306B28189397M522197M146350N779977M788300K981826N771305N293053N318588N241245
3297B72032238N682060O377708N706782M973707N782147N912235N953010N295332N710601
$$ y = [92377390, 93639045, 95341170, 97571638, 98716650, 99710632, 101128756, 102434227, 103922958, 106369401, 108155058, 109413299, 110739961, 112511570, 113869325, 116295887, 118030186, 119203413, 122017222, 123240214, 125525669, 126962469, 130295352, 133317232, 134463910, 136282263, 138101918, 140856636, 142779317, 145709273, 149356390, 153048469, 153624164, 155839721, 158331739, 161214111, 163577370, 166652537, 170572498, 173712704, 176909759, 179933842, 183115721, 185472543, 189644712, 193048805, 196353355, 201838932, 206142320, 209477252, 213373734, 217084435, 220880167, 224763678, 228189397, 232711594, 236857944, 242637921, 247426221, 250408047, 256179352, 261472405, 266790993, 272032238, 277714298, 284092006, 289798788, 294772495, 300554642, 306466877, 312419887, 317715219, 323425820]
3288C23425820O328966P158619M706451P857077O164513O858374P380054P601013N827155
3279C83308042Q595067O864670Q349504P298676P941725Q787175P868115R017616Q368615
3270D56399205P625547R144158Q423470Q111054R363596R592240R611496Q710833R908280
3261E36889879J0440589J0393023J0341834J0736694J1437571R661974R977220J2451691
3253F22330475J0284900J1663131J1950743J0449505J1988725J3196951J1301437J1583488
3245G14749355J2712711J2441853J3187498J2775793J2857365J2461937J4759435J2728551
3237H18674498J5140441J4384859J4090760J7785689J1683562J4107742J3438472J4793918
3229I34099941J3893394J5692491J5426936J7353693J4620707J6423811J6375484J5076786
$$ y = [323425820, 329754786, 336913405, 341619856, 349476933, 355641446, 362499820, 369879874, 377480887, 383308042, 391903109, 398767779, 407117283, 414415959, 422357684, 431144859, 439012974, 448030590, 456399205, 464024752, 473168910, 481592380, 489703434, 499067030, 508659270, 518270766, 526981599, 536889879, 547330468, 557723491, 568065325, 578802019, 590239590, 599901564, 609878784, 622330475, 632615375, 644278506, 656229249, 666678754, 678667479, 691864430, 703165867, 714749355, 727462066, 739903919, 753091417, 765867210, 778724575, 791186512, 805945947, 818674498, 833814939, 848199798, 862290558, 880076247, 891759809, 905867551, 919306023, 934099941, 947993335, 963685826, 979112762, 996466455, 1011087162, 1027510973, 1043886457, 1058963243]
3221A058963243J6116431J6195626J6864154J7203080J6591737J8654456J5707015
3214A176295742J9019545J7258136J7084993J7666493J7007366J7712104J8574610
3207A300618989J6879991J7476437J7711596J7429004J6642891J8402815J7409985
3200A422571708J5890863J8130669J5352542J6543271J6400362J5455667J4692013
3193A535037095J5663189J3879246J4018193J2525714J2352364J1777899J1613980
3186A626867680J1313927J0027477O946745Q009765P748526N622887L006292O502129
3178A686045428K403520J496642J566248r27983r49290l668541n735105o685688o965020
3169A666580211r426090j2128586j0737397j4556407j4229732j7692856j6349972j9836979
$$ y = [1058963243, 1075079674, 1091275300, 1108139454, 1125342534, 1141934271, 1160588727, 1176295742, 1195315287, 1212573423, 1229658416, 1247324909, 1264332275, 1282044379, 1300618989, 1317498980, 1334975417, 1352687013, 1370116017, 1386758908, 1405161723, 1422571708, 1438462571, 1456593240, 1471945782, 1488489053, 1504889415, 1520345082, 1535037095, 1550700284, 1564579530, 1578597723, 1591123437, 1603475801, 1615253700, 1626867680, 1638181607, 1648209084, 1655155829, 1663165594, 1670914120, 1676537007, 1679543299, 1686045428, 1688448948, 1689945590, 1691511838, 1690583855, 1689634565, 1685966024, 1680230919, 1673545231, 1666580211, 1657154121, 1645025535, 1634288138, 1619731731, 1605501999, 1587809143, 1571459171, 1551622192]
3161A551622192k1246907k2202130k3163676k3409529k6111037k6051110k7110937
3154A382326866k8525357k8925924k9551663l0126751k8680129l1061283l0581037
3147A174874722k9926284l1348366k9988192k9795430k9510636k8886809k8826496
3140I66592509k8262439k7877176k6109195k6830959k5074802k4393512k3904810k1992382
3132G62147234k1512813k2226816k1535660j9351051j9014413j9214129j7867697j6899826
3124F04524829j6286741j7520993j5752355j4394426j4602080j3520475j3256342j3563921
3116D85627496j3799211j1146393j2351519j0805829j0202451p763268j0922107r906315
3108C98730403r694122r768364r169508j0403692q274309q495833p957729o529645p517847
$$ y = [1551622192, 1530375285, 1508173155, 1485009479, 1461599950, 1435488913, 1409437803, 1382326866, 1353801509, 1324875585, 1295323922, 1265197171, 1236517042, 1205455759, 1174874722, 1144948438, 1113600072, 1083611880, 1053816450, 1024305814, 995419005, 966592509, 938330070, 910452894, 884343699, 857512740, 832437938, 808044426, 784139616, 762147234, 740634421, 718407605, 696871945, 677520894, 658506481, 639292352, 621424655, 604524829, 588238088, 570717095, 554964740, 540570314, 525968234, 512447759, 499191417, 485627496, 471828285, 460681892, 448330373, 437524544, 427322093, 419558825, 408636718, 398730403, 389036281, 379267917, 370098409, 359694717, 351420408, 342924575, 334966846, 328437201, 320919354]
3099C20919354q694700o984619q005672q921178o414851n608222l853936m400113n301593
3090B62734470m751954m500697q062064n760568n359128m912623m504300n154772l986926
3081B15741438l933305l785471m469956l761365l950708l229814k788538k028146l068401
3072A84725734j817256k839681l960768o75724m133210l155216k114370m518461n512105
3063A55998943J682653j758164q15250k173015j360136j737920k053253k834202r19118
3054A44030538j999021j639164k280283q94233j553684m86598j473523j531400j229201
3045A30943431k397693q53284j506732R24520l75156m31644j740801J05469k057717
3036A22610393j130420N62108L64740j58005o99564j229125j826996q15036N09543m96143
$$ y = [320919354, 312224654, 305240035, 297234363, 288313185, 281898334, 276290112, 272436176, 268036063, 262734470, 257982516, 253481819, 245419755, 239659187, 234300059, 229387436, 224883136, 219728364, 215741438, 211808133, 208022662, 203552706, 199791341, 195840633, 192610819, 189822281, 187794135, 184725734, 182908478, 180068797, 176108029, 175432305, 171299095, 168143879, 166029509, 161511048, 155998943, 157681596, 155923432, 155108182, 152935167, 151575031, 149837111, 147783858, 144949656, 144030538, 142031517, 140392353, 138112070, 137217837, 135664153, 135177555, 133704032, 132172632, 130943431, 128545738, 127692454, 126185722, 127110242, 126735086, 126303442, 124562641, 124668110, 122610393, 121479973, 122042081, 122406821, 122248816, 121549252, 120320127, 118493131, 117678095, 118187638, 117691495]
3026A17691495j117653n21108J760144J681853J265724j31323L05402l38411M78806
3017A21074929j128110P87861J489681K125691N08585L85517P19275r7659J641261R02865
3007A28409896P34908K472786K728945N77573N64484l20166j837118K63106J464838
2998A35059252K348455L268882M048576K987067K474765K938844K809316M539430R18064
2989A61392651M424692L440714L107021M411866M935350N03676p44821l227110j019800
2980A77224239J86007K431372M468344N354654N148157N578974P360932M550751N662660
2971B17966090R124820Q690853Q606344O464830M744201L902195M264701K953157O90199
2962B67407390L25989J966528P635572P253723R302137J1482602J2419712J3055714
$$ y = [117691495, 116573842, 116052734, 117812878, 119494731, 120760455, 120629132, 120934534, 120596123, 121074929, 119946819, 120734680, 122224361, 124350052, 124858637, 125244154, 125963429, 125865770, 127507031, 128409896, 129144804, 131617590, 134346535, 134924108, 135488592, 135168426, 133331308, 133594414, 135059252, 137407707, 140676589, 144725165, 147712232, 150186997, 153125841, 155935157, 160474587, 161392651, 165817343, 169258057, 172365078, 176776944, 181712294, 182215970, 181471149, 178244039, 177224239, 177410246, 179841618, 184309962, 189664616, 194812773, 200391747, 207752679, 212303430, 217966090, 227090910, 235781763, 244388107, 250852937, 255597138, 259499333, 263764034, 266717191, 267407390, 267733379, 269699907, 277335479, 284589202, 293891339, 305373941, 317793653, 330849367]
2954C30849367J2954433J2178719R724090J1501104J0950831J0300531J1873861J3456555
2946D23789491P960045M786678M574933O872595N892222J0542865J4872864J7314994
2938D96606687J8612693K1079392K0600570J5103006J3238046J3922828J3528474J6011842
2930F28703538J8070723K1208783J8417364J1121070M467849N70541M445998P906977
2922G14912843R333408J5657311J9734970K3156613K1640615J9083101J9271477J7042325
2914H59832663J8237465K3337149K2240091K1123803K0875543J7535677J5015687J3161851
2906A011359929J0120444J2181496J3910752R494057N331883J0187640K0350304K4853557
2898A117790062K4089864J9747572K1349367L9701864N4407393M8443744L8758613
$$ y = [330849367, 343803800, 355982519, 365706609, 377207713, 388158544, 398459075, 410332936, 423789491, 431749536, 436536214, 441111147, 447983742, 453875964, 464418829, 479291693, 496606687, 515219380, 536298772, 556899342, 572002348, 585240394, 599163222, 612691696, 628703538, 646774261, 667983044, 686400408, 697521478, 701989327, 702559868, 707005866, 714912843, 724246251, 739903562, 759638532, 782795145, 804435760, 823518861, 842790338, 859832663, 878070128, 901407277, 923647368, 944771171, 965646714, 983182391, 998198078, 1011359929, 1021480373, 1033661869, 1047572621, 1057066678, 1062398561, 1072586201, 1092936505, 1117790062, 1141879926, 1161627498, 1182976865, 1222678729, 1277086122, 1325529866, 1364288479]
2891A364288479N3592705R0402888J11777897J00402592P1656486O0969720N1648631
2884A904739398K8935814q142629l2751208O938681Q2210184J19850403M5703004
2877B147483647j14109612k02769221j71831239p9724579j5391579K8054332Q9262994
2870A680974743J31810148J36075774R7668487M0419768r778812k8415651j2856042
2863B035898415M781135J3968928k092003k5816658n5723710j25186399j94081170
2856A651748538k46720373k34150661j75992465r6030599m31444N9500134O5197822
2849A023120952L0460398j0413687k8833762m4676218o6245669p4280161k7977619
2842H01154234M6791389P5684667J4950396j31537286k21189835k00669542j27313855
$$ y = [1364288479, 1417881184, 1508284072, 1620061969, 1720464561, 1792121047, 1853090767, 1904739398, 1933675212, 1925532583, 1892781375, 1899720056, 1981930240, 2101780643, 2147483647, 2033374035, 1830604814, 1658773575, 1579048996, 1563657417, 1591711749, 1680974743, 1812784891, 1948860665, 2046529152, 2086948920, 2077170108, 2048754457, 2035898415, 2040679550, 2054648478, 2052556475, 2026739817, 1971016107, 1845829708, 1651748538, 1405028165, 1170877504, 994885039, 898854440, 898422996, 957923130, 1023120952, 1053581350, 1043167663, 1014333901, 969657683, 903412014, 829131853, 801154234, 847945623, 923630290, 938580686, 807043400, 585853565, 385184023, 257870168]
2835B57870168p7942776n0762537j1782877P145086K285239l124237j3131787k6809912
2827H3746367k9165763j6627614p882375r469845j2387901j2556412m828397Q478129
2819f93811J3513647J0572490J885285p518485K001284N1860J131733P517839Q779726
2810C7241568P841687L178191k374128m073969p014035j1556817j0507423q495589n836868
2801a597383l89824j511756k016711k894573l486943k200448K097727L541182K720043
2792e738686M846993M603449N887574L742594q075068o800221o238611m645407l428314
2783a5845697l629441m06549J745574J174416K85384j638088l148527k865329j009914
2774b5338171J259809J957263J594405J76029J555332K223757J119091Q13589r80436
$$ y = [257870168, 179927392, 129164855, 117381978, 124527064, 126812303, 123688066, 110556279, 83746367, 54580604, 37952990, 30070615, 20600770, 8212869, -4343543, -9171940, -693811, 12819836, 23392326, 25277611, 17759126, 19760410, 19812270, 20944003, 28461842, 37241568, 45083255, 48261446, 45887318, 41813349, 34799314, 23242497, 12735074, 4239485, -1597383, -1987207, -3498963, -5515674, -8410247, -11897190, -14097638, -11999911, -8458729, -5738686, -891693, 3711756, 9599330, 13341924, 5266856, -1533365, -7771976, -12417383, -15845697, -19475138, -19881687, -18136113, -16961697, -16676313, -18314401, -21462928, -24328257, -25338171, -24078362, -22121099, -20526694, -20350665, -18795333, -16571576, -15452485, -14638896, -15619332]
2765a5619332N20562J827530M647509K49497L8095N25369k110223j549841l400171l87203
2755a5258208L29040J147350K498612R18873L415060L174960L6706J213869r11429j301326
2745d736493j638560j781053O04675p25494k92656m88839l22663k700410o03460J254074
2735a1430879j65452L351277J785185K131178L197379K791347J540536k48096K87792j177
2725C239090l215599Q70529j012996o63530k67083n36295L2236j1716K261179j3732L26974
2714A009057J442381K11856J300393J656293K456900N91568r64732j066571k75467j874724
2704D486954j783050l712358p30558j150727j384940J22784L72855Q31248j061717o27606
2694d637115j71093K31246N2295J187669J467678q8412j127013j282316j441981j215987
$$ y = [-15619332, -15098770, -13271240, -8623731, -8374234, -8336139, -7810770, -9920993, -11470834, -14871005, -15258208, -14929168, -13781818, -11283206, -10364333, -6949273, -3774313, -3737607, -2523738, -3435167, -4736493, -6375053, -8156106, -7551431, -8276925, -8569581, -9058420, -9381083, -12081493, -12684953, -11430879, -11596331, -8245054, -6459869, -4328691, -1131312, 1660035, 3200571, 2952475, 3240267, 3239090, 23491, 894020, -118976, -782506, -1049589, -1585884, -1553648, -1565364, 695815, 682083, 1009057, 2451438, 2663294, 3963687, 5619980, 8076880, 8668448, 7703716, 6637145, 6361678, 4486954, 2703904, -1008454, -1739012, -2889739, -4274679, -4151895, -3779040, -2947792, -4009509, -4637115, -4808208, -4576962, -4524667, -3336998, -1869320, -1957732, -3084745, -4367061, -5809042, -7025029]
2684g025029r95739m8950n0445R45331l83591O48631m42381l94074m18084P62483M99041
2673f902807Q76150J96301o91178J465201P03146n5659m88728j432926j57033j099218
2663g586751N22384n28231M05735K2536J106034M19606m49670l78863j07968Q77531N04492
2652e193165L96723J107180L88389O05006O92115o58879O51137q6179J885719J130986
2642I19032J71729l48022O41124m43477j81171o75722N75996n94139J5249P34977O72145
2631A487721q60710M83213l33801j618369O893110j565208J160730K045033k83066Q32992
2621H241645j933538m47920j354428J95787n48375k77039J226698j443138j023841l05566
2611B330285k68114R91944m637128m12657p3491J125245J177049j37043p1219j237619
$$ y = [-7025029, -8020768, -8069718, -8120163, -7174832, -7558423, -6909792, -7352173, -7746247, -8164331, -7401848, -6902807, -6026657, -5830356, -6521534, -5056333, -4353187, -4408846, -4897574, -6330500, -6487533, -7586751, -7064367, -7592598, -7186863, -7164327, -6058293, -5638687, -6088357, -6467220, -6575188, -5697657, -5193165, -4796442, -3689262, -3300873, -2695867, -2003752, -2662631, -2011494, -2097673, -211954, 919032, 1090761, 742739, 1383863, 940386, 759215, 83493, 659489, 65350, 80599, 815576, 1487721, 627011, 1110224, 776423, -841946, 6051164, 4485956, 5646686, 7691719, 7408653, 8241645, 6308107, 5860187, 4505759, 4701546, 4153171, 3876132, 5102830, 3659692, 2635851, 2330285, 2062171, 3054115, -1583013, -1995670, -2069161, -943916, 233133, 96090, 24871, -1212748]
2601a212748m88076q14367j288173l78529n94567k82060R51395j235230J71118j049615
2591f220852k443624k93625n50071K36487l35842q12366Q89562J68037j347923q50536
2581a1560753q25329J265643j7996m61789J96195P4604J58236k47467Q36118m60675j10601
2570a1153814L0899n0763K28924M67979J30880p97086j43042n9139k04537r55079L60757
2559a2144021n50962o71374N234N69079m53301L88057n131K40952Q0261m13978J01040
2548a2854144M53736L77060R74116n50479j94726j171896R1963Q16089l46264o14723
2538a3019268j74144m30814R49366n39748m08047O73113m80887K11474k064728J026071
2528a4257612L7386j00873J101893N48586p63415N47119q38880m28809N59321r07832
$$ y = [-1212748, -1700824, -2515191, -3803364, -4181893, -4776460, -5058520, -4107125, -5342355, -5171237, -6220852, -8664476, -8958101, -9508172, -9271685, -9607527, -10419893, -9530331, -9362294, -10710217, -11560753, -12386082, -11120439, -11138435, -11600224, -11404029, -11329425, -11171189, -11418656, -10582538, -11043213, -11153814, -11122915, -11173678, -10944754, -10476775, -10345895, -11142981, -11286023, -11345162, -11549699, -12504778, -12144021, -12694983, -13366357, -13361123, -12792044, -13245345, -12857288, -12862419, -12621467, -12541206, -12955184, -12854144, -12400408, -12023348, -11049232, -11599711, -11794437, -12966333, -12874370, -12058281, -12404545, -13019268, -13193412, -13624226, -12674860, -13214608, -13622655, -12949542, -13430429, -13218955, -15283683, -14257612, -14220226, -14321099, -13219206, -12670620, -13434035, -12886916, -13725796, -14154605, -13595284, -14503116]
2518a4503116m05576m10817j90218N28414M85887K55571l01860J23216o33732j470047
2508a6522278P94669L36607r2039q85892m18399L30393O54743l01166K28030J01230M66488
2497a5307614j322867k16017J80749l84267M06606N73358k77654N05955k054161k21203
2487a8117115L60777M97510o52918o4137J82228m18484J81781J338030N7994q23115q38810
2476a8296259J477159k31317q62834Q40015o93596J66677n88629L00435j39797l87585
2466a8415731m19297K49201O29863J786891j491198o05368J241461m29591p71381k16203
2456a8441353R6341P92799K56840n71321l26529O062l69914K32009k78211j95694J355923
2445a7443048Q8926P26521j320309p54125J128965q61311J173833p14493L49963j37862
$$ y = [-14503116, -14908692, -15319509, -15509727, -14981313, -14495426, -14239855, -14541715, -14418499, -15052231, -16522278, -15727609, -15391002, -15483041, -16368933, -16787332, -16456939, -15802196, -16103362, -15875332, -15774102, -15307614, -16630481, -16846498, -16665749, -17050016, -16643410, -16070052, -16347706, -15841751, -17895912, -18117115, -17756338, -17258828, -17911746, -17975883, -17793655, -18212139, -18030358, -16692328, -16634334, -17457449, -18296259, -16819100, -17050417, -17913251, -17073236, -17766832, -17600155, -18188784, -17888349, -18028146, -18415731, -18835028, -18585827, -17955964, -16169073, -17660271, -18265639, -17024178, -17453769, -18225150, -18441353, -18345012, -17552213, -17295373, -17866694, -18193223, -18187161, -18557075, -18325066, -18603277, -18798971, -17443048, -17354122, -16627601, -17947910, -18702035, -17573070, -18434381, -17260548, -17975041, -17625078, -17762940]
2435a7762940J13425o84903J551565l96232P32j83736o95854L72218k94507K45822q78726
2424a8613136O13838m80353Q19302j85765K99682J89678k65105L38445n67309M3452j08948
2413a7916219J068569q79822Q71210j206350k21924j59403N94543l94459k8215j23045
2403a8395115J431499j130810l8307m37618k41358K09087n1987P109o22108K34267j2716
2392a9048057j52483L05207j797035J295957j406542P78984J318639P26137k056701M12493
2382a9623401j020478M17433k69199J46779P74871O49100j584222j29081N8215l5610
2372b0615593j71416K494605j109022N4855N3599k087652J576744l37943j3844m1726
2362b0197393O96816k52783l53076j30731J21940j46458o5181j151387Q98019J53267L0861
$$ y = [-17762940, -17649515, -18334418, -16782853, -17179085, -17178353, -17362089, -18057943, -17685725, -17980232, -17734410, -18613136, -17999298, -18479651, -17660349, -17846114, -17546432, -17356754, -17621859, -17283414, -17850723, -17807271, -17916219, -16847650, -17727472, -16856262, -18062612, -18284536, -18443939, -17849396, -18243855, -18272070, -18395115, -16963616, -18094426, -18132733, -18570351, -18811709, -18602622, -18654609, -18647500, -19269608, -19035341, -19048057, -19200540, -18895333, -20692368, -19396411, -20802953, -20023969, -18705330, -17979193, -20035894, -19623401, -20643879, -20226446, -20495645, -20348866, -19573995, -18924895, -20509117, -20638198, -20579983, -20615593, -20787009, -18292404, -19401426, -19346571, -19292972, -21380624, -19803880, -20141823, -20155667, -20197393, -19500577, -19753360, -20106436, -20237167, -20115227, -20261685, -20326866, -21478253, -20580234, -20426967, -20396106]
2351b0396106N30252q87027J85951o22055M48253P46959J36289n65358j82984J19272Q435
2340b0478119p85731N12291O60183J58132p64084P34676o2542j40226K74746J42509Q3200
2329a9664965r08404j747140n87488P79935o5235J120948j61699j256672j99644Q19148
2319b1871216p08686o43793J903834l94285n7064K95574J099996o37027o07322J65899
2309b1454090L53391L24303j74794o6544m88399Q95164k14786Q7114j431548Q52156j45892
2298b1463925k37726k56459K29814K9806K87355L15263l23830r53541J442781j096328
2288b2026790K57751J094403m4551J69246J21694j25792k00207K51217M53498R64039
2278a9085492j020463L23766j356484j08481P67048M02920o25979k44216m17150l33035
$$ y = [-20396106, -19865854, -20752881, -20566930, -21188985, -20740732, -19993773, -19857484, -20422842, -20605826, -20486554, -20478119, -21263850, -20751559, -20091376, -19933244, -20697328, -19962652, -20025194, -20165420, -19890674, -19748165, -19664965, -20573369, -22320509, -22907997, -22128062, -22193297, -21072349, -21234048, -22490720, -22690364, -21871216, -22579902, -23223695, -21319861, -21714146, -21771210, -21475636, -20375640, -21012667, -21619989, -21454090, -21100699, -20776396, -20951190, -21017734, -21506133, -20610969, -20825755, -20738641, -22170189, -21318033, -21463925, -21701651, -21958110, -21728296, -21698490, -21411135, -21095872, -21419702, -22373243, -20930462, -22026790, -21769039, -20674636, -20719187, -20549941, -20428247, -20554039, -20754246, -20503029, -20049531, -19085492, -20105955, -19782189, -21138673, -21247154, -20480106, -20077186, -20703165, -20947381, -21364531, -21697566]
2268b1697566J155119p4749J17202K68898j027814P4689P44064L98822m88124M61449m1402
2257b0109412K35823j450753O01644K73814J08617r75157O03738l83532L72727j25359
2247b0847850n72087M58148n33037M38262J84837j20928L22946m49146j173594J171548
2237b1120901R91611m49265N23186j68283p58101j61950J90028J354681q66693L31172
2227b0134515j117176m19974K97591N94265J68594o00101J395091p926j410115J608066
2217a9626200j758723L60896L45937k65206m07806L85514O06335j099785K61136J391218
2207a9806684j642034K86159P13377J57178q78148K95651O4690m26967k93817M47131
2197b1083464M29115k6458j497986K7644J57376J014397l6757m65359P90833J16643o42820
$$ y = [-21697566, -20542447, -20617196, -20499994, -20231096, -21258910, -21184221, -20440157, -20041335, -20529459, -20068010, -20109412, -19873589, -21324342, -20722698, -20448884, -20340267, -21315424, -20711686, -21095218, -20722491, -20847850, -21419937, -20961789, -21494826, -21056564, -20871727, -20992655, -20669709, -21118855, -22292449, -21120901, -20129290, -20578555, -20055369, -20223652, -20981753, -21143703, -20953675, -19598994, -20465687, -20134515, -21251691, -21671665, -21374074, -20779809, -20611215, -21211316, -19816225, -19824151, -21234266, -19626200, -21384923, -21024027, -20678090, -20943296, -21351102, -20965588, -20359253, -21459038, -21197902, -19806684, -21448718, -21162559, -20449182, -20292004, -21170152, -20874501, -20809811, -21236778, -21530595, -21083464, -20654349, -20680807, -22178793, -22151149, -21993773, -20979376, -21016133, -21481492, -20690659, -20574016, -21216836]
2186b1216836N90077p22191L25301K02800l02858L96434j242292n39386N9076J560674
2176b0889201q79785o81901l46060K64311J057735k70254k53006N16899r86746J57129
2166b2310879J78244N71938p03960J06932J95604p4311p6367L92226l07407K61115M17680
2155b1349185r10204O27311L60657K23569Q2789n01078k36868J41697j087495O28232
2145b2020575Q67163l99026m07863J08770M74660J76122n48574N93585P94J89811o06460
2134b1571593Q53513j530591J85166K49088J43681m32615L50009j35234P4826r06751
2124b2720501M16128l27953J395135p97767N38919j155210R05427J80116n18258k96376
2114b2380340m78409p9884J030659L53274l08707j021061j94978P02385N78466n39727
$$ y = [-21216836, -20626759, -21348950, -21023649, -20820849, -21123707, -20727273, -21969565, -22508951, -22449875, -20889201, -21768986, -22450887, -22796947, -22532636, -21474901, -21745155, -21998161, -21481262, -22468008, -22310879, -22132635, -21560697, -22264657, -22157725, -21962121, -22036432, -22112799, -21720573, -22027980, -21766865, -21349185, -22259389, -21632078, -21271421, -21047852, -20965063, -21466141, -21703009, -21561312, -22648807, -22020575, -21153412, -21552438, -21960301, -21851531, -21376871, -21200749, -21749323, -21155738, -21154944, -20965133, -21571593, -20718080, -22248671, -22063505, -21814417, -21670736, -22103351, -21753342, -21888576, -21813750, -22720501, -22304373, -22632326, -21237191, -22034958, -21496039, -22651249, -21745822, -21565706, -22083964, -22380340, -22858749, -22938633, -21907974, -21554700, -21863407, -22884468, -23079446, -22377061, -21798595, -22338322]
2104b2338322J88142Q30047j034154k36144m02809J1548n39324R08661O70482m99176
2094b2441049m15524J74977k08207q7922J007309o15093r61693j15301J64922R09065
2084b2588516k59151o11215J254518n13613n346M43145k11572o5953o53810L98759R01054
2073b1911700K93519k17856N57299o151n76115k85230J79110j205048R2403p27424Q86656
2062b2920537l04359N02964J19779J88752n27215K44453r47657j83311K10908Q52554
2052b2763669L61431k56511m00176k97084o38478N75181N91348k10872L39693P7030J47174
2041b2474933o50113L83837L12198n63353r1639p83109K10198P32607j67993o07940l81312
2030b4081552P70045M07106r38684l91442K90012q96679R81291j99394k23720M31035
$$ y = [-22338322, -22150180, -21320133, -22354287, -22590431, -22993240, -22981692, -23521016, -22612355, -21941873, -22441049, -22856573, -22681596, -22889803, -22977725, -21970416, -22585509, -23547202, -23662503, -23497581, -22588516, -22847667, -23458882, -22204364, -22717977, -22723323, -22280178, -22491750, -22557703, -23211513, -22812754, -21911700, -21618181, -21836037, -21278738, -21284889, -21861004, -22146234, -21967124, -23172172, -23079769, -23807193, -22920537, -23224896, -22721932, -22602153, -22413401, -22940616, -22696163, -23643820, -23827131, -23616223, -22763669, -22402238, -22658749, -23058925, -23356009, -23994487, -23419306, -22827958, -23038830, -22699137, -22622107, -22474933, -23125046, -22741209, -22429011, -22992364, -23084003, -23867112, -23656914, -22924307, -23092300, -23700240, -24081552, -23311507, -22904401, -23843085, -24234527, -23944515, -24841194, -23859903, -24059297, -24283017, -23851982]
2020b3851982M50339n83925Q12714n12670L92557L66659m52852Q28021n71717j39688
2010b3262544J281444j952895L24211P21055q68818M46766L98274r0747k93298j069757
2000b4366309l1626J493774J088944j772257P21368J077538j304928o79501M83623K6550
1990b3262824O64768k15765J21190j118320O97501o0487k06722L45340j540018J393760
1980b3181577N27160L0999l88416O27654q24251N8313n80321O99679R96686r13457j28963
1969b3076494k6953j75372j051954J991646J18410p99845j56069P23785j2967L00015k5200
1958b2190998j026899q8879j87155J04323K19486n76275K53608n54571j0458K32836k40162
1947b4065144N41396j02839O37057j279646J370466K54019j025427M60257J41593N54856
$$ y = [-23851982, -23401643, -23985568, -23172854, -23685524, -23292967, -22926308, -23379160, -22551139, -23122856, -23262544, -21981100, -23933995, -23609784, -22888729, -23757547, -23310781, -22912507, -23003254, -23296552, -24366309, -24397935, -22904161, -21815217, -23587474, -22866106, -21788568, -23093496, -23772997, -23289374, -23262824, -22598056, -22813821, -22692631, -23810951, -23113450, -23173937, -23380659, -23035319, -24575337, -23181577, -22654417, -22623418, -23011834, -22384180, -23208431, -23150118, -23730439, -23030760, -22034074, -22947531, -23076494, -23103447, -23278819, -24330773, -22339127, -22220717, -23020562, -23176631, -22452846, -22465813, -22165798, -22190998, -23217897, -23306776, -23493931, -23389608, -23170122, -23746397, -23492789, -24047360, -24057818, -23824982, -24065144, -23523748, -23626587, -22989530, -24269176, -22898710, -22644691, -23670118, -23209861, -23068268, -22513412]
1937b2513412M15436o16407q07028M6527j25908n23228K60817O16753j459908O70510
1927b4035848M31173J20680R3775N3570P2898K6633j31049K09494O65825j268890n3377
1916b3815116N1911k74065j26113Q01289Q11023r69928J96843j19761L24491J427129
1906b1692297j164724p49676k72590m87217p160N16527o15808J484426j090181J066047
1896b3012653k92369q5292j38996O66873p27812L99647J09037n22217j58670K34055k97624
1885b3826021l32145J164580j00974L97545q584m42063j021895P28712N08096k8564n18420
1874b3479733j21832J51990j347159J405636q70768O68280K01012J80619M63287j315578
1864b4064246o70M68227n80429M82420L05077j082979o45178L031729q12250l91920O93176
$$ y = [-22513412, -22097976, -22714383, -23521411, -23474884, -23600792, -24124020, -23863203, -23246450, -24706358, -24035848, -23604675, -23483995, -23390220, -23336650, -23263752, -23237119, -23368168, -23158674, -22492849, -23761739, -23815116, -23763205, -24037270, -24163383, -23362094, -22551071, -23520999, -23324156, -23443917, -23119426, -21692297, -22857021, -23606697, -23879287, -24366504, -24373664, -23857137, -24472945, -22988519, -24078700, -23012653, -23305022, -23390314, -23529310, -22862437, -23590249, -23190602, -23081565, -23603782, -23762452, -23528397, -23826021, -24158166, -22993586, -23094560, -22697015, -22705599, -23147662, -24169557, -23440845, -22932749, -22961313, -23479733, -23601565, -23449575, -24796734, -23391098, -24261866, -23593586, -23392574, -23211955, -22748668, -24064246, -24064916, -23596689, -24177118, -23694698, -23389621, -24472600, -25117778, -22086049, -22898299, -23290219, -22597043]
1853b2597043j410715J268462n5553k13782k76961j71050k83755r63025N74075R65990
1843b3163357n9064n26235Q79429j079304N50731m07131k16349L03767P57871p58326
1833b3717968M73141p26437R94013j740356P95427N04606k90474j48351K46711k34449
1823b3844137J83530J46110j02648O85400o62166R31843K65726j164666N86701N4715
1813b2919592j55547n61004P63396o71920R06072K72527j911118K815O93663K67925K09945
1802b3102838j141907J057231l49921L01367l55139l05516O63002j96227K70543M93321
1792b2666084n89629L34271q31269O18470k344965R92260O64466l97733j164405R43404
1782b4441214L80564L31940m6017M90187m08354p24399P33878p54922J62361O19005Q18393
$$ y = [-22597043, -24007758, -22739296, -22794849, -23008631, -23285592, -23456642, -23740397, -24703422, -24129347, -23163357, -23222421, -23748656, -22869227, -23948531, -23397800, -23804931, -24021280, -23717513, -22959642, -23717968, -23244827, -23971264, -22977251, -24717607, -23922180, -23417574, -23708048, -23856399, -23609688, -23844137, -23660607, -23514497, -23617145, -22931745, -23593911, -22662068, -22396342, -23561008, -22974307, -22919592, -23075139, -23636143, -22872747, -23544667, -22638595, -22366068, -24277186, -24274371, -23580708, -23312783, -23102838, -24244745, -23187514, -23537435, -23236068, -23591207, -23896723, -23233721, -23429948, -23159405, -22666084, -23255713, -22921442, -23752711, -23134241, -25479206, -24486946, -23822480, -24220213, -25384618, -24441214, -24060650, -23728710, -23774727, -23284540, -23692894, -24417293, -23683415, -24438337, -24275976, -23656971, -22838578]
1771b2838578j328466L98445l99382N57913r18075P00556k38306J46022q80046p40453
1761b5540370K106776j41025p94301k6553M00045P78063p35952j57006Q88399l03412
1751b3525336L04155j156680K02075j64368P9599j89111n03221P75875L39382J88377
1741b3649253o84416M10476M6073R72935j002600r4465j173656J136510l79678L45381
1731b4072693M93055L2434k64191m96692O7527q91409J295298r09042j24312o3279j2972
1720b4946276N77744j222510j97559r055K228681o20507O7541j05583P09885J13067K63412
1709b3141160n58562m33069N99856o74555O3308O46162r83725O10554m47693K62451R17919
1698b3138514j218025r12682M19635M51890k94516J287867j488774j60647Q92436J91951
$$ y = [-22838578, -24167044, -23768599, -24167981, -23610068, -24528143, -23827587, -24065893, -23919871, -24799917, -25540370, -23433594, -23574619, -24368920, -24395473, -23995428, -23217365, -23953317, -24110323, -23221924, -23525336, -23221181, -24377861, -24175786, -24340154, -24260555, -24449666, -24952887, -24177012, -23837630, -23649253, -24333669, -23923193, -23877120, -22904185, -23906785, -24001250, -25174906, -24038396, -24418074, -24072693, -23579638, -23547204, -23811395, -24308087, -24240560, -25131969, -23836671, -24745713, -24870025, -24933304, -24946276, -24368532, -25591042, -25788601, -25797656, -23568975, -24189482, -24121941, -24227524, -23517639, -23404572, -23141160, -23699722, -24132791, -23532935, -24207490, -24144182, -23498020, -24481745, -23871191, -24318884, -24056433, -23138514, -24356539, -25269221, -24849586, -24397696, -24692212, -23404345, -24893119, -25053766, -24161330, -23969379]
1688b3969379K17982L70241l76177L38305q81640k81748m62722J680400q81369j70083
1678b4416190o3964R36478r86531q5544L31588J79050J33732l57011k38206N83952j788504
1667b5771150P70108k73583N06720m40192K06761L65319Q3217L80136K98725m74206j36574
1656b4484719m42722M37759j52711P84615l7876o96676J94564l34462J76705k2423J78220
1645b4399726M79196M59890j127555M51056R9431r20736J370200q77212P90945l62437
1635b4036948o59861M67561N98786L90019n84624q87174K97802n40099M01234J21366
1625b4431938N69479m68429J3194J4448p28084J63354M83404k96765l40689k77617J154866
1614b4144777N6453Q7045j076503Q5413O36907M39573O17724m05301j546965Q19470m67583
$$ y = [-23969379, -23751397, -23381156, -23757333, -23419028, -24300668, -24582416, -25045138, -23364738, -24246107, -24416190, -24480154, -23543676, -24530207, -24615751, -24284163, -24105113, -23971381, -24328392, -24566598, -23982646, -25771150, -25001042, -25274625, -24767905, -25208097, -25001336, -24636017, -24552800, -24172664, -23873939, -24348145, -24484719, -24927441, -24489682, -24642393, -23857778, -23895654, -24592330, -24397766, -24732228, -24555523, -24577946, -24399726, -23920530, -23460640, -24588195, -24137139, -24037708, -24958444, -23588244, -24465456, -23674511, -24036948, -24696809, -24229248, -23630462, -23240443, -23825067, -24712241, -24414439, -24954538, -24553304, -24431938, -23862459, -24330888, -24317694, -24303246, -25031330, -24867976, -24384572, -24681337, -25022026, -25299643, -24144777, -24088324, -24001279, -25077782, -24992369, -24355462, -23915889, -23298165, -23703466, -25250431, -24430961, -24898544]
1603b4898544k27243M43551j65437N25377O25168k85871m75519J238522j81982j036208
1593b4438186P6038M32492k70529J70150N0831P19067J3701l31309m09606m16995K36223
1582b4168123l54875m75852J69701Q39429R72312n98971K18200l05090j36413m12431
1572b4252113M24300n37078J24478p70995J172944n5737J5316M03768j057089K09984
1562b4322222l10608L29727O64603k40909P5628l12503k7282l91345p02769J164079k77302
1551b4350903j10087L45489n79136K14435J91744K85594K62520l17429R40313p05316
1541b3822776p25799o0717N84245p9082P75802j37913k24388n20639N96076m42335m28066
1530b4485592q96300N14072L18395J03222M54214p0240n3074p45386P37750P46337R24225
$$ y = [-24898544, -25125787, -24682236, -24847673, -24322296, -23697128, -23982999, -24458518, -23219996, -23401978, -24438186, -24362148, -23929656, -24200185, -24030035, -23979204, -23260137, -23246436, -23577745, -23987351, -24404346, -24168123, -24522998, -24998850, -24829149, -23989720, -23017408, -23616379, -23398179, -23703269, -23839682, -24252113, -23827813, -24364891, -24240413, -25011408, -23838464, -23894201, -23878885, -23475117, -24532206, -24322222, -24632830, -24303103, -23638500, -23879409, -23803781, -24116284, -24143566, -24534911, -25237680, -24073601, -24350903, -24460990, -24115501, -24694637, -24480202, -24288458, -24002864, -23740344, -24057773, -23117460, -23822776, -24548575, -24609292, -24025047, -24104129, -23328327, -23466240, -23690628, -24211267, -23615191, -24057526, -24485592, -25381892, -24867820, -24549425, -24446203, -23991989, -24062229, -24115303, -24860689, -24122939, -23376602, -22452377]
1519b2452377R5564m59183j379207n99383P13615n5654o6991K3245l90007j06068j77401
1508b4853847o70358K464961p13447q19155l68021R34401P10217j51707M43564r27420
1498b3950812M57088j025354p06744Q67981J16705Q88137n67579j67700M47618L5515l4970
1487b3640115Q179O19046Q44335j070330J56n15181o04201p73473J16000p35022O61100
1476b5089506o9869R26792j67153J53075o28974j31233L83457P9560N62632K52991r68889
1465b4697117O71406l77954N70607j813470K249330r29326p04809L34189k04672O60016
1455b4241800k81255n86332N31576K57317J53608n19090K71793O40211n38270j323003
1445b5635245P77230o11431J201740M24930j235992j45610P14655Q93393K60318k16260
$$ y = [-22452377, -22356813, -22815996, -24195203, -24794586, -24080971, -24136625, -24203616, -24180371, -24570378, -24676446, -24853847, -25524205, -23059244, -23772691, -24591846, -24959867, -24025466, -23315249, -23466956, -23023392, -23950812, -23493724, -24519078, -25225822, -24357841, -24241136, -23352999, -23920578, -24088278, -23640660, -23605145, -23640115, -23631936, -23012890, -22168555, -23238885, -23238729, -23753910, -24358111, -25131584, -25015584, -25750606, -25089506, -25159375, -24232583, -24399736, -24246661, -24875635, -25006868, -24623411, -24543851, -23981219, -23728228, -24697117, -24025711, -24403665, -23833058, -25646528, -23397198, -24326524, -25031333, -24697144, -24901816, -24241800, -24523055, -25109387, -24577811, -24320494, -24166886, -24685976, -24414183, -23773972, -24312242, -25635245, -24858015, -25469446, -24267706, -23842776, -25078768, -25224378, -24509723, -23616330, -23356012, -23572272]
1435b3572272o41666j82536R03519o67773p25119R56347M143p86265K16436L18973n29941
1424b4706154O39938n9981m31146j77879r1152L64293n75434R65105q1499M97695o15719
1413b4271933L01906n70948J62053k65834J104621r24649j59518m87133N46012K43957
1403b4321466n28789L38647o40112M03379Q74469K03538p55905l73820j7632L67712k21048
1392b4671027N65885j669337K64162P99036M20630p12640K80598r65328L07259J63755
1382b5217007L85006O24718K53436q16244r00601k27414N48239L00966L07361l30498
1372b5072038J32169n60646M73334P13336N64823O54749j851720j92740o79929k28149
1362b6046811K200134Q59442r29629j003503J384774j388634q6518L58908r38642K20878
$$ y = [-23572272, -24213938, -24396474, -23492955, -24160728, -24885847, -23929500, -23925357, -24711622, -24495186, -24176213, -24706154, -24066216, -24126197, -24557343, -24735222, -24826374, -24462081, -25037515, -24072410, -24153909, -23656214, -24271933, -23970027, -24540975, -24378922, -24644756, -23540135, -24464784, -24624302, -25111435, -24565423, -24321466, -24850255, -24511608, -25151720, -24748341, -23873872, -23670334, -24426239, -24800059, -24817691, -24449979, -24671027, -24105142, -25774479, -25510317, -24711281, -24290651, -25003291, -24722693, -25688021, -25380762, -25217007, -24832001, -24207283, -23953847, -24770091, -25670692, -25898106, -25349867, -25048901, -24741540, -25072038, -24939869, -25500515, -25027181, -24313845, -23749022, -23094273, -24945993, -25138733, -25818662, -26046811, -23846677, -22987235, -23916864, -24920367, -23535593, -24924227, -25010745, -24651837, -25590479, -25369601]
1352b5369601J520842j422020K04058P84238p31397o9894n76972K14348K494629n20105
1342b3471874l40054o48383O70924j341717O47691n1089N86632o84766J81670P2418
1332b4378548j219781J100117j70145m36697P12545k11577J139741r07124m6596j46849
1322b4564914J223375q19922K62880j166218k34314J003413M3931l24736M36530m30582
1312b4570557O43108n34174m27821l77962K77057o47089K342217o00685r07235o11197
1302b5414338L12797J019685m13468L61864k66594L59777L45484j72995r56293k62166
1292b5086247O5300L49521n48924K64750m16295J109488J40580m40527J08251k34148
1282b4688251k63897J32023O26980k02501n0128m79824N00237q44926P12510j078615P8677
$$ y = [-25369601, -23848759, -25270779, -25066721, -24282483, -25013880, -25083774, -25660746, -25446398, -22951769, -23471874, -23811928, -24460311, -23789387, -25131104, -24483413, -24534502, -23947870, -24632636, -24450966, -24378548, -25598329, -24498212, -24668357, -25105054, -24392509, -24604086, -23464345, -24371469, -24418065, -24564914, -23341539, -24161461, -23898581, -25064799, -25299113, -24295700, -24251769, -24576505, -24139975, -24570557, -23927449, -24461623, -24889444, -25267406, -24990349, -25637438, -23295221, -23895906, -24803141, -25414338, -25101541, -24081856, -24495324, -24133460, -24400054, -24040277, -23694793, -23867788, -24824081, -25086247, -25020947, -24671426, -25220350, -24955600, -25371895, -24262407, -24121827, -24562354, -24454103, -24688251, -24952148, -24820125, -24193145, -24395646, -24445774, -24925598, -24425361, -25270287, -24557777, -25636392, -25557715]
1271b5557715K138697k38996j310241J77037j11508l51509j45595O72859q75584J246810
1261b4355745k21860K24570l74691O84593p7145p58391P13887n65262l83345J656521
1251b3456868j142044r8471j180963R85598M48510L45089j20484q0985n98965k46000
1241b5145583o26544N60380J635221j102322j06837N13371m78318P65982j055447J249329
1231b3790768q63487m6773R8695k97248j215821Q66280k80505L49365L50435o18030P04740
1220b4743117J163045p28500q15122o27422J212375m84917J87791k85029L7102k80185
1210b5363979n97409M13419Q69412R4710r01372R63O11455n5682N1839J73902N85792
1199b4116950K61023j042620L6826M71384k82707q57226J37803J19773K89398k12370P0211
$$ y = [-25557715, -23419018, -23658014, -24968255, -24791218, -24902726, -25254235, -25399830, -24726971, -25602555, -24355745, -24577605, -24353035, -24727726, -24043133, -24120278, -24878669, -24164782, -24730044, -25113389, -23456868, -24598912, -24697383, -25878346, -24892748, -24444238, -24099149, -24219633, -24300618, -24899583, -25145583, -25772127, -25211747, -23576526, -24678848, -24785685, -24272314, -24750632, -23984650, -25040097, -23790768, -24654255, -24701028, -24602333, -24899581, -26115402, -25249122, -25529627, -25180262, -24829827, -25447857, -24743117, -23580072, -24308572, -25123694, -25751116, -24538741, -25023658, -24835867, -25120896, -25083794, -25363979, -25961388, -25547969, -24678557, -24583847, -25485219, -25484256, -24872801, -24928483, -24876644, -24702742, -24116950, -23855927, -24898547, -24861721, -24390337, -24673044, -25530270, -25392467, -25272694, -24983296, -25195666, -25125455]
1188b5125455r81084O96361L62861L90081o23261L21766l6585J8061j88803L4025R93991
1177b4138042k44504n40322j66217p92891O12021N4505N96921q28776J33784J466483
1167b3847038j113238P43759o3727P7606o15406p5312k12006K56547L72924j723679P93250
1156b5406320L89300N7357k39446j54409j007630K291840l16625q66694l6410j716468
1146b7005505K632709Q98672j16897q25635J134454q11774M11311j760270n10893M52707
1136b5501121J795886K49878l021799N14000R9719K88078J094995j200830q27004K431565
1126b4076633P11728o5666r31121L33429O8943r05637R60269L38228q67108Q39458j448822
1115b5042932M5416O9864P84093o32174j96731L55257k68740L87139m6443L73626q94576
$$ y = [-25125455, -26106539, -25410178, -25047317, -24657236, -25280497, -24958731, -24995316, -24977255, -25166058, -25132033, -24138042, -24382546, -24922868, -25089085, -25881976, -25269955, -25215450, -24618529, -25447305, -25313521, -23847038, -24960276, -24216517, -24280244, -24202638, -24818044, -24893356, -25105362, -24848815, -24475891, -26199570, -25406320, -25017020, -24959663, -25199109, -25353518, -26361148, -24069308, -24385933, -25252627, -25289037, -27005505, -24372796, -23474124, -23591021, -24416656, -23282202, -24093976, -23682665, -25442935, -25953828, -25501121, -23705235, -23455357, -26477156, -25963156, -25863437, -25575359, -24480364, -25681194, -26508198, -24076633, -23364905, -23430571, -24361692, -24028263, -23959320, -24864957, -23904688, -23566460, -24433568, -23594110, -25042932, -24997516, -24927652, -24143559, -24775733, -24972464, -24617207, -24885947, -24498808, -24545251, -24171625, -25066201]
1104b5066201m42445L35325R32598j134716P49855M11874l67381Q38644j539745J73238
1094b5108954j214526P91940J125344r9635n35911K62003o77043L3127l33849j29006
1084b5886510M56386J47438j2839n50885J835165l22140r61958M44813J2584M88637J73622
1073b4175687m81669j41578r44742J207511J17005j337552J625973j053759J237601J59776
1063b3787121q12662j622993R40960m38009j241477N66233M82411J09625l15823N88927
1053b5529929j343654P17670k50845k85731L80837O02027n44099J133746o14530q52597
1043b6587105J733448n28852O03646K17545q95627r12564J550269q49768M10007j070809
1033b6329810R48201j16469M18752q79256R99779k98825K56343j95405n81804m71417
$$ y = [-25066201, -25508646, -25173321, -24240723, -25375439, -24625584, -24213710, -24581091, -23742447, -25282192, -25108954, -26323480, -25531540, -24406196, -24505831, -25041742, -24779739, -25456782, -25423655, -25757504, -25886510, -25430124, -25282686, -25295525, -25846410, -24011245, -24333385, -25295343, -24850530, -24837946, -24349309, -24175687, -24657356, -24798934, -25743676, -24536165, -24419160, -25756712, -24130739, -25184498, -23946897, -23787121, -24599783, -26222776, -25281816, -25719825, -26961302, -26395069, -25912658, -25803033, -26118856, -25529929, -26873583, -26155913, -26406758, -26692489, -26311652, -25709625, -26253724, -25119978, -25734508, -26587105, -24853657, -25382509, -24778863, -24561318, -25456945, -26369509, -24819240, -25669008, -25259001, -26329810, -25381609, -25498078, -25079326, -25958582, -24958803, -25257628, -25001285, -25196690, -25778494, -26249911]
1023b6249911J082954m34342j01835O2548m9200J14475p07160q614j06744J28783R0639
1012b6178407O51771N29120o15977j149615J12544J60979N10427l28446n57146J493275
1002b5371475q21524L14905J352988j149179o24421L55076k8010R25161n00150j060705
992b6607334k99698N66948o83236L86801P48478k66149L81215p43415K89182p16758
982b6943966J820192J773724j425705j59888M24894k95144o27397n26863R92222k95711
972b5263642P02469q87003l34830K95211K5860M15941n24172O74356j85441r4979M63037
961b4713193K65323k52624j255117l78210Q73911P21527j580489J059261M72844m49295
951b5236062R7372p39005R19581o90362R45975O70874M87793k228473k65283O26242k6948
$$ y = [-26249911, -25166957, -25601299, -25703134, -25640586, -25689786, -25575311, -26282471, -26291085, -26397829, -26269046, -26178407, -25526636, -24997516, -25613493, -26763108, -26650564, -26489585, -25979158, -26307604, -26864750, -25371475, -26192999, -25878094, -24525106, -25674285, -26298706, -25943630, -25971640, -25046479, -25546629, -26607334, -26907032, -26340084, -27023320, -26636519, -25888041, -26154190, -25772975, -26516390, -26227208, -26943966, -25123774, -23350050, -24775755, -24935643, -24510749, -24805893, -25433290, -25960153, -24967931, -25263642, -24561173, -25448176, -25783006, -25487795, -25461935, -25045994, -25570166, -24895810, -25081251, -25176230, -24713193, -24447870, -24700494, -25955611, -26333821, -25459910, -24738383, -26318872, -25259611, -24786767, -25236062, -25138690, -25877695, -24958114, -25648476, -24702501, -24031627, -23543834, -25772307, -26037590, -25411348, -25438296]
940b5438296M71070k94870m17465j56291J855647M78285p85307o19553J92509K40607K2618
929b4451046n48303p31663J545311p60723j92476k47857J55990k37084r4529L10911M76447
918b4775022k62484K26876q81553L96781J26428K53961l87614l02402M26597O8099j72143
907b5282476J754627j710081L38252l06558l8274n07853j80889l81683L03445J300290
897b4711200o24829l52795n75998Q98484N69055M7798o51677n31808J143273j22825r23880
886b5836402j82338O60569Q46586q71692O49193l84681J94092K37383L29282k34518j77636
875b4770162o42999Q10850j562755L20312N82397J022096L952791l404055m86667Q8102
865b4090090j126998R1994j6888L51815k97251n29500L14933K4350L85098L50358k14550
$$ y = [-25438296, -24967226, -25262096, -25679561, -25835852, -23980205, -23501920, -24287227, -24906780, -24714271, -24473664, -24451046, -24999349, -25731012, -24185701, -24946424, -25138900, -25386757, -25230767, -25467851, -25562380, -25251469, -24775022, -25037506, -24810630, -25692183, -25295402, -25168974, -24915013, -25302627, -25605029, -25178432, -25110333, -25282476, -23527849, -25237930, -24899678, -25206236, -25244510, -25752363, -25933252, -26314935, -26011490, -24711200, -25336029, -25688824, -26264822, -25366338, -24797283, -24749485, -25401162, -25932970, -24789697, -24912522, -25836402, -26018740, -25358171, -24511585, -25383277, -24734084, -25118765, -24924673, -24687290, -24358008, -24592526, -24770162, -25413161, -24602311, -26165066, -25844754, -25262357, -24240261, -20287470, -23691525, -24178192, -24090090, -25217088, -25125094, -25141982, -24790167, -25087418, -25616918, -25301985, -25277635, -24892537, -24542179, -24756729]
854b4756729o78370l07754M46079N96911l26712Q64444M9913j45975P0579L73594M66103
843b3347917k426534P10440m27409K87128Q2682P5456M45318q0655r75671J61442R80160
832b4515560j02280M48559k18302k17812O6695N27356o24123M2745l8403j00977j88009
821b4920111j014119Q66415P38295P1510R96527j219334j34701j128069Q23824n25689
811b5445452L50860l91269O988K71994N64054j54492L69147l51094L04989j39633K95663
800b4318245k34175l67364O57671n911J59130l89229p35717M15325L40014m19153r8800
789b4996454q83706j75226O84475K05583J992510k392943j012293K418474q61346J92154
779b4828772m59203K1566N5192n72095J63672O13709k47790k37990j82542q74325K14241
$$ y = [-24756729, -25435099, -25742853, -25296774, -24699863, -25026575, -24162131, -24112218, -24258193, -24187614, -23814020, -23347917, -25774451, -25064011, -25491420, -25204292, -25121610, -25046154, -24600836, -24681491, -25657162, -25495720, -24515560, -24617840, -24169281, -24387583, -24605395, -24538700, -24011344, -24635467, -24592722, -24631125, -24732102, -24920111, -25934230, -25067815, -24329520, -24258010, -23261483, -24480817, -24615518, -25743587, -24919763, -25445452, -25094592, -25485861, -25478873, -25206879, -24642825, -24797317, -24428170, -24779264, -24474275, -24613908, -24318245, -24552420, -24919784, -24262113, -24268024, -24108894, -24498123, -25233840, -24818515, -24478501, -24897654, -24996454, -25880160, -26055386, -25370911, -25165328, -23172818, -25565761, -26578054, -24159580, -25020926, -24828772, -25287975, -25266409, -25211217, -25783312, -25619640, -25005931, -25253721, -25491711, -25674253, -26548578, -26334337]
768b6334337L29274K63477J024967k97740m48966P38591j33139J68239j026671j977573
758b7693878K274709Q46139Q1727o89020p38131N91602j046817L45477j24988K51184
748b5901996K73365o34533M13580L97383j59339n89524P24677J8199K3873m55355P31778
737b5157892P29449j309539j286056K14776O45806L15000m61946R53510K93739j500916
727b6564069Q94576m56125P74518l10083n43641N29517n15985P25531k55765l49870Q2127
716b5989269k11741P17419k03436o6964Q97305r98426L55819q9283n10573P04812N38466
705b4855871k81218L97204q28726J29187j22729Q82759m26100j658334J673976q54246
695b5944098K77011L84682K92983N41918k96484j273240l2684N90672K80495k97742J65750
$$ y = [-26334337, -26005063, -25741586, -24716619, -25014359, -25463325, -24724734, -24857873, -24689634, -25716305, -27693878, -25419169, -24573030, -24491303, -25180323, -25918454, -25326852, -26373669, -26028192, -26153180, -25901996, -25628631, -26263164, -25849584, -25452201, -25611540, -26201064, -25476387, -25458188, -25434315, -25889670, -25157892, -24428443, -25737982, -27024038, -26809262, -26163456, -25848456, -26310402, -25356892, -25063153, -26564069, -25669493, -26125618, -25351100, -25661183, -26204824, -25675307, -26191292, -25465761, -25721526, -26071396, -25989269, -26201010, -25483591, -25687027, -25753991, -24856686, -25855112, -25499293, -25588576, -26099149, -25394337, -24855871, -25137089, -24739885, -25568611, -25439424, -25562153, -24679394, -25105494, -26763828, -25089852, -25944098, -25667087, -25282405, -24989422, -24447504, -24743988, -26017228, -26049912, -25459240, -25178745, -25476487, -25310737]
684b5310737k98679l24226K24746O7979M78901r46125J423592K61217r69493M0564j34783
673b5487044J191985p73322K72433l97568l1662p63406O01717k97005j88077r03164Q18629
662b5956484k24187N63525p3695j68230J35156P46732m9266j333261J30304J785858
652b4443548k076007P53835J042629m81347l77618J18183l09431l0899L81570n04224q3959
641b6010816P86689o50058J42327j49790M05122O8103J95353o56548O17243o44873j38319
630b6035567m94652J212362q58006J109640r43584K65609K66646K85926j67311L73695
620b4985242m25801m02326O49956j98208n35061j02195L58705k42063j08181j10436J13882
609b5986970K55086n20391J430149r09756j35638M06897j61132P04213r1964j560699o2968
$$ y = [-25310737, -25609416, -25933642, -25708896, -25640917, -25162016, -26108141, -24684549, -24423332, -25392825, -25352261, -25487044, -24295059, -25068381, -24795948, -25193516, -25225178, -25988584, -25386867, -25683872, -25871949, -26775113, -25956484, -26180671, -25617146, -25690841, -25859071, -25723915, -24977183, -25026449, -26359710, -26229406, -24443548, -26519555, -25765720, -24723091, -25204438, -25582056, -25463873, -25773304, -25804203, -25422633, -25926857, -26010816, -25224127, -25874185, -25731858, -25881648, -25476526, -25408423, -25213070, -25869618, -25252375, -25897248, -26035567, -26530219, -25317857, -26175863, -25066223, -26009807, -25744198, -25477552, -25191626, -25358937, -24985242, -25411043, -25813369, -25163413, -25361621, -25896682, -25998877, -25640172, -25882235, -25990416, -26100852, -25986970, -25731884, -26252275, -24822126, -25731882, -25867520, -25460623, -25621755, -24917542, -25009506, -26570205, -26633173]
598b6633173O02581k82591J163178l74684n75788l15559K31449L25218m31804j67576p0079
587b6528828j76599R48669K12575J28701Q0394j096064K56903R47083q73496Q72879
577b5227783j017648O31146j840645J712129J59823r11056Q64653j40107J435347j777456
567b6111597o36476O71935k00591n55628O02174m98991J050146r04737J363696m86933
557b5707002k233682J076420L63008R59160n36833o94272K21353M07776M93426r26485
547b6577131p18204K5448K274572l73287l17870q09241L21515L52043o00885R82591L49502
536b5090947P5930r36814M685l78548N04495n59225r13576Q10503J91286Q93421l81150
525b5779940Q526p56924J692679j384640J115200j038437p18102J61572J285502M14082
$$ y = [-26633173, -26030592, -26313183, -25150005, -25524689, -26100477, -26416036, -26184587, -25859369, -26291173, -26458749, -26528828, -26705427, -25756758, -25544183, -25415482, -25335088, -26431152, -26174249, -25227166, -26100662, -25227783, -26245431, -25614285, -27454930, -25742801, -25582978, -26494034, -25629381, -25769488, -24334141, -26111597, -26748073, -26076138, -26276729, -26832357, -26230183, -26729174, -25679028, -26583765, -25220069, -25707002, -27940684, -26864264, -26501256, -25542096, -26078929, -26773201, -26551848, -26144072, -25650646, -26577131, -27295335, -27269887, -24995315, -25368602, -25686472, -26495713, -26174198, -25822155, -26423040, -25440449, -25090947, -25015017, -25951831, -25947146, -26325694, -25821199, -26380424, -27294000, -26483497, -26292211, -25398790, -25779940, -25771414, -26528338, -24835659, -26220299, -25105099, -26143536, -26861638, -26700066, -25414564, -25000482]
515b5000482j350421M99583L3659K09585J041921p16965m56262J57539m64757m66897
505b6513497J138156k74213p4774M23226j831473R25140R37492o4463N74890l52045
495b5111561j101876L19345j15930q3290l59539l24470M72825M62476P34716K24128o42147
484b5525323N12565j296444N43553J976372j849038N19780m71987l51658Q6217J46706
474b5709257n08497j063028J141936l97864Q39738K49454K05882p8876q43923J79244
464b5985191l21051J148137k56900n64990j88913M2843j17517O30201p08674n93647p45120
453b7660822J846518m32219O3795L49385j41768l01500J52518j93887J023462q08714
443b6103232k62160J29068L05098q92390o697L80999q5048M7280m59053J40920Q44305
$$ y = [-25000482, -26350903, -25851320, -25817661, -25608076, -24566155, -25283120, -25739382, -25581843, -26046600, -26513497, -25375341, -25649554, -25724328, -25301102, -27132575, -26207435, -25269943, -25334406, -24759516, -25111561, -26213437, -25894092, -26010022, -26093312, -26452851, -26777321, -26304496, -25842020, -25107304, -24883176, -25525323, -25012758, -26309202, -25765649, -23789277, -25638315, -25118535, -25590522, -25942180, -25855963, -25709257, -26217754, -27280782, -26138846, -26536710, -25696972, -25447518, -25241636, -25320512, -26164435, -25985191, -26306242, -25158105, -25415005, -25979995, -26168908, -26126065, -26243582, -25613381, -26322055, -26915702, -27660822, -25814304, -26246523, -26182728, -25833343, -25975111, -26276611, -26124093, -26317980, -25294518, -26103232, -26365392, -26236324, -25931226, -26823616, -26830313, -26449314, -26534362, -26487082, -26946135, -26805215, -25960910]
432b5960910r43120N55610J76373k24852j406939L159028j422501L78390l84247m95535
422b6568703M50850o01636M20335L218J01682M06064p10357j81667j2762o40437k044995
411b9378408K695191J55139J47895J707570k068534P93125o4995o3187l33546k54622
401b6664372L87452Q46009l0754N38502m72529j013924L13077j31955P15046J49376r79523
390b6343595M81655J51980m78801l91158m7043k522J09801O28802J54595q3884l80548
379b6200718j21032L13827N77140j404762R83544K80992n24452O48228r16574j24895j0596
368b6499298m07100P67958j034539J144734k75741N6568k95048O55597q89775M45271
358b6331373J61876p21018M66004Q61507o86256M25459o15k73331J547061j317131J2883
$$ y = [-25960910, -26904030, -26348420, -26172047, -26396899, -27803838, -24644810, -26067311, -25688921, -26073168, -26568703, -26117853, -26719489, -26299154, -26295936, -26194254, -25788190, -26498547, -26680214, -26692976, -27333413, -29378408, -26683217, -26528078, -26380183, -24672613, -26741147, -25948022, -26013017, -26076204, -26409750, -26664372, -26276920, -25430911, -25461665, -24923163, -25395692, -26409616, -26096539, -26228494, -25513448, -25364072, -26343595, -25861940, -25709960, -26188761, -26579919, -26626962, -26629484, -26519683, -25890881, -25736286, -25820170, -26200718, -26321750, -26007923, -25430783, -26835545, -25852001, -25571009, -26095461, -25447233, -26363807, -26488702, -26499298, -26906398, -26138440, -27172979, -26028245, -26303986, -26247418, -26542466, -25886869, -26776644, -26331373, -26169497, -26890515, -26424511, -25563004, -26249260, -25823801, -25824416, -26097747, -24550686, -25867817, -25854934]
347b5854934R9755K19133j208073J084778m8591J60797j69033q08361j27619J066864
337b5585284K88279J83661K18386q00152N78647k38358p07976L6186n11582Q52582M3737
326b5641874k69819P948K42253j176002P40196j834420J58639L17376l87057K979930
316b4862830j066680o71715N96340M03656J0261o72377m9255k82900M80827R53373q02394
305b5963694l59254P5801K58607J54661n27325j67269O29656K20721n71774L31958M64717
294b5453195q5822m34839j136425J24710L23240R8246M72992J114761m83037m27150J62563
283b5723956J22541j832940J416564K71834n28078N05861q01211P08492M58857J106050
273b4295986j784652Q50027j341573O2594p14623L20058m41439J535014P749J115963
$$ y = [-25854934, -25755179, -25536046, -26744119, -25659341, -25707932, -25547135, -25716168, -26524529, -26652148, -25585284, -25297005, -25113344, -24894958, -25695110, -25116463, -25354821, -26062797, -26026611, -26538193, -25685611, -25641874, -25911693, -25903745, -25661492, -26837494, -26097298, -27931718, -27773079, -27455703, -27842760, -24862830, -25929510, -26601225, -26004885, -25601229, -25590968, -26263345, -26312600, -26595500, -26114673, -25161300, -25963694, -26322948, -26247147, -25988540, -25833879, -26361204, -26528473, -25898817, -25678096, -26249870, -25917912, -25453195, -25539017, -25973856, -27110281, -26985571, -26662331, -26564085, -26091093, -24976332, -25459369, -25886519, -25723956, -25601415, -27434355, -26017791, -25745957, -26274035, -25768174, -26569385, -25860893, -25402036, -24295986, -26080638, -25230611, -26572184, -26509590, -27224213, -26904155, -27345594, -25810580, -25802831, -24686868]
263b4686868p47386j072909J79224k035397J951683o20286R49878j65503M63010k2204
253b5806758O2104k59479j27480j833135J484552O55847Q274p31985O36143m21477L67112
242b5966282k42896k72989J283759p25015p63820J1879J64054J4440k54830P68119k45039
231b6228620k29170p31054J766767L95937m94775O9373K71256j673947P87242m0997p67358
220b6875346l1222n22938R97753R6687P34135j204058M36512N13685K95245J72955j247024
209b6633616M06294K3638j41762O73569n50598Q5861j66747J061788n95476J691625
199b4145424j310927J18039j213577p04166J639308j108969m66160J315883j593277O63984
189b6805286q25605J124735K4719O48291p49872J28273M69740n76033k342478K865262
$$ y = [-24686868, -25434254, -26507163, -26327939, -28363336, -26411653, -27031939, -26082061, -26247564, -25784554, -25806758, -25744654, -26004133, -26131613, -27964748, -26480196, -25824349, -25816075, -26548060, -25911917, -26333394, -25966282, -26209178, -26482167, -25198408, -25923423, -26687243, -26675364, -26511310, -26496870, -26751700, -25983581, -26228620, -26457790, -27188844, -25422077, -25026140, -25520915, -25451542, -25180286, -26854233, -26066991, -26107988, -26875346, -26906568, -27429506, -26431753, -26335066, -25600931, -26804989, -26368477, -25854792, -25559547, -25386592, -26633616, -26227322, -26203684, -26345446, -25671877, -26222475, -26136614, -26303361, -25241573, -25837049, -24145424, -25456351, -25338312, -26551889, -27256055, -25616747, -26725716, -27191876, -25875993, -27469270, -26805286, -27630891, -26506156, -26481437, -25833146, -26583018, -26454745, -25985005, -26561038, -28903516, -26038254]
179b6038254O6096k49411q9898o19629k29309P61380j572532J075008J099376j114621
169b6911794J035091k48938Q4382m42200J55760r9866Q74934O32078p04654n46617J57743
158b6014081J41467P96800m53001l3699q61704N02293m15672P8380m8445O38209q05692
147b6475145n00798Q52666l97932m37775O30193q2895N32363J062047j161146N9522p97616
136b6716516N20323k38783K9704P46924q4755J44054l00053j68114j066147N03754O73313
125b5956296L68177K2229L09297q09750M4088o33166R11506p59383q6407k31362m67621
114b7288688N04885J109978n5327j022950J607041j119568l05458q52664O36305q23491
104b7609937J764977l10773r8374o37228P52620p96380R07263Q66001j172409l33726
$$ y = [-26038254, -25972158, -26221569, -26311467, -26931096, -27160405, -26399025, -27971557, -26896549, -25797173, -26911794, -25876703, -26125641, -26041259, -26483459, -26327699, -26427565, -25552631, -24920553, -25625207, -26171824, -26014081, -25872614, -25075814, -25528815, -25562514, -26424218, -25921925, -26337597, -26259217, -26307662, -25669453, -26475145, -26975943, -26123277, -26521209, -26958984, -26328791, -26411686, -25879323, -24817276, -25978422, -25918900, -26716516, -26196193, -26434976, -26405272, -25658348, -25743103, -25599049, -25899102, -26067216, -27133363, -26629609, -25956296, -25588119, -25565890, -25256593, -26066343, -26022255, -26655421, -25743915, -26503298, -26589705, -26821067, -27288688, -26783803, -25673825, -25729152, -26752102, -25145061, -26264629, -26570087, -27422751, -26786446, -27609937, -25844960, -26155733, -26254107, -26891335, -26138715, -26935095, -26027832, -25161831, -26334240, -26667966]
94b6667966O00065k96585Q53521K9203n74014n49572R6590K90184J30387J02737p79863
83b6765313m93749J596460M29731j548417M1523O21110p8187p86910J8190M8154K99134
72b6618274o10748Q53791l48272P89761K09277j96328l7958k59498o93328M43872m08963
61b6876668L8137K54696N28976m86411N30459l97596N43791k292331j9019K89418p0562
50b7957110J599130l35957M80533j19455q38498J054788j69897p62441q38418N07634
40b7379691J502109J42304r00948L63475q63114J49766N48339J295905j955349J963749
30b5133455N00708j351819q62241P24496k03358O86151n86861N36487j755106J462442
20b5982556j73035n12324n72875L98465K24632J7517K74260j083206J87163L38407K66515
$$ y = [-26667966, -26067901, -26364486, -25510965, -25481762, -26055776, -26605348, -26508758, -26218574, -26088187, -25985450, -26765313, -27259062, -25662602, -25232871, -26781288, -26739765, -26118655, -26196842, -26983752, -26965562, -26917408, -26618274, -27229022, -26375231, -26723503, -25933742, -25724465, -25920793, -25958751, -26218249, -26911577, -26467705, -26876668, -26838531, -26583835, -26054859, -26541270, -26010811, -26408407, -25864616, -28156947, -28175966, -27886548, -27957110, -26357980, -26693937, -26213404, -26332859, -27171357, -26116569, -26286466, -27048907, -27887325, -27379691, -25877582, -25735278, -26636226, -26272751, -27135865, -26986099, -26437760, -25141855, -27097204, -25133455, -24632747, -25984566, -26846807, -26122311, -26325669, -25639518, -26226379, -25689892, -27444998, -25982556, -26155591, -26667915, -27240790, -26842325, -26617693, -26600176, -26325916, -27409122, -27221959, -26883552, -26617037]
9b6617037K2084L12695J61537k62808Q39458K3936j024493p85866J526434j112427O77849
-2b6238638R5672k10610m25211J11235R66624p5775P04566K97181j275145J46466k21895
-13b6125530j278677L68647L34296j068427Q09569J99283J166977j87980o523j80961
-23b5969326m45999j61837Q41761n46449Q81048r51995l93330L34615m14317M8854p92415
-34b7569390L1580J021071p45343n7343O81130M73169o65285J78412O41693q19132P43553
-45b6085885n34027M65154O95297n27998o5187J08841n31616M58974k42596J45253k04014
-56b6317804n13963j39065K54748N98917k88577J68423O34916j99296l10767j87728K12151
-67b6088045j000061J356914n61749Q4244k0420k46941o91752M8220k25572J155345j28356
$$ y = [-26617037, -26594953, -26282258, -26120721, -26383529, -25544071, -25520135, -26544628, -27330494, -25804060, -26916487, -26238638, -26142966, -26353576, -26778787, -26667552, -25700928, -25776703, -25072137, -24774956, -26050101, -25903635, -26125530, -27404207, -27035560, -26701264, -27769691, -26960122, -26760839, -25593862, -25781842, -25788365, -25969326, -26415325, -26577162, -25735401, -26281850, -25400802, -26352797, -26746127, -26411512, -26825829, -26776975, -27569390, -27537810, -26516739, -27262082, -27319425, -26638295, -26165126, -26830411, -26651999, -26010306, -26829438, -26085885, -26619912, -26154758, -25459461, -25987459, -26052646, -25943805, -26475421, -26016447, -26259043, -26113790, -26317804, -26831767, -26970832, -26716084, -26117167, -26405744, -26237321, -25602405, -25801701, -26112468, -26300196, -26088045, -27088106, -25731192, -26292941, -26208697, -26229117, -26476058, -27167810, -27119590, -27345162, -26189817, -26318173]
-78b6318173j2995q84508J360398M77889p46212k32258n80557R83885J86717o3647L4145
-89b5795316K56523K14391o06728l00052P54564n53427k74639m9771n91181N67060r71278
-100b7349854K6812K377648r26297O36875p57929k35248R9163j34991o27243L45757
-110b6545307J191001m58047o41946M47777q17237K60440K58091L04420k23037m61985
-120b6685830J294574o3269j68777q14512M06651n91662r59435L11548K502732j54925
-130b4922905q70112j37212M04917n61807K51406l74291m61430K17005r94206M59141
-140b6989494O42895K55230K74795j132824M01957n90579L82590J159265p24335M69323
-150b5851177j46938k49283l89992J97793J47277j17407m37811Q82280j320872O23883
$$ y = [-26318173, -26331168, -27215676, -25855278, -25377389, -26123601, -26355859, -26936416, -25952531, -25765814, -25829461, -25795316, -25538793, -25324402, -25931130, -26231182, -25476618, -26030045, -26304684, -26354455, -26945636, -26378576, -27349854, -27323042, -24945394, -25871691, -25234816, -25992745, -26227993, -26128830, -26263821, -26891064, -26545307, -25354306, -25812353, -26454299, -26006522, -26823759, -26563319, -26305228, -26000808, -26223845, -26685830, -25391256, -25454525, -25623302, -26437814, -26031163, -26622825, -27582260, -27270712, -24767980, -24922905, -25793017, -25930229, -25525312, -26087119, -25835713, -26210004, -26671434, -26454429, -27448635, -26989494, -26346599, -26091369, -25816574, -26949398, -26547441, -27138020, -26755430, -25596165, -26320500, -25851177, -25998115, -26247398, -26637390, -26439597, -26292320, -26409727, -26847538, -25965258, -27286130, -26662247]
-160b6662247Q2899j099165J271214M61104o21648o44087R2026J190292o41377l10201
-170b6881190j15331p43585J272080P13700k41000N56422L70449j469669m54650N14544
-180b6478230o49623N11748j359265r1182K599493K73363O16709j045276k17626o27780
-190b6467669M90637m02005J053704n00312l43612p74735L54774Q61047R3839j593361
-200b7227693M56991p06330J040081K77405k19353J87541n90830J205280J15466q3343
-210b5544785l4522r03488P37989m80363n49974J036683l06508m29543O680Q53106k36033
-221b5850758j39417P87264l15426n59466J18216j176741k1149O88042n07765M95662
-231b6481538J114538r24571q90442J97667Q82168N91790K37992o45230m91569L7365
$$ y = [-26662247, -26579348, -27678513, -26407299, -25946195, -26567843, -27211930, -27119904, -25929612, -26570989, -26881190, -26996521, -27740106, -26468026, -25754326, -25995326, -25438904, -25068455, -26538124, -26992774, -26478230, -27127853, -26616105, -27975370, -28066552, -25467059, -25193696, -24576987, -25622263, -25839889, -26467669, -25977032, -26379037, -25325333, -25825645, -26169257, -26943992, -26589218, -25728171, -25634332, -27227693, -26770702, -27477032, -26436951, -26159546, -26378899, -26191358, -26782188, -25576908, -25461442, -25544785, -25579307, -26482795, -25744806, -26225169, -26775143, -25738460, -26044968, -26474511, -26467831, -25614725, -25850758, -25990175, -25202911, -25518337, -26077803, -25959587, -27136328, -27157477, -26469435, -26977200, -26481538, -25367000, -26291571, -27182013, -26984346, -26102178, -25510388, -25272396, -25917626, -26409195, -26371830]
-241b6371830q27789R59333M63474j484501j364023K467374j01939J75113o1918o00n72851
-252b6720157L33207m26801Q07281q43930m6267j046418J136505j57897m45811J61213
-262b7249075R11945J83116k8177j123243P16818l16616k62638P38283O4465L26217n14107
-273b6553012J656167m29692J700832k584874o42094q86271J140352k71653Q23230r0111
-283b6137126l79959P06111q34151Q90935p00931J21967M06778j685356m69696J023748
-293b7057680p18298K00101J390058q49407m03454L37910J448419L95815j701306P05943
-303b6251899p40361R30333n51456n14149n37501N57095J35732j05536N50071o05877
-313b7133548P37523P17264q86617J01692j089808Q07199P47579l75338m50051l79426
$$ y = [-26371830, -27199619, -26240286, -25776812, -27261313, -28625336, -26157962, -26259901, -26084788, -26146706, -26147306, -26720157, -26386950, -26813751, -26006470, -26850400, -26896667, -27943085, -26806580, -26964477, -27410288, -27249075, -26337130, -26154014, -26182191, -27305434, -26588616, -26905232, -27167870, -26429587, -26365122, -26038905, -26553012, -24896845, -25326537, -23625705, -26210579, -26852673, -27738944, -26598592, -26870245, -26047015, -26137126, -26517085, -25810974, -26645125, -25754190, -26455121, -26333154, -25926376, -27611732, -28081428, -27057680, -27775978, -27575877, -26185819, -27035226, -27438680, -27100770, -25652351, -25256536, -26957842, -26251899, -26992260, -26061927, -26613383, -27127532, -27665033, -27107938, -26972206, -27077742, -26527671, -27133548, -26396025, -25678761, -26565378, -26463686, -27553494, -26746295, -25998716, -26374054, -26824105, -27203531]
-323b7203531q3749R20900j302481L70441Q23092l20809k273575L684727j319696J29041
-333b6575640J063408N70900O63207k176487m26745L42926L50647k2706R52795o4915
-343b5322610j165223R48356m92280Q8380m15465n96515O87104l03232r4429J342961
-353b5322953j076399k22673L07178J24935n5513o96096O30940k81798k75981J198608
-363b5669752j151074q5811J75246k13768M8790r72307P17826J122903M6484K06783q09967
-374b6584647o00007J018928j184088J299635j199194N66186J41555K408363j115223
-383b5248492j168800l66903k19240L53537Q16778k0099q7241j05474K04620j296455
-393b7137769k55435o36688J727862r46848O5587n37406J236135K23090o44435O33497
$$ y = [-27203531, -27287280, -26366380, -27668861, -27298420, -26475328, -26796137, -29069712, -25384985, -26704681, -26575640, -25512232, -24941332, -24278125, -26454612, -26881357, -26538431, -26187784, -26210490, -25257695, -25322610, -26487833, -25539477, -26031757, -25943377, -26358842, -26955357, -26268253, -26571485, -26665914, -25322953, -26399352, -26622025, -26314847, -26189912, -26245425, -26941521, -26310581, -26592379, -26868360, -25669752, -26820826, -26906637, -26731391, -26945159, -26896369, -27868676, -27150850, -26027947, -25981463, -25774680, -26584647, -27184654, -26165726, -27349814, -26050179, -27249373, -26683187, -26541632, -24133269, -25248492, -26417292, -26784195, -27003435, -26649898, -25833120, -25853219, -25940460, -26045934, -25841314, -27137769, -27393204, -28029892, -26302030, -27248878, -27183291, -27720697, -26484562, -26261472, -26905907, -26272410]
-403b6272410o7100q08044J165243Q60609k145731k81001R68763j115707Q59118K90943
-413b6545317m37164O47146J04664q66499p62926Q88885M05030J86700p57681J049205
-423b6087957M34466j182822m74418o9789J053632l46930O77417r25821p4229k6100L89172
-434b6633379l43673P61159Q6175j74720l67975N07764J525120r96662j18169o96773O8931
-445b6382202K24843q76523N74367P53762p04556k30793J55019j49064P25342j62560
-455b6072365M29544L27571k51275K47277K08406j151718m64190J020661j214272N65207
-465b6355154l80389k83588K31238l60209L95251j10875r6055K87508o79867O20270N36719
-476b6195151o78649R1470K1576M79542j50690J273479p56032Q3139M90794p7136p46998
$$ y = [-26272410, -26339510, -27147554, -25982311, -25121702, -27267433, -27548434, -26579671, -27695378, -26836260, -26545317, -26982481, -26335335, -26230671, -27097170, -27860096, -26971211, -26566181, -26379481, -27137162, -26087957, -25653491, -26836313, -27310731, -27380520, -26326888, -26673818, -25996401, -26922222, -26996451, -27022551, -26633379, -26977052, -26215893, -26129718, -26304438, -26672413, -26164649, -24639529, -25636191, -25754360, -26451133, -26382202, -26157359, -27033882, -26459515, -25705753, -26410309, -26641102, -26486083, -26635147, -25909805, -26072365, -25642821, -25315250, -25566525, -25319248, -25110842, -26262560, -26726750, -25706089, -26920361, -26355154, -26735543, -27019131, -26787893, -27148102, -26752851, -26863726, -26959781, -26672273, -27352140, -26731870, -26195151, -26873800, -26782330, -26760754, -26281212, -26431902, -25158423, -25914455, -25831316, -25340522, -25417658, -26164656]
-487b6164656m67612n9104j96451j40508o19320J086954J000755r49651j32468o74973
-497b7317034Q42979J3678k63215k98305p10455O16268N85861L05155M92567o35376n02747
-508b6870624M1335O881N32386j228536Q32926O23984o21095j05077R22491K5170N73671
-519b5266488n83698l41513M09910j379395o23266J100859K49076m00489N90202o8414
-529b6313216j79765k07847J426312q88183m78542M44770j05977J05866j010528p91940
-539b7999050N19469J334390j074035J090548J045951k53150j627707m81385O81335K56443
-549b6507191P57702N51008m37161q83401n02468J223334j08817j278142L50270L61925
-559b6472941k82759j84242K9388J053770k83316j211661q58937K137822m09131J95653
$$ y = [-26164656, -26632268, -26691372, -26887823, -27028331, -27647651, -26560697, -25559942, -26509593, -26642061, -27317034, -26474055, -26460377, -26723592, -27021897, -27732352, -27116084, -26530223, -26225068, -25732501, -26367877, -26870624, -26829289, -26822408, -26290022, -27518558, -26685632, -26061648, -26682743, -26787820, -25865329, -25840159, -25266488, -25850186, -26191699, -25781789, -27161184, -27784450, -26683591, -26434515, -26835004, -26244802, -26313216, -26492981, -26700828, -25274516, -26162699, -26641241, -26196471, -26302448, -26196582, -27207110, -27999050, -27479581, -26145191, -27219226, -26128678, -25082727, -25335877, -26963584, -27444969, -26763634, -26507191, -25749489, -25198481, -25635642, -26519043, -27021511, -25798177, -25906994, -27185136, -26834866, -26472941, -26755700, -26939942, -26910554, -25856784, -26140100, -27351761, -28210698, -26072876, -26482007, -26286354]
-569b6286354n50895L14709N35576j622692O89684L84237K66443o31368K73579L03453
-579b6323628n16603m9866L85491K46605o65100j424720K272660J546796j139318K87412
-589b5380271P4542N27243j262381k27322l90938m73076r14116J123066L15576J053542
-599b5554135j145881P3705R30646p87796L1929k96545j06622p25485j87658O05703O28819
-610b6533320N69723j639758J064441J869630j538733N8958k05307p22980L23419P95270
-620b5958657L48096Q10772m42420j417934l96211Q48317q92782M88068j31261P8407
-630b6665605J92683j165158M98906n20789j0074J053846L90921O87152k365210Q30667
-640b7072661l05327J307038N53710j834192k18264K45910m9903J52525j81433N61973
$$ y = [-26286354, -26837249, -26522540, -25986964, -27609656, -26919972, -26535735, -26269292, -26900660, -26627081, -26323628, -26840231, -26890097, -26504606, -26258001, -26923101, -28347821, -26075161, -24528365, -25667683, -25380271, -25305729, -24778486, -26040867, -26268189, -26659127, -27132203, -28046319, -26923253, -26607677, -25554135, -26700016, -26626311, -25695665, -26483461, -26451532, -26748077, -26854699, -27580184, -27767842, -27162139, -26533320, -25963597, -27603355, -26538914, -24669284, -26208017, -26149059, -26354366, -27077346, -26753927, -25958657, -25610561, -24799789, -25242209, -26660143, -27056354, -26208037, -27100819, -26612751, -26744012, -26665605, -26472922, -27638080, -27139174, -27659963, -27670037, -26616191, -26225270, -25538118, -27903328, -27072661, -27377988, -26070950, -25517240, -27351432, -27569696, -27323786, -27373689, -27221164, -27402597, -26840624]
-650b6840624l59172n3251q97015J74193K576984l830018J181524K831843j061150J28960
-660b6147726O45013j170393K49931K19185m50889n877m70354R00645Q59082M466j044511
-671b6411428J019006j225575J49892L27316p00648J39512O20050o54743N61503q91286
-681b7066401k12954O86249j56264n2905N97165m0982J38655k99385Q7124K33190q48956
-692b6935464P05431m22442M04825k3851N50096n61314J28103m22234N46008k88889o46225
-703b6965956O21130L84439p71095J90593j77189J283l4255l92917M39422M67275k97680
-714b6534950O31429k21738j60007J2878m17434N10135p77586j47722o61620J051814
-724b6714801Q28665k02559N04054q57433m7940k61554j87389N0694k62704J67235K0905
$$ y = [-26840624, -27199796, -27253047, -28150062, -27975869, -25398885, -29228903, -28047379, -25215536, -26276686, -26147726, -25502713, -26673106, -26423175, -26203990, -26654879, -26660756, -27131110, -26230465, -25371383, -25366917, -26411428, -25392422, -26617997, -26468105, -26140789, -26841437, -26701925, -26081875, -26736618, -26175115, -27066401, -27279355, -26593106, -26749370, -26802275, -26205110, -26246092, -26107437, -26406822, -26319698, -26086508, -26935464, -26230033, -26652475, -26247650, -26271501, -25721405, -26282719, -26154616, -26576850, -26030842, -26319731, -26965956, -26344826, -25960387, -26731482, -26540889, -26718078, -26716795, -26751050, -27143967, -26704545, -26237270, -26534950, -25903521, -26125259, -26285266, -26272388, -26689822, -26179687, -26957273, -27104995, -27766615, -26714801, -25886136, -26088695, -25584641, -26442074, -26490014, -26751568, -26938957, -26888263, -27150967, -26983732, -26962827]
-735b6962827p38070K64249J25365R51372r05190J221982j409917K36442O89966K71626
-745b6255002J14821n28179N49287j95287l17723N1652N86599j547662M93431k91105
-755b7339168L57565N23517o40585k31797L27527m8080p14780k3682J305525m3543P05680
-766b5821821p8368o46471k30384L87158L73515j017984L21075J247854q21293o79427
-776b6966146m56774L66110L75446N0984j38274J6127m60604J551881p19856N48619j86959
-787b6019446o21689l50001L61839K04017j82661q78372P07182K70675m49229J212793
-797b5744892j057570K35089m81339Q06339L47334M9977j936393L77914k29499J713487
-807b5919553o17633L1762M04870j15766o69018M22096Q60284j388968J775705n91140
$$ y = [-26962827, -27700897, -27436648, -27311283, -26359911, -27265101, -26043119, -27453036, -27216594, -26526628, -26255002, -26140181, -26668360, -26119073, -26314360, -26632083, -26580431, -25993832, -27541494, -27048063, -27339168, -26981603, -26458086, -27098671, -27330468, -27002941, -27051021, -27765801, -27789483, -26483958, -26527501, -25821821, -25900189, -26546660, -26777044, -26389886, -26016371, -27034355, -26713280, -25465426, -26286719, -26966146, -27422920, -27056810, -26681364, -26630380, -26768654, -26752527, -27213131, -25661250, -26381106, -25832487, -26019446, -26641135, -26991136, -26629297, -26425280, -26607941, -27486313, -26779131, -26508456, -26957685, -25744892, -26802462, -26567373, -27048712, -26242373, -25895039, -25845062, -27781455, -27403541, -27633040, -25919553, -26537186, -26505424, -26100554, -26216320, -26885338, -26463242, -25602958, -26991926, -25216221, -25807361]
-817b5807361m38062l44241J87779m63662J42108K77535n7417m96948L11743M0572q41649
-828b7489603J075966J79816j78807M35173j613590M29757O79311P07368q80677r2586
-838b6747872Q35277q20926m44400J725748p14204j062674k59536n6443K030111n07796
-848b6022715j64266n08587m88791l67954N2650J038036N31084j231923O05394p2428p283
-859b6636783n84096O84877o32315M93614j2578K57527j39835L61281m79718j110952
-869b7798978J012320j049441k66497R11210R63883l213l99943j312622Q42336L35287
-879b6765658O78918P2846l11697O7655L71041J59904k62080J2306o35050L64790j36170
-890b6383195P12434j785508J354714p37140L46154P24263j022856j50666l40847P79253
$$ y = [-25807361, -26245423, -26589664, -26401885, -26865547, -26723439, -26445904, -26503321, -27000269, -26688526, -26647954, -27489603, -26413637, -26233821, -26412628, -25977455, -27591045, -27161288, -26481977, -25774609, -26655286, -26747872, -25912595, -26733521, -27177921, -25452173, -26166377, -27229051, -27488587, -27545030, -25514919, -26022715, -26186981, -26695568, -27184359, -27552313, -27499663, -26461627, -25930543, -27162466, -26557072, -26629500, -26636783, -27220879, -26536002, -27168317, -26674703, -26687281, -26429754, -26569589, -26208308, -26688026, -27798978, -26786658, -27836099, -28102596, -27191386, -26227503, -26230716, -26630659, -27943281, -27100945, -26765658, -26086740, -26013894, -26325591, -26257936, -25886895, -25726991, -25989071, -25976765, -26611815, -26247025, -26383195, -25670761, -27456269, -26101555, -26838695, -26492541, -25768278, -26791134, -26941800, -27282647, -26503394]
-900b6503394n56514m24677L18319L91683n55387Q33249K04038j422162o37790P98126
-910b7554509J038026J85695k92267o28682J76572J130824m77313r45642J088007O59003
-920b5620286j149609O62600J85698p32087n0165p61308J43423N20532J07629l93140
-930b7086713N11785k06340l44809J49784m84335O04553Q530K29015J271462j013026m7286
-941b6407380R85177l66948k36172j57507j455755J483226l95260J78854j475156o94392
-951b8541313J471059R7901m19897J714755j083140J056411m56393J60519j55436M28050
-961b5727484q92741q90178P777Q83078o45865j464024J012979J410105o14843l22200
-971b7243396Q68830k36150q45986J120901N49903j153786J232252j055839j81956k12720
$$ y = [-26503394, -27059908, -27484585, -27166266, -26774583, -27329970, -26496721, -26292683, -27714845, -28352635, -27554509, -26516483, -26330788, -26623055, -27251737, -27075165, -25944341, -26421654, -27367296, -26279289, -25620286, -26769895, -26107295, -25921597, -26653684, -26703849, -27465157, -27321734, -26801202, -26693573, -27086713, -26574928, -26781268, -27126077, -26976293, -27460628, -26856075, -26847545, -26618530, -25347068, -26360094, -26407380, -25422203, -25789151, -26025323, -26182830, -27638585, -26155359, -26550619, -26371765, -27846921, -28541313, -27070254, -26972353, -27392250, -25677495, -26760635, -25704224, -26160617, -26000098, -26155534, -25727484, -26620225, -27510403, -27502626, -26619548, -27265413, -28729437, -27716458, -26306353, -26921196, -27243396, -26374566, -26610716, -27456702, -26335801, -25785898, -26939684, -25707432, -26763271, -26945227, -27157947]
-981b7157947o512j16942N8402p1435O46069r43101J688698O81254m90905N72723k90986
-992b5430682k5012r62070J6707l64215m35296P02125L94274p57530j097779K279607
-1002b5679871j55274n67806J086675k92756j90221J90765n30031O953j467595K48628
-1012b7350533K31796m0059P03483m10306j20303j136688J064800j09662R86065o38257
-1022b6819664n67718K65834J079838l7431j062618m80055N96096O317N55967j80872
-1032b6644306O09648L12181j541297J002079r14871L24109K67201n17135K53744O92362
-1042b6156285l73152j3179j931151J651523p80492K49829O89953L55287k77411O93858
-1052b5891220L58281p88682N30816p60373K00143q29580m78802K385481j774842P45060
$$ y = [-27157947, -27164459, -27281401, -27222999, -27294434, -26648365, -27591466, -25902768, -25221514, -25712419, -25139696, -25430682, -25455694, -26417764, -26401057, -26765272, -27200568, -26498443, -26104169, -26861699, -27959478, -25679871, -25835145, -26402951, -25316276, -25609032, -25799253, -25608488, -26138519, -26131566, -27599161, -27350533, -27118737, -27158796, -26455313, -26865619, -26985922, -28122610, -27057810, -27167472, -26181407, -26819664, -27387382, -27121548, -26041710, -26079141, -27141759, -27621814, -27025718, -27019401, -26463434, -26644306, -26034658, -25722477, -27263774, -26261695, -27176566, -26852457, -26585256, -27102391, -26848647, -26156285, -26529437, -26542616, -28473767, -26822244, -27602736, -27352907, -26662954, -26307667, -26585078, -25891220, -25532939, -26321621, -25790805, -26551178, -26351035, -27180615, -27659417, -25273936, -27048778, -26303718]
-1062b6303718M93273r84198N45843P18159l02042q55209J32337n72305L7070J46608
-1072b6944182P99032m28189M44086j271889M43213L530Q93907n23220J17551q67210R2635
-1083b7240736o63220o71322P91911L83596K86030p05918K304443j716250M54418M64017
-1093b6313031r8301r84262P55371K16894j1908K27622J607386k992837Q90095l60079
-1103b7063050P80897k41426n02737L08247O16377N72784k163252J102452j31313p86245
-1113b7507266k99446l81005L91706Q50975r6443K78861M20788J55288l42613j27231
-1123b6656386m72744P68995n97893J17649J27502J72054k31999J93547K80069m14952
-1133b6714158N08905N98450L13918o65020m41447k89839P87627p05675m06851N38945
$$ y = [-26303718, -25810445, -26794643, -26248800, -25530641, -25832683, -26687892, -26555555, -27127860, -27090790, -26944182, -26145150, -26573339, -26129253, -27401142, -26957929, -26954399, -26060492, -26583712, -26466161, -27333371, -27240736, -27903956, -28575278, -27783367, -27399771, -27113741, -27819659, -25515216, -27231466, -26777048, -26313031, -26411332, -27395594, -26640223, -26423329, -26435237, -26207615, -24600229, -27593066, -26702971, -27063050, -26282153, -26523579, -27026316, -26718069, -26101692, -25528908, -27692160, -26589708, -26721021, -27507266, -27806712, -28187717, -27796011, -26945036, -27041479, -26762618, -26341830, -26186542, -26529155, -26656386, -27129130, -26360135, -26958028, -26840379, -26712877, -26540823, -26772822, -26579275, -26299206, -26714158, -26205253, -25606803, -25292885, -25957905, -26399352, -26689191, -25901564, -26607239, -27014090, -26475145]
-1143b6475145p73205M5721r7251L84018P7979n31179k91394R97615j85466M39910n73541
-1154b6981938N58078j587118M14228l39151P94061m92766K76477N16479J255722m52488
-1164b6038416q4038j469821J008460Q12220K15459j445264j30456N29144J312445p48202
-1174b6038469m63866Q80175k58099p71830j20646R99432p20661J300162J1443R6093
-1184b5086266q40026j337334N82271n49153L59486l26299J84438P44659l26286r09082
-1194b7503592J883482l10779o76738K77511J191518n08413j012260r64745R5962O54381
-1204b6873673n72887P56588m2505L22760j135410R10277n98715L96039m47105J302501
-1214b5982130j181175k0249J125634m97569K50411J03596o16786l84851q449R24862
$$ y = [-26475145, -27248350, -27202629, -27299880, -26915862, -26837883, -27369062, -27660456, -26662841, -26848307, -26408397, -26981938, -26423860, -28010978, -27596750, -27935901, -27141840, -27634606, -27358129, -26841650, -25585928, -26038416, -26122454, -27592275, -26583815, -25771595, -25556136, -27001400, -27131856, -26602712, -25290267, -26038469, -26502335, -25622160, -25880259, -26652089, -26772735, -25773303, -26493964, -25193802, -25182359, -25086266, -25926292, -27263626, -26681355, -27230508, -26871022, -27197321, -27012883, -26268224, -26594510, -27503592, -25620110, -25930889, -26607627, -26330116, -25138598, -25647011, -26659271, -27624016, -27528054, -26873673, -27446560, -26689972, -26732477, -26409717, -27545127, -26634850, -27233565, -26837526, -27284631, -25982130, -27163305, -27183554, -26057920, -26555489, -26305078, -26201482, -26818268, -27203119, -27211568, -26286706]
-1224b6286706r42196l56516R4663N77831P69123M96793m17013j68873r42472l03801r9490
-1235b7578657J145959k32755R8462o9473L28581r96929n93646O06053R71949m52393
-1245b6772849j56684j31448N29923n71886k52864q9270N73930R97122j143413p15259
-1255b7732698L24223j373213J05857K025567O97369l85689k2075M38457j047258K15189
-1265b6754271j78291l3487m81097k75538J152998L89871J84866l07328l62052J17931
-1275b6546398L11947O0830j12820p79428P14630n20164p72164R66677J15572l37725
-1285b6899043n13110J097864M0351j31597K45562m73631R27805r99178o37909P24831
-1295b6618055q11536P24479j03017K40328J31862m54115J07417o7397O01958o4107M93762
$$ y = [-26286706, -27228902, -27585418, -27490755, -26912924, -26143801, -25647008, -26064021, -26232894, -27175366, -27479167, -27578657, -26432698, -26665453, -26566991, -26636464, -26307883, -27304812, -27898458, -27292405, -26320456, -26772849, -26929533, -27060981, -26531058, -27102944, -27355808, -27445078, -26871148, -25874026, -27017439, -27732698, -27408475, -28781688, -28675831, -26650264, -25952895, -26338584, -26360659, -25922202, -26969460, -26754271, -26932562, -26966049, -27447146, -27722684, -26569686, -26179815, -25994949, -26302277, -26664329, -26546398, -26234451, -26173621, -26286441, -27065869, -26351239, -26871403, -27643567, -26676890, -26561318, -26899043, -27412153, -26314289, -26273938, -26405535, -26159973, -26633604, -25705799, -26704977, -27342886, -26618055, -27429591, -26705112, -26808129, -26567801, -26435939, -26890054, -26782637, -26850034, -26248076, -26312183, -25818421]
-1306b5818421k03357k77421j426617J021065K92876o49408m3657l95856J60831J013678
-1316b6326287l07678j89631N68350J40772J7690j325421L68678o53693n1483J748636
-1326b6010067j172312J816963j892755R98511l88378j96019N08546J29256j13698L23114
-1336b5996839r97545k01601J378864J82360j343048l0495J13838k69026L40945m33460
-1346b7256007n06530L83389p43645J513811n08717L21654J136748j075719Q71514m94379
-1356b6357881o09565l92429r1953O18801p40587J72896n42947P06641J020897l36598
-1366b6552725J09904J4801o50598k83200P71261m95555K10618O83364j235840K31694
-1376b7196276P09721n86004L09041O37623n00855q54758J05073o8374O85877o51489
$$ y = [-25818421, -26021778, -26299199, -27725816, -26704751, -26411875, -27061283, -27104940, -27500796, -27339965, -26326287, -26633965, -26823596, -26255246, -26114474, -26096784, -27422205, -27053527, -27707220, -27758703, -26010067, -27182379, -25365416, -27258171, -26259660, -26648038, -26844057, -26335511, -26206255, -26319953, -25996839, -26994384, -27195985, -25817121, -25634761, -26977809, -27008304, -26894466, -27163492, -26822547, -27256007, -27762537, -27379148, -28122793, -26608982, -27117699, -26796045, -25659297, -26735016, -25863502, -26357881, -26967446, -27359875, -27451828, -26833027, -27573614, -27400718, -27943665, -27237024, -26216127, -26552725, -26442821, -26428020, -27078618, -27361818, -26590557, -27086112, -26875494, -26192130, -27427970, -27196276, -26486555, -27072559, -26763518, -26125895, -26626750, -27481508, -27376435, -27444809, -26758932, -27410421]
-1386b7410421Q14143Q24926j115304N42875j57952k08549L2846O09649j501445n56557
-1396b8125789J043643J470057r54605j52320j150090J209274r67142J481663l45414
-1405b6490723Q03294m97759J961002o0635l479934J85014O14532n685n96197M17682
-1415b7149409O04485J412831j281925l37399o01276M64789k12608j1636j137069J254654
-1425b6994563J06423L03975j45222k13486J36550j34187J6075K94481o15069p32102
$$ y = [-27410421, -26596278, -25771352, -26886656, -26343781, -26501733, -26710282, -26677436, -26067787, -27569232, -28125789, -27082146, -25612089, -26566694, -26719014, -27869104, -26659830, -27626972, -26145309, -26490723, -25687429, -26185188, -24224186, -24284821, -27764755, -27579741, -26965209, -26970894, -27567091, -27149409, -26544924, -25132093, -26414018, -26751417, -27352693, -26887904, -27100512, -27112148, -28249217, -26994563, -26888140, -26584165, -26729387, -26942873, -26806323, -26940510, -26924435, -26629954, -27245023, -27977125]
$$ [...]
-2730a4665017  $$ checkpoint
##END NTUPLES=
##END=
