##TITLE=Unknown
##JCAMP-DX= 5.00 $$From Command Line Converter 1.0
##DATA TYPE= NMR Spectrum
##DATA CLASS=  XYDATA

##ORIGIN= Exported from Command Line Converter 1.0
##OWNER= MS
##$URL= http://wwwchem.uwimona.edu.jm:1104/software/jcampdx.html
##SPECTROMETER/DATA SYSTEM= NUTS EXPORT
##.OBSERVE FREQUENCY= 300.149506
##.OBSERVE NUCLEUS= ^1H
##INSTRUMENTAL PARAMETERS= 1H
##XUNITS= PPM
##YUNITS= ARBITRARY UNITS
##XFACTOR= 0.0000133267
##YFACTOR= 9.4695830000
##FIRSTX=  -1.669340
##FIRSTY= -3107.000000
##LASTX=  11.657400
##NPOINTS= 16384
##MAXY= 9402565.000000
##MINY= -67018.000000
##DELTAX=   0.000813
##XYDATA= (X++(Y..Y))
$$ plain form
-125263 -329 -370 -265 -607 -355 -418 -286 -344 -173 -302 -465 -341 164 -840 -772 -316 -575 -415 -375 -241 -453 -401
-123977 -401 -475 -274 -581 -266 -251 -373 -439 -416 -394 -702 -505 -450 -519 -223 -560 -219 -403 -332 -406 -224 -417 -501 -259
-122575 -259 -261 -293 -397 -501 -290 -414 -509 -410 -455 -607 -538 -528 -464 -720 -240 -190 -456 -238 -5 -435 -567 -489 -243
-121173 -243 -556 -400 -472 -68 -358 -65 -494 -366 -438 -525 -418 -326 -605 -295 -425 -453 -388 -245 -624 -316 -397 -414
-119832 -414 -376 -582 -308 -337 -365 -209 -519 -490 -620 -528 -288 -391 -323 -557 -548 -428 -144 -283 -411 -364 -462 -500 -539
-118429 -539 -210 -304 -378 -558 -452 -391 -473 -276 -441 -523 -246 -471 -282 -362 -178 -454 -474 -379 -273 -299 -501 -434 -388
-117021 -388 -319 -367 -395 -230 -564 -282 -324 -153 -438 -462 -362 -420 -197 -382 -291 -351 -265 -611 -526 -453 -589 -491 -609
-115619 -609 -486 -460 -438 -419 -356 -420 -377 -637 -403 -490 -423 -485 -322 -247 -604 -342 -426 -374 -314 -492 -415 -499 -163 -370
$$ packed form
-125263c29m1J05l42K52o3J32n8J71j29j63J24N05j004O8M56k59J60M0J34k12N2
-123977d01p4K01l07L15J5j22o6K3K2l08J97N5o9K96l37L41j84P1p4J82j93q4K42
-122575b59kl2j04j04K11j24r5R9m5j52O9J0O4k56M80N0k66K18K33m30j32P8K46
-121173b43l13J56p2M04k90K93m29J28p2q7J07R2k79L10j30k8O5J43l79L08q1j7
-119832d14L8k06K74k9k8J56l10K9j30R2K40j03O8k34RJ20K84j39j28M7r8l8l9
-118429e39L29r4p4j80J06O1q2J97j65q2K77k25J89q0J84k76k0R5J06k6k02O7M6
-117021c88O9m8k8J65l34K82m2J71k85k4J00n8K23j85R1o0Q6l46Q5P3j36R8j18
-115619f09J23K6K2J9O3o4M3k60K34q7O7o2J63P5l57K62q4N2O0j78P7q4L36k07
$$ plain form
-114156 -370 -258 -414 -327 -473 -391 -405 16 -265 -292 -431 -175 -521 -247 -281 -516 -220 -412 -409 -350 -402 -357 -386 -206
-112746 -206 -250 -402 -225 -350 -412 -313 -528 -488 -281 -195 -352 -322 -283 -287 -113 -640 -242 -276 -380 -564 -622 -313 -330
-111344 -330 -226 -426 -282 -563 -413 -325 -293 -546 -150 -578 -301 -444 -298 -458 -442 -445 -411 -397 -494 -223 -372 -332
-110003 -332 -687 -369 -231 -226 -248 -378 -298 -309 -200 -324 -297 -219 -119 -649 -539 -213 -194 -305 -266 -342 -185 -332 -305
-108602 -305 -414 -447 -291 -373 -294 -268 -236 -105 -431 -438 -302 -185 -505 -373 -318 -307 -373 -439 -142 -478 -268 -341 -450
-107192 -450 -502 -557 -347 -164 -323 -381 -384 -371 -468 -525 -331 -281 -344 -425 -319 -203 -341 -511 -500 -267 -383 -205 -380
-105790 -380 -206 -209 -452 -448 -423 -534 -481 -220 -382 -261 -346 -258 -394 -233 -346 -362 -378 -155 -235 -378 -636 -420 -247
-104388 -247 -250 17 -438 -262 -228 -379 -197 -535 -307 -255 -372 -520 -261 -417 -324 -310 -615 -531 -165 -254 -264 -354 -350
$$ packed form
-114156c70J12j56Q7j46Q2j4M21k81k7j39K56l46K74l4k35K96j92LN9n2M5k9J80
-112746b06m4j52J77j25o2R9k15M0K07Q6j57L0L9mJ74n27L98l4j04j84n8L09j7
-111344c30J04k00J44k81J50Q8L2k53L96m28K77j43J46j60J6lL4J4r7K71j49M0
-110003c32l55L18J38Nk2j30Q0j1J09j24K7P8J00n30J10L26J9j11L9p6J57j47K7
-108602c05j09l3J56q2P9K6L2J31l26pJ36J17l20J32N5J1o6o6K97l36K10p3j09
-107192d50n2n5K10J83j59n8lJ3r7n7J94N0o3q1J06J16j38j70J1K33j16J78j75
-105790c80J74lk43MK5j11N3K61j62J21q5Q8j36J61j13j6j6K23q0j43k58K16J73
-104388b47lK67m55J76L4j51J82l38K28N2j17j48K59j56R3J4l05Q4L66q9j0r0M
$$ plain form
-102986 -350 -385 -387 -353 -337 -255 -438 -566 -378 -223 -113 -48 -260 -190 -253 -371 -309 -195 -327 -306 -285 -284 -279 -107 -252 -356
-101454 -356 -361 -237 -492 -499 -266 -600 -97 -326 -220 -311 -489 -161 -151 -369 -364 -480 -411 -194 -284 -285 -231 -181 -417 -248
-99991 -248 -173 -241 -167 -521 -130 -391 -266 -600 -364 -287 -305 -155 -155 -423 -147 -412 -453 -296 -397 -472 -365 -361 -258
-98589 -258 -432 -391 -386 -174 -88 -380 -355 -499 -428 -475 -231 -235 -152 -173 -214 -389 -261 -326 -402 -372 -198 -509 -174 -289
-97125 -289 -85 -482 -314 -476 -386 -333 -282 -373 -295 -255 -313 -449 -466 -357 -434 -328 -314 -324 -397 -246 -287 -356 -369 -349 -298
-95601 -298 -177 -417 -253 -85 -662 -405 -265 -270 -405 -439 -329 -292 -345 10 -459 -433 -72 -146 -239 -616 -296 -398
-94252 -398 -156 -275 -428 -425 -46 -218 -86 -487 -248 -398 -267 -259 -397 -322 -299 -366 -265 -280 -355 -363 -333 -168 -409
-92852 -409 -277 -230 -141 -150 -290 -282 -288 -330 -361 -372 -109 -358 -414 -309 -147 -472 -386 -177 -302 -279 -173 15 -265 -468
$$ packed form
-102986c50l5kL4J6Q2j83j28J88J55J10O5k12P0o3j18O2J14j32K1K1JNJ72j45j04
-101454c56nJ24k55pK33l34N03k29J06r1j78L28J0k18Nj16O9K17r0jN4N0k36J69
-99991b48P5o8P4l54L91k61J25l34K36P7j8J50%k68K76k65m1J57j01p5J07MJ03
-98589b58j74M1NK12Q6k92K5j44P1m7K44mQ3k1m1j75J28o5p6L0J74l11L35j15
-97125b89K04l97J68j62R0N3N1r1P8M0n8j36j7J09p7J06J4j0p3J51m1o9j3K0N1
-95601b98J21k40J64J68n77K57J40nj35l4J10L7n3L55m69K6L61p4r3l77L20j02
-94252c98K42j19j53LL79j72J32m01K39j50J31Qj38P5K3o7J01j5p5qL0J65k41
-92852d09J32M7Q9rj40Qom2l1j1K63k49n6J05J62l25Q6K09j25K3J06J88k80k03
$$ plain form
-91388 -468 -463 -258 -93 -179 -282 -108 -231 -331 -278 -220 -429 -228 -389 -155 -175 -371 -489 -116 -289 -218 -526 -129
-90040 -129 -147 -289 -163 -270 72 -317 -379 -274 -317 -330 -209 -144 -397 -247 -380 -418 -552 -426 -4 -451 -421 -337
-88699 -337 -241 -333 -295 -478 -382 -419 -356 -119 -175 -652 -284 -339 -527 -426 -252 -227 -45 -331 -442 -351 -208 -169 -235
-87296 -235 -126 -288 -55 -265 -359 -267 -173 -180 -181 -265 -200 -329 -192 -285 -27 -211 -347 -413 -489 -531 -328 -224 -495 -385
-85833 -385 -228 -143 -11 -175 -184 -74 -414 -231 -524 -536 -286 -593 -46 -204 -304 -551 -196 -51 -398 -258 -155
-84547 -155 -394 -251 -545 -250 -269 -228 -292 -166 -280 -380 -122 -160 -345 -392 -281 -397 -330 -212 -351 -205 -307
-83267 -307 -119 -369 -237 -176 -85 -371 -181 -371 -233 -362 -274 -390 -278 -23 -296 -326 -392 -402 -230 -378 -163
-81988 -163 -320 -227 -147 -407 -274 -403 -263 -183 -278 -378 -418 -200 -242 -299 -125 -178 -102 -441 -220 -290 -451 -48 -4
$$ packed form
-91388d68NK05J65q6j03J74j23j00N3N8k09K01j61K34k0j96j18L73j73P1l08L97
-90040a29j8j42J26j07L42l89o2J05m3j3J21O5k53J50j33l8j34J26M22m47L0Q4
-88699c37R6r2L8j83R6l7O3K37n6m77L68n5j88J01J74K5J82k86j11R1J43L9o6
-87296b35J09j62K33k10r4R2R4pjq4O5j29J37r3K58j84j36o6p6m2K03J04k71J10
-85833c85J57Q5J32j64rJ10l40J83k93j2K50l07N47j58j00k47L55J45l47J40J03
-84547a55k39J43k94K95j9M1o4J26j14j00K58l8j85m7J11j16O7J18j39J46j02
-83267c07J88k50J32O1R1k86J90j90J38j29Q8j16J12K55k73l0o6j0J72j48K15
-81988a63j57R3Q0k60J33j29J40Q0r5j00m0K18m2n7J74n3P6l39K21p0j61M03M4
$$ plain form
-80579 -4 -325 -349 -67 14 -243 -148 -227 -301 -125 -333 -33 -310 -109 -239 88 -254 -105 -378 -226 -353 -137 -199
-79237 -199 -213 -208 -147 -290 -244 -321 -248 -231 -298 -362 0 -232 -413 -187 -274 -393 -100 -412 -415 -315 -225 -411 -346 -201
-77774 -201 -304 -482 -325 55 -426 -292 -519 -215 -229 -383 -359 -245 -325 -247 -193 -258 -259 -261 -419 -114 -197 -122 -45 -193
-76311 -193 -395 9 -245 -208 -367 -347 -403 -341 51 -231 -235 -120 -215 -348 -164 -135 -310 -312 -178 -199 -242 -279 -333 -453
-74848 -453 -288 -310 -285 -436 -293 -439 -232 -79 -243 -215 -435 -334 -251 -214 -165 -185 -122 -276 -132 -84 -270 -184 -248
-73440 -248 -215 -196 -265 -120 -136 -407 -315 -448 -193 -335 -114 -217 24 -258 -258 -260 -203 -145 -399 -149 -49 -320 -270
-72037 -270 -130 -177 -144 -117 -159 -362 -335 -337 -381 -352 -202 -57 -422 -194 -115 -291 -325 -371 -159 -219 -455 -178 -195 -70
-70574 -70 -62 -62 -384 -340 -211 -65 -377 -346 -398 -108 -202 -302 -66 -385 -354 -216 -224 -343 -349 -321 -385 -18 -171 -252 -446
$$ packed form
-80579dl21k4K82Q1k57R5p9p4J76k08L00k77K01j30L27l42J49k73J52j27K16o2
-79237a99j4NO1j43M6p7P3J7o7o4L62k32j81K26q7j19K93l12lJ00R0j86O5J45
-77774b01j03j78J57L80m81J34k27L04j4j54K4J14q0P8N4o5jkj58L05q3P5P7j48
-76311a93k02M04k54L7j59K0n6O2L92k82mJ15r5j33J84K9j75kJ34k1m3l7n4j20
-74848d53J65k2K5j51J43j46K07J53j64K8k20J01Q3L7M9k0O3j54J44M8j86Q6o4
-73440b48L3J9o9J45j6k71R2j33K55j42K21j03K41k82%kN7N8k54K50J00k71N0
-72037b70J40m7L3K7m2k03K7km4K9J50J45l65K28P9j76l4m6K12o0k36K77j7J25
-70574g0Q%l22M4J29J46l12L1n2K90r4j00K36l19L1J38qj19oK8o4L67j53q1j94
$$ plain form
-69042 -446 -171 -246 -313 -313 -455 -215 -301 -315 -140 -239 -371 -101 -221 -305 -361 -261 -225 -74 -110 -344 -309 -131 -50 -273
-67579 -273 -166 -141 -280 -24 -279 -141 -228 -67 -248 -87 -245 88 -196 -235 -260 -216 74 -146 51 -135 -297
-66299 -297 51 -356 96 -139 -256 -307 -131 -120 -296 -362 -155 -367 -202 -129 -121 -78 -48 -273 -47 -318 -208 -222
-64958 -222 -228 -133 -15 -128 -186 -536 -352 60 -277 -539 -167 -365 -179 -189 -165 -227 -150 -216 -31 -80 -222 -64 -224
-63550 -224 -190 -395 -396 -159 153 -318 -531 -348 -195 -329 -297 -212 -240 -155 -167 -414 -156 -308 -255 -95 -253 -278 -211
-62147 -211 -155 -206 -31 -252 -172 -114 -240 1 -94 -198 -377 -194 -160 -82 -162 -269 -328 -168 -365 -101 -208 -300 -63
-60745 -63 -303 -242 -184 -290 -158 -270 -410 -157 -122 -152 -191 -157 -512 -210 -262 -65 -314 -66 -386 -158 -74 -251
-59404 -251 -206 -220 -114 -256 -123 -164 -243 -146 -247 -305 -277 -18 -138 -13 85 40 -380 -332 -291 -219 -184 -129 -146 -207 -199
$$ packed form
-69042d46K75p5o7%j42K40q6j4J75r9j32K70j20q4n6J00L6J51l6k34L5J78Q1k23
-67579b73J07K5j39K56k55J38q7J61j81J61j58L33k84l9k5M4K90k20J97j86j62
-66299b97L48m07M52k35j17n1J76J1j76o6K07k12J65P3QM3L0k25K26k71J10j4
-64958b22oR5J18j13n8l50J84M12l37k62L72j98J86j0K4o2P7o6J85m9j42J58j60
-63550b24L4k05jK37L12m71k13J83J53j34L2Q5k8Q5j2k47K58j52N3J60j58k5O7
-62147b11N6n1J75k21Q0N8j26K41r5j04j79J83L4P8q0j07n9J60j97K64j07r2K37
-60745f3k40O1N8j06J32j12j40K53L5l0l9L4l55L02n2J97k49K48l20K28Q4j77
-59404b51M5j4J06j42J33m1p9R7j01n8K8K59j20J25R8m5m20M8M1P2L5N5j7o1Q
$$ plain form
-57872 -199 -159 -262 12 -230 -494 -48 -236 -299 11 -203 -164 -111 -308 -327 -291 -300 -291 17 -95 -312 -185 -232 -264
-56470 -264 158 -227 -253 -140 -163 -217 -106 -243 -300 -156 -196 -1 -224 -80 -352 -214 67 -180 -22 42 -159
-55191 -159 -12 -362 -280 55 -24 -87 -50 -235 -297 -143 -327 -158 -26 -335 -326 -118 -140 -270 -43 -297 -297 -214 60
-53789 60 -12 -199 14 -14 -208 -295 -325 -220 -271 -226 -61 14 -175 -168 -224 -332 -172 -463 -305 115 -68 -279 -273 -168
-52319 -168 -266 -208 18 -293 -53 -419 -162 -419 -304 -121 -435 -172 -262 -301 -282 -46 -284 -215 -275 -68 -198 -41
-50977 -41 -337 -284 -241 105 -21 54 -149 -274 -1 -114 -108 -99 -175 -94 -125 -462 -372 -148 -66 -168 -269 -98 -21 -23 -95
-49453 -95 -171 -98 -96 -191 6 -356 -310 -591 94 -133 112 43 -290 -134 -127 -154 -218 -27 -167 -90 306 -86 -293 -180
-47990 -180 -367 -298 -101 -291 -314 -313 -333 -195 -203 0 -278 -489 -113 -235 -19 5 -317 -221 -211 -218 -215 -322 -147 -513
$$ packed form
-57872a99M0j03K74k42k64M46j88o3L10k14L9N3j97j9L6rRL08j12k17J27m7l2
-56470b64M22l85k6J13k3n4J11j37n7J44m0J95k23J44k72J38K81k47J58O4k01
-55191a59J47l50Q2L35p9o3L7j85o2J54j84J69J32l09RK08k2j30K27k54%Q3K74
-53789F0p2j87K13k8j94q7l0J05n1M5J65P5j89Pn6j08J60k91J58M20j83k11OJ05
-52319a68r8N8K26l11K40l66K57k57J15J83l14K63r0l9J9K36k38O9o0K07j30J57
-50977d1k96N3M3L46j26P5k03j25K73j13ORp6Q1l1l37R0K24Q2j02j01J71P7kp2
-49453i5p6P3Kr5J97l62M6k81O85k27K45o9l33J56Pk7o4J91j40P7L96l92k07J13
-47990a80j87O9J97j90k3Jk0J38qK03k78k11L76j22K16K4l22R6J0pLj07J75l66
$$ plain form
-46519 -513 -196 -105 -91 -67 -49 -223 -185 -366 36 33 -406 -188 -218 -222 -138 -73 -18 -151 -219 -319 -355 -262 -162 -97 -182
-44995 -182 -35 -233 -317 -201 -91 -160 -203 -214 -154 -330 -550 -152 -85 -171 83 -221 -183 -197 -166 -22 119 110 -314
-43593 -314 -160 -64 -166 -186 67 -198 19 -250 -142 -177 -38 -175 -125 -70 -244 -151 88 -154 -313 -216 -277 -386
-42252 -386 -140 -264 -75 -319 -29 -314 -105 -95 -308 -91 -187 -90 -244 -334 -160 -29 -262 -268 -137 -285 -117
-40965 -117 -264 -151 -403 20 -131 2 -136 115 -216 104 -162 -211 55 119 -106 -60 72 -193 59 -235
-39748 -235 -8 -67 -221 -29 -111 -199 -199 -97 -157 305 -232 57 -23 32 -113 -17 -49 -92 -192 -76 -8 -68 -39 -3
-38285 -3 99 -95 -130 -225 -106 9 -320 -248 -117 27 -189 -61 -167 -99 -118 -213 -153 -335 -76 -213 -72 -214
-36936 -214 -72 -192 22 -73 -157 -181 -54 185 126 -131 -84 -295 -255 0 -85 -23 198 -253 -143 -130 -47 -299 -65
$$ packed form
-46519e13L17R1J4K4J8j74L8j81M02lm39K18l0mQ4O5N5j33o8j00l6R3J00O5q5
-44995a82J47j98q4J16J10o9m3j1O0j76k20L98O7q6K54l04L8j4L1J44J41rm24
-43593c14J54R6j02k0K53k65K17k69J08l5J39j37N0N5j74R3K39k42j59R7o1j09
-42252c86K46j24J89k44K90k85K09J0k13K17r6R7j54r0J74J31k33oJ31j48J68
-40965a17j47J13k52M23j51J33j38K51l31L20k66m9K66O4k25M6J32k65K52k94
-39748b35K27n9j54J92q2q8%J02o0M62n37K89q0N5j45R6l2m3j00J16O8o0K9L6
-38285cJ02j94l5r5J19J15l29P2J31J44k16J28j06O8j9r5O0j82K59j37J41j42
-36936b14J42j20K14r5q4k4J27K39n9k57M7k11M0K55q5O2K21m51J10J3Q3k52K34
$$ plain form
-35534 -65 -2 37 210 -430 81 -509 -132 -36 -172 -117 -249 -210 -65 -94 -58 -62 -271 -225 108 32 -84 -187 -123 -22
-34070 -22 -147 -132 -263 -57 -70 -321 -251 -240 -286 -99 -239 -168 -133 162 -169 -71 -253 -227 -44 -31 -76 -108 -77 -176
-32607 -176 17 -306 -233 -150 -74 -129 -171 -220 0 -177 -264 -312 -59 57 -297 -188 -172 -205 -279 -54 -128 -308 -55
-31205 -55 28 -36 -308 -382 -68 -202 10 65 -215 -75 -239 146 215 3 -10 -28 142 98 -76 90 24 97 -150
-29795 -150 80 -194 -178 115 -94 -144 -310 -73 140 -170 20 26 -50 57 9 -48 -109 -288 -21 -78 7 -45 14
-28395 14 -69 -50 -11 -31 -111 -209 -30 59 -151 15 -35 -240 -55 200 -58 -181 43 -49 -31 -10 -253 68 -30 109
-26931 109 53 -31 -35 -147 -53 -72 42 47 -191 32 -208 241 -3 -18 -19 -49 29 151 -133 -165 -83 -47 -62 -169 -39
-25406 -39 -4 -259 -341 29 -90 -11 -188 -77 129 77 6 -201 9 197 6 -119 -135 133 -127 46 -131 -63
$$ packed form
-35534f5O3L9J73o40N11n90L77R6j36N5j32L9J45k9L6mk09M6L33p6j16j03O4J01
-34070b2j25J5j31K06j3k51P0J1m6J87j40P1L5K95l31R8j82K6J83J3m5l2L1r9
-32607a76J93l23P3Q3P6n5m2m9K20j77q7m8K53J16l54J09J6l3p4K25p4j80K53
-31205e5Q3o4k72p4L14j34K12N5k80J40j64L85O9k12j3j8J70m4j74J66o6P3k47
-29795a50K30k74J6K93k09n0j66K37K13l10J90Op6J07m8n7o1j79K67n7Q5n2N9
-28395A4q3J9L9k0q0r8J79Q9k10J66n0k05J85K55k58j23K24r2J8K1k43L21r8J39
-26931A09n6q4mj12R4j9J14Nk38K23k40M49k44j5jl0P8J22k84l2Q2L6j5j07J30
-25406c9L5k55q2L70j19P9j77J11K06n2p1k07K10J88j91j25j6K68k60J73j77O8
$$ plain form
-24058 -63 21 -36 -88 29 -67 -188 -144 7 -9 100 -69 59 -162 196 -167 -24 76 -168 209 25 -159 55
-22717 55 59 -96 86 44 -70 81 34 -31 -235 -143 36 -75 -22 191 159 -160 -46 102 -80 33 284 123
-21376 123 -252 94 134 -242 -116 -235 32 -77 46 -168 -174 -148 -138 74 192 95 89 -156 65 108 -249 65
-20029 65 -61 -18 -22 -28 160 77 109 22 161 150 119 -7 -91 -36 180 178 -65 133 112 110 -139 1 -138 73 66 -94
-18442 -94 -18 34 -254 137 120 323 55 390 -147 166 -112 182 164 -43 41 221 -48 58 171 104 99 262
-17103 262 41 145 162 124 26 196 -22 162 348 -100 327 123 42 27 291 280 37 181 -36 271 291 114
-15761 114 83 275 123 63 136 186 319 63 74 230 176 298 399 421 216 220 -35 230 39 38 92 95 244 303
-14291 303 64 237 221 289 43 148 21 31 -94 212 -14 244 85 94 167 -60 273 542 486 12 61 312
$$ packed form
-24058f3Q4n7n2J17r6j21M4J51j6J09j69J28k21L58l63J43J00k44L77j84j84K14
-22717E5Mj55J82m2j14J51m7o5k04R2J79j11N3K13l2l19J14J48j82J13K51j61
-21376A23l75L46M0l76J26j19K67j09J23k14oK6J0K12J18r7ok45K21M3l57L14
-20029F5j26M3moJ88q3L2q7J39j1l1j26q4N5K16kk43J98k1kk49J40j39K11pj60
-18442i4P6N2k88L91j7K03k68L35n37L13k78K94j8k07Q4J80k69J06J13o7nJ63
-17103B62k21J04J7l8r8J70k18J84J86m48M27k04q1j5K64j1k43J44k17L07K0j77
-15761A14l1J92j52o0P3N0J33k56J1J56n4J22J01K2k05Mk55K65j91jN4LJ49N9
-14291C03k39J73j6O8k46J05j27J0j25L06k26K58j59RP3k27L33K69n6m74M9K51
$$ plain form
-12949 312 223 94 254 123 122 171 -4 174 225 225 -12 308 147 22 183 131 132 265 234 526 85 150 91 254
-11486 254 71 146 215 246 200 265 25 300 165 114 270 336 345 304 -19 194 39 385 270 270 63 382 27
-10086 27 124 22 250 -40 193 51 237 -134 11 206 679 42 360 342 424 -16 328 118 273 174 405
-8798 405 231 278 127 391 340 281 149 159 229 258 74 527 180 251 61 447 458 551 331 285 142 393 237
-7396 237 216 307 305 162 369 148 443 191 499 378 585 374 502 229 514 231 250 396 476 322 379 200
-6056 200 359 309 536 472 309 290 442 666 443 79 376 211 519 461 483 269 528 545 849 357 718
-4768 718 552 620 658 728 586 720 474 653 466 896 523 962 475 903 583 944 593 1121 178 1085
-3551 1085 534 1038 723 1013 487 922 760 1060 848 1059 776 1299 648 1150 683 1350 568 1018 873
$$ packed form
-12949C12q9j29J60j31jM9j75J78N1%k37L20j61j25J61n2JJ33l1K92m41O5n9J63
-11486B54j83P5O9L1m6O5k40K75j35n1J56O6Rm1l23K13j55L46j15%k07L19l55
-10086B7R7j02K28k90K33j42J86l71J45J95M73o37L18j8Q2m40L44k10J55r9K31
-8798D05j74M7j51K64n1n9j32J0P0K9j84M53l47P1j90L86J1R3k20m6j43K51j56
-7396B37k1R1kj43K07k21K95k52L08j21K07k11J28k73K85k83J9J46Q0j54N7j79
-6056B00J59n0K27o4j63j9J52K24k23l64K97j65L08n8K2k14K59J7L04m92L61
-4768G18j66O8L8P0j42J34k46J79j87M30l73M39m87M28l20L61l51N28r43R07
-3551A085n51N04l15K90n26M35j62L00k12K11k83N23o51N02m67O67p82M50j45
$$ plain form
-2394 873 1567 935 1241 1027 1509 899 1773 1252 1882 1086 2093 1192 2049 1564 2312 2157 2666 1413 2748
-1229 2748 1724 3025 2295 3556 2667 4814 4821 4653 2284 5276 3221 6354 4242 8488 6152 12483
-257 12483 8748 21001 20376 66662 81198 -7078 3566 -3883 2246 -2690 1359 -1612 1259
540 1259 -1130 1199 -534 1651 1442 1754 -627 1227 -472 888 -611 685 -620 490 -703
1452 -703 320 -430 376 -393 449 -343 148 -454 408 -27 880 -1816 -190 -547 174 -242 269 -440
2555 -440 319 -203 352 -568 473 -198 159 -323 324 -506 -22 -462 235 -610 -92 -580 35 -318 -491
3712 -491 -199 108 -386 155 -327 143 -392 137 -222 35 48 223 -209 256 -319 118 -178 153 278 352
4937 352 1240 1047 -172 140 -492 63 -373 272 -71 24 -443 460 -100 107 -187 172 -358 190 -268
$$ packed form
-2394H73O94o32L06k14M82o10Q74n21O30p96J007r01Q57m85P48j55N09j253J335
-1229B748j024J301p30J261q89K147Pj68k369K992k055L133k112M246k336O331
-257A2483l735J2253o25M6286J4536q8276J0644p449O129m936M049k971K871
540A259k389K329j733K185k09L12k381J854j699J360j499J296j305J110j193
1452g03J023p50Q06p69Q42p92M91o02Q62m35R07k696J626l57P21m16N11p09
2555d40P59n22N55r20J041o71L57m82O47q30M84m40O97q45N18m88O15l53j73
3712d91K92L07m94N41m82M70n35N29l59K57J3J75m32M65n75M37k96L31J25P4
4937C52Q88j93j219L12o32N55m36O45l43R5m67R03n60K07k94L59n30N48m58
$$ plain form
6095 -268 -115 -119 170 78 197 -360 205 31 60 162 276 55 100 -62 323 -134 217 -34 262 -148 -148 2
7435 2 34 -434 94 -271 288 -187 292 -137 -98 -123 243 -15 191 -317 101 -166 347 -238 202 142 250
8715 250 -71 226 66 145 127 216 147 248 425 956 1298 2805 440 60 -36 -112 -280 -90 -77 197 -62
10001 -62 129 -163 114 -309 235 -430 -195 -85 -196 -123 -264 -421 -102 -262 21 -157 -77 -458 88 -353
11220 -353 34 -282 -28 -291 -84 -47 102 14 434 130 -316 -253 -234 -358 -109 -265 -233 -220 -235 -489 -238 -252
12560 -252 -169 -224 -107 -228 -267 -263 -29 -130 -76 -197 -39 -352 -244 -176 -151 -224 -146 -206 2 -479 -313 -239 167
13969 167 -271 -161 -207 107 -257 -128 -159 -64 -239 51 -67 112 12 -322 -45 -207 -20 -72 -196 -304 -290
15250 -290 -226 -285 -256 -169 -43 -151 -2 -310 -10 -449 53 -328 -254 -356 -87 -322 -91 -204 -105 -18 -206 -256
$$ packed form
6095b68J53mK89r2J19n57N65j74K9J02J14k21M5j62L85m57L51k51K96m10%J50
7435BL2m68N28l65N59m75M79m29L9k5L66k58K06n08M18k67N13n85M40o0J08
8715B50l21K97j60P9j8Q9o9J01J77N31L42J507k365l80r6p6j68J90J3K74k59
10001f2J91k92K77m23N44o65K35J10j11P3j41j57L19j60K83j78Q0l81N46m41
11220c53L87l16K54k63K07L7J49q8M20l04m46O3J9j24K49j56L2J3j5k54K51j4
12560b52Q3n5J17j21l9MK34j01N4j21J58l13J08O8K5p3P8o0K08m81J66P4M06
13969A67m38J10m6L14l64J29l1R5j75K90j18J79j00l34K77j62J87n2j24j08J4
15250b90O4n9K9Q7J26j08J49l08L00m39N02l81P4j02K69k35K31j13R9Q7j88n0
$$ plain form
16589 -256 -213 -182 63 -144 -46 -139 -22 -312 -32 -257 -168 -33 45 -348 -159 -319 -18 -275 -206 -366 -353 -259
17938 -259 -175 -461 -43 61 32 -180 -236 -220 111 -418 -138 -303 -75 -309 101 -20 -13 61 329 -103 -37 -270
19279 -270 -189 -393 -271 -331 -220 -238 -323 -202 -139 -236 -93 -161 -4 -95 -27 -329 -184 -12 -145 -166 103 -140 -9
20680 -9 -43 -170 -378 -229 -341 -306 -67 -115 -220 3 -450 -183 -214 -25 -259 -11 -230 -315 -386 -106 -288 -160
22021 -160 -529 -24 -326 -272 -202 -217 -15 -150 -199 -77 -309 -265 -130 -37 -333 -78 -232 -72 -340 148 -128
23309 -128 -251 -394 96 -278 -67 -348 -24 -193 -188 -184 -297 -350 -229 -562 -139 -230 -123 -115 18 -282 57 -255
24648 -255 -92 -322 -101 -180 -160 -481 23 -8 -103 -231 -6 -298 -107 -141 3 -416 -400 -88 -281 -349 66 -515
25989 -515 -125 -185 -205 -438 85 -244 8 -184 39 -255 -195 -28 -231 -304 -102 -252 -326 -72 -304 -299 -74 -119
$$ packed form
16589b56M3L1K45k07R8r3J17k90K80k25Q9J35P8l93J89j60L01k57O9j60J3R4
17938b59Q4k86M18J04k9k12n6J6L31n29K80j65K28k34M10j21PP4K68m32O6k33
19279b70Q1k04J22o0J11j8q5J21O3r7J43o8J57r1O8l02J45J72j33k1K69k43J31
20680il4j27k08J49j12L5K39m8j05K23m53K67l1J89k34K48k19q5p1K80j82J28
22021a60l69N05l02N4P0j5K02j35m9J22k32M4J35R3k96K55j54J60k68M88k76
23309a28j23j43M90l74K11k81L24j69NMj13n3J21l33M23r1J07QJ33l00L39l12
24648b55J63k30K21p9K0l21N04l1r5j28K25k92J91l4J44m19J6L12j93o8M15n81
25989e15L90o0k0k33N23l29K52j92K23k94O0J67k03p3K02j50p4K54k32NK25m5
$$ plain form
27338 -119 -40 -265 -162 -115 -142 -319 -117 -293 61 -421 -238 -93 59 -135 -101 -66 -194 -253 -126 -232 -336
28617 -336 -226 -236 -542 110 -341 -149 -207 2 -116 -98 -279 -97 -63 60 -286 -47 -318 -128 -177 -62 -231
29897 -231 -311 -87 -295 -418 -244 -265 -52 71 -181 -269 56 -98 -28 -95 -178 -38 -263 -156 -118 -329 108 23
31244 23 -126 -183 -142 -49 178 23 -125 -95 -138 -264 20 -103 -126 -204 -43 -286 91 -240 -88 -347 39 -394
32585 -394 109 179 363 441 -166 -151 39 -205 -110 -147 -299 -235 -50 -65 -4 -156 33 -47 -83 114 42 -175 -200
33987 -200 -154 -4 -225 86 -83 19 -119 -112 -61 -245 -132 -36 -314 -244 -217 -105 -227 -294 -392 -36 -68 -97 -347
35390 -347 -38 -118 112 -92 73 114 -198 -70 57 -24 -14 -184 -189 -129 -204 -160 -228 -141 131 -187 -124 -277 -97
36798 -97 -225 26 -17 -20 -413 -7 -220 -85 -362 -69 -108 13 -210 -175 -14 -129 -19 -18 -2 66 -215 -148 -134
$$ packed form
27338a19P9k25J03M7k7j77K02j76L54m82J83J45J52j94L4L5j28n9J27j06j04
28617c36J10j0l06O52m51J92n8K09j18J8j81J82L4J23l46K39k71J90m9J15j69
29897b31q0K24k08j23J74k1K13J23k52q8L25j54P0o7q3J40k25J07L8k11M37q5
31244B3j49n7M1R3K27j55j48L0m3j26K84j23k3p8J61k43L77l31J52k59L86m33
32585c94N03P0J84P8o07J5J90k44R5l7j52O4J85j5O1j52J89q0l6J97p2k17k5
33987b00M6J50k21L11j69J02j38PN1j84J13R6k78P0K7J12j22o7r8L56l2k9k50
35390c47L09q0K30k04J65M1l12J28J27q1J0j70nO0p5M4o8Q7K72l18O3j53J80
36798i7j28K51m3ll93M06k13J35k77K93l9J21k23L5J61j15J10JJ6O8k81O7J4
$$ plain form
38200 -134 10 -246 -105 -143 -125 -227 -58 -146 -254 -69 -29 83 -152 -64 -244 29 3 -164 7 -158 -14
39480 -14 -58 -151 -100 -47 -175 -340 -74 -100 -44 -221 154 -54 -272 127 7 31 -324 -140 -377 -184 -59 -5
40827 -5 -286 14 -153 73 33 104 -507 -66 -392 12 -173 -333 -130 -25 10 -14 8 63 -19 133 -3 19 -95
42230 -95 16 64 -136 -345 -260 -202 95 -139 -8 -245 79 -101 1 -90 1 -79 -189 -132 -40 6 -36 -82 -102 95
43693 95 46 -43 -152 -105 139 63 67 -37 -88 -49 129 -148 -131 22 12 8 169 25 -9 -72 -63 -142 27 -75 -160 -246
45279 -246 121 209 319 125 -116 -235 -207 -76 -62 -276 -83 -203 -140 -134 -144 -110 129 70 -31 67 67 -39 -29 -65
46743 -65 179 -447 18 -86 -101 45 200 128 -50 34 -60 -215 243 -16 182 -197 -53 -144 70 -142 175
48029 175 85 147 -348 181 -171 39 45 9 -298 -139 -99 59 -97 186 36 -139 -254 -183 -8 55 -151 -59
$$ packed form
38200a34J44k56J41l8J8j02J69q8j08J85M0J12k35Q8j80K73k6j67J71j65J44
39480a4m4r3N1N3j28j65K66k6N6j77L75k08k18L99j20K4l55J84k37J93J25N4
40827ek81L00j67K26m0P1o11M41l26M04j85j60K03J05L5k4K2N5q2J52j36K2j14
42230i5J11M8k00k09Q5N8K97k34J31k37L24j80J02r1R1q0j10N7R2M6m2m6k0J97
43693I5m9q9j09M7K44p6Mj04n1L9J78k77J7J53j0mJ61j44l4o3Rp9J69j02q5q6
45279b46L67Q8J10j94k41j19K8J31J4k14J93j20O3Oj0L4K39n9j01R8%j06J0l6
46743f5K44o26M65j04j5J46J55p2j78Q4r4j55M58k59J98l79J44r1K14k12L17
48029A75r0O2m95N29l52K10Ol6l07J59M0J58j56K83j50j75j15P1J75O3k06R2
$$ plain form
49370 -59 -72 -155 -267 87 -64 22 127 -85 -206 -286 28 -11 -137 39 -143 -97 -108 -147 -391 -271 54 102 -158
50772 -158 298 -125 -223 -4 -16 -90 -287 -210 -36 14 -189 -79 87 -74 -69 29 112 205 67 -106 33 155 160
52180 160 -13 280 -81 -46 56 31 -5 122 -330 70 -126 85 -78 -88 -130 26 -25 -98 -152 -75 -1 -42 -206
53583 -206 76 -77 90 100 -201 -80 -22 217 -181 -199 -212 18 160 29 206 83 17 14 -65 -57 -37 -248 176
54985 176 -138 205 -28 179 106 -13 88 34 79 -116 18 -112 -223 -191 71 169 79 47 126 149 -45 -189
56326 -189 -91 174 102 0 21 -27 142 34 -80 -191 182 10 -217 127 -103 170 216 170 7 -246 -110
57612 -110 -63 66 59 -9 57 -186 174 43 -102 -100 127 131 -11 33 1 -57 170 -84 5 10 -36 -176 35 -70 -196
59136 -196 -45 63 -138 2 -53 -155 -58 -137 61 -109 2 118 28 -85 -67 -59 -177 151 -109 250 -1 137
$$ packed form
49370e9j3q3j12L54j51Q6J05k12j21q0L14l9j26J76j82M6j1l9k44J20L25M8k60
50772a58M56m23r8K19j2p4j97P7J74N0k03J10J66j61NR8Q3R3j38j73J39J22N
52180A60j73K93l61L5J02k5l6J27m52M00j96K11j63j0m2J56n1p3n4P7P4m1j64
53583b06K82j53J67J0l01J21N8K39l98j8j3K30J42j31J77j23o6lp9QK0k11M24
54985A76l14L43k33K07p3j19J01n4M5j95J34j30j11L2K62R8r0l2P9K3j94j44
56326a89R8K65p2j02K1m8J69j08j14j11L73j72k27L44k30K73M6m6j63k53J36
57612a10M7J29po8O6k43L60j31j45KK27Mj42M4l2n8K27k54Q9Nm6j40K11j05j26
59136a96J51J08k01J40n5j02R7p9J98j70J11J16r0j13J8Qj18L28k60L59k51J38
$$ plain form
60478 137 74 239 205 127 54 140 17 217 82 27 -95 147 -4 225 155 -56 313 64 4 79 -134 -87 106
61880 106 -14 109 261 196 -1 50 331 -59 44 85 75 149 64 106 56 -146 179 -112 113 -31 242 -127
63228 -127 129 184 186 -80 433 35 360 -1 -24 -20 282 80 -88 -110 88 62 -47 30 214 -130 -64 51 -219
64629 -219 4 102 203 297 29 311 107 146 -46 245 48 140 264 -133 189 -55 20 225 62 99 312
65909 312 167 95 93 17 408 174 173 -11 26 -131 -16 17 71 24 -78 -151 113 164 193 144 -27 31 -77 115
67380 115 5 -215 55 -209 197 -113 339 185 -56 61 -6 -172 266 -50 88 153 75 40 168 173 -8
68659 -8 -53 269 265 -41 5 189 30 -63 167 68 -19 111 345 87 389 253 213 64 5 -240 19 43 42 303
70122 303 54 424 7 231 143 -25 142 312 127 196 -44 133 400 241 -2 325 106 261 82 62
$$ packed form
60478A37o3J65l4p8p3Q6j23K00j35n5j22K42j51K29p0k11L69k49o0P5k13M7J93
61880A06j20J23J52o5j97N1K81l90J03M1j0P4q5M2n0k02L25k91K25j44K73l69
63228a27K56N5Kk66N13l98L25l61k3ML02k02j68k2J98k6j09P7J84l44O6J15k70
64629b19K23R8J01R4k68K82k04L9j92K91j97R2J24l97L22k44P5K05j63L7K13
65909C12j45p2kp6L91k34jj84L7j57J15L3N4m7j02p3K64N1K9m9j71N8j08J92
67380A15j10k20K70k64M06l10M52j54k41J17o7j66M38l16J38O5p8l5J28Nj81
68659hm5L22ml06M6J84j59r3K30r9q7J30K34k58L02j36m0j49n9k45K59K4jK61
70122C03k49L70m17K24q8j68J67J70j85O9k40J77K67j59k43L27k19J55j79k0
$$ plain form
71341 62 174 130 14 -7 75 259 60 82 7 66 19 161 210 -96 70 49 230 246 -29 343 178 27 67
72751 67 -27 34 315 -22 270 -146 333 189 -75 166 102 184 189 -58 200 145 167 272 602 117 445 44
74090 44 278 121 129 2 180 209 121 258 261 72 101 223 38 55 151 44 149 213 225 205 138 65 267 -35
75554 -35 64 80 93 242 188 141 -6 110 301 131 22 130 -12 61 120 124 183 183 325 111 306 123 99 157
77017 157 -16 192 -23 -17 140 102 368 100 118 183 177 89 212 271 -180 25 136 183 156 156 84 227 134 -18
78488 -18 394 247 250 142 148 164 227 197 -159 47 114 350 87 327 340 169 82 146 185 132 218 105 394 178
79951 178 56 157 148 237 243 58 354 154 191 365 297 335 141 162 231 -63 257 335 51 136 252 111 -108
81353 -108 150 142 374 200 164 244 -60 240 1 203 182 13 283 287 82 362 166 247 282 367 61 375 389
$$ packed form
71341F2J12m4j16k1Q2J84j99K2p5N9m7J42M9l06J66k1J81J6k75L72j65j51M0
72751F7r4O1K81l37K92m16M79j44k64K41o4Q2Nk47K58n5K2J05L30m85L28m01
74090D4K34j57Qj27J78K9q8J37Lj89K9J22j85J7R6j07J05O4J2k0o7p3K02l02
75554c5R9J6J3J49n4m7j47J16J91j70j09J08j42P3N9MN9%J42k14J95j83k4N8
77017A57j73K08k15OJ57l8K66k68J8O5oq8J23N9m51K05J11M7k7%p2J43r3j52
78488a8M12j47Lj08OJ6O3l0l56K06O7K36k63K40J3j71q7O4L9n3Q6j13K89k16
79951A78j22J01rQ9Oj85K96k00L7J74o8L8j94K1O9k94L20P8k84Q5J16j41k19
81353a08K58qK32j74l6Q0l04L00k39K02k1j69K70Mk05K80j96Q1L5Q5l06L14J4
$$ plain form
82755 389 331 285 176 56 41 364 465 158 253 173 235 189 380 195 345 232 72 91 242 271 171 115 312
84165 312 7 247 353 315 183 326 170 362 -15 379 307 282 398 342 95 270 116 209 337 277 80
85443 80 150 220 366 32 324 159 210 98 53 405 263 249 276 186 178 152 408 117 319 157 310 494 583
86846 583 200 181 384 270 180 -19 133 235 327 178 386 173 176 133 290 286 141 131 132 159 152 319 -20 487
88309 487 176 185 261 211 330 417 242 340 13 250 170 418 508 410 88 649 318 321 388 376 50 326 334 467
89780 467 426 287 309 113 117 426 240 511 223 396 58 123 300 283 453 539 523 233 330 648 166 191 523
91182 523 319 308 467 439 55 637 464 208 290 499 258 257 513 245 293 372 383 426 489 201 376 410 624
92584 624 471 570 338 544 403 206 226 424 289 447 890 629 630 710 875 924 919 880 840 879 1064 1058 1078 1096
$$ packed form
82755C89n8m6j09j20j5L23J01l07R5q0O2m6J91j85J50j13j60J9J51K9j00n6J97
84165C12l05K40J06l8j32J43j56J92l77L94p2k5J16n6k47J75j54R3J28o0j97
85443H0P0P0J46l34K92j65N1j12m5L52j42j4K7r0qk6K56k91K02j62J53J84Q9
86846E83l83j9K03j14r0j99J52J02R2j49K08k13Lm3J57mj45j0JK7pJ67l39N07
88309D87l11RP6n0J19Q7j75R8l27K37q0K48R0r8l22N61l31LO7j2l26K76QJ33
89780D67m1j39K2j96ML09j86K71k88J73l38O5J77j7J70Q6j6k90R7L18m82K5L32
91182E23k04j1J59k8l84N82j73k56Q2K09k41jK56k68M8P9J1M3O3k88J75L4K14
92584F24j53R9k32K06j41j97K0J98j35J58M43k61JQ0J65M9nl9m0L9J85oK0J8
$$ plain form
94047 1096 890 1030 542 705 454 709 494 629 433 619 695 350 529 532 289 644 271 281 511 240
95272 240 313 275 152 526 415 367 357 145 234 325 297 346 128 255 357 372 452 294 342 329 298 479 76 153
96736 153 180 547 67 747 270 426 380 282 451 566 279 351 378 671 480 403 462 180 334 523 110 238
98077 238 273 144 427 343 388 379 124 279 239 402 652 454 118 548 564 259 329 125 232 459 427 285
99424 285 277 272 239 247 438 337 372 410 572 323 434 160 423 161 457 288 251 595 491 333 140 430 129
100826 129 301 204 176 323 316 558 535 490 475 205 460 347 614 282 409 343 179 311 310 333 178 317 343
102228 343 364 398 323 380 67 359 121 130 171 383 127 331 427 450 361 642 414 396 191 24 138 328 583
103631 583 385 379 637 329 404 244 366 331 334 131 62 440 771 258 394 366 553 312 465 278 235 479
$$ packed form
94047A096k06J40m88J63k51K55k15J35j96J86P6l45J79Lk43L55l73J0K30k71
95272B40P3l8j23L74j11m8j0k12Q9R1k8M9k18J27J02J5Q0j58M8j3l1J81m03P7
96736A53K7L67m80O80m77J56m6r8J69J15k87P2K7K93j91p7N9k82J54J89m13J28
98077B38L5j29K83q4M5rk55J55m0J63K50j98l36M30J6l05P0k04J07K27l2j42
99424B85qnl3QJ91j01L5L8J62k49J11k74K63k62K96j69l7L44j04j58j93K90l01
100826A29J72r7k8J47pK42k3m5j5k70K55j13K67l32J27o6j64J32jK3j55J39K6
102228C43K1L4p5N7l13K92k38RM1K12k56K04R6K3q9K81k28j8k05j67J14J90K55
103631E83j98oK58l08P5j60J22l5Lk03o9L78L31n13J36k8J87k41J53j87m3K44
$$ plain form
104979 479 515 350 500 374 594 554 387 408 610 564 219 294 455 514 230 158 302 567 487 462 370 559 534
106380 534 477 663 381 418 422 525 263 447 227 422 314 579 188 327 353 408 422 406 412 279 588 554 213
107782 213 410 451 530 440 396 344 352 406 622 603 229 417 443 143 626 287 550 458 520 346 474 388 409 337
109245 337 425 286 421 565 711 493 309 433 246 532 461 596 422 582 506 285 452 599 334 522
110472 522 358 370 360 203 453 364 651 386 513 393 563 372 417 592 356 488 475 654 207 342 670
111751 670 354 327 499 583 477 516 293 339 794 497 616 500 120 520 500 517 604 388 589 722 499 475
113092 475 286 493 486 559 453 437 431 305 555 756 247 549 454 355 451 669 192 361 426 675 349 487 598
114501 598 242 452 568 344 437 598 656 532 835 261 397 583 230 428 461 639 365 423 367 752 491
$$ packed form
104979D79L6j65J50j26K20m0j67K1K02m6l45P5J61N9k84p2J44K65q0k5r2J89k5
106380E34n7J86k82L7MJ03k62J84k20J95j08K65l91J39K6N5J4j6Oj33L09l4l41
107782B13J97M1P9r0m4n2QN4K16j9l74J88K6l00M83l39K63r2O2j74J28q6K1p2
109245C37Q8j39J35J44J46k18j84J24j87K86p1J35j74J60p6k21J67J47k65J88
110472E22j64J2j0j57K50q9K87k65J27j20J70j91M5J75k36J32j3J79m47J35L28
111751F70l16k7J72Q4j06L9k23M6M55k97J19j16l80M00k0J7Q7k16K01J33k23k4
113092D75j89K07pP3j06j6oj26K50K01n09L02r5r9R6K18m77J69O5K49l26J38J11
114501E98l56K10J16k24R3J61N8j24L03n74J36J86l53J98L3J78k74N8n6L85k61
$$ plain form
115780 491 875 947 625 863 487 629 507 472 452 490 411 414 616 437 521 507 468 438 634 543 508 432 454 640
117243 640 427 638 551 378 521 760 370 634 348 412 401 532 518 581 478 602 641 381 350 457 761 226
118584 226 504 696 724 711 507 799 476 581 588 591 710 599 594 419 439 497 445 556 474 586 805 764 582 734
120055 734 530 610 532 708 429 511 493 572 577 693 456 728 652 457 408 691 424 653 763 778 646 613 372
121457 372 598 760 664 541 712 503 482 536 730 554 547 790 722 585 475 649 869 395 607 622 529 448
122797 448 748 584 414 528 459 780 841 560 727 754 820 620 610 478 706 662 432 930 487 465 758 688
124146 688 694 471 583 525 620 556 820 630 373 488 770 405 596 837 880 548 818 460 707 655 554 598
125487 598 465 416 531 414 778 686 734 696 584 583 832 559 597 501 298 393 643 532 596 540 728 529 466
$$ packed form
115780D91L84P2l22K38l76J42j22l5k0L8p9LK02j79Q4j4l9l0J96r1l5p6K2J86
117243F40k13K11q7j73J43K39l90K64k86O4j1J31j4O3j03J24L9k60l1J07L04n35
118584B26K78J92K8j3k04K92l23J05PLJ19j11nj75K0N8n2J11q2J12K19m1j82J52
120055G34k04Q0p8J76k79Q2j8P9NJ16k37K72p6j95m9K83k67K29J10J5j32l3k41
121457C72K26J62r6j23J71k09k1N4J94j76pK43o8j37j10J74K20m74K12J5r3q1
122797D48L00j64j70J14o9L21O1k81J67K7O6k00j0j32K28m4k30M98m43k2K93p0
124146F88Ok23J12n8R5o4K64j90k57J15K82l65J91K41M3l32K70l58K47n2j01M4
125487E98j33m9J15j17L64r2M8l8j12jK49k73L8r6k03R5K50j11O4n6J88j99o3
$$ plain form
126888 466 469 1074 748 579 665 801 617 746 568 993 697 679 744 720 725 539 646 601 591 648 545 912 581
128290 581 939 691 547 321 682 847 618 637 606 453 702 561 785 760 661 635 978 802 868 794 718 658
129638 658 529 844 689 757 1061 689 668 667 738 715 758 861 411 729 867 631 879 984 630 595 800 954
130980 954 715 474 768 672 738 863 512 707 603 580 704 994 670 896 980 684 919 958 850 520 675
132258 675 675 829 854 996 750 726 680 876 885 752 848 687 1055 858 754 756 715 811 741 766 930 983 779 846 966
133790 966 808 664 996 761 843 713 796 900 770 721 872 846 1096 795 688 821 810 707 634 839 738
135070 738 984 972 462 502 808 902 993 1147 975 848 826 866 1201 900 902 887 844 809 889 984 675 1036 1037 927
136533 927 818 863 828 843 730 1121 616 692 859 894 825 1088 758 1010 1072 997 978 995 639 1067 712 832 854
$$ packed form
126888D66LO05l26j69Q6J36j84J29j78M25k96j8O5k4Nj86J07m5j0N7j03L67l31
128290E81L58k48j44k26L61J65k29J9l1j53K49j41K24k5r9k6L43j76O6p4p6o0
129638F58j29L15j55O8L04l72k1jP1k3M3J03m50L18J38k36K48J05l54l5K05J54
130980I54k39k41K94r6O6J25l51J95j04k3J24K90l24K26Q4k96K35L9j08l30J55
132258F75%J54K5J42k46k4m6J96Rj33R6j61L68j97j04Km1R6p0K5J64N3k04O7J20
133790I66j58j44L32k35Q2j30Q3J04j30m9J51k6K50l01j07J33j1j03p3K05j01
135070G38K46j2n10M0L06R4R1J54j72j27k2M0L35l01Kj5m3l5Q0R5l09L61Jj10
136533I27j09M5l5J5j13L91n05P6J67L5o9K63l30K52O2p5j9J7l56M28l55J20K2
$$ plain form
137936 854 880 1190 935 974 921 1018 1265 1078 789 1131 975 944 1191 943 939 889 1236 1089 1326 1055 1028 1025 869
139344 869 825 1080 949 1164 914 1143 841 1021 1141 1063 870 1153 1203 924 1021 1228 976 1321 1089 1153 1055
140624 1055 907 1128 1207 1037 1033 979 982 885 1378 898 1344 969 1274 1005 1002 1358 1077 1039 1059 1092 881 945 1216
142026 1216 1190 1050 1113 1277 1027 995 1110 1407 1444 1151 1254 1283 1121 1215 1160 768 1352 1108 1217 1108 1211
143312 1211 1416 1251 1265 1377 1243 1151 1244 1184 1013 1247 1192 1212 1218 1057 1297 1306 1411 1319 1149 1349 1153 1252 1180
144714 1180 1323 1338 1303 1557 1222 1346 1320 1348 1267 1188 1208 1257 1171 1284 1329 1399 1518 1365 1384 1445 1135 1592 1367
146117 1367 1331 1566 1258 1419 1680 1556 1409 1546 1657 1426 1456 1338 1557 1704 1385 1359 1707 1754 1759 1476 1582
147395 1582 1456 1676 1519 1526 1929 1904 1733 1756 1724 1731 1752 1763 1963 1837 1957 1760 1976 1846 1934 1896 1642 1592 1946
$$ packed form
137936H54K6L10k55L9n3R7K47j87k89L42j56l1K47k48mn0L47j47K37k71k7lj56
139344H69m4K55j31K15k50K29l02J80J20p8j93K83N0k79R7K07k52L45k32O4r8
140624A055j48K21P9j70mn4Lr7M93m80M46l75L05k69lL56k81l8K0L3k11O4K71
142026A216k6j40O3J64k50l2J15K97L7k93J03K9j62R4n5l92N84k44J09j09J03
143312A211K05j65J4J12j34r2R3o0j71K34n5K0Oj61K40RJ05r2j70K00j96R9p2
144714A180J43J5l5K54l35J24k6K8q1p9K0M9q6J13M5P0J19j53J9O1l10M57k25
146117A367l6K35l08J61K61j24j47J37J11k31L0j18K19J47l19k6L48M7Nk83J06
147395A582j26K20j57PM03k5j71K3l2PK1J1K00j26J20j97K16j30Q8l8k54n0L54
$$ plain form
148805 1946 2038 1936 2132 1994 2025 2386 2758 3141 4695 7112 3042 2110 1811 1861 1777 1673 1719 1723 1879 2017
150024 2017 1878 1773 1756 1878 1813 1712 1914 1604 1879 1830 1992 1955 2256 1587 2148 2098 1730 1992 2126 2131 2216 2153
151364 2153 2034 1981 2425 2445 2430 2228 2259 1965 2000 2160 2414 2342 2746 3561 4751 6255 3150 2097 2185 2309
152583 2309 2275 2519 2447 1705 1999 2199 2424 2306 1976 2044 2295 2247 2396 2214 2396 2305 2241 2358 2548 2298 2439
153869 2439 2344 2504 2470 2371 2487 2577 2491 2496 2365 2592 2565 2592 2458 2551 2876 2758 2791 2233 2645 2539 2558 2773 2583
155271 2583 2823 2508 2564 2561 2495 2743 2946 2467 2497 1897 1884 2375 2697 2954 2985 3227 2944 3302 2840 3320 2997
156557 2997 2915 3204 3319 3292 3316 3317 3172 3488 3278 3380 3428 3443 3574 3799 3466 3452 3550 3458 3901 4081 3744 3962
157899 3962 3937 3946 4382 4437 4717 4113 3722 3742 4101 4167 4188 4181 4201 4413 4726 5310 6401 5229 4757 4490 4342 4416
$$ packed form
148805A946R2j02J96j38L1L61L72L83J554K417m070r32k99N0q4j04M6MJ56J38
150024B017j39j05j7J22o5j01K02l10K75m9J62l7L01o69N61n0l68K62J34NQ5o3
151364B153j19n3M44K0j5k02L1k94L5J60K54p2M04Q15J190J504l105j053Q8J24
152583B309l4K44p2p42K94K00K25j18l30O8K51m8J49j82J82r1o4J17J90k50J41
153869B439r5J60l4r9J16R0q6Nj31K27k7K7j34R3L25j18L3n58M12j06J9K15j90
155271B583K40l15N6lo6K48K03m79L0o00j3M91L22K57L1K42k83L58m62M80l23
156557B997q2K89J15k7K4Jj45L16k10J02M8J5J31K25l33j4R8r2M43J80l37K18
157899C962k5RM36N5K80o04l91K0L59O6K1pK0K12L13N84J091j172m72k67j48P4
$$ plain form
159240 4416 4542 4511 4650 4495 4336 4554 4568 4561 4222 4549 4796 4729 4616 3901 4902 5614 5113 5450 5082 4869
160457 4869 5252 5655 5398 5374 5665 5681 6138 5704 5869 5930 5941 6157 5807 6216 6070 6501 6496 6573 6638 6523 6685 6950
161806 6950 7040 7032 7417 7245 7236 7527 6967 7496 7510 7912 7993 8023 8135 8235 8277 8501 8365 8918 8888 9118 9776 9723 10445
163208 10445 10343 11078 11553 11759 12145 11799 12741 12992 13676 14371 15410 15705 16934 19035 19574 16997 18091
164249 18091 19100 20581 21848 24124 24984 29118 30011 36532 35819 38108 40160 47158 51905 63035 74533
165161 74533 91737 107097 165034 250638 546477 992922 244797 24766 26426 8831 13929
165835 13929 12715 13257 9252 12542 12128 15375 13801 11802 11842 11626 12423 11415 10455 10194 9941 9176 8008
166870 8008 5664 5679 7101 6698 6168 6261 5845 5966 5308 5509 4954 5087 4329 4685 4960 4638 5029 4650 4519
$$ packed form
159240D416J26l1J39j55j59K18J4pl39L27K47o7j13p15J001P12n01L37l68k13
160457D869L83M03k57k4K91J6M57m34J65O1J1K16l50M09j46M31nP7O5j15J62K65
161806F950R0qL85j72rK91n60N29J4M02Q1L0J12J00M2K24j36N53l0K30O58n3P22
163208A0445j02P35M75K06L86l46R42K51O84O95J039K95J229K101N39k577J094
164249A8091J009J481J267K276Q60M134Q93O521p13K289K052O998M747J1130J1498
165161G4533J7204J5360N7937Q5604K95839M46445p48125k20031J660j7595N098
165835A3929j214N42m005L290m14L247j574j999M0k16P97j008r60k61k53p65j168
166870H008k344J5J422m03n30R3m16J21o58K01n55J33p58L56K75l22L91l79j31
$$ plain form
168027 4519 4724 4259 4343 3978 3973 3297 3431 3246 3283 3165 3567 3582 3288 2761 3101 2684 2581 2165 2578 2220 2426
169313 2426 2273 2312 2173 2060 1935 2276 1956 2330 2185 2410 2108 2170 1877 2167 2118 2339 2022 2454 1932 2604
170532 2604 2837 2775 2124 2644 2298 3795 3870 3284 2654 2906 2934 3687 3248 3229 3042 3581 3013 3226 2993 3631
171749 3631 3234 3890 3242 4378 3963 5072 4537 5180 4151 5583 4795 6615 5696 8254 8051 12430 14099
172791 14099 30717 29884 45096 32183 20194 13933 1750 4474 1495 3660 1709 3709 2131
173580 2131 3658 2267 3234 2236 3204 2256 3139 2112 3094 2146 2688 1975 2609 2115 2239 1846 2602 2178
174683 2178 2415 1691 2062 1878 2560 2383 3132 1795 1949 1586 1509 1362 1478 1440 1720 1332 1474 1127 1360
175840 1360 857 984 940 1054 592 1077 1016 1046 745 1188 621 764 342 716 734 695 395 668 499 1015 335
$$ packed form
168027D519K05m65Q4l65no76J34j85L7j18M02J5k94n27L40m17j03m16M13l58K06
169313B426j53L9j39j13j25L41l20L74j45K25l02O2k93K90m9K21l17M32n22O72
170532B604K33o2o51N20l46J497P5n86o30K52K8P53m39j9j87N39n68K13k33O38
171749C631l97O56o48J136m15J109n35O43j029J432p88J820r19K558k03M379J669
172791A4099J6618q33J5212j2913j1989o261j2183K724k979K165j951K000j578
173580B131J527j391R67r98R68r48Q83j027R82r48N42p13O34m94J24l93P56m24
174683B178K37p24L71j84O82j77P49j337J54l63p7j47J16l8K80l88J42l47K33
175840A360n03J27m4J14m62M85o1L0l01M43n67J43m22L74J8l9l00K73j69N16o80
$$ plain form
177128 335 563 352 394 68 470 297 486 91 441 211 461 591 781 365 538 529 263 -158 -101 117 540
178406 540 412 915 2325 2841 1583 271 231 145 19 116 -56 84 173 156 123 77 11 -50 -127 165 -85 152
179747 152 -328 100 123 26 -148 -146 61 33 -367 11 -191 -262 -140 186 -218 68 -149 87 -308 277 48
181034 48 241 141 950 1250 4153 3688 -108 150 -455 -218 -194 -253 -160 -79 -431 -24 -214 -26 -75 -116 -82
182314 -82 -208 -6 -411 -33 -257 204 510 1563 2520 215 -300 -179 -34 -78 -246 -529 -445 -185 -200 -475
183531 -475 -354 -245 -401 -399 -546 -203 -234 -560 -541 -528 -524 -632 -471 -331 -446 -573 -445 -275 -459 -63 -142 109
184872 109 112 -380 -624 -512 -408 -290 -473 -332 -511 -466 -866 -661 -573 -628 -833 -383 -749 -553 -559 -597 -530 -659
186220 -659 -709 -504 -230 -317 -425 -538 -435 -507 -513 -507 -549 -638 -623 -382 -440 -639 -635 -443 -805 -674 -753 -590 -930 -648
$$ packed form
177128C35K28k11M2l26M02j73J89l95L50k30K50J30J90m16J73rk66m21N7K18M23
178406E40j28N03J410N16j258j312m0q6j26R7j72J40Q9j7l3m6o6o1p7K92k50K37
179747A52m80M28K3r7j74KK07k8m00L78k02p1J22L26m04K86k17K36l95N85k29
181034D8J93j00Q09L00K903m65l796K58o05K37K4n9R3Q1l52M07j90J88m9m1L4
182314h2j26K02m05L78k24M61L06J053R57k305n15J21J45m4j68k83Q4K60j5k75
183531d75J21J09j56Kj47L43l1l26J9J3Mj08J61J40j15j27J28J70j84L96p9K51
184872A09Lm92k44J12J04J18j83J41j79M5m00K05Q8n5k05M50l66J96ol8O7j29
186220f59n0K05K74q7j08j13J03p2oOm2q9J5K41n8j99MJ92l62J31p9J63l40K82
$$ plain form
187683 -648 -852 -808 -627 -765 -649 -940 -711 -524 -863 -732 -727 -260 -706 -722 -558 -564 -554 -542 -629 -455 -565 -484 -715
189085 -715 -512 -821 -747 -554 -582 -709 -766 -864 -783 -818 -735 -823 -633 -746 -696 -963 -614 -597 -829 -816 -613 -672 -621 -964
190556 -964 -314 -474 -442 -663 -760 -832 -641 -456 -539 -669 -640 -886 -696 -575 -548 -563 -258 -469 -544 -766 -460 -533
191897 -533 -737 -634 -652 -733 -716 -905 -510 -609 -641 -850 -759 -923 -514 -852 -403 -825 -913 -787 -448 -618 -616 -972
193238 -972 -627 -763 -552 -983 -653 -445 -689 -605 -620 -778 -675 -931 -886 -795 -412 -880 -885 -972 -704 -674 -459 -787
194578 -787 -444 -469 -422 -811 -545 -766 -305 -676 -574 -664 -680 -489 -585 -601 -585 -655 -902 -758 -486 -521 -654 -916
195926 -916 -599 -536 -531 -710 -531 -490 -976 -792 -484 -823 -481 -604 -650 -757 -769 -542 -712 -848 -449 -417 -576 -581
197268 -581 -343 -658 -617 -991 -581 -820 -390 -628 -441 -488 -609 -824 -577 -589 -508 -665 -780 -616 -586 -797 -653
$$ packed form
187683f48k04M4J81j38J16k91K29J87l39J31NM67m46j6J64oJ0J2q7J74j10Q1k31
189085g15K03l09P4J93k8j27n7r8Q1l5Q3q8J90j13N0k67L49J7k32J3K03n9N1l43
190556i64O50j60L2k21r7p2J91J85q3j30K9k46J90J21K7j5L05k11p5k22L06p3
191897e33k04J03j8q1J7j89L95r9l2k09R1j64M09l38M49m22q8J26L39j70Kl56
193238i72L45j36K11m31L30K08k44Q4j5j58J03k56M5R1L83m68nq7K68L0K15l28
194578g87L43k5M7l89K66k21M61l71J02r0j6J91r6j6J6p0k47J44K72l5j33k62
195926i16L17O3Nj79J79M1m86J84L08l39L42j23m6j07j2K27j70j36L99L2j59n
197268e81K38l15M1l74M10k39M30k38J87m7j21k15K47j2Q1j57j15J64L0k11J44
$$ plain form
198546 -653 -506 -787 -756 -362 -466 -583 -442 -390 -626 -329 -655 -510 -726 -529 -630 -553 -636 -558 -473 -513 -482 -307
199895 -307 -770 -401 -571 -603 -575 -495 -514 -520 -569 -717 -631 -349 -419 -362 -484 -350 -474 -414 -314 -456 -684 -322 -119
201297 -119 -242 -429 -681 -573 -410 -428 -562 -630 -715 -613 -660 -553 -256 -551 -136 -647 -322 -175 -257 -325 -629
202576 -629 -300 -310 -347 -74 -214 -329 -321 -72 -622 -200 -365 -198 -75 -64 -222 26 -423 -115 -186 -83 -100 -121
203917 -121 -543 -344 -218 -141 -267 -118 60 -253 -223 -216 109 132 -114 104 -90 -10 -55 288 -177 34 111 -239
205264 -239 50 -8 -20 217 34 -41 70 44 98 92 -3 -8 117 115 20 87 303 35 370 80 101 276 -66 48
206727 48 175 472 266 367 113 392 320 378 539 270 280 285 527 815 713 530 353 487 225 545 473 361
208068 361 488 552 548 732 271 525 513 485 464 572 448 638 645 501 673 550 552 705 549 635 465 626 548
$$ packed form
198546f53J47k81L1L94j04j17J41N2k36K97l26J45k16J97j01P7q3P8Q5m0L1J75
199895c07m63L69j70l2K8Q0j9om9j48Q6K82p0N7j22J34j24O0J00j42k28L62K03
201297a19j23j87k52J08J63j8j34o8q5J02m7J07K97k95M15n11L25J47q2o8l04
202576f29L29j0l7K73j40j15QK49n50M22j65J67J23J1j58K48m49L08p1J03j7k1
203917a21m22J99J26P7j26J49J78l13L0PL25K3k46K18j94Q0m5L43m65K11P7l50
205264b39K89n8j2K37j83p5J11k6N4or5nJ25kr5O7K16k68L35k90K1J75l42J14
206727D8J27K97k06J01k54K79p2N8J61k69J0NK42K88j02j83j77J34k62L20p2j12
208068C61J27O4mJ84m61K54j2k8k1J08j24J90Pj44J72j23KJ53j56Q6j70J61p8
$$ plain form
209478 548 603 516 888 798 610 732 853 616 922 879 619 622 783 557 900 865 986 639 869 1030 1024 645
210819 645 1179 823 1127 1100 838 645 1067 954 1052 861 862 812 956 872 1098 781 1066 854 1050 938 1067
212098 1067 995 1075 979 1077 1023 1105 827 1016 611 1126 1045 1123 799 981 917 1251 947 927 976 934 999 989 1034 1032 761
213622 761 1056 941 971 1134 977 870 1034 973 840 936 852 797 848 882 1030 633 871 886 982 616 901 929 966
215032 966 773 809 696 817 700 777 741 809 565 790 926 768 836 795 604 664 679 748 514 631 509 755
216373 755 617 706 867 792 445 543 500 610 632 583 408 608 727 679 610 696 498 629 854 748 407 603
217713 603 469 451 659 436 196 832 611 381 373 442 502 348 415 503 593 468 473 426 364 285 468 397 207 556
219184 556 522 476 626 647 258 302 81 266 159 303 112 126 267 118 272 134 343 317 301 167 102 64
$$ packed form
209478E48N5q7L72r0j88J22J21k37L06m3k60LJ61k26L43l5J21l47K30J61ol79
210819F45N34l56L04k7k62j93M22j13R8j91Jn0J44q4K26l17K85k12J96j12J29
212098A067p2Q0r6R8n4Q2k78J89m05N15q1P8l24J82o4L34l04k0M9m2O5j0M5kk71
213622G61K95j15L0J63j57j07J64o1j33R6q4n5N1L4J48l97K38J5R6l66K85K8L7
215032I66j93L6j13J21j17P7l6O8k44K25J36j58O8m1j91O0J5O9k34J17j22K46
216373G55j38Q9J61p5l47R8m3J10K2m9j75K00J19m8o9Q6j98J31K25j06l41J96
217713F03j34j8K08k23k40O36k21k30qO9O0j54O7Q8R0j25Nm7o2p9J83p1j90L49
219184E56l4m6J50K1l89M4k21J85j07J44j91J4J41j49J54j38K09k6j6j34o5l8
$$ plain form
220525 64 410 332 64 279 311 45 238 20 105 285 169 432 301 143 155 278 134 278 163 216 78
221805 78 439 217 425 225 210 65 239 -18 175 10 -100 226 95 44 497 -94 125 -80 144 108 -265
223083 -265 -50 176 8 238 111 -84 127 60 -208 97 115 -19 44 -42 -253 163 56 87 113 -84 -26 -88
224432 -88 153 187 -120 147 89 52 -81 73 120 -55 -43 -110 -217 1 -26 -118 -320 4 -95 -90 -54 -119 -120 -44 -214
225956 -214 -114 -268 -34 -99 -31 -203 -168 114 14 -58 -339 -119 -207 -17 -172 -322 -89 -85 -2 -345 -113 -229
227298 -229 -286 -135 -161 -166 -160 -178 -134 -136 -269 -236 -51 -490 -190 -250 -139 -217 -184 -73 -306 -185 -341 -292 -224 -241 -150
228822 -150 -351 -274 -316 -367 -117 -126 -93 -137 28 -354 -35 -97 -478 -297 -395 -366 -216 -186 -81 -208 -273 -230 -179 -305
230293 -305 -434 -351 -477 -318 -252 -385 -202 -178 -496 -270 -240 -344 -405 -425 -348 -117 -384 -376 -411 -288 -288 -344 -407 -10
$$ packed form
220525F4L46p8k68K15L2k66J93k18Q5J80j16K63j31j58J2J23j44J44j15N3j38
221805G8L61k22K08k00j5j45J74k57J93j65j10L26j31n1M53n91K19k05K24l6l73
223083b65K15K26j68K30j27j95K11o7k68L05J8j34O3q6k11M16j07L1K6j97N8o2
224432h8K41L4l07K67n8l7j33J54M7j75J2o7j07K18k7r2k02L24r9NL6o5jP6j70
225956b14J00j54K34o5O8j72L5K82j00p2k81K20q8J90j55j50K33MQ3l43K32j16
227298b29n7J51k6nOj8M4kj33L3J85m39L00o0J11p8L3J11k33J21j56M9O8j7R1
228822a50k01P7m2n1K50rL3m4J65l82L19o2l81J81r8K9J50L0J05j27o5M3N1j26
230293c05j29Q3j26J59O6j33J83K4l18K26L0j04o1k0P7K31k67Ql5J23%n6o3L97
$$ plain form
231756 -10 -545 -406 -526 -256 -308 -265 -186 -428 -189 -156 -247 -385 -286 -385 -243 -301 -335 -195 -529 -499 -319 -220 -154 -229
233219 -229 -491 -298 -302 -295 -451 -372 -398 -351 -500 -463 -278 -265 -181 -304 -350 -474 -659 -79 -376 -392 -258 -315 -292 -494
234682 -494 -128 -167 -249 -270 -266 -349 -412 -517 -349 -95 -392 -321 -482 -443 -545 -466 -222 -178 -288 -413 -276 -265 -533
236084 -533 -311 -377 -203 -240 -231 -449 -338 -217 -387 -546 -162 -473 -308 -409 -299 -476 -308 -500 -255 -470 -225
237371 -225 -290 -408 -535 -534 -339 -331 -462 -469 -293 -131 -425 -480 -460 -567 -449 -566 -607 -326 -519 -349 -461 -417 -485
238773 -485 -571 -380 -405 -586 -576 -450 -241 -306 -351 -517 -499 -30 -462 -512 -572 -579 -513 -311 -208 -423 -496 -467 -493 -368
240236 -368 -462 -720 -495 -347 -411 -443 -239 -450 -468 -377 -228 -386 -598 -260 -476 -550 -350 -270 -128 -648 -663 -555
241585 -555 -356 -316 -436 -389 -230 -368 -369 -282 -260 -102 -273 -305 -379 -766 -532 -596 -332 -619 -414 -262 -346 -400 -379
$$ packed form
231756a0n35J39j20K70n2M3P9k42K39L3r1j38R9r9J42n8l4J40l34L0J80R9O6p5
233219b29k62J93mPj56P9k6M7j49L7J85J3Q4j23m6j24j85N80k97j6J34n7K3k02
234682d94L66l9q2k1Mq3o3j05J68K54k97P1j61L9j02P9K44M4j10j25J37J1k68
236084e33K22o6J74l7Rk18J11J21j70j59L84l11J65j01J10j77J68j92K45k15K45
237371b25o5j18j27JJ95Qj31pJ76J62k94n5K0j07J18j17m1K81j93J70j12M4o8
238773d85q6J91k5j81J0J26K09o5m5j66J8M69m32n0o0pO6K02J03k15p3K9k6J25
240236c68r4k58K25J48o4l2K04k11j8R1J49j58k12L38k16p4K00Q0J42n20j5J08
241585e55J99M0j20M7J59j38jQ7K2J58j71l2p4l87K34o4K64k87K05J52q4n4K1
$$ plain form
242985 -379 -186 -598 -85 -369 -374 -213 -412 -111 -235 -229 -260 -457 -511 -241 -532 -248 -604 -274 -367 -474 -377 -188
244327 -188 -404 -397 -506 -373 -455 -162 -536 -381 -474 -363 -316 -203 -508 -341 -276 -442 -475 -319 -453 -601 -479 -298
245668 -298 -475 -175 -385 -455 -555 -347 -379 -539 -340 -525 -340 -418 -264 -248 -439 -353 -306 -304 -308 -358 -453 -327 -342 -407
247138 -407 -488 -561 -319 -506 -370 -360 -387 -526 -635 -392 -254 -451 -563 -527 -593 -482 -359 -473 -351 -208 -614
248417 -614 -470 -394 -326 -395 -289 -332 -113 -338 -469 -410 -345 -384 -389 -518 -547 -322 -121 -311 -540 -284 -270 -446 -541
249819 -541 -140 -183 -331 -541 -460 -377 -439 -541 -171 -560 -379 -160 -289 -426 -572 -442 -287 -651 -584 -551 -272
251107 -272 -340 -308 -343 -439 -502 -129 -291 -412 -126 -319 -388 -380 -289 -198 -342 -597 -249 -454 -421 -525 -289 -496 -443
252508 -443 -574 -395 -639 -482 -510 -452 -514 -370 -352 -409 -517 -472 -471 -206 -143 -407 -93 -480 -239 -466 -397 -473 -187
$$ packed form
242985c79J93m12N13k84nJ61j99L01j24Ol1j97n4K70k91K84l56L30r3j07R7J89
244327a88k16Pj09J33q2K93l74J55r3J11M7J13l05J67O5j66l3J56j34j48J22J81
245668b98j77L00k10p0j00K08l2j60J99j85J85p8J54J6j91Q6M7Kmn0r5J26j5o5
247138d07q1p3K42j87J36J0k7j39j09K43J38j97j12L6o6J11J23j14J22J43m06
248417f14J44P6O8o9J06m3K19k25j31N9O5l9nj29k9K25K01j90k29K56J4j76r5
249819e41M01m3j48k10Q1Q3o2j02L70l89J81K19j29j37j46J30J55l64O7L3K79
251107b72o8L2l5r6o3L73j62j21K86j93o9QR1R1j44k55L48k05L3j04K36k07N3
252508d43j31J79k44J57k8N8o2J44J8n7j08M5JK65O3k64L14l87K41k27O9p6K86
$$ plain form
253910 -187 -402 -612 -668 -470 -191 -437 -414 -356 -299 -344 -403 -432 -534 -510 -261 -593 -441 -528 -315 -421 -497 -207 -297
255312 -297 -268 -474 -484 -488 -419 -486 -352 -534 -456 -432 -416 -577 -179 -319 -248 -592 -810 -212 -525 -299 -707 -427 -221
256722 -221 -489 -246 -272 -572 -405 -390 -505 -232 -556 -276 -281 -558 -226 -620 -191 -457 -283 -224 -234 -434 -362 -513
258063 -513 -570 -565 -183 -233 -321 -438 -349 -404 -569 -363 -123 -515 -385 -518 -387 -560 -365 -316 -439 -511 -334 -487
259403 -487 -115 -367 -478 -172 -390 -226 -327 -790 -584 -316 -409 -494 -329 -501 -582 -412 -153 -378 -175 -364
260622 -364 -419 -360 -309 -408 -147 -375 -131 -316 -418 -487 -438 -544 -259 -589 -600 -453 -198 -239 -297 -362 -425 -230 -196
262030 -196 -642 -494 -326 -114 -441 -306 -287 -297 -369 -358 -500 -274 -472 -443 -513 -385 -427 -522 -62 -327 -486 -319
263371 -319 -517 -462 -371 -295 -526 -304 -412 -172 -535 -322 -273 -435 -501 -314 -522 -444 -428 -118 -503 -475 -480 -465 -317
$$ packed form
253910a87k15k10n6J98K79k46K3N8N7m5n9k9j02K4K49l32J52q7K13j06p6K90r0
255312b97K9k06j0mO9o7J34j82P8K4J6j61L98j40P1l44k18N98l13K26m08K80K06
256722b21k68K43k6l00J67J5j15K73l24K80nk77L32l94M29k66J74N9j0k00P2j51
258063e13n7NL82n0q8j17Q9n5j65K06K40l92J30j33J31j73J95M9j23p2J77j53
259403d87L72k52j11L06k18J64j01m63K06K68r3q5J65j72q1J70K59k25K03j89
260622c64n5N9N1r9K61k28K44j85j02o9M9j06K85l30j1J47K55m1n8o5o3J95L4
262030a96m46J48J68K12l27J35J9j0p2J1j42K26j98K9p0J28m2r5M60k65j59J67
263371c19j98N5R1P6k31K22j08K40l63K13M9j62o6J87k08P8J6L10l85K8nJ5J48
$$ plain form
264773 -317 -480 -618 -161 -398 -95 -524 -373 -373 -124 -367 -166 -478 -188 -216 -335 -425 -455 -426 -450 -266 -321 -379
266122 -379 -350 -492 -431 -380 -251 -544 -393 -199 -363 -240 -524 -319 -374 -481 -463 -289 -122 -397 -248 -447 -535
267401 -535 -347 -419 -471 -361 -330 -482 -438 -257 -788 -400 -363 -501 -255 -383 -494 -328 -392 -338 -407 -362 -414 -495 -389
268803 -389 -399 -419 -339 -555 -192 -385 -682 -478 -295 -303 -136 -484 -452 -420 -545 -513 -419 -470 -373 -514 -415 -661 -218
270205 -218 -456 -280 -512 -598 -243 -294 -513 -299 -428 -459 -286 -534 -226 -455 -253 -432 -299 -230 -270 -205 -475
271491 -475 -139 -183 -506 -531 -274 -113 -290 -322 -370 -282 -345 -381 -444 -421 -293 -272 -356 -477 -514 -235 -650 -520 -153
272893 -153 -574 -362 -562 -222 -366 -388 -233 -328 -292 -344 -552 -325 -538 -164 -492 -365 -585 -304 -101 -487 -227
274173 -227 -198 -456 -320 -482 -231 -344 -489 -407 -290 -358 -362 -252 7 -566 -480 -346 -123 -472 -275 -94 -214
$$ packed form
264773c17j63j38M57k37L03m29J51%K49k43K01l12K90k8j19r0l0K9k4J84n5n8
266122c79K9j42O1N1J29k93J51J94j64J23k84K05n5j07J8J74J67k75J49j99q8
267401e35J88p2n2J10L1j52M4J81n31L88L7j38K46j28j11J66o4N4o9M5n2q1J06
268803c89j0k0Q0k16L63j93k97K04J83qJ67l48L2L2j25L2R4n1R7j41R9k46M43
270205b18k38J76k32q6L55n1k19K14j29l1J73k48L08k29K02j79J33O9m0O5k70
271491d75L36m4l23k5K57J61j77l2m8Q8o3l6o3K3J28K1q4j21l7K79m15J30L67
272893a53m21K12k00L40j44k2J55r5L6n2k08K27k13L74l28J27k20K81K03l86K60
274173b27K9k58J36j62K51j13j45Q2J17o8mJ10K59n73Q6J34K23l49J97J81j20
$$ plain form
275460 -214 -340 -231 -611 -475 -289 -341 -352 -208 -358 -473 -149 -414 -219 -308 -431 -419 -526 -527 -322 -331 -347 -536
276801 -536 -327 -175 -368 -251 -351 -363 -319 -202 -382 -472 -333 -603 -204 -105 -353 -435 -385 -417 -414 -211 -282 -393 -347
278203 -347 -475 -471 -216 -263 -255 -212 -386 -366 -234 -412 -217 -326 -247 -202 -246 -542 -382 -364 -304 -435 -247 -560 -625 -463
279666 -463 -244 -342 -303 -333 -223 -253 -274 -405 -413 -368 -267 -509 -225 -551 -311 -184 -226 -513 -382 -176 25 -550
281013 -550 -301 -464 -394 -245 22 -413 -194 -290 -450 -339 -215 -211 -520 -485 10 -580 -446 -378 -482 -545 -198 -651
282354 -651 -235 -437 -298 -388 -325 -150 -316 -359 -479 -387 -509 -664 -228 -430 -292 -344 -340 -224 -295 -365 -359 -444 -532 -481
283818 -481 -413 -557 -396 -529 -360 -197 -341 -636 -225 -260 -527 -406 -248 -416 -115 -512 -397 -440 -286 -441
285043 -441 -473 -317 -520 -787 38 234 252 550 -1 -167 -169 -387 -190 -542 -242 -279 -411 -185 -292 -250 -330 -451
$$ packed form
275460b14j26J09l80J36J86n2j1J44j50j15L24k65J95q9j23J2j07jK05rj6j89
276801e36K09J52j93J17j00j2M4J17j80r0J39k70L99R9k48q2N0l2LK03p1j11M6
278203c47j28MK55m7QM3j74K0J32j78J95j09P9M5m4k96J60J8O0j31J88l13o5J62
279666d63K19r8L9l0J10l0k1j31qM5J01k42K84l26K40J27m2k87J31K06K01n75
281013e50K49j63P0J49K67m35K19r6j60J11J24Ml09L5M95n90J34O8j04o3L47m53
282354f51M16k02J39r0O3J75j66m3j20R2j22j55M36k02J38n2MJ16p1p0Oq5q8N1
283818d81O8j44J61j33J69J63j44k95M11l5k67J21J58j68L01l97J15m3J54j55
285043d41l2J56k03k67Q25J96J8K98n51j66kk18J97l52L00l7j32K26j07M2q0j21
$$ plain form
286384 -451 -327 -106 -275 -436 -120 -211 -414 -277 -456 -245 -475 -397 -156 -272 -273 -370 -201 -116 -228 -213 -679 -389
287725 -389 -308 -275 -296 -174 -174 -613 -248 -139 -304 -475 -412 -335 -340 -256 -116 -292 -536 -364 -438 -563 -290 -258 -271 -355
289188 -355 -188 -479 -69 -435 -328 -23 -466 -346 -267 -478 -377 7 -389 -443 -119 -434 -71 -269 -414 -216
290413 -216 -323 -197 -242 -444 -273 -540 -563 -326 -294 -265 -284 -430 -23 -453 -205 -201 -274 -242 -277 -393 -223 48 -65
291816 -65 -432 -172 -170 -352 -362 -157 -170 -441 -46 -240 -129 -339 -134 -309 -148 -130 -407 -233 -305 -596 -381 -273
293155 -273 -587 -230 -249 -205 -9 169 -464 -553 -416 -220 -212 -293 -314 -347 -302 -387 -263 -539 -106 -282 -209 -238 -490
294565 -490 73 -393 -162 -78 101 -287 -90 -331 -395 -250 -571 -304 -381 -311 -103 -369 -400 -333 -219 -342 -327 -118
295906 -118 -84 -208 -272 -248 -144 -101 -483 -254 -370 -151 -369 -358 -381 -467 -396 -308 -104 -209 -407 -342 -231 -356 -86
$$ packed form
286384d51J24K21j69j61L16r1k03J37j79K11k30P8K41j16jr7J69Q5j12J5m66K90
287725c89Q1L3k1J22%m39L65J09j65j71O3P7nQ4J40j76k44J72p4j25K73L2j3q4
289188c55J67k91M10l66J07L05m43J20P9k11J01L84l96n4L24l15L63j98j45J98
290413b16j07J26m5k02J71k67k3K37L2K9j9j46M07m30K48Mp3L2l5j16J70K71j13
291816f5l67K60Kj82j0K05j3k71L95j94J11k10K05j75J61J8k77J74p2k91K15J08
293155b73l14L57j9M4J96J78o33q9J37J96Qq1k1l3M5q5J24k76M33j76P3k9k52
294565d90N63m66K31Q4J79l88J97k41o4J45l21K67p7P0K08k66l1O7J14j23J5K09
295906a18L4j24o4K4J04M3l82K29j16K19k18J1k3q6P1Q8K04j05j98O5J11j25K70
$$ plain form
297308 -86 -74 -247 -256 -227 -342 -105 -333 -169 -426 -334 -301 -162 -400 -248 -458 -216 -376 -443 -336 -364 -220 -377
298656 -377 -21 -243 -357 -257 -469 -314 -157 -385 -62 -427 -202 -205 -255 -249 -264 -286 -523 -305 -268 -310 -254 -237 -277
300058 -277 -178 -161 -422 -234 -204 -505 -480 -342 -581 -509 -226 202 -81 -200 -93 -359 -133 -261 -326 -157 -371
301338 -371 -160 -162 -199 -368 -41 -367 -155 -482 -135 -239 -182 -82 -114 -80 -243 -252 -123 -147 -237 -397 -357 -159 -263
302740 -263 -67 -31 -372 -347 -182 -139 -445 -82 -131 -332 -352 -127 -427 -389 -103 -132 -317 -286 -35 34 -230 -199 -246
304148 -246 -221 16 -191 -256 -107 52 -211 -16 -256 -16 -132 -248 -68 -55 49 -124 -140 -166 176 -118 -118 -53
305489 -53 40 -143 47 -267 120 -125 -113 -278 -251 691 50 244 271 323 295 68 430 293 402 -23 318 124
306831 124 380 556 763 747 869 801 1111 1238 1408 1091 1565 1663 2674 2594 4281 6025 11968 14550 23842
$$ packed form
297308h6J2j73rK9j15K37k28J64k57R2L3J39k38J52k10K42j60o7J07k8J44j57
298656c77L56k22j14J00k12J55J57k28L23l65K25ln0Oj5k2k37K18L7m2N6J7m0
300058b77R9J7k61J88L0l01K5J38k39P2K83M28k83j19J07k66K26j28o5J69k14
301338c71K11kl7j69L27l26K12l27L47j04N7J00l2L4j63rJ29k4r0j60M0J98j04
302740b63J96L6l41K5J65M3l06L63m9k01k0K25l00L8K86k9j85L1K51O9k64L1m7
304148b46K5K37k07o5J49J59k63J95k40K40j16j16J80J3J04j73j6k6L42k94%O5
305489e3R3j83J90l14L87k45J2j65K7R42o41J94K7N2k8k27L62j37J09m25L41j94
306831A24K56J76K07j6J22o8L10J27J70l17M74R8J011q0J687J744N943K582R292
$$ plain form
307995 23842 21239 21969 16193 8863 6455 1904 2132 959 1347 664 1360 964 1203 661 1118 836 1049
309029 1049 515 1029 349 653 323 523 255 399 -3 427 81 386 212 273 214 335 25 310 73 465
310247 465 143 250 51 179 82 -32 54 337 -156 -6 -32 197 10 159 -32 258 99 41 -18 -20 -232 -29
311595 -29 -60 -29 -237 123 -124 154 -65 50 -88 69 -152 -131 -249 -30 -227 -153 -251 124 -120 -86 -330 -75
312935 -75 -122 -240 -45 43 -253 -51 -338 9 -108 79 -198 -139 -84 -118 -272 130 -375 -192 -9 -80 70 -123
314276 -123 -106 -71 -224 -164 15 143 25 -80 -83 -173 -87 -138 20 103 -44 17 -240 12 -456 -273 -248 -310 -68
315686 -68 -264 -115 -18 -280 -328 -173 -53 -242 -122 -389 -201 9 51 -246 -128 71 -188 -41 110 -10 -246
316965 -246 -226 -131 -213 -35 -275 -329 -221 -207 -234 -180 -420 177 -364 -224 -131 -245 -464 -237 -416 -234 -246 -181 11
$$ packed form
307995B3842k603P30n776p330k408m551K28j173L88o83O96l96K39n42M57k82K13
309029A049n34N14o80L04l30K00k68J44m02M30l46L05j74O1n9J21l10K85k37L92
310247D65l22J07j99J28r7j14Q6K83m93J50k6K29j87J49j91K90j59n8n9kk12K03
311595b9l1L1k08L60k47K78k19J15j38J57k21K1j18K19j97P4r8L75k44L4k44K55
312935g5m7j18J95Q8k96K02k87L47j17J87k77N9N5l4j54M02n05J83J83p1J50j93
314276a23J7L5j53O0J79J28j18j05lr0Q6n1J58Q3j47O1k57K52m68J83K5o2K42
315686f8j96J49R7k62m8J55J20j89J20k67J88K10M2k97J18J99k59J47J51j20k36
316965b46K0R5q2J78k40n4J08J4k7N4k40N97n41J40R3j14k19K27j79J82j2O5J92
$$ plain form
318367 11 -51 -58 -69 -431 -311 -330 -11 -503 -351 -156 -330 -25 -253 -241 -322 -241 -169 -163 -39 -229 -388 -374 -240 -39
319830 -39 -197 -418 -257 -98 -324 -503 -278 -126 -370 -486 -295 -189 -236 -363 -139 -250 -446 -371 -269 -482
321057 -482 -30 -597 -156 -305 -429 -407 -247 -138 -141 -371 -179 -95 -330 -397 -142 -313 -254 -350 -23 -275 -264 -480
322396 -480 -246 -269 -126 -548 -267 -268 -264 -218 -212 -538 -247 -421 -496 -453 -405 -431 -285 -354 -327 -380 -322 -372 -313 -427 -312
323921 -312 -635 -60 -339 -61 -324 -148 -177 -433 -418 -258 -449 -191 -452 -392 -283 -368 -308 -338 -464 -430 -372 -171
325262 -171 -493 -619 -406 -349 -576 -308 -550 -163 -331 -262 -285 -153 -446 -309 -333 -118 -396 -276 -448 -289 -322
326549 -322 -143 -216 -331 -481 -366 -300 -317 -538 -337 -373 -185 -60 -462 -155 -212 -332 -212 -299 -383 -598 -276 -423
327889 -423 -417 -425 -172 -553 -279 -148 -314 -356 -292 -255 -83 -410 -99 -387 -181 -285 -306 -457 -154 -233 -403 -395 -229
$$ packed form
318367A1o2pj1l62J20j9L19m92J52J95j74L05k28J2q1Q1P2OJ24j90j59J4J34K01
319830c9j58k21J61J59k26j79K25J52k44j16J91J06m7j27K24j11j96P5J02k13
321057d82M52n67M41j49j24K2J60J09lk30J92Q4k35o7K55j71N9r6L27k52J1k16
322396d80K34k3J43m22K81jMM6Ol26K91j74p5M3M8k6J46o9K7n3N8n0N9j14J15
323921c12l23N75k79K78k63J76k9k56J5J60j91K58k61O0J09q5O0l0j26L4N8K01
325262a71l22j26K13N7k27K68k42L87j68O9k3J32k93J37k4K15k78J20j72J59l3
326549c22J79p3j15j50J15O6j7k21K01l6J88J25m02L07n7j20J20q7q4k15L22j47
327889d23OqK53l81K74J31j66m2O4L7J72l27L11k88K06j04k1j51L03p9j70QJ66
$$ plain form
329291 -229 -280 -302 -272 -344 -263 -183 -331 -247 -445 -520 -539 -342 -253 -483 -577 -164 -454 -125 -518 -378 -299 -437 -534 -375
330762 -375 -331 -525 -739 7 -276 -564 -485 -357 -490 -317 -242 -345 -257 -448 -269 -377 -568 -314 -539 -422 -171
332042 -171 -310 -374 -213 -541 -576 -539 -366 -458 -122 -368 -276 -208 -240 -406 -386 -527 -357 -244 -263 -280 -252 -375 -223
333443 -223 -380 -326 -544 -220 -443 -323 -469 -146 -235 -428 -464 -549 -525 -501 -422 -112 -672 -350 -277 -290 -351 -17 -435
334845 -435 -489 -291 -420 -292 -527 11 -255 -322 -170 -520 -406 -437 -332 -157 -135 -273 -264 -394 -226 -226 -316 -235 -277
336255 -277 -224 -250 -516 -210 -362 -187 -441 -395 -290 -410 -379 -531 -273 -243 -279 -302 -302 -465 -393 -346 -371 -267 -385
337657 -385 -441 -291 -312 -521 -241 -408 -317 -391 -324 -326 -391 -381 -431 -585 -487 -42 -573 -334 -541 -426 -503 -272 -479
339059 -479 -226 -352 -367 -429 -139 -204 -444 -315 -642 -350 -258 -244 -606 -415 -431 -220 -374 -327 -485 -156 -262 -420
$$ packed form
329291b29n1k2L0p2Q1Q0j48Q4j98p5j9J97Q9k30r4M13k90L29l93J40P9j38r7J59
330762c75M4j94k14P46k83k88P9J28j33J73P5j03Q8j91J79j08j91K54k25J17K51
332042a71j39o4J61l28l5L7J73r2L36k46R2O8l2j66K0j41J70J13j9j7K8j23J52
333443b23j57N4k18L24k23J20j46L23q9j93l6q5K4K4P9L10n60L22P3j3o1L34m18
334845d35n4J98j29J28k35N38k66o7J52l50J14l1J05J75K2j38Rj30J68%r0Q1m2
336255b77N3k6k66L06j52J75k54M6J05j20L1j52K58L0l6k3%j63P2M7k5J04j18
337657c85n6J50k1k09K80j67R1p4O7ko5J0n0j54R8M45n31K39k07J15p7K31k07
339059d79K53j26j5o2K90o5k40J29l27K92R2J4l62J91j6K11j54M7j58L29j06j58
$$ plain form
340406 -420 -514 -463 -171 6 -500 -285 -333 -444 -473 -296 -294 -434 -226 -340 -413 -227 -338 -328 -550 -418 -385 -360 -473
341809 -473 -421 -158 -267 -179 -318 -292 -407 -336 -230 -319 -231 -152 -440 -477 -407 -422 -156 -370 -233 -572 -368 -575 -446
343211 -446 -596 -318 -235 -227 -371 -466 -370 -292 -440 -267 -239 10 -374 -344 -384 -527 -375 -398 -545 -470 -307 -535 -593
344613 -593 -765 -725 -54 -379 -163 -294 -356 -440 -353 -455 -302 -163 -639 -450 -365 -458 -151 -265 -185 -679 -253 -378
345954 -378 -166 -293 -398 -313 -177 -365 -86 -348 -483 -311 -229 -287 -176 -437 -394 -202 -382 -536 -432 -440 -308
347240 -308 -532 -515 -382 -270 -395 -395 -422 -352 -538 -238 -489 -205 -217 -113 -621 -289 -398 -296 -592 -264 -620
348520 -620 -524 -419 -470 -308 -274 -597 -198 -240 -339 -400 -241 -537 -103 -434 -327 -287 -474 -268 -347 -458 -379 -396 -416
349929 -416 -412 -382 -234 -285 -300 -428 -304 -262 -256 -399 -482 -305 -539 -151 -418 -178 -545 -220 -250 -469 -562 -662 -317
$$ packed form
340406d20r4N1K92J77n06K15m8j11k9J77Kj40K08j14p3J86j11J0k22J32L3K5j13
341809d73N2K63j09Q8j39K6j15P1J06q9Q8P9k88l7P0j5K66k14J37l39K04k07J29
343211d46j50K78Q3Qj44r5R6P8j48J73K8K49l84L0m0j43J52k3j47P5J63k28n8
344613e93j72M0O71l25K16j31o2q4Q7j02J53J39m76J89Q5r3L07j14Q0m94M26j25
345954c78K12j27j05Q5J36j88K79k62j35J72Q2n8J11k61M3J92j80j54J04qJ32
347240c08k24J7J33J12j25%k7P0j86L00k51K84j2J04n08L32j09J02k96L28l56
348520f20R6J05n1J62L4l23L99m2r9o1J59k96M34l31J07M0j87K06p9j11P9j7k0
349929d16ML0J48n1j5j28J24M2Oj43q3J77k34L88k67K40l67L25l0k19r3j00L45
$$ plain form
351331 -317 -308 -258 -125 -409 -334 -494 -355 -362 -94 -280 -39 -159 -730 -440 -535 -485 -324 -507 -331 -226 -468 -326
352672 -326 -261 -295 -190 -275 -387 -355 -164 -641 -72 -318 -132 -599 -203 -219 -33 -481 -403 -410 -360 -373 -209 -200 -472
354074 -472 -602 -385 -268 -610 -470 -175 -426 -420 -560 -447 -534 -359 -254 -104 -395 -394 -458 -485 -735 -191 -246 -156
355421 -156 -457 -410 -476 -374 -502 -341 -235 -273 -331 -316 -191 -354 -371 -526 -321 -379 -521 -242 -274 -414 -364 -336 -317
356824 -317 -218 -509 -506 -426 -402 -438 -449 -433 42 -481 -412 -482 -273 -426 -304 -528 -514 -440 -308 -366 -331 -612 -202 -238
358287 -238 -358 -440 -237 -393 -208 -442 -216 -282 -275 -367 -156 -293 -249 -432 -129 -730 -308 -290 -311 -381 -272 -288 -125
359689 -125 -432 -354 -551 -544 -385 -336 -293 -339 -402 -497 -505 -322 -328 -373 -562 -498 -364 -99 -319 -279 -292 -26 -337 -336 -641
361221 -641 -188 -363 -583 -373 -313 -591 -256 -229 -252 -296 -312 -417 -372 -448 -190 -619 -315 -352 -429 -286 -275 -412 -220
$$ packed form
351331c17RN0J33k84P5j60J39pK68j86K41j20n71K90r5N0J61j83J76J05k42J42
352672c26O5l4J05q5j12L2J91m77N69k46J86m67L96j6J86m48P8pN0j3J64Rk72
354074d72j30K17J17l42J40K95k51Oj40J13q7J75J05J50k91Jo4k7k50N44n5R0
355421a56l01M7o6J02j28J61J06l8n8J5J25j63j7j55K05n8j42K79l2j40N0K8J9
356824c17R9k91LQ0K4l6j1J6M75n23O9p0K09j53J22k24J4P4J32n8L5k81M10l6
358287b38j20q2K03j56J85k34K26o6Pr2K11j37M4j83L03o01M22J8k1p0J09j6J63
359689a25l07P8j97PJ59M9M3m6o3r5qJ83om5j89O4J34K65k20M0j3K66l11Jl05
361221f41M53j75k20K10O0k78L35K7k3m4j6j05M5p6K58m29L04l7p7J43J1j37J92
$$ plain form
362623 -220 -329 -336 -354 -188 -411 -370 -405 -452 -452 -318 -532 -110 -495 -217 -468 -310 -532 -377 -356 -270 -555 -322 -317
364025 -317 -161 -621 -271 -304 -634 -141 -377 -322 -171 -287 -127 -661 -320 -325 -327 -392 -83 -94 -222 -387 -411 -202
365366 -202 -396 -260 -403 -449 -365 -281 -126 -434 -425 -453 -545 -333 -438 -403 -141 -282 -384 -570 -75 -293 -242 -473
366713 -473 -439 -278 -291 -50 -409 -304 -332 -525 -289 -319 -292 -338 -346 -448 -419 -480 -425 -607 -262 -359 -428 -434 -409 -274 -121
368238 -121 -336 -172 -367 -389 -207 -246 -439 -224 -383 -208 -323 -437 -324 -574 -468 -309 -679 -341 -188 -525
369457 -525 -385 -279 -453 -239 -374 -444 -633 -319 -236 -205 -450 -233 -313 -168 -556 -112 -349 -222 -420 -417 -336 -333
370804 -333 -324 -312 -375 -302 -320 -50 -391 -342 -330 -401 -407 -294 -420 -483 -29 -300 -250 -405 -557 -398 -241 -289 -564 -424
372267 -424 -386 -530 -346 -234 -107 -229 -377 -337 -543 -250 -515 -344 -558 -526 -276 -213 -467 -62 -418 -165 -293
$$ packed form
362623b20j09pj8J66k23M1l5m7%J34k14M22l85K78k51J58k22J55K1Q6k85K33N
364025c17J56m60L50l3l30M93k36N5J51j16J60n34L41nko5L09j1j28j65k4K09
365366b02j94J36j43m6Q4Q4J55l08Rk8r2K12j05L5K62j41j02j86M95k18N1k31
366713d73L4J61j3K41l59J05k8j93K36l0K7m6qj02K9o1N5j82L45r7o9oK5J35J53
368238a21k15J64j95k2J82l9j93K15j59J75j15j14J13k50J06J59l70L38J53l37
369457e25J40J06j74K14j35p0j89L14Q3L1k45K17q0J45l88M44k37J27j98LQ1L
370804c33RJ2o3P3j8K70l41M9J2p1oJ13j26o3M54k71N0j55j52J59J57m8k75J40
372267d24L8j44J84J12J27j22j48M0k06K93k65J71k14L2K50O3k54M05l56K53j28
$$ plain form
373547 -293 -220 -400 -334 -411 -374 -244 -303 -379 -198 -467 -685 -676 -256 -165 -713 -844 -98 -1759 -622 716 -293
374826 -293 -7 -525 -175 -176 -315 -351 -426 -60 -150 -130 -279 -354 -347 -343 -192 -378 156 -253 -280 -198 -407 -212 -518 -239
376297 -239 -224 -171 -441 -377 -348 -315 -445 -106 -188 -385 43 -138 -294 -307 -324 -436 -366 -226 -546 -342 -359 -161 -497
377699 -497 -258 -371 -307 -418 -249 -503 -471 -734 -397 -365 -401 -241 -168 -439 -189 -384 -383 -204 -275 -570 -410 -422
379040 -422 -371 -323 -276 -377 -408 -542 -458 -406 -484 -168 -395 -132 -480 -238 -85 -320 -308 -491 -452 -335 -122 -358
380381 -358 -438 -788 -107 -326 -109 -498 -345 -216 -202 -306 -401 -717 -402 -279 -252 -298 -349 -237 -171 -296 -517 -204
381728 -204 -482 -513 -298 -318 -248 -442 -445 -195 -165 -657 -391 -422 -437 -473 -416 -267 -468 -221 -185 -490 -323 -515 -271
383131 -271 -356 -265 -282 -290 -541 -516 -358 -452 -514 -278 -195 -199 -416 -395 -449 -146 -493 -257 -557 -357 -554 -191 -260 -403
$$ packed form
373547b93P3j80O6p7L7J30n9p6J81k69k18RM20R1n48j31P46j661J137J338j009
374826b93K86n18L50jj39l6p5L66r0K0j49p5PMJ51j86N34m09k7Q2k09J95l06K79
376297b39J5N3k70O4K9L3j30L39q2j97M28j81j56j3j7j12P0J40l20K04j7J98l36
377699d97K39j13O4j11J69k54L2k63L37L2l6J60P3k71K50j95JJ79p1k95J60j2
379040d22N1M8M7j01l1j34Q4N2p8L16k27K63l48K42J53k35J2j83L9J17K13k36
380381c58q0l50O81k19K17l89J53J29J4j04r5l16L15J23K7m6n1J12O6j25k21L13
381728b04k78l1K15k0P0j94lK50L0m92K66l1j5l6N7J49k01K47L6l05J67j92K44
383131b71q5R1j7qk51K5J58r4o2K36Q3mk17K1n4L03l47K36l00K00j97L63o9j43
$$ plain form
384594 -403 -275 -463 -463 -220 -367 -343 -282 -507 -474 -387 -372 -155 -471 -603 -280 -264 -322 -322 -455 -258 -246 -461 -376 -408
386057 -408 -649 -354 -544 -265 -358 -369 -108 -176 -258 20 -486 -337 -316 -291 -401 -239 -250 -310 -293 -391 -540 -4 -417
387467 -417 -200 -525 -318 -222 -336 -397 -301 -524 -407 -497 -610 -600 -352 -485 -473 -499 -336 -707 -112 -187 -337 -469
388808 -469 -275 -211 -382 -419 -337 -404 -369 -532 -358 -406 -184 -661 -217 -304 -574 -303 -379 -346 -127 -250 -223 -435 -338
390209 -338 -488 -52 -388 -289 -290 -281 -252 -335 -286 -288 -301 -222 -220 -426 -237 -390 -290 -248 -466 -248 -737 -451 -306 -210 -222
391734 -222 -467 -322 -317 -165 -478 -401 -43 -382 -216 -307 -214 -564 -523 13 -246 -339 -253 -348 -187 -248 -332 -486 -368
393143 -368 -365 -30 -355 -366 -270 -333 -341 -171 -197 -358 -469 -249 -312 -426 -569 -330 -425 -99 -375 -394 -268 -429 -302
394545 -302 -259 -628 -413 -208 -437 -486 -112 -430 -390 -535 -230 -425 -244 -440 -202 -424 -121 -176 -159 -520 -330
$$ packed form
384594d03J28j88%K43j47K4O1k25L3Q7J5K17l16j32L23J6n8%j33J97J2k15Q5l2
386057d08k41K95j90K79r3j1K61o8q2K78n06J49K1K5j10J62j1o0J7r8j49N36m13
387467d17K17l25K07R6j14o1R6k23J17r0j13J0K48j33J2k6J63l71N95p5j50j32
388808d69J94O4j71l7Q2o7L5j63J74m8K22m77M44q7k70K71p6L3K19j23K7k12R7
390209c38j50M36l36R9jRK9q3M9kj3P9Kk06J89j53J00M2k18K18m89K86J45R6j2
391734b22k45J45NJ52l13P7L58l39J66r1R3l50M1N36k59r3Q6r5J61o1q4j54J18
393143c68LL35l25j1R6o3qJ70k6j61j11K20o3j14j43K39r5L26k76j9J26j61J27
394545c02M3l69K15K05k29m9L74l18M0j45L05j95J81j96K38k22L03n5J7l61J90
$$ plain form
395825 -330 -575 -428 -164 -222 -317 -274 -380 -355 -407 -349 -184 -170 -254 -482 -428 -306 -346 -89 -344 -457 -421 -417 -490 -367
397288 -367 -205 -282 -251 -69 -607 -131 -520 -305 -315 -481 -296 -254 -524 -251 -354 -134 -213 -219 -389 -467 -285 -349
398635 -349 -247 -201 -512 -415 -246 -256 -346 -270 -522 -273 -500 -311 -296 -380 -593 -116 -515 -23 -174 -449 -362 -222
399976 -222 -322 -327 -346 -497 -103 -309 -268 -418 -434 -384 -538 -138 -348 -259 -542 -194 -436 -360 -453 -505 -391 -341 -327
401379 -327 -476 -421 -238 -220 -159 -464 -280 -407 -311 -387 -364 -459 -241 -325 -279 -384 -352 -325 -162 -276 -309 -645 -209
402788 -209 -402 -167 -375 -369 -411 -452 -456 -594 -342 -515 -450 -460 -396 -343 -318 -276 -362 -396 -486 -277 -220 -65 -320 -143 -259
404313 -259 -158 -232 -344 -384 -27 75 -241 -572 -125 -441 -283 -358 -130 -526 -461 -344 -366 -438 -475 -803 -238 -411
405654 -411 -324 -556 -425 -469 -296 -539 -25 -283 -284 -509 -449 -369 -449 -319 -123 -377 -411 -594 -558 -559 -277 -568 -339
$$ packed form
395825c30k45J47K64n8r5M3j06K5n2N8J65J4q4k28N4J22m0K57k55j13L6Mp3J23
397288c67J62p7L1J82n38M76l89K15j0j66J85M2k70K73j03K20p9oj70p8J82o4
398635c49J02M6l11R7J69j0r0P6k52K49k27J89J5q4k13M77l99M92j51k75Q7J40
399976b22j00nj9j51L94k06M1j50j6N0j54M00k10Q9k83L48k42P6r3n2J14N0J4
401379c27j49N5J83J8O1l05J84j27R6p6K3r5K18q4M6j05L2K7J63j14l3l36M36
402788b09j93K35k08Om2m1mj38K52j73O5j0O4N3K5M2q6l4r0K09N7J55k55J77j16
404313b59J01p4j12m0L57J02l16l31M47l16J58p5K28l96O5J17k2p2l7l28N65j73
405654d11Q7k32J31m4J73k43N14k58jk25O0Q0q0J30J96k54l4j83L6jK82k91K29
$$ plain form
407055 -339 -503 -156 -516 -475 -388 -485 -179 -280 -352 -393 -404 -153 -439 -36 -291 -283 -427 -294 -396 -167 -501 -87
408403 -87 -113 -596 -364 -437 -380 -204 -532 -395 -530 -294 -328 -167 -136 -384 -437 -496 -135 -309 -359 -350 -38 -264 -121
409805 -121 -404 -268 -271 -544 -305 -256 -198 -457 -125 -639 -192 -481 -268 -175 -362 -124 -498 -350 -254 -287 -123 -526
411147 -526 -358 -408 -12 -453 -489 -483 -601 -166 -158 -479 -519 -500 -308 -628 -449 -664 -207 -227 -179 -299 -413 -189 -386
412555 -386 -499 -387 -461 -241 -392 -416 -281 -449 -493 -462 -292 -269 -307 -402 -352 -455 -343 -258 -511 -391 -449 -321 -411
413957 -411 -256 -205 -621 -248 -529 -418 -308 -358 -293 -150 -277 -320 -514 -573 -345 -166 -430 -264 -396 -453 -205
415237 -205 -302 -315 -337 -455 -458 -79 -234 -233 -600 -171 -549 -178 -390 -405 -466 -182 -480 -259 -355 -288 -534 -307 -421
416639 -421 -391 -354 -342 -443 -370 -164 -47 -339 -403 -290 -173 -365 -355 -492 -495 -685 -301 -512 -106 -458 -282 -366
$$ packed form
407055c39j64L47l60M1Q7r7L06j01p2m1j1K51k86M03k55Qj44J33j02K29l34M14
408403h7k6m83K32p3N7J76l28J37j35K36l4J61L1k48n3n9L61j74n0RL12k26J43
409805a21k83J36lk73K39M9N8k59L32n14M47k89K13R3j87K38l74J48R6l3J64m03
411147e26J68n0L96m41l6Oj18M35Ql21m0J9J92l20J79k15M57k0M8j20j14K24j97
412555c86j13J12p4K20j51k4J35j68m4L1J70K3l8r5N0j03J12Q5k53J20n8J28r0
413957d11J55N1m16L73k81J11J10n0O5J43j27m3j94n9K28J79k64J66j32n7K48
415237b05r7j3k2j18lL79j55Jl67M29l78L71k12j5o1K84k98K21r6O7k46K27j14
416639d21L0L7J2j01P3K06J17k92o4J13J17j92J0j37lj90L84k11M06l52J76q4
$$ plain form
417986 -366 -389 -431 -411 -345 -456 -369 12 35 253 459 137 -156 -250 -498 -338 -175 -37 -354 -310 -477 -65 -536
419328 -536 -508 -471 -240 -319 -302 -75 -207 -374 -533 -456 -368 -513 -356 -380 -508 -391 -171 -433 -216 -470 -476 -588
420669 -588 -209 -63 -302 -390 -355 -128 -197 -420 -179 -477 -521 -639 -413 -622 -361 -312 -146 -513 -579 -466 -363
421947 -363 -427 -287 -154 -229 -242 -389 -501 -485 -486 -88 -453 -409 -411 -259 -367 -527 -429 -256 -208 -365 -543 -411 -404 -289
423418 -289 -549 -382 -416 -64 -371 -289 -315 -379 -521 -284 -569 -196 -426 -215 -434 -342 -343 -319 -446 -211 -621 -405
424759 -405 -404 -351 -612 -364 -484 -292 -366 -330 -299 -323 -528 -185 -278 -432 -509 -4 -359 -120 -347 -326 -280 -94 -406
426161 -406 -307 -263 -200 -233 -430 -504 -544 -374 -445 -730 -325 -246 -321 -157 -510 -427 -73 -407 -229 -349 -356 -495 -134
427570 -134 -371 -426 -362 -432 -256 -316 -569 -243 -387 -366 -449 -592 -330 -600 -638 -485 -437 -435 -245 -451 -490 -277 -334
$$ packed form
417986c66k3m2K0O6j11Q7L81K3K18K06l22k93r4k48J60J63J38l17M4j67M12m71
419328e36K8L7K31p9J7K27j32j67j59P7Q8j45J57k4j28J17K20k62K17k54oj12
420669e88L79J46k39q8L5K27o9k23K41k98m4j18K26k09K61M9J66l67o6J13J03
421947c63o4J40J33p5j3j47j12J6jL98l65M4kJ52j08j60R8J73M8j57j78J32PJ15
423418b89k60J67l4L52l07Q2k6o4j42K37k85L73k30K11k19R2jK4j27K35m10K16
424759d05JN3k61K48j20J92p4L6L1k4k05L43r3j54p7N05l55K39k27K1M6J86l12
426161d06R9M4O3l3j97p4m0J70p1k85M05P9p5J64l53Q3L54l34J78j20pj39L61
427570a34k37n5O4p0J76o0k53L26j44K1q3j43K62k70l8J53M8KJ90k06l9K13n7
$$ plain form
428972 -334 -294 -359 -272 -517 -247 -607 -486 -496 -139 -259 -246 -483 -333 -472 -118 -334 -242 -476 -254 -291 -278 -410
430313 -410 -192 -296 -418 -480 -177 -377 -461 -332 -399 -354 -200 -448 -284 -537 -452 -405 -95 -276 -201 -773 -214 -477
431654 -477 -235 -305 -247 -302 -505 -415 -444 -262 -195 -443 -251 -462 -293 -294 -232 -516 -369 -461 -294 -589 -138 -360 -469
433062 -469 -231 -431 -617 -377 -378 -560 -129 -241 -634 -338 -612 -416 -379 -423 -222 -305 -467 -118 -443 -357 -387 -365
434404 -365 -338 -359 -423 -357 -621 -251 -275 -226 -511 -189 -455 -351 -469 -306 -456 -431 -404 -424 -247 -171 -306 -262 -385
435806 -385 -106 -152 -480 -470 -61 -480 -395 -340 -397 -445 -554 -615 -513 -407 -668 -832 -308 -564 -149 -286 -364 -472
437147 -472 -473 -460 -289 -172 -507 -253 -154 -361 -111 -195 -276 -505 -202 -382 -309 -606 -360 -362 -123 -370 -531 -347
438494 -347 -192 -452 -508 -281 -219 -409 -252 -383 -354 -475 -264 -285 -303 -435 -144 -556 -183 -225 -91 -542 -183
$$ packed form
428972c34M0o5Q7k45K70l60J21j0L57j20J3k37J50j39L54k16R2k34K22l7J3j32
430313d10K18j04j22o2L03k00q4J29o7M5J54k48J64k53Q5M7L10j81P5n72N59k63
431654d77K42p0N8n5k03R0k9J82O7k48J92k11J69jO2k84J47r2J67k95M51k22j09
433062d69K38k00j86K40jj82M31j12l93K96k74J96L7m4K01q3j62L49l25Q6l0K2
434404c65K7k1o4O6k64L70k4M9k85L22k66J04j18J63j50K5K7k0J77P6j35M4j23
435806c85K79m6l28J0M09m19Q5N5n7m8j09o1J02J06k61j64N24k56M15j37p8j08
437147d72jJ3J71J17l35K54R9k07K50q4q1k29L03j80P3k97K46kK39k47j61J84
438494c47J55k60n6K27O2j90J57j31K9j21K11k1j8j32K91m12L73m2J34m51L59
$$ plain form
439774 -183 -505 -196 -377 -188 -247 -365 -453 -258 -580 -241 -538 -320 -205 -476 -463 -299 -628 -394 -579 -404
440992 -404 -449 -439 -440 -512 -593 -404 -374 -294 -192 -221 -425 -150 -321 -387 -615 -349 -553 -263 -428 -388 -308 -212 -394 -416
442463 -416 -511 -114 -418 -422 -551 -340 -342 -264 -543 -200 -280 -288 -162 -38 638 1346 340 55 -20 -164 -178 -226 -272
443865 -272 -20 -473 -424 -421 -192 -403 -289 -344 -294 -492 -399 -464 -243 -479 -58 -407 -50 -520 -379 -394 -374 -305 -182
445267 -182 -539 -385 -71 -68 -523 -106 -348 -228 -265 -334 -429 -277 -287 -301 -336 -184 -370 -170 -291 -99 -275 -273 -580
446669 -580 -223 -144 -245 -413 -15 -98 -301 -206 -269 -475 -398 -269 -183 -382 -161 -229 -152 -540 -263 -443 -374 -485
448016 -485 -68 -285 -358 -261 -183 -513 -121 -539 -203 -455 -372 -385 -378 -535 -413 -331 -182 -504 -429 -514 -207 -359 -432
449419 -432 -52 -424 -420 -237 -250 -358 -595 -310 -268 -270 -672 -155 -522 -139 -365 -246 -556 -347 -490 -124 -330
$$ packed form
439774a83l22L09j81J89n9j18q8J95l22L39k97K18J15k71J3J64l29K34j85J75
440992d04m5J0jp2q1J89L0Q0J02k9k04K75j71o6k28K66k04K90j65M0Q0R6j82k2
442463d16r5L97l04mj29K11kP8k79L43q0qJ26J24O76P08j006k85p5j44j4m8m6
443865b72K52m53M9LK29k11J14n5N0j98R3o5K21k36M21l49L57m70J41j5K0O9J23
445267a82l57J54L14Lm55M17k42J20l7o9r5J52j0j4l5J52j86K00j21J92j76Kl07
446669e80L57P9j01j68L98q3k03R5o3k06P7J29Q6j99K21o8P7l88K77j80O9j11
448016d85M17k17p3R7P8l30L92m18L36k52Q3j3Pj57J22Q2J49l22P5q5L07j52p3
449419d32L80l72MJ83j3j08k37K85M2km02N17l67L83k26J19l10K09j43L66k06
$$ plain form
450699 -330 -30 252 1335 653 -210 -224 6 -272 -70 -274 -398 -325 -142 -383 -612 -362 -311 -553 -318 -223
451924 -223 -217 -338 -148 -416 -286 -673 -414 -434 -262 -239 -351 -663 -155 -320 -356 -490 -325 -19 -163 -454 -484
453202 -484 -209 -55 -369 -111 -569 -175 -191 -25 -544 -95 -189 -120 -514 -77 -379 -151 -383 -121 -586 -471
454422 -471 -657 -377 -377 -350 -463 -310 -549 -103 -278 -15 -397 -132 -143 -285 -391 -362 -623 -242 -227 -146 -296 -212
455769 -212 -546 -127 -403 -171 -177 -160 -408 -169 -403 -53 -617 5 -116 66 -95 18 -207 -100 -341 110
456988 110 -174 -185 -296 -5 -400 139 -203 495 46 129 -235 76 -260 255 -520 87 -186 -28 -501 144
458205 144 -530 -320 -382 -203 -485 -90 -469 -152 -379 244 -355 82 -515 -166 -321 79 -281 204 -130 102
459431 102 -252 84 -385 153 -455 20 -420 226 -345 -17 -136 158 -115 160 -345 72 -162 -169 -377 157
$$ packed form
450699c30L00K82J083o82q63j4K30k78K02k04j24P3J83k41k29K50N1k42K35R5
451924b23Oj21J90k68J30l87K59k0J72K3j12l12N08j65l6j34J65L06j44k91l0
453202d84K75J54l14K58m58L94j6J66n19M49r4O9l94M37l02K28k32K62m65J15
454422d71j86K80%K7j13J53k39M46j75K63l82K65j1j42j06K9k61L81J5Q1j50Q4
455769b12l34M19k76K32oJ7k48K39k34L50n64O22j21J82j61J13k25J07k41M51
456988A10k84j1j11K91l95N39l42O98m49Q3l64L11l36N15p75O07k73J58m73O45
458205A44o74K10o2J79k82L95l79L17k27O23n99M37n97L49j55M00l60M85l34K32
459431A02l54L36m69N38o08M75m40O46n71L28j19K94k73K75n05M17k34pk08N34
$$ plain form
460650 157 -531 326 -413 197 -243 156 -260 125 -364 29 -488 -53 -372 -7 -466 -42 -515 298 -407
461806 -407 477 -327 391 -189 253 -322 629 -529 989 -286 975 186 1422 481 930 -382 1236
462848 1236 168 1381 298 1952 980 2803 1399 3850 2519 6764 5115 7031 4893 9940 9345
463759 9345 18454 23524 51862 109204 285557 212065 55807 41599 22078 22230 14488 19488
464495 19488 14209 14848 10714 12508 9261 11291 9010 10564 8721 9989 8042 9267 7375 8402
465346 8402 6635 7064 5232 6623 5247 6198 4896 5316 4805 5340 4554 5268 4061 4730 4044 4693 3963
466387 3963 4392 3687 4228 3380 3817 3437 3933 3140 3458 2995 3438 2882 3180 2667 3195 2805 3338 2528 2880
467545 2880 2318 2649 2063 2546 1845 2400 2127 2371 1816 2245 1851 2145 1650 1801 1678 2136 1844 2000 1562
$$ packed form
460650A57o88Q57p39O10m40L99m16L85m89L93n17M35l19L65m59M24m73Q13p05
461806d07Q84q04P18n80M42n75R51j158J518j275J261p89J236r41M49j312J618
462848A236j068J213j083J654r72J823j404K451j331M245j649J916k138N047n95
463759I345R109N070K8338N7342J76353p3492j56258j4208j9521J52p742N000
464495A9488n279O39m134J794l247K030k281J554j843J268j947J225j892J027
465346H402j767M29j832J391j376R51j302M20n11N35p86P14j207O69o86O49p30
466387C963M29p05N41q48M37l80M96p93L18m63M43n56K98n13N28l90N33q10L52
467545B880n62L31n86M83p01N55k73K44n55M29l94K94m95J51j23M58k92J56m38
$$ plain form
468709 1562 2158 1733 1918 1824 1895 1442 1999 1891 1748 1424 1686 1575 2208 1938 1896 1654 1860 1567 2002 1611
469926 1611 1944 1851 1889 1559 1997 1398 1862 1472 1639 1571 1821 1490 1739 1639 1742 1366 1666 1559 1529 1438 1806
471206 1806 1351 1674 1241 1436 1334 1188 1120 1468 1010 1441 1146 1503 929 1469 1183 1540 1326 1485 1114
472370 1114 1344 1256 1201 1345 1248 1371 1338 1213 1346 1155 1171 1233 1311 1064 1539 1021 1286 1151 1234 1040 1393 1129
473710 1129 958 843 1210 1076 1046 887 1369 991 1045 919 967 1108 1237 988 969 563 941 883 775 570 1016
474990 1016 898 871 621 942 580 696 811 905 631 871 458 483 713 519 451 709 554 755 467 661
476215 661 335 444 616 681 455 545 372 595 275 223 85 627 405 571 358 161 243 192 174 296 321 518
477557 518 16 527 290 494 195 289 204 155 29 323 329 190 366 349 495 434 244 385 233 285 319 313 228
$$ packed form
468709A562N96m25J85r4P1m53N57j08j43l24K62j11O33k70m2k42K06k93M35l91
469926A611L33r3L8l30M38n99M64l90J67o8K50l31K49j00J03l76L00j07l0r1L68
471206A806m55L23m33J95j02j46o8L48m58M31k95L57n74N40k86L57k14J59l71
472370A114K30q8n5J44r7J23l3j25J33j91J6O2P8k47M75n18K65j35Q3j94L53k64
473710A129j71j15L67j34l0j59M82l78N4j26M8J41J29k49j9m06L78n8j08k05M46
474990A016j18k7k50L21l62J16J15R4k74K40m13K5K30j94o8K58j55K01k88J94
476215F61l26J09J72O5k26R0j73K23l20n2j38N42k22J66k13j97Q2n1j8J22K5J97
477557E18n02N11k37K04k99R4q5m9j26K94Oj39J76j7J46o1j90J41j52N2L4oq5
$$ plain form
478959 228 132 74 147 390 276 55 53 154 232 150 207 -8 163 -33 95 143 209 283 383 85 -36 145 -64
480368 -64 -8 -94 -127 -5 321 152 57 146 68 126 78 188 -134 478 242 116 154 198 -192 16 -2 255 -73
481769 -73 254 28 180 -85 4 61 -2 -121 -301 -234 -91 -30 190 -85 60 -183 124 238 -185 121 -130
483049 -130 84 129 -23 162 -137 -171 34 150 -67 160 -219 257 323 281 121 228 131 147 87 138 246 1201
484390 1201 1156 511 237 -30 -36 -146 1 160 89 55 -184 -32 7 -131 253 0 -232 128 46 1 -108 -111
485738 -111 -55 -246 -127 -51 -150 -266 38 -55 -235 -60 111 -168 -256 40 -192 30 -78 -347 -203 -98 -97 -227
487079 -227 -225 -299 -182 -280 -144 27 -100 -98 -72 55 10 -186 -235 -379 -360 -305 2 -44 -114 -390 -235 -278 -281 -291 -161
488603 -161 -168 -277 -157 -20 -120 -197 -317 -414 -143 -300 -350 -448 -517 -548 -123 -213 -98 -138 -291 -483 -74 -293 -312
$$ packed form
478959B28r6n8P3K43j14k21kJ01P8q2N7k15J71j96J28M8O6P4J00k98j21J81k09
480368f4N6q6l3J22L26j69r5Q9p8N8m8J10l22O12k36j26L8M4l90K08j8K57l28
481769g3L27k26J52k65Q9N7o3j19j80O7J43O1K20k75J45k43L07J14m23L06k51
483049a30K14M5j52J85k99l4K05J16k17K27l79M76O6m2j60J07r7J6o0N1J08R55
484390A201m5o45k74k67oj10J47J59p1l4k39J52L9j38L84k53k32L60q2m5j09l
485738a11N6j91J19P6r9j16L04r3j80J75J71k79q8K96k32K22j08k69J44J05Jj30
487079b27Kp4J17r8J36J71j27KK6J27m5j96m9j44J9N5L07m6p0k76J55m3lj0J30
488603a61pj09J20J37j00p7j20r7K71j57n0r8o9l1M25r0J15m0j53j92M09k19j9
$$ plain form
490013 -312 -485 -480 -347 -181 -141 -149 -435 -216 -298 -389 -345 -333 -138 -210 -220 -261 -245 -183 -45 -291 -350 -233 101 -141
491476 -141 -412 -286 -325 -282 -147 -581 -143 -172 132 -156 -196 -191 -488 -226 -318 -273 -563 -295 -209 -423 -234 -189 -331
492878 -331 -316 -265 -344 -471 -369 -537 -328 -367 -407 -88 -226 -475 -142 -507 -130 -345 -106 -312 -198 -405 -436
494157 -436 -326 -486 -356 -381 -406 -367 -510 -332 -320 -146 -163 -224 -405 -217 -627 -377 -228 -477 -169 -305 -270 -134
495505 -134 -220 -385 -498 -298 65 -171 -254 -198 -168 -341 -556 -297 -506 -309 -370 -571 -439 -390 -358 6 -372 -308
496847 -308 -451 -514 -151 -276 -318 -437 -258 -519 -417 -350 -340 -372 -207 -406 -309 -561 -532 -497 -534 -523 -511 -554 -440
498247 -440 -482 -691 -129 -538 -493 -271 -270 -367 -484 -452 -310 -424 -221 -480 -446 -396 -189 -73 -344 -530 -497 -344
499596 -344 -621 -617 -396 -751 -465 -449 -457 -443 -383 -523 -331 -509 -646 -427 -454 -349 -528 -411 -321 -347 -499 -463 -240
$$ packed form
490013c12j73NJ33J66M0qk86K19q2r1M4J2J95p2j0m1J6O2J38k46n9J17L34k42
491476a41k71J26l9M3J35m34M38k9L04k88m0Nk97K62r2M5k90K68Q6k14J89M5j42
492878c31J5N1p9j27J02j68K09l9m0L19j38k49L33l65L77k15K39k06J14k07l1
494157d36J10j60J30k5k5L9j43J78J2J74j7o1j81J88m10K50J49k49L08j36L5J36
495505a34q6j65j13K00L63k36q3N6L0j73k15K59k09J97o1k01J32M9L2L64l78O4
496847c08j43o3L63j25m2j19J79k61J02O7J0l2J65j99R7k52K9L5l7J1J2m3J14
498247d40m2k09N62m09M5K22Jr7j17L2J42j14K03k59L4N0K07J16k71j86L3J53
499596c44k77MK21l55K86J6qJ4O0j40J92j78j37K19k7J05j79J17R0k6j52L6K23
$$ plain form
500998 -240 -455 -552 -470 -370 -385 -542 -398 -328 -637 -545 -426 -443 -424 -355 -578 -210 -471 -495 -471 -255 -449 -416 -408 -542
502461 -542 -517 -766 -375 -535 -305 -361 -279 -265 -483 -411 -650 -156 -492 -614 -263 -712 -407 -715 -524 -571 -473 -519
503803 -519 -387 -289 -550 -206 -221 -427 -569 -557 -538 -383 -363 -276 -556 -347 -336 -464 -319 -689 -463 -668 -557 -364
505150 -364 -478 -432 -582 -454 -418 -503 -478 -697 -548 -370 -464 -265 -614 -383 -497 -621 -628 -628 -779 -616 -508 -685
506491 -685 -603 -615 -329 -410 -427 -690 -389 -352 -563 -604 -534 -477 -413 -687 -486 -461 -419 -333 -315 -545 -482 -637 -284 -246
507954 -246 -436 -548 -480 -350 -727 -536 -657 -390 -473 -801 -481 -518 -544 -597 -389 -514 -666 -648 -456 -553 -755 -453
509295 -453 -698 -594 -498 -622 -526 -727 -588 -744 -383 -771 -296 -514 -592 -489 -448 -635 -456 -468 -280 -616 -694
510581 -694 -500 -552 -614 -680 -743 -451 -509 -519 -298 -556 -838 -680 -701 -699 -528 -703 -583 -330 -420 -503 -425 -497 -657 -705
$$ packed form
500998b40k15r7Q2J00j5j57J44P0l09R2J19j7J9O9k23L68k61k4K4K16j94L3Qj34
502461e42K5k49L91j60K30n6Q2J4k18P2k39M94l36j22L51m49L05l08J91m7R8m6
503803e19J32R8k61L44j5k06j42J2J9J55K0Q7k80K09J1j28J45l70K26k05J11J93
505150c64j14M6j50J28L6q5K5k19J49J78r4J99l49K31j14j24p%j51J63J08j77
506491f85Q2j2K86q1j7k63L01L7k11m1P0N7O4k74K01K5M2Q6J8k30O3j55L53L8
507954b46j90j12O8J30l77J91j21K67q3l28L20l7k6n3K08j25j52J8J92r7k02L02
509295d53k45J04R6j24R6k01J39j56L61l88M75k18p8J03M1j87J79j2J88l36p8
510581f94J94n2o2o6o3K92n8j0K21k58k82J58k1KJ71j75J20K53r0q3P8p2j60m8
$$ plain form
512045 -705 -477 -559 -516 -667 -540 -625 -564 -402 -495 -697 -590 -534 -557 -564 -439 -608 -646 -642 -659 -497 -690 -618 -484 -572
513508 -572 -615 -444 -407 -521 -471 -812 -667 -873 -529 -538 -473 -682 -681 -707 -698 -794 -389 -606 -579 -752 -398 -737 -590 -481
514971 -481 -574 -525 -452 -536 -726 -690 -579 -366 -613 -765 -679 -641 -480 -641 -660 -768 -447 -681 -531 -625 -602 -621 -383
516381 -383 -697 -625 -353 -789 -938 -541 -609 -738 -752 -755 -526 -605 -707 -695 -537 -307 -607 -815 -565 -321 -463 -710
517722 -710 -711 -675 -742 -643 -685 -636 -569 -594 -504 -757 -688 -209 -291 -783 -548 -760 -492 -539 -441 -563 -756 -406 -682 -688 -622
519246 -622 -695 -591 -687 -630 -703 -768 -914 -616 -581 -600 -761 -785 -575 -581 -727 -566 -497 -685 -589 -237 -386 -556 -620 -523
520710 -523 -560 -540 -685 -585 -503 -497 -492 -630 -615 -661 -384 -620 -450 -987 -589 -668 -657 -400 -852 -889 -520 -600 -512 -893
522180 -893 -666 -721 -457 -731 -667 -723 -363 -567 -558 -822 -401 -599 -686 -859 -859 -771 -648 -562 -702 -764 -612 -582 -456
$$ packed form
512045g05K28q2M3j51J27q5O1J62r3k02J07N6k3pJ25j69l8Mj7J62j93P2J34q8
513508e72m3J71L7j14N0l41J45k06L44rO5k09Jk6Rr6M05k17K7j73L54l39J47J09
514971d81r3M9P3q4j90L6J11K13k47j52Q6L8J61j61j9j08L21k34J50r4K3j9K38
516381c83l14P2K72m36j49L97o8j29j4lK29p9j02J2J58K30l00k08K50K44j42k47
517722g10jL6o7R9m2M9O7k5R0k53O9M79q2m92K35k12K68m7R8j22j93L50k76oO6
519246f22p3J04r6N7p3o5j46K98L5j9j61k4K10oj46J61O9j88R6L52j49j70o4R7
520710e23l7K0j45J00Q2ONj38J5m6K77k36J70n37L98p9J1K57m52l7L69q0Q8l81
522180h93K27n5K64k74O4n6L60k04Rk64M21j98q7j73%Q8J23Q6j40o2J52L0J26
$$ plain form
523582 -456 -651 -401 -720 -562 -696 -644 -458 -718 -698 -558 -684 -613 -812 -618 -743 -715 -983 -535 -885 -600 -791
524861 -791 -889 -607 -809 -585 -474 -800 -808 -677 -638 -847 -559 -535 -565 -664 -661 -833 -664 -777 -646 -738 -654 -620 -590 -840
526324 -840 -398 -952 -733 -484 -1039 -667 -595 -829 -697 -703 -500 -677 -791 -881 -746 -671 -849 -418 -891 -626 -607
527612 -607 -907 -925 -737 -910 -697 -852 -787 -736 -676 -807 -736 -524 -868 -731 -948 -591 -670 -623 -670 -686 -690 -802 -801 -789
529075 -789 -616 -645 -411 -680 -826 -589 -703 -755 -621 -761 -695 -638 -820 -823 -989 -563 -862 -556 -776 -498 -521 -814
530415 -814 -627 -809 -813 -603 -909 -810 -588 -623 -622 -818 -1001 -825 -688 -818 -668 -622 -901 -740 -972 -326 -573 -680
531764 -680 -786 -557 -843 -727 -574 -928 -715 -938 -786 -712 -640 -842 -908 -710 -682 -726 -774 -694 -673 -732 -741 -686 -821
533166 -821 -393 -762 -553 -731 -1100 -859 -871 -680 -759 -856 -767 -631 -856 -933 -914 -932 -659 -999 -773 -540 -568 -1109
$$ packed form
523582d56j95K50l19J58j34N2J86k60K0J40j26P1j99J94j25K8k68M48l50K85j91
524861g91r8K82k02K24J11l26qJ31L9k09K88K4l0r9Lj72J69j13J31r2Q4L4L0k50
526324h40M42n54K19K49n55L72P2k34J32oK03j77j14r0J35P5j78M31m73K65J9
527612f07l00j8J88j73K13j55O5N1O0j31P1K12l44J37k17L57p9M7m7j6mj12JJ2
529075g89J73k9K34k69j46K37j14n2J34j40O6N7j82lj66M26k99L06k20K78k3k93
530415h14J87j82mK10l06R9K22l5Jj96j83J76J37j30J50M6k79J61k32O46k47j07
531764f80j06K29k86J16J53l54K13k23J52P4P2k02o6J98K8m4m8Q0K1n9rN5j35
533166h21M28l69K09j78l69K41j2J91p9r7Q9J36k25p7J9j8K73l40K26K33k8n41
$$ plain form
534505 -1109 -693 -739 -783 -874 -902 -797 -886 -955 -814 -784 -585 -637 -1063 -881 -946 -823 -915 -753 -720 -671 -569 -806 -692
535908 -692 -751 -671 -707 -798 -871 -799 -578 -665 -726 -824 -821 -671 -332 -539 -828 -447 -758 -572 -787 -841 -793 -562 -791 -447
537378 -447 -736 -589 -859 -717 -843 -872 -1105 -582 -720 -902 -898 -1058 -581 -370 -755 -648 -511 -561 -278 -504 -808
538658 -808 -816 -684 -485 -341 -640 -666 -415 -406 -528 -536 -862 -782 -915 -614 -609 -877 -643 -1001 -854 -804 -602 -632 -685 -873
540122 -873 -781 -1134 -797 -958 -816 -790 -441 -471 -472 -708 -603 -653 -809 -955 -514 -729 -671 -669 -755 -638 -562 -987 -854
541524 -854 -942 -694 -616 -729 -1144 -737 -907 -873 -986 -728 -836 -834 -1124 -798 -1178 -626 -1093 -784 -1206 -505 -1127
542810 -1127 -754 -1175 -592 -1176 -642 -1097 -638 -1176 -629 -1008 -574 -1147 -452 -1152 -419 -920 -332 -986 -228
543967 -228 -1234 -339 -820 -36 -1477 62 -1475 811 -1208 2137 -691 7274 8600 59649 36682
$$ packed form
534505a109M16m6m4r1k8J05q9o9J41L0J99n2m26J82o5J23r2J62L3M9J02k37J14
535908f92n9Q0l6r1p3P2K21q7o1r8LJ50L39k07k89L81l11J86k15n4M8K31k29L44
537378d47k89J47k70J42j26k9k33N23j38j82Mj60M77K11l85J07J37n0K83k26l04
538658h08qJ32J99J44k99k6K51Rj22ql26Q0j33L01Nk68K34l58J47N0K02l0n3j88
540122h73R2l53L37j61J42K6L49l0jk36J05n0j56j46M41k15N8Kq6J17P6m25J33
541524h54q8K48P8j13m15M07j70L4j13K58j08Kk90L26l80N52m67L09m22P01o22
542810a127L73m21N83n84N34m55M59n38N47l79M34n73O95p00P33n01N88o54P58
543967b28j006Q95m81P84j441J539j537K286k019L345k828P965J326N1049k2967
$$ plain form
544887 36682 4322 8433 1752 4841 1175 3571 923 2636 859 2466 772 2130 985 2402
545736 2402 1073 2053 757 1730 886 1326 575 1335 50 781 201 738 112 678 69 587 -7 464
546840 464 -279 634 -225 569 -123 78 -207 294 -210 303 -191 150 248 176 -131 192 -117 51 -285 56
548057 56 -442 13 -591 -79 -462 -236 -539 39 -522 -469 -363 -200 -620 -416 -303 -407 -623 -328 -697 -351
549276 -351 -842 -310 -537 -397 -598 -477 -531 -351 -476 -240 -444 -463 -902 -411 -503 -382 -702 -368 -1002 -278
550501 -278 -709 -392 -845 -631 -749 -486 -646 -314 -870 -722 -828 -649 -862 -786 -1034 -386 -585 -248 -502 -462
551719 -462 -790 -528 -628 -348 -638 -464 -814 -285 -703 -468 -678 -596 -559 -577 -977 -583 -993 -440 -818 -503
552938 -503 -943 -562 -686 -626 -1087 -731 -1044 -573 -991 -914 -1244 -676 -1211 -733 -871 -906 -1155 -815 -992 -1101
$$ packed form
544887C6682l2360M111o681L089l666K396k648J713j777J607j694J358j145J417
545736B402j329R80j296R73q44M40p51P60j285P31n80N37o26N66o09N18n94M71
546840D64p43R13q59P94o92K01k85N01n04N13m94L41R8p2l07L23l09J68l36L41
548057E6m98M55o04N12l83K26l03N78n61N3J06J63m20K04J13j04k16K95l69L46
549276c51m91N32k27J40k01J21n4J80j25K36k04j9m39M91r2J21l20L34o34P24
550501b78m31L17m53K14j18K63j60L32n56J48j06J79k13P6k48O48j99L37k54M0
551719d62l28K62j00K80k90J74l50N29m18K35k10Q2L7j8m00L94m10N53l78L15
552938e03m40L81j24O0m61L56l13M71m18P7l30N68n35M78j38l5k49L40j77j09
$$ plain form
554163 -1101 -789 -749 -1059 -595 -1123 -850 -1432 -1124 -1343 -1138 -1030 -1029 -1267 -931 -1497 -1085 -1378 -1085 -1383 -1099
555381 -1099 -1569 -1128 -1284 -1004 -1436 -1158 -1345 -1091 -1284 -1291 -1304 -1055 -1041 -921 -1060 -824 -748 -745 8 1038 5609
556661 5609 10528 13431 22498 8734 6606 5902 11867 24518 42579 26780 10496 8514 6864
557457 6864 7458 11202 18295 9986 5949 4767 4083 3758 4268 4153 3841 4074 5037 6714 14029 13054 15927
558492 15927 17211 13280 17262 33938 64557 65091 85928 100658 66094 33808 29407 28738 45949
559288 45949 48581 55815 39631 22356 19878 17290 16660 14200 15191 15988 16130 13825 13122 12586 13205
560201 13205 13879 17580 21672 39615 39867 23482 25284 30049 58088 94977 77586 47391 69128
560997 69128 58794 30696 25466 22478 21661 26426 27087 19091 19239 19732 20146 23037 19578 17874 15552
$$ packed form
554163a101L12M0l10M64n28K73n82L08k19K05J08Jk38L36n66M12k93K93k98K84
555381a099m70M41j56K80m32K78j87K54j93pj3K49J4J20j39K36P6LP53J030M571
556661E609M919K903R067j3764k128p04N965J2651J8061j5799j6284j982j650
557457F864N94L744P093q309m037j182o84l25N10j15l12K33R63J677P315r75K873
558492A5927J284l931L982J6676L0619N34K0837J4730l4564l2286m401o69J7211
559288D5949K632P234j6184j7275k478k588o30k460R91P97J42k305p03n36O19
560201A3205O74L701M092J7943K52j6385J802M765K8039L6889j7391l0195K1737
560997F9128j0334k8098n230k988q17M765O61p996J48M93M14K891l459j704k322
$$ plain form
561916 15552 14905 16014 17193 13815 13838 12070 12515 11020 14185 15639 29807 35878 21042 17722 19313
562828 19313 23802 44628 72129 37521 23943 21766 23472 33141 47143 29139 20339 19609 18972
563624 18972 19956 16643 18126 16621 14815 14402 15395 18913 29848 20064 15794 14054 14651 13695 16879
564535 16879 18681 37463 46626 58600 57292 31682 29655 19791 17907 14797 14785 13864 13822 13941 15265
565455 15265 20264 20592 14126 13802 12161 12269 11183 11561 10852 11078 11062 12144 17383 17777 11973 12206 12340
566490 12340 15464 25113 20451 12013 12979 11056 14096 16348 12435 9754 10205 9055 9501 8407 8937
567408 8937 7999 8637 8241 8415 7531 8014 7523 7998 7130 7395 7036 7202 6861 7363 6880 7151 7327 8738 7641
568565 7641 7375 7316 7497 9337 10247 7385 7458 6698 7387 8183 7797 6614 6506 6056 6189 5810 6343 5876 6380
$$ packed form
561916A5552o47J109J179l378K3j768M45j495L165J454J4168O071j4836l320J591
562828A9313M489K0826K7501l4608j3578k177J706R669J4002j8004q800p30o37
563624A8972R84l313J483j505j806m13R93L518J0935r784m270j740N97r56L184
564535A6879J802J8782R163J1974j308k5610k027r864j884l110j2r21m2J19J324
565455A5265M999L28o466l24j641J08j086L78p09K26j6J082N239L94n804K33J34
566490A2340L124R649m662q438R66j923L040K252l913k681M51j150M46j094N30
567408H937r38O38l96J74q84M83m91M75q68K65l59J66l41N02m83K71J76J411j097
568565G641k66n9J81J840R10k862P3p60O89P96l86j183j08m50J33l79N33m67N04
$$ plain form
569723 6380 5802 6260 5675 6092 6208 6232 6963 7214 5781 5837 5916 6384 6997 8137 8483 9174 8856 8272 6358
570887 6358 6246 5254 5633 5428 6008 5941 5683 5090 5415 4852 5106 4612 5142 4798 5113 4713 5096 4466 4729
572044 4729 4985 5696 5252 4995 4743 4924 5219 6112 5091 4866 4474 4471 4940 5063 4270 4185 3995 4052 3883 3916
573269 3916 3776 3896 3732 4065 3774 4084 3804 3590 3445 3692 3493 3457 3380 3424 3175 3477 3258 3335 3226 3234 2907
574549 2907 3174 3084 3088 2969 3090 2771 2811 2753 3058 3052 3005 2654 2994 2719 3089 2389 2672 2640 2507 2339 2604 2476
575889 2476 2539 2507 2226 2178 2393 2263 2396 2325 2370 2388 2378 2283 2210 2350 2361 1980 2407 2621 2160 2102 2688 2452 2688
577298 2688 2519 2527 2294 2200 1873 2126 1885 2168 1852 1974 1705 1680 1903 1926 1716 1934 1611 1864 1730 1831 2062
578578 2062 2101 1770 2193 2094 2128 2057 2375 2273 2333 2140 2059 1919 2037 2091 2129 1961 2047 1541 1878 1710 1533 1592
$$ packed form
569723F380n78M58n85M17J16K4P31K51j433N6P9M68O13J140L46O91l18n84j914
570887F358j12r92L79k05N80o7k58n93L25n63K54m94N30l44L15m00L83o30K63
572044D729K56P11m44k57k52J81K95Q93j021k25l92lM69J23p93q5j90N7j69L3
573269C916j40J20j64L33k91L10k80k14j45K47j99l6p7M4k49L02k19P7j09Ql27
574549B907K67r0Mj19J21l19M0n8L05om7l51L40k75L70p00K83l2j33j68K65j28
575889B476O3l2k81m8K15j30J33p1M5J8j0r5p3J40J1l81M27K14m61n8N86k36K36
577298B688j69Qk33r4l27K53k41K83l16J22k69k5K23K3k10K18l23K53j34J01K31
578578B062L9l31M23r9L4p1L18j02O0j93q1j40J18N4L8j68Q6n06L37j68j77N9
$$ plain form
579918 1592 1799 1162 1509 1375 1537 1222 1369 956 1382 1166 1473 1012 1245 1094 1502 1197 1397 1291 1205
581076 1205 1280 1607 1135 1414 1179 1366 1030 1076 960 1151 1023 1209 991 922 809 922 730 877 772 919
582301 919 917 1001 792 947 1044 641 513 911 758 962 629 830 624 1266 722 949 800 1037 583 811 641
583580 641 1098 255 708 -244 904 2099 1853 1727 1657 885 890 1267 1000 1128 1174 788 1030 689 889 1010
584799 1010 1027 597 966 355 687 624 1104 753 704 555 678 729 799 727 557 520 522 253 619 510 849 397
586146 397 414 436 604 85 449 171 463 72 309 -114 128 -128 239 -137 -23 -229 288 -321 -36 -414
587365 -414 -269 -445 3 -538 -290 -704 -457 -784 -418 -626 -674 -1235 -295 -848 -414 -1119 -368 -786 -400 -1170
588590 -1170 -463 -996 -574 -1457 -518 -1276 -678 -993 -15 -968 -176 -1225 -105 -1433 669 -679 1033
$$ packed form
579918A592K07o37L47j34J62l15J47m13M26k16L07m61K33j51M08l05K00j06q6
581076A205P5L27m72K79k35J87l36M6j16J91j28J86k18o9j13J13j92J47j05J47
582301I19kQ4k09J55R7m03j28L98j53K04l33K01k06O42n44K27j49K37m54K28j70
583580F41M57q43M53r52J148J195k46j26p0p72NL77k67J28M6l86K42l41K00J21
584799A010J7m30L69o11L32o3M80l51m9j49J23N1P0p2j70l7Kk69L66j09L39m52
586146C97J7K2J68n19L64k78K92l91K37m23K42k56L67l76J14k06N17o09K85l78
587365d14J45j76M48n41K48m14K47l27L66k08m8n61R40n53M34p05P51m18L86p70
588590a170P07n33M22q83R39p58N98l15R78r53P92j049J120j328K102j348J712
$$ plain form
589625 1033 -277 2193 613 6489 9734 35658 43924 64911 80284 31201 25475 23809 39734
590421 39734 81225 126955 76949 50763 41393 26016 22061 20636 21904 30744 35573 23234 18192
591210 18192 15280 15030 13432 13411 12764 13813 12649 16740 20338 43633 48481 26830 30654 39698 39024
592130 39024 48866 99261 76315 63484 55532 50209 69789 84565 41006 30248 24528 22941
592858 22941 19995 20385 19588 21675 23319 20420 16851 16514 15219 15352 14092 14356 13083 13053 12167 12062
593837 12062 11371 11605 10481 10397 9815 10440 9588 9584 9270 9432 8856 9263 8565 9117 8973 10292 10046 12564 14684
594995 14684 12026 9403 10062 9781 14576 16099 13175 12163 9824 8869 8726 8398 8504 9109 8989 7896
595975 7896 7903 7367 7410 7018 7005 7001 6932 6768 6685 6660 7557 8607 9080 8317 8353 9023 8256 10709 12937 9798 11032
$$ packed form
589625A033j310K470j580N876L245K5924Q266K0987J5373m9083n726j666J5925
590421C9734M1491M5730n0006k6186r370j5377l955j425J268Q840M829j2339n042
591210A8192k912k50j598k1o47J049j164M091L598K3295M848k1651L824R044o74
592130C9024R842N0395k2946j2831p952n323J9580J4776m3559j0758n720j587
592858B2941k946L90p97K087J644k899l569l37j295J33j260K64j273l0q86j05
593837A2062o91K34j124q4n82O25q52ml14J62n76M07o98N52j44J319k46K518K120
594995A4684k658k623O59k81M795J523k924j012k339r55j43l28J06O05j20j093
595975G896Pn36M3l92j3mo9j64q3k5Q97J050M73p63L6O70p67K453K228l139J234
$$ plain form
597255 11032 10513 9672 12083 9605 7490 7516 6980 6978 6771 6831 6826 6735 6470 6383 6251 6631 6380 6395 6076 6009 6094
598534 6094 5894 6164 5912 5837 6037 5700 5522 5531 5620 5214 5630 5410 5306 5186 5134 4870 5217 5195 5051 5041 4907
599821 4907 4819 4992 4521 5070 4963 5218 5106 4895 4846 4896 4857 4889 4702 4620 4761 4425 4453 4452 4269 4527 4198 4283
601161 4283 4385 4318 4255 4276 4176 4422 4274 3933 3998 4044 3851 4123 3987 3899 3952 3909 4113 3752 3742 3776 3742 3765 3537
602563 3537 3489 3509 3605 3353 3400 3442 3344 3245 3167 3156 3255 3067 3127 3254 3079 3041 3289 3144 3002 3039 3136 2696 2806 2952
604026 2952 2777 2780 2999 2851 3031 2931 2751 2679 3024 2739 2894 2993 2673 2591 2772 2569 2717 2637 2442 2546 2342
605314 2342 2178 2346 2542 2530 2387 2575 2485 2465 2400 2475 2177 2253 2415 2520 2493 2389 2128 2319 2375 2235 2332 2372
606654 2372 2423 2343 1943 2323 2087 2005 2051 2215 2087 2129 1907 2013 2048 2031 2091 2386 1981 2001 2080 2072 1654 1954 1947 1922
$$ packed form
597255A1032n19q41K411k478k115K6n36kk07O0nr1k65q7j32L80k51J5l19o7Q5
598534F094k00K70k52p5K00l37j78RQ9m06M16k20j04j20n2k64L47k2j44j0j34
599821D907q8J73m71N49j07K55j12k11m9N0l9L2j87q2J41l36K8jj83K58l29Q5
601161D283J02o7o3K1j00K46j48l41O5M6j93K72j36q8N3m3K04l61j0L4l4K3k28
602563C537m8K0R6k52M7M2r8r9p8j1R9j88O0J27j75l8K48j45j42L7R7m40J10J46
604026B952j75LK19j48J80j00j80p2L45k85J55R9l20q2J81k03J48q0j95J04k04
605314B342j64J68J96j2j43J88r0k0o5P5k98P6J62J05k7j04k61J91N6j40R7M0
606654B372N1q0m00L80k36q2M6J64j28M2k22J06L5j7O0K95m05K0P9qm18L00pk5
$$ plain form
608117 1922 2171 1973 2018 1681 1974 2111 1916 1821 1891 1885 1540 1454 1595 1736 1577 1625 1583 1743 1363 1940 1561 1803
609466 1803 1916 1769 1563 1462 1587 2006 1776 1887 1733 1875 1607 1766 1653 1824 1709 2104 1958 1745 1624
610622 1624 2140 1657 1559 1567 1445 1549 1399 1645 1319 1455 1405 1458 1433 1320 1482 1544 1540 1342 1812 1565 1529 1690
611963 1690 1507 1712 1583 1552 1841 1601 1722 1577 1390 1224 1287 1552 1489 1386 1456 1513 1353 1130 1585 1346 1229
613250 1229 1234 1219 1112 1182 1248 1086 1462 1507 1553 1312 1113 1253 1037 1186 1153 1224 851 1217 1041 1024 965 1188 1182
614652 1182 1115 1172 1000 1196 1018 1002 1441 945 1221 956 1217 1141 1081 853 1047 1074 831 1218 594 1194 1161
615932 1161 1172 971 746 684 751 1003 811 1044 960 924 820 875 765 955 1177 986 657 1011 915 795 993
617211 993 977 724 718 873 947 957 761 1091 846 1047 471 658 1003 891 779 641 1199 727 847 811 854 838
$$ packed form
608117A922K49j98M5l37K93J37j95r5P0ol45q6J41J41j59M8m2J60l80N77l79K42
609466A803J13j47k06j01J25M19k30J11j54J42k68J59j13J71j15L95j46k13j21
610622A624N16m83r8Qj22J04j50K46l26J36n0N3k5j13J62O2mj98M70k47l6J61
611963A690j83K05j29l1K89k40J21j45j87j66O3K65o3j03P0N7j60k23M55k39j17
613250A229Nj5j07P0O6j62L76M5M6k41j99J40k16J49l3P1l73L66j76j7n9K23o
614652A182o7N7j72J96j78j6M39m96K76k65K61p6o0k28J94K7k43L87o24O00l3
615932A161J1k01k25o2O7K52j92K33q4l6j04N5j10J90K22j91l29L54r6j20J98
617211I93j6k53oJ55P4J0j96L30k45K01n76J87L45j12j12j38N58m72J20l6M3j6
$$ plain form
618559 838 490 886 829 851 984 623 798 767 968 858 600 874 972 772 673 788 937 618 669 471 785
619838 785 596 790 685 987 694 714 892 794 821 573 592 770 725 752 559 728 613 765 760 690 616 743 751
621240 751 634 553 766 572 804 761 750 635 781 670 535 745 617 819 614 809 709 574 617 749 587
622528 587 690 536 637 709 568 738 569 488 652 802 489 640 403 549 394 511 353 501 509 554 491
623806 491 535 576 545 582 343 492 554 623 556 460 338 391 571 488 515 620 473 457 549 473 657 480 483 427 640
625331 640 382 420 314 548 646 498 185 414 318 539 460 484 296 423 381 613 491 349 425 435 315 398
626672 398 210 390 416 368 364 406 548 472 122 625 613 846 338 3 392 595 183 308 465 274 261 385
628020 385 486 637 405 578 466 260 464 618 258 419 615 385 206 358 255 516 500 393 169 321
$$ packed form
618559H38l48L96n7K2J33l61J75l1K01j10k58K74R8k00r9J15J49l19N1j98L14
619838G85j89J94j05L02k93K0J78r8K7k48J9J78m5K7j93J69j15J52np0p4J27Q
621240G51j17q1K13j94K32m3j1j15J46j11j35K10j28K02k05J95j00j35M3J32j62
622528E87J03j54J01P2j41J70j69q1J64J50l13J51k37J46j55J17j58J48QM5o3
623806D91M4M1l1L7k39J49O2O9o7r6j22N3J80q3K7J05j47j6R2p6J84j77Ln6K13
625331F40k58L8j06K34R8j48l13K29r6K21p9K4j88J27m2K32j22j42P6J0j20Q3
626672C98j88J80K6m8mM2J42p6l50N03j2K33n08l35L89K03m12J25J57j91j3J24
628020C85J01J51k32J73j12k06K04J54l60J61J96k30j79J52j03K61j6j07k24J52
$$ plain form
629238 321 449 238 154 362 306 277 312 346 581 461 413 223 310 368 203 158 244 313 446 302 263 314 332 387
630701 387 184 410 348 555 326 556 449 401 337 88 448 195 261 246 232 397 292 458 322 519 238
631989 238 397 276 443 413 303 78 165 430 423 375 51 284 295 418 335 69 460 305 516 272 421 -4
633329 -4 286 316 344 911 275 454 136 358 103 187 434 300 227 333 511 459 153 167 324 274 246 91 239
634731 239 285 131 278 186 134 475 203 -43 215 341 122 290 199 228 280 225 482 300 344 220 444 478
636072 478 275 392 116 282 152 349 0 445 314 394 331 173 270 170 255 201 354 279 202 281 101 244
637419 244 -63 148 436 72 336 225 379 143 145 112 8 115 109 151 69 322 224 210 236 431 8 70 338
638821 338 -107 16 68 326 118 70 147 -85 337 -84 115 8 89 354 410 12 -74 215 173 234 363 137
$$ packed form
629238C21J28k11q4K08n6k9L5L4K35j20m8j90Q7N8j65m5Q6O9J33j44l9N1J8N5
630701C87k03K26o2K07k29K30j07m8o4k49L60k53O6j5j4J65j05J66j36J97k81
631989B38J59j21J67l0j10k25Q7K65pm8l24K33J1J23q3k66L91j55K11k44J49m25
633329dK90L0K8N67o36J79l18K22k55Q4K47j34p3J06J78n2l06J4J57n0k8j55J48
634731B39M6j54J47r2n2L41k72k46K58J26k19J68r1K9N2n5K57j82M4j24K24L4
636072D78k03J17k76J66j30J97l49M45j31Q0o3j58R7j00Q5n4J53p5p7P9j80J43
637419B44l07K11K88l64K64j11J54k36Kl3j04J07oM2q2K53r8j4K6J95m23O2K68
638821C38m45J23N2K58k08m8P7k32M22m21J99j07Q1K65N6l98q6K89m2O1J29k26
$$ plain form
640162 137 310 170 241 279 321 141 139 232 -82 340 280 -130 278 55 215 88 109 277 73 115 434 223
641511 223 165 251 274 134 163 245 265 59 -58 101 -76 264 20 196 358 284 210 242 244 301 272 160 11 47
642974 47 78 134 65 209 175 63 222 -22 147 249 -16 287 256 270 7 -88 115 25 237 467 131 42 422
644375 422 -16 -25 152 206 277 240 27 490 -21 340 3 393 216 103 177 9 223 -16 274 -12 -39 294
645716 294 43 163 273 163 131 142 198 144 206 202 253 87 -135 243 -178 188 -63 160 -63 -26 206 69
647065 69 -188 183 -17 143 129 182 185 152 226 38 115 -180 219 132 116 79 57 171 189 112 228 259 25 103 -102
648589 -102 91 46 -3 85 98 -41 127 -7 43 -25 179 89 57 76 114 154 -154 193 178 147 356 -26 67 -7
650052 -7 135 51 452 225 90 112 50 -54 282 85 -110 -87 123 150 252 150 27 96 59 96 244 149 172
$$ packed form
640162A37J73j40P1L8M2j80kR3l14M22o0m10M08k23J60j27K1J68k04M2L19k11
641511B23n8Q6K3j40K9Q2K0k06j17J59j77L40k44J76J62p4p4L2KN7k9j12j49L6
642974D7L1N6o9J44l4j12J59k44J69J02k65L03l1J4k63r5K03r0K12K30l36q9L80
644375D22m38rJ77N4P1l7k13M63n11L61l37L90j77j13P4j68K14k39K90k86k7L33
645716B94k51J20J10j10l2J1N6n4O2mN1j66k22L78m21L66k51K23k23L7K32j37
647065F9k57L71k00J60j4N3Ll3P4j88P7k95L99q7j6l7k2J14J8p7J16L1k34P8k05
648589a02J93m5m9Q8J3j39J68j34N0o8K04r0l2J9L8M0l08L47j5l1K09l82R3p4
650052gJ42q4M01k27j35K2o2j04L36j97j95K3K10K7J02j02j23O9l7L7J48r5K3
$$ plain form
651455 172 -29 -137 -47 20 161 -70 181 221 -36 37 -47 87 272 226 283 68 157 229 18 157 34 161
652802 161 23 132 2 -48 91 68 178 46 136 285 210 113 -84 59 114 156 229 -17 283 94 -20 -58
654143 -58 -134 77 -7 -101 97 62 44 -129 168 272 144 165 -128 15 56 2 207 64 152 57 54 126 -73 242
655606 242 -14 64 -164 -15 5 76 151 171 105 51 -109 194 55 30 -251 294 179 -158 141 197 159 49 0
657008 0 117 -92 112 263 78 -101 -6 -105 -23 -76 313 200 50 -57 174 146 90 105 -7 46 96 146 164 -47
658479 -47 63 129 234 -95 46 252 -151 164 300 -142 202 185 143 41 -34 301 132 22 -16 252 147
659758 147 79 -88 386 4 -51 -64 45 257 39 -87 -45 25 47 113 -126 68 93 272 20 -46 251 -9
661099 -9 -62 -82 147 82 78 -12 -129 82 21 354 288 -74 240 171 137 231 183 -311 -67 -80 -73 -42 143 -129 49
$$ packed form
651455A72k01j08R0O7J41k31K51M0k57P3q4J34J85m6N7k15Q9P2k11J39j23J27
652802A61j38J09j30n0J39k3J10j32R0J49p5r7j97J43N5M2P3k46L00j89j14l8
654143e8p6K11q4r4J98l5j8j73K97J04j28K1k93J43M1n4K05j43Q8r5lP2j99L15
655606B42k56P8k28J49K0P1P5K0o6n4j60L03j39k5k81N45j15l37K99N6l8j10m9
657008@J17k09K04J51j85j79R5r9Q2n3L89j13j50j07K31k8n6J5j12N3N0N0J8k11
658479d7J10O6J05l29J41K06m03L15J36m42L44j7m2j02p5L35j69j10l8K68j05
659758A47o8j67M74l82n5j3J09K12k18j26M2P0K2O6k39J94K5J79k52o6K97k60
661099in3k0K29o5mr0j17K11o1L33o6l62L14o9l4R4m8m94K44j3PL1J85k72J78
$$ plain form
662631 49 181 316 61 -67 -34 -11 298 -46 139 -284 180 -102 26 29 -223 -43 -230 -249 102 -156 -49
663911 -49 34 70 53 -98 -62 -186 -70 -174 -254 -51 99 2 127 157 -33 153 88 59 -45 250 -50 38 -29
665313 -29 -23 -18 -43 193 70 61 -89 -32 -45 -44 256 22 -105 209 -82 54 -13 272 -146 70 -82 -108 -234 91
666776 91 -74 152 -32 -238 -3 146 114 14 2 47 -36 63 -154 -31 235 251 212 -222 29 -275 198 105
668123 105 -329 66 -154 129 -80 -43 -95 -43 70 146 29 55 -152 32 164 75 56 -59 -23 -46 -179 -180 -72
669526 -72 -321 -298 -8 153 -174 26 -48 28 -214 -52 -142 192 -113 -51 -61 178 3 -115 212 -99 -74 -18
670867 -18 73 -86 -80 98 36 75 -86 207 -292 -76 144 152 -1 153 35 -19 -182 87 138 99 51 53 -141 -76
672330 -76 21 51 -39 121 63 67 98 31 -104 11 71 -46 42 -195 -1 26 -209 213 -73 -29 -90 121 33 10 -62
$$ packed form
662631D9J32J35k55j28L3K3L09l44J85m23M64k82J28Lk52J80j87j9L51k58J07
663911d9Q3L6j7j51L6j24J16j04q0K03J50r7J25L0j90J86o5k9j04K95l00Q8o7
665313b9ONk5K36j23rj50N7j3JL00k34j27L14k91J36o7K85m18K16j52k6j26L25
666776I1j65K26j84k06K35J49l2j00j2M5q3R9k17J23K66J6l9m34K51l04M73r3
668123A05m34L95k20K83k09L7n2N2J13P6j17K6k07J84J32q9j9j15L6k3j33jJ08
669526g2k49K3K90J61l27K00p4P6k42J62r0L34l05O2j0K39j75j18L27l11K5N6
670867a8R1j59OJ78o2L9j61K93m99K16K20Qj53J54j18n4j63K69N1l9m8Kj94O5
672330g6R7L0r0J60n8ML1o7j35J15O0j17Q8k37J94K7k35M22k86M4o1K11q8k3p2
$$ plain form
673862 -62 -81 70 -12 22 72 40 -78 -129 -156 118 55 -268 61 -106 -53 -70 201 -142 77 87 84 69 -4 66 -98
675386 -98 201 -71 -13 76 77 -298 -92 -322 113 -161 -218 -64 46 14 -1 199 -172 -105 -19 -150 -224 -46 -112
676788 -112 -105 -124 -146 68 28 33 19 -72 134 104 -22 136 -38 -72 -126 -151 -136 45 52 -88 64 -219 242 -269 -114
678312 -114 124 -69 119 145 -28 242 -81 -183 361 104 -175 62 91 -80 26 -9 -317 9 -66 -58 60
679593 60 -250 -113 -35 109 7 -48 41 -87 40 105 225 -59 -52 11 -62 -107 -294 -208 -250 -8 -85 -24 -35 -132 -192
681124 -192 -180 -36 -88 32 184 -55 -191 -14 -72 89 105 26 -118 123 24 193 -344 -116 -172 148 -130 -208
682464 -208 272 -47 34 -73 87 -5 -49 13 -214 61 155 165 29 -106 158 236 -156 -67 -30 67 -51 122 174
683866 174 264 19 28 -35 62 -160 -4 127 31 -61 -161 -114 125 -51 -156 -221 -190 -199 25 -137 -19 -121 -61 208
$$ packed form
673862f2j9J51q2L4N0l2j18n1k7K74o3l23L29j67N3j7K71l43K19J0lj5p3P0j64
675386i8K99k72N8Q9Jl75K06k30M35k74n7J54J10l2j5K00l71O7Q6j31p4J78o6
676788a12Pj9k2K14m0Nj4r1K06l0j26J58j74l4n4k5J5J81Pj40J52k83M61n11J55
678312a14K38j93J88K6j73K70l23j02N44k57k79K37K9j71J06l5l08L26p5QJ18
679593F0l10J37P8J44j02n5Q9j28J27O5J20k84PO3p3m5j87Q6m2K42p7O1j1r7o0
681124a92J2J44n2J20J52k39j36J77n8J61J6p9j44K41r9J69n37K28n6L20k78p8
682464b08M80l19Q1j07J60r2m4O2k27K75R4J0j36j35K64P8l92Q9L7R7j18J73N2
683866A74R0k45Ro3R7k22J56J31r6r2j00M7K39j76j05o5L1rK24j62J18j02O0K69
$$ plain form
685337 208 72 -182 18 -42 11 -64 47 -22 25 -31 -28 -169 -87 40 143 82 130 -125 -87 83 -46 -126 9 -75
686800 -75 23 -119 -61 -124 -103 -27 70 -8 -80 0 -205 -126 -8 27 -237 -75 149 -175 -20 34 14 8 -120 -305 -39
688324 -39 89 -73 185 66 -266 -239 -168 -121 -107 57 136 -277 -164 66 8 -312 -21 -59 27 -11 -214 -159 -218
689727 -218 -211 -98 -119 -47 -25 -88 -209 -30 3 -96 -90 -68 -299 -146 25 -147 -44 134 164 -14 -28 -99 79 -262
691190 -262 -132 -150 -57 -228 -143 -327 -111 -190 -155 -159 22 -315 -105 -67 -121 50 3 -175 -173 192 -144 -124 -60 -132
692661 -132 90 -119 -136 -110 -144 -276 -157 -98 -124 29 134 -88 -296 9 9 46 -107 -187 -229 -60 -119 41 -22
694063 -22 45 -154 4 -45 -69 -80 -112 -145 -241 -173 -162 52 -226 -293 -44 74 7 -33 -13 -307 -165 -32 -236 -245 -78
695587 -78 61 -117 34 -245 0 -81 141 -276 -9 26 -89 -202 -273 30 160 132 83 -182 -140 -116 1 -76
$$ packed form
685337B08j36k54K00o0N3p5J11o9M7n6Lj41Q2J27J03o1M8k55L8J70j29q0J35q4
686800g5R8j42N8o3K1P6R7p8p2Q0k05P9J18L5k64J62K24l24J55N4k0oj28j85K66
688324c9J28j62K58j19l32K7P1M7J4J64P9m13J13K30n8l20K91l8Q6l8k03N5n9
689727b18PJ13k1P2K2o3j21J79L3r9OK2k31J53J71j72J03J78L0j78j4p1J78l41
691190b62J30j8R3j71Q5j84K16p9L5mJ81l37K10L8n4J71m7j78KL65l36K0O4p2
692661a32K22k09j7K6l4j32J19N9k6J53J05k22k08L05%L7j53q0m2J69n9J60o3
694063b2O7j99J58m9k4j1l2l3r6O8J1K14k78o7K49J18o7m0K0k94J42J33k04rJ67
695587g8J39j78J51k79K45q1K22m17K67L5j15j13p1L03J30k8m9k65M2K4J17p7
$$ plain form
696928 -76 -32 -12 -130 -169 -104 3 190 60 -37 -101 -167 -34 26 11 59 -103 -128 -30 -95 -200 -62 10 -144 -228 -78
698460 -78 -79 -254 -12 -68 -271 -122 22 18 205 -209 -155 138 -43 -53 23 -361 -144 -215 -116 -82 -36 -126 -136 21
699923 21 61 -187 38 -217 -73 -264 -195 -233 39 -449 -160 -126 -18 130 134 -133 18 -213 -242 18 -108 -126
701264 -126 -45 56 165 -135 164 -72 30 6 -243 -49 140 -191 -52 -87 -288 -67 -173 -71 -250 -139
702482 -139 97 -155 200 75 83 -229 -65 -130 -176 -122 -155 -54 -126 -122 -101 311 -59 294 361 -496 -323 -348 -320 -226
703953 -226 -337 -233 -219 -193 -73 153 66 -399 -216 -109 -142 -219 -188 -141 -422 -266 -321 249 -229 -154 -19 -60 -211
705355 -211 5 -125 -186 -133 -247 -65 -218 -131 -67 -64 -73 -328 -191 -90 -180 -48 -48 -7 -145 -79 -78 -76 -165 -142 -20 15
706940 15 -47 -188 31 -47 -216 -70 -27 -149 -23 -109 -373 4 14 -125 -77 -104 -253 164 -206 -61 -426 -243
$$ packed form
696928g6M4K0j18l9O5J07J87j30r7o4o6J33O0j5M8j62k5R8o5j05J38P2j54q4J50
698460g8jj75K42n6k03J49J44mJ87m14N4K93j81j0P6l84K17p1R9L4M6r0j0J57
699923B1M0k48K25k55J44j91O9l8K72m88K89L4J08J48Mk67J51k31k9K60j26j8
701264a26Q1J01J09l00K99k36J02k4k49J94J89l31J39l5k01K21j06J02j79J11
702482a39K36k52L55j25Ql12J64o5m6N4l3J01p2MK1M12l70L53O7q57J73k5K8R4
703953b26j11J04J4K6J20K26q7m65J83J07l3p7L1M7k81J56n5N70m78P5J35m1j51
705355b11K16j30o1N3j14J82j53Q7O4Lrk55J37J01r0J32%M1j38O6JKq9K3J22L5
706940A5o2j41K19p8j69J46M3j22J26q6k64L77J0j39M8k7j49M17l70J45l65J83
$$ plain form
708281 -243 -232 -243 -239 -216 -165 23 -63 -158 -47 -219 -73 9 -114 -297 -266 -30 -161 -304 -326 -251 -76 -351 -198
709691 -198 -199 -141 -186 99 135 -439 -37 -256 -204 -42 -174 -113 -334 174 56 21 -54 8 -105 -28 -268 83 -94
711093 -94 244 -71 -17 -69 23 -246 -36 -77 -31 -59 4 73 4 -110 -204 -119 -64 101 18 140 -31 -95 -163 -173 187
712617 187 -198 198 -98 -108 -257 -233 37 -56 15 84 61 -41 -304 189 -149 -141 -91 -262 -111 -28 47 15 -112
714020 -112 -180 -113 -98 -396 93 -113 -148 15 -248 -125 -202 96 -129 67 -11 -248 -153 -221 142 -104 -136 -4
715367 -4 -91 -133 -179 -93 -31 113 -260 -227 -75 85 18 -286 -156 -224 -134 -211 -234 128 101 -71 -46 -9 -49 -283 -180
716891 -180 -82 -3 -48 -3 -204 -197 -24 -174 -86 -152 -44 -81 5 -257 -88 -117 -86 -370 -88 5 54 49 -298 -145 -152
718417 -152 -209 -134 -40 -226 -54 -66 -163 -3 -272 -127 25 -373 40 -286 -138 -331 -201 -90 55 -309 -306 -32
$$ packed form
708281b43J1j1MK3N1J88q6r5J11j72J46Q2j23j83L1K36j31j43k2P5J75k75J53
709691a98jN8m5K85L6n74M02k19N2J62j32O1k21N08j18l5p5O2j13P7k40L51j77
711093i4L38l15N4n2R2k69K10m1M6k8O3O9o9j14r4Q5N5J65q3J22j71o4o8j0L60
712617A87l85L96k96j0j49K4K70r3P1O9k3j02k63M93l38QN0j71J51Q3P5l2j27
714020a12o8O7J5k98M89k06l5J63k63J23p7K98k25J96p8k37R5o8L63k46l2J32
715367dq7m2m6Q6O2J44l73L3J52J60o7l04J30o8R0p7k3L62k7j72K5L7m0k34J03
716891a80R8P9m5M5k01PJ73j50Q8o6J08l7Q6k62J69k9L1k84K82R3M9nl47J53p
718417a52n7P5R4j86J72j2r7J60k69J45J52l98M13l26J48j93J30J11J45l64LK74
$$ plain form
719757 -32 -25 -118 -175 -253 4 -180 -60 -145 -188 -7 -17 -85 -239 -6 98 -111 -301 142 -104 -220 -42 -24 -106
721166 -106 -233 -28 -143 -196 -61 -82 -325 -141 25 -250 -112 -120 -292 -38 -203 -100 -197 -187 60 -108 -214
722446 -214 -196 -190 195 119 27 -209 -192 -152 -4 -191 -350 -133 -186 -219 -35 -4 -133 -322 -334 -322 -137 -279 -222 -41
723910 -41 11 -6 140 3 -233 -160 299 100 -536 -290 -121 -215 -100 -221 -71 -157 -181 -175 -357 17 -98 -199
725249 -199 -151 -115 -256 -83 -131 16 76 -327 -141 63 -183 -239 -287 -131 -87 -471 -132 -178 70 -101 -550 -155
726598 -155 -255 -153 -208 -209 -178 16 27 16 -283 -221 -325 -99 -122 -13 -132 -80 -161 -122 19 150 -102 -101 -340 -90
728061 -90 79 -79 -376 -49 -266 -286 -53 -265 -137 -135 -213 -196 183 -90 -22 -222 -58 -272 -81 -206 -439 230
729402 230 -224 -82 240 -57 -64 -102 -219 -360 27 43 -31 -156 -125 -38 -194 -326 -181 -15 131 -151 -269 77
$$ packed form
719757c2Pr3n7p8K57j84J20q5m3J81j0o8j54K33J04k09j90M43k46j16J78J8q2
721166a06j27K05j15n3J35k1k43J84J66k75J38qj72K54j65J03r7J0K47j68j06
722446b14J8OL85p6r2k36J7M0J48j87j59K17n3l3J84L1j29j89j2J2J85j42N7J81
723910d1N2j7J46j37k36P3M59j99o36K46J69r4J15j21J50q6k4Oj82L74j15j01
725249a99M8L6j41J73m8J47O0m03J86K04k46n6m8J56M4l84L39m6K48j71m49L95
726598a55j00J02n5jL1J94J1j1k99O2j04K26k3J09j19N2q1L9J41J31k52Jk39K50
728061i0J69j58k97L27k17k0K33k12J28Kp8J7L79k73O8k00J64k14J91j25k33O69
729402B30m54J42L22k97pl8j17j41L87J6p4j25L1Q7j56j32J45J66J46k82j18L46
$$ plain form
730750 77 -201 -429 -263 5 61 -278 -169 -85 -132 -509 -317 -329 -230 -458 18 -103 -94 -139 -16 3 -246 -118 -181
732152 -181 -53 -62 -34 -348 -247 -334 -135 -195 -342 -170 -153 -341 -152 -223 -32 29 -115 -111 -142 -115 -339 -437 -164 -32
733615 -32 -261 -196 -290 -299 -44 -226 -240 -153 -144 -259 -24 -139 -181 -155 -80 -230 34 -190 -51 -382 -310 -128 -166 -151
735078 -151 -144 2 -59 -20 -333 -18 -210 138 -265 -100 -71 -39 -225 -71 -63 -140 114 -70 -253 -38 -301 -185
736427 -185 -318 -49 -352 38 -189 141 -236 -228 -315 -320 -453 -201 15 -44 -205 -73 -395 -75 113 -173 -240 -212
737767 -212 -137 158 -343 -227 -221 28 -323 -118 -264 -228 -232 175 -355 -475 -285 -141 -68 -228 -508 -135 88 -81
739108 -81 -293 -68 219 -58 -455 -214 4 -306 -189 -206 -303 -185 -218 70 22 -140 -164 -73 -262 -208 -290 -37
740449 -37 -173 360 27 -134 -299 -106 -342 -233 -16 -43 -90 -109 -202 -230 -361 -222 -265 -163 -130 -98 -249 -323 -53
$$ packed form
730750G7k78k28J66K68N6l39J09Q4m7l77J92j2R9k28M76j21Rm5J23J9k49J28o3
732152a81J28rK8l14J01q7J99o0j47J72J7j88J89p1J91O1j44Ml1K7k24r8K73J32
733615c2k29O5r4rK55j82j4Q7Rj15K35j15m2K6P5j50K64k24J39l31P2J82l8J5
735078a51PJ46o1L9l13L15j92L48m03J65K9L2j86J54Qp7K54j84j83K15k63J16
736427a85j33K69l03L90k27L30l77Qq7nj33K52K16n9j61J32l22L20J88k86o7K8
737767b12P5K95n01J16OK49l51K05j46L6mM07n30j20J90J44P3j60k80L73K23j69
739108h1k12K25K87k77l97K41K18l10J17j7r7J18l3K88m8j62k4R1j89N4q2K53
740449c7j36N33l33j61j65J93k36J09K17k7m7j9r3k8j31J39m3J02L3L2j51p4K70
$$ plain form
741859 -53 -326 -33 -278 -192 -199 -253 -140 -247 -360 -273 -161 -106 -224 -49 -319 -245 -236 -280 -428 -231 -374 -72 -297
743259 -297 -217 -263 -208 -108 -36 -304 -157 42 -184 -274 -239 -244 -395 -35 -184 39 -198 -286 -538 -204 -275 -307 -29
744661 -29 -199 -190 -310 -290 -209 -133 -166 -207 -55 -110 -21 -233 -6 -258 -224 -280 -90 124 -361 -193 -202 -324 -99 -421
746125 -421 -54 -247 -175 -285 -122 -232 5 -215 -220 -140 -134 -69 -14 -252 16 -67 -56 -426 -70 -324 -101 -163 -116
747534 -116 -406 -147 -385 -164 -200 -186 -200 -47 -164 -175 -198 116 -152 -139 -144 -230 99 -180 -195 -205 35 11 -197
748937 -197 -106 -227 -182 -112 -382 -216 -112 317 -105 -188 -52 -125 -40 -87 -294 -443 15 -109 -90 -346 -209 -28
750278 -28 -242 -200 -83 -96 -214 -37 -187 -302 -247 -214 -222 -209 -226 -74 -288 53 -130 -64 -197 -51 -326 -130 -47
751686 -47 -56 -175 -346 -303 -291 -32 83 -109 -443 -350 -282 -416 -304 -154 -94 -98 -262 -77 -192 -183 -332 -285 -352 -239
$$ packed form
741859e3k73K93k45Q6pn4J13j07j13Q7J12N5j18J75k70P4Rm4j48J97j43L02k25
743259b97Q0m6N5J00P2k68J47J99k26r0L5nj51L60j49K23k37q8k52L34p1l2K78
744661b9j70Rj20K0Q1P6l3m1J52n5Q9k12K27k52L4n6J90K14m85J68rj22K25l22
746125d21L67j93P2j10J63j10K37k20nQ0OO5N5k38K68q3J1l70L56k54K23o2M7
747534a16k90K59k38K21l6J4j4J53j17j1k3L14k68J3nq6L29k79j5j0K40k4k08
748937a97R1j21M5P0k70J66J04M29m22q3J36p3Q5m7k07j49M58j24J9k56J37J81
750278b8k14M2J17j3j18J77j50j15N5L3qJ3j7J52k14L41j83O6j33J46k75J96Q3
751686d7rj19j71M3J2K59J15j92l34R3O8j34J12J50O0mj64J85j15Rj49M7o7J13
$$ plain form
753149 -239 -372 -54 -95 -247 -288 -157 -359 -250 -140 29 -371 -67 -330 -277 -332 -241 -309 -115 -216 -266 -115 -169
754490 -169 -219 -319 -459 -249 -450 -177 -253 -101 -146 -84 -73 -273 -191 -121 -180 -244 -122 -47 -410 -372 -582 -264 3
755893 3 -7 -98 -261 -6 -41 -184 -359 -230 -244 -67 -100 -161 107 -111 -130 -202 -228 -309 -48 -381 -200 -13 -150
757295 -150 -8 -172 -476 -58 67 -323 -412 -328 -252 -382 -234 -373 -11 -214 -124 -252 -269 -328 -183 -280 -213 -251
758642 -251 -348 53 -10 -305 -249 -176 -143 -143 -250 -339 -365 -276 -410 -282 -240 -201 -388 -21 -194 -277 -238 -171 17 -253
760105 -253 -396 -180 -204 -478 -71 -93 -94 -375 -386 -288 -239 -134 -321 -36 -358 -5 -143 -6 -345 -303 -101 -308
761446 -308 53 -311 27 -231 -403 -268 -93 -65 -371 -277 -235 -237 -367 -615 -263 -256 -387 -439 -176 51 -294 -344
762795 -344 -196 -290 -171 125 -140 -202 -257 -179 -226 -99 -64 -194 -281 -322 -176 -291 -273 -202 -39 -190 -280 -228 -167 -252
$$ packed form
753149b39j33L18m1j52m1J31k02J09J10J69m00L04k63N3n5R1o8J94j01n0J51n4
754490a69n0j00j40K10k01K73p6J52m5O2J1k00Q2P0n9o4J22P5l63L8k10L18K67
755893Cj0r1j63K55l5j43j75J29j4J77l3o1K68k18j9p2k6q1K61l33J81J87j37
757295a50J42j64l04M18J25l90q9Q4P6j30J48j39L62k03R0j28j7n9J45r7O7l8
758642b51r7M01o3k95N6P3L3%j07q9k6Q9j34J28M2L9j87L67j73q3L9O7J88k70
760105b53j43K16k4k74M07k2jk81j1R8M9J05j87K85l22L53j38J37l39M2K02k07
761446c08L61l64L38k58j72J35J75K8l06R4M2kj30k48L52Pj31n2K63K27l45n0
762795c44J48r4J19K96k65o2n5P8m7J27L5j30q7m1J46j15J8P1J63j51r0N2O1q5
$$ plain form
764258 -252 -348 -315 -335 -156 67 -159 -167 -153 -198 -173 -334 -61 -75 -529 9 -98 -332 -380 -289 -246 102 -194 -409
765660 -409 -598 -404 25 -468 -251 -435 -326 -94 -322 -326 -80 -103 -221 -285 -103 -183 -287 -189 -184 -418 -192 36
767000 36 -343 -218 -395 -341 -415 -336 -283 -14 -261 -287 -266 -52 206 -229 -266 -399 -112 -312 -270 -145 -204 -79 -325
768410 -325 -158 -110 -111 -164 -346 -227 -327 -274 -390 -175 -156 -259 -170 -245 -5 -184 -462 -250 -71 -179 -328 84
769751 84 -79 -277 -425 -177 -19 26 -550 -178 -90 6 -33 -331 -337 -54 -328 -205 -123 -228 -446 -285 -303 -348 -415
771153 -415 -269 -261 -311 -266 -371 -140 -395 -345 -241 -128 -260 -118 -227 -499 -247 -155 -57 -86 -203 -188 -260 -98 -337
772561 -337 -125 -300 -128 -168 -87 -300 -334 -156 -107 -12 -268 -2 -130 -399 -210 -207 -39 -153 -165 -300 -254 -252 -443
773964 -443 -301 -298 -424 -266 -334 -162 -383 -363 -444 -123 -235 -177 -251 -156 -258 -280 -214 -124 -273 -147 -392 -276 -270 -249
$$ packed form
764258b52r6L3k0J79K23k26qJ4m5K5j61K73j4m54N38j07k34m8R1M3L48k96k15
765660d09j89J94M29m93K17j84J09K32k28mK46k3j18o4J82q0j04R8Nk34K26K28
767000C6l79J25j77N4p4P9N3K69k47k6K1K14K58m35l7j33K87k00M2J25n9J25k46
768410c25J67M8jn3j82J19j00N3j16K15J9j03Q9p5K40j79k78K12J79j08j49M12
769751H4j63j98j48K48J58M5n76L72Q8R6l9k98oK83k74J23Q2j05k18J61j8m5o7
771153d15J46Qn0M5j05K31k55N0J04J13j32J42j09k72K52R2R8k9j17J5p2J62k39
772561c37K12j75J72m0Q1k13l4J78M9R5k56K66j28k69J89LJ68j14j2j35M6Kj91
773964d43J42Lj26J58o8J72k21K0q1L21j12N8p4R5j02k2O6R0j49J26k45J16OK1
$$ plain form
775427 -249 -201 -318 -426 -304 -180 -198 37 -329 -77 -314 -403 -235 -94 -371 -373 -205 -281 -436 -313 -174 4
776707 4 -332 -180 -467 -34 -211 -395 -222 -108 -568 -230 -229 -271 -160 -293 -212 -433 -305 -193 -296 -281 -313 -136
778054 -136 -408 -337 -249 -341 -287 -142 -320 -346 -303 -204 -490 -474 -224 -302 -241 -380 -407 -242 -149 -254 217 -334 -518
779456 -518 -224 -351 -167 -155 -554 -319 -486 -168 -306 -213 -219 -329 -333 -431 -263 -309 -198 -291 -97 -314 -240 -297 78
780858 78 -107 46 -128 -382 -79 -198 -260 -197 -196 -143 -332 -163 7 -216 -414 -232 -470 -110 -61 8 -185 -432
782200 -432 -283 -484 -347 -406 -46 -343 -263 -368 -14 -313 -433 -382 41 -400 -137 -178 -155 -119 -33 -362 -235 -176
783547 -176 -160 -339 -350 -137 -116 -265 -259 -265 -213 -225 -264 -229 -330 -118 -87 -338 -137 -317 -367 -241 -387 -253 -130 -252
785010 -252 -372 -243 -514 -184 -147 -449 -169 -263 -88 -373 -324 -115 -313 -205 -354 -232 -112 -161 -226 0 14
$$ packed form
775427b49M8j17j08J22J24j8K35l66K52k37q9J68J41k77kJ68p6j55J23J39J78
776707Dl36J52k87M33j77j84J73J14m60L38Jm2J11j33Q1k21J28J12j03J5l2J77
778054a36k72P1Q8r2N4J45j78k6M3R9k86J6K50p8O1j39k7J65R3j05M71n51j84
779456e18K94j27J84J2l99K35j67L18j38R3oj10mr8J68m6J11r3J94k17P4n7L75
780858G8j85J53j74k54L03j19o2O3JN3j89J69J70k23j98J82k38L60M9O9j93k47
782200d32J49k01J37n9L60k97Q0j05L54k99j20N1M23m41K63m1K3L6Q6l29J27N9
783547a76J6j79j1K13K1j49OoN2j2l9L5j01K12L1k51K01j80n0J26j46J34J23j22
785010b52j20J29k71L30L7l02K80r4J75k85M9K09j98J08j49J22J20m9o5K26J4
$$ plain form
786290 14 -123 -154 -6 -187 -163 -186 -379 -125 -159 -281 -156 -315 -146 -345 -460 -363 -341 -449 -194 -364 -301 -162
787631 -162 -87 5 -171 -347 -555 -288 -198 -409 -214 -464 -251 -455 -148 -358 -219 -298 -405 -19 -79 -303 -109
788917 -109 -276 -383 -460 -417 -329 -316 -122 -392 -261 -195 -177 -229 -26 -171 -316 -127 -230 -121 -284 -191 -173 -544
790259 -544 -465 -175 -161 -416 -139 -144 -240 -105 -264 -400 -448 -158 -186 -219 -369 -395 -408 -288 -461 -364 -285 -57 -456
791661 -456 -380 -7 -369 -199 -180 -404 -482 -273 -352 -297 -309 -272 -337 -197 -376 -188 -191 -269 -388 -438 -172 25 -271
793069 -271 -319 -265 -305 -182 -368 -369 -376 -174 -400 -142 -370 -76 -428 -207 -212 -142 -495 -420 -220 -152 -171 -351 -153 -82
794532 -82 -9 -261 -531 -78 -131 -278 -190 -394 -342 -266 -257 -162 -315 -493 -317 -271 -232 -374 -277 -368 -211 -327 -244 -473
795996 -473 -161 -523 -184 -363 -209 -264 -270 -388 -345 -262 -171 -277 -125 -193 -376 -64 -449 -367 -232 -296 -195 -225 -331
$$ packed form
786290A4j37l1J48j81K4k3j93K54l4j22J25j59J69j99j15R7K2j08K55j70O3J39
787631a62P5R2j76j76k08K67R0k11J95k50K13k04L07k10J39p9j07L86o0k24J94
788917a09j67j07p7M3Q8J3J94k70J31O6J8n2K03j45j45J89j03J09j63R3J8l71
790259e44P9K90J4k55K77nr6J35j59j36m8K90k8l3j50k6j3J20j73R7P9K28l99
791661d56P6L73l62J70J9k24p8K09p9N5j2L7o5J40j79J88lp8j19n0K66J97k96
793069b71m8N4m0J23j86jpK02k26K58k28K94l52K21nP0l53P5K00O8j9j80J98P1
794532h2P3k52k70M53n3j47Q8k04N2P6RR5j53j78J76M6L9j42R7r1J57j16Q3k29
795996d73L12l62L39j79J54n5oj18M3Q3R1j06J52o8j83L12l85Q2J35o4J01l0j06
$$ plain form
797398 -331 -169 -230 -398 -230 -176 -174 -133 -236 -184 -166 -57 -328 -212 -264 -197 -224 -81 -526 -440 -217 -227 -164 -427 -425
798868 -425 -405 -287 -100 -308 -221 -342 -370 -310 -581 -402 -263 -126 -308 -344 -119 -227 -335 -297 -248 -613 -340 -148
800210 -148 -95 -442 -352 -456 -270 -261 -289 -205 -228 -125 -265 -184 -329 -301 -724 -362 -233 -124 -275 -504 -246 -411
801551 -411 -328 -362 -236 -159 -516 -372 -77 -215 -380 -308 -158 -258 -252 -425 -178 -76 -57 -242 -231 -179 -343 -181
802898 -181 -360 -277 -201 -393 -316 -221 -268 -309 -319 -310 -229 -289 -367 -290 -455 -196 -238 -337 -152 -444 -222 -181 -179 -173 -351 -327
804485 -327 -294 1 -155 48 -328 -486 -430 -312 -65 -341 -303 -236 -319 -324 -202 -260 -139 -402 -256 -186 -213 -223 -177
805885 -177 15 -387 -194 -502 -240 -277 -318 -455 -190 -246 -172 -238 147 -388 -274 -136 -337 -268 -336 -383 -233 -309
807227 -309 -117 -185 -221 -96 -66 -380 -281 -252 -373 -311 -105 -385 -128 -153 -412 -292 -282 -236 -194 -98 55 -172 -230
$$ packed form
797398c31J62o1j68J68N4KM1j03N2J8J09k71J16n2O7k7J43m45Q6K23j0O3k63K
798868d25K0J18J87k08Q7j21k8O0k71J79J39J37j82l6K25j08j08L8M9l65K73J92
800210a48N3l47R0j04J86Rk8Q4k3J03j40Q1j45K8m23L62J29J09j51k29K58j65
801551d11Q3l4J26P7l57J44K95j38j65P2J50j00Oj73K47J02J9j85J1N2j64J62
802898a81j79Q3P6j92P7R5m7m1j0RQ1o0p8P7j65K59m2r9J85k92K22M1KOj78K4
804485c27L3K95j56K03l76j58N6J18K47k76L8O7q3nJ22n8J21k63J46P0k7j0M6
805885a77J92m02J93l08K62l7m1j37K65n6P4o6L85n35J14J38k01O9o8m7J50p6
807227c09J92o8l6J25L0l14R9K9j21O2K06k80K57k5k59J20J0M6M2R6J53k27n8
$$ plain form
808629 -230 -357 -370 -347 -243 -133 -212 -178 -141 -233 -70 -375 -343 -212 -303 -127 -315 -137 -279 -180 -271 -202 -204 -441 15
810099 15 -270 -367 -141 -185 -228 -307 -518 -239 -256 -273 -239 -307 -286 -321 -84 -485 -116 -336 -156 -228 -272 -115 -428 -236
811563 -236 -362 -204 -365 -281 -264 -324 -243 -324 -339 -144 -169 -399 -503 -201 -235 -213 -318 -386 -330 -222 -227 -538 -433 -169
813026 -169 -463 -109 -306 -330 -199 -326 -271 -71 -212 -189 -337 -434 -312 -331 -218 -135 7 -290 -111 -321 -250 -384
814367 -384 -203 -187 -56 -227 -372 -156 -79 -295 -663 -393 -425 -216 -315 -252 8 -145 -175 -356 -274 -239 -108 -250
815714 -250 -107 -361 -359 -488 -198 -384 -320 -245 -321 -177 -241 -413 -347 -307 -262 -272 -419 -383 -250 -171 -344 -339 -350 -107
817178 -107 -372 -140 -137 -186 -197 -504 -310 -230 -256 -372 -303 -476 -210 -442 -535 -471 -232 -545 -346 -237 -208 -195 -198 -386
818641 -386 -509 -499 -345 -119 -158 -162 -405 -184 -274 -193 -494 -266 -429 -361 -309 -340 -333 -326 -89 -386 -144 -198 -371 -160
$$ packed form
808629b30j27j3K3J04J10p9L4L7r2J63l05L2J31r1J76j88J78j42R9r1O9kk37M56
810099A5k85r7K26m4m3p9k11K79j7j7L4o8K1l5K37m01L69k20J80p2m4J57l13J92
811563b36j26J58j61Q4J7o0Q1q1j5J95k5k30j04L02l4K2j05o8N6J08nl11J05K64
813026a69k94L54j97k4J31j27N5K00j41K3j48r7J22j9J13Q3J42k97J79k10P1j34
814367c84J81J6J31j71j45K16P7k16l68K70l2K09r9O3K60j53l0j81Q2L5J31j42
815714b50J43k54Kj29K90j86O4P5p6J44o4j72O6M0M5j0j47L6J33P9j73Nj1K43
817178a07k65K32Lm9j1l07J94Q0k6j16O9j73K66k32r3O4K39l13J99J09K9J3lj88
818641c86j23J0J54K26l9mk43K21r0Q1l01K28j63O8N2l1PPK37k97K42n4j73K11
$$ plain form
820104 -160 -204 -272 -246 -404 -438 -165 -195 -221 -536 -457 -18 -269 -256 -207 -310 -249 -306 -490 -556 -322 -291 -376 -357 -479
821575 -479 -202 -144 -287 -170 -569 -135 -369 -230 -181 -296 -271 -247 -331 -306 -281 -566 -399 -263 -235 -251 -335 -200 -389
822977 -389 -530 -257 -353 -40 -297 -424 -474 -272 -407 -203 -294 -293 -475 -185 -383 -354 -472 -272 -311 -258 -394 -369
824318 -369 -347 -325 -137 -171 -208 -555 -340 -558 -234 -257 -466 -269 -287 -462 -289 -340 -124 -252 -441 -218 -359 -235
825665 -235 -187 -116 -216 -120 -264 -358 -132 -382 -495 -328 -146 -353 -172 -160 -278 -195 -536 -345 -376 -204 -250 -381
827006 -381 -287 -348 -67 -466 -312 -41 -345 -382 -73 -284 -158 -255 -369 -428 -372 -264 -269 -79 -102 -390 -217 -491
828348 -491 -485 -304 -319 -280 -352 -47 -190 -190 -229 -222 -253 -349 -364 -335 -315 -348 -302 -354 -308 -379 -189 -179 -274 -321 -407 -165 -262 -359
830055 -359 -236 -322 -406 -427 -228 -302 -291 -71 -306 -324 -138 -353 -222 -229 -444 -276 -321 -386 -537 10 -217 -116 -240
$$ packed form
820104a60m4o8K6j58l4K73l0k6l15P9M39k51J3M9j03O1n7j84o6K34L1q5J9j22
821575d79K77N8j43J17l99M34k34J39M9j15K5K4q4K5K5k85J67J36K8j6q4J35j89
822977c89j41K73r6L13k57j27n0K02j35K04r1Jj82K90j98K9j18K00l9N3j36K5
824318c69K2K2J88l4l7l47K15k18L24k3k09J97j8j75J73n1K16j28j89K23j41J24
825665b35M8P1j00R6j44r4K26k50j13J67J82k07J81J2j18Q3l41J91l1J72m6j31
827006c81R4o1K81l99J54K71l04l7L09k11J26r7j14n9N6J08nJ90k3k88J73k74
828348d91OJ81j5L9p2L05j43%l9Pl1r6j5K9K0l3M6n2M6p1J90J0r5m7q6K42r7r7
830055c59J23q6q4k1J99p4J1K20k35j8J86k15J31pk15J68m5o5j51N47k27J01j24
$$ plain form
831457 -240 -283 -315 -379 -346 -205 -243 -206 -440 -482 -383 -194 -265 -349 -230 -261 -449 -342 -373 -531 -139 -84 -387 -182 -294
832928 -294 -323 -303 -140 -464 -381 -282 -308 -274 -121 -289 -302 -350 -435 -288 -420 -188 -243 -169 -217 -380 -434 -417 -304 -352
834391 -352 -403 -365 -394 -256 -422 -377 -299 -256 -165 -301 -442 -335 -229 -223 -239 -571 -436 -394 -73 -507 -485 -503 -253 -320
835854 -320 -185 -232 -509 -219 -482 -238 -420 -438 -329 -254 -301 -278 -295 -563 -297 -200 -128 -205 -97 -201 -222 -414 -311
837257 -311 -415 -317 -197 -661 -465 -416 -313 -115 -427 -302 -411 -359 -259 -346 -400 -426 -534 -169 -282 -304 -463 -403
838605 -403 -191 -276 -144 -399 -550 10 -288 -277 -480 -546 -160 -305 -288 -344 -419 -298 -328 -595 -248 -287 -259 -280 -452
840007 -452 -250 -299 -206 -416 -337 -269 -211 -209 -414 -558 -220 -219 -137 -222 -391 -501 -396 -553 -99 -301 -191 -488 -241
841408 -241 -409 -193 -518 -340 -306 -207 -342 -258 -230 -255 -409 -308 -381 -170 -327 -296 -336 -340 -460 -316 -296 -242 -139
$$ packed form
831457b40m3l2o4L3J41l8L7k34m2R9J89p1q4J19l1j88J07l1j58L92N5l03K05j12
832928b94k9K0J63l24Q3R9k6L4J53j68j3m8q5J47j32K32n5P4m8j63n4J7J13m8
834391c52n1L8k9J38j66M5P8M3R1j36j41J07J06Oj6l32J35M2L21m34K2j8K50o7
835854c20J35m7k77K90k63K44j82j8J09P5m7K3j7k68K66R7P2p7J08j04k1j92J03
837257c11j04R8J20m64J96M9J03J98l12J25j09N2J00q7n4k6j08L65j13k2j59O0
838605d03K12q5J32k55j51N60k98J1k03o6L86j45J7n6p5J21l0k67L47l9K8k1j72
840007d52K02m9R3k10P9O8N8Kk05j44L38JQ2q5j69j10J05j57M54k02J10k97K47
841408b41j68K16l25J78L4R9j35Q4K8k5j54J01p3K11j57L1m0mj20J44K0N4J03
$$ plain form
842810 -139 -235 -258 -314 -319 -419 -302 -342 -321 -282 -188 -322 -296 -192 -303 -136 -197 -263 -164 -441 -275 -354 -639 -276 -180
844281 -180 -337 -453 -525 -384 -587 -283 -242 -242 -149 -461 -626 -301 -160 -179 -409 -527 -330 -523 -419 -342 -283 -398
845622 -398 -150 -355 -124 -373 -615 -374 -327 -401 -387 -246 -292 -382 -244 -389 -189 -529 -210 -307 -437 -494 -411 -220
846963 -220 -265 -306 -191 -514 -460 -227 -436 -309 -359 -584 -380 -230 -483 -156 -518 -360 -225 -481 -492 -343 -482
848249 -482 -387 -402 -444 -426 -381 -403 -325 -312 -217 -456 -291 -334 -465 -336 -419 -310 -317 -545 -405 -181 -409 -287 -573 -441
849713 -441 -327 -530 -336 -331 -375 -296 -431 -183 -327 -417 -199 -604 -207 -292 -585 -371 -522 -322 -171 -563 -310
850993 -310 -455 -317 -371 -242 -481 -339 -482 -469 -468 -237 -223 -230 -139 -436 -255 -286 -133 -481 -290 -247 -394 -439 -469
852394 -469 -591 -347 -410 -230 -269 -314 -231 -384 -322 -371 -517 -203 -480 -473 -516 -319 -371 -177 -501 -211 -520 -407 -333
$$ packed form
842810a39r6k3n6nj00J17m0K1L9R4j34K6J04j11J67o1o6R9k77J66p9k85L63R6
844281a80j57j16p2J41k03L04M1%R3l12j65L25J41j9k30j18J97j93J04P7N9j15
845622c98K48k05K31k49k42K41M7p4J4J41m6r0J38j45K00l40L19r7j30n7Q3J91
846963b20m5m1J15l23N4K33k09J27n0k25K04J50k53L27l62J58J35k56j1J49j39
848249d82R5j5m2J8M5k2P8J3R5k39J65m3j31J29q3J09pk28J40K24k28J22k86J32
849713d41J14k03J94Nm4P9j35K48j44r0K18m05L97q5k93K14j51K00J51l92K53
850993c10j45J38n4J29k39J42j43J3JK31J4pR1k97J81l1J53l48J91M3j47m5l0
852394d69j22K44o3J80l9m5Q3j53O2m9j46L14k77Pm3J97n2J94l24K90l09J13P4
$$ plain form
853803 -333 -137 -399 -216 -409 -458 -340 -173 -597 -425 -220 -623 -361 -441 -483 -243 -462 -421 -286 -178 -628 -217
855083 -217 -418 -546 -411 -365 -226 -364 -201 -621 -283 -399 -448 -495 -232 -239 -482 -513 -286 -579 -484 -441 -220 -47
856423 -47 -525 -268 -443 -520 -229 -186 -440 -452 -152 -604 -441 -339 -444 -690 -253 -544 -355 -318 -356 -501 -234
857711 -234 -313 -123 -257 -526 -337 -289 -280 -448 -258 -261 -136 -263 -375 -233 -727 -417 -124 -522 -412 -372 -164 -314
859052 -314 -365 -436 -303 -506 -304 -486 -566 -269 -408 -549 -431 -428 -161 -293 -318 -423 -290 -399 -415 -666 -111 -639
860392 -639 -232 -374 -556 -275 -192 -490 -108 -416 -336 -401 -400 -338 -489 -308 -164 -399 -488 -360 -397 -301 -14 -606
861733 -606 -373 -269 -240 -348 -318 -375 -129 -218 -344 -448 -236 -333 -116 -493 -312 -365 -275 -544 -537 -293 -522 -345
863081 -345 -461 -474 -197 -192 -577 -170 -416 -158 -442 -437 -459 -329 -295 -384 -253 -627 -84 -427 -432 -563 -613 -332 -306
$$ packed form
853803c33J96k62J83j93m9J18J67m24J72K05m03K62q0m2K40k19M1J35J08m50M11
855083b17k01j28J35M6J39j38J63m20L38j16m9m7K63pk43l1K27k93R5M3K21J73
856423d7m78K57j75p7K91M3k54j2L00m52J63J02j05k46M37k91J89L7l8j45K67
857711b34p9J90j34k69J89M8Rj68J90lJ25j27j12J42m94L10K93l98J10M0K08j50
859052c14n1p1J33k03K02j82q0K97j39j41J18LK67j32k5j05J33j09j6k51N55n28
860392f39M07j42j82K81Q3k98L82l08Q0o5JO2j51J81J44k35q9J28l7R6K87n92
861733f06K33J04K9j08L0n7K46q9j26j04K12r7K17l77J81n3R0k69PK44k29J77
863081c45j16j3K77Nl85M07k46K58k84Nk2J30L4q9J31l74N43l43nj31n0K81K6
$$ plain form
864482 -306 -564 -317 -456 -175 -405 -404 -343 -271 -428 -470 -450 -435 -260 -587 -232 -503 -366 -521 -478 -407 -520 -393
865823 -393 -514 -250 -149 -499 -306 -275 -157 -376 -301 -463 -336 -279 -485 -462 -283 -198 -335 -538 -99 530 -343
867111 -343 -671 -241 -295 -393 -294 -211 -174 -392 -606 -490 -487 -485 -458 -641 -353 -559 -91 -366 -618 -182 -507 -586 -471
868512 -471 -372 -342 -509 -363 -498 -266 -391 -439 -358 -565 -391 -407 -406 -452 -467 -469 -421 -329 -414 -444 -258 -206 -437 -271 -335
870037 -335 -596 -335 -293 -334 -417 -325 -408 -300 -541 -365 -417 -294 -285 -309 -332 -281 -376 -318 -358 -524 -363 -356 -477 -316 -602
871562 -602 -576 -320 -383 -294 -529 -447 -334 -448 -396 -321 -303 -452 -351 -419 -331 -444 -375 -311 -322 -428 -367 -518 -582 -268
873025 -268 -327 -416 -34 -464 -249 -519 -304 -398 -446 -460 -332 -322 -394 -359 -262 -433 -178 -206 -245 -498 -99 -452 -2
874434 -2 -523 -401 -452 -420 -406
$$ packed form
864482c06k58K47j39K81k30JO1P2j57m2K0J5J75l27L55k71J37j55M3P1j13J27
865823c93j21K64J01l50J93L1J18k19P5j62J27N7k06K3J79Q5j37k03M39O29q73
867111c43l28M30n4r8R9Q3L7k18k14J16LKK7j83K88k06M68k75k52M36l25p9J15
868512d71R9L0j67J46j35K32j25m8Q1k07J74j6Jm6j5kM8R2q5l0J86N2k31J66o4
870037c35k61K61M2m1q3R2q3J08k41J76n2J23Rk4k3N1r5N8m0j66J61Pj21J61k86
871562f02K6K56o3Q9k35Q2J13j14N2P5J8j49J01o8Q8j13O9O4j1j06O1j51o4L14
873025b68n9q9L82m30K15k70K15r4m8j4J28J0p2L5R7j71K55k8l9k53L99l53M50
874434bn21J22n1L2J4
##END=
