##TITLE=Unknown
##JCAMP-DX= 5.00 $$From Command Line Converter 1.0
##DATA TYPE= NMR Spectrum
##DATA CLASS=  XYDATA

##ORIGIN= Exported from Command Line Converter 1.0
##OWNER= SVB
##$URL= http://wwwchem.uwimona.edu.jm:1104/software/jcampdx.html
##SPECTROMETER/DATA SYSTEM= NUTS EXPORT
##.OBSERVE FREQUENCY= 300.149506
##.OBSERVE NUCLEUS= ^1H
##INSTRUMENTAL PARAMETERS= 1H
##XUNITS= PPM
##YUNITS= ARBITRARY UNITS
##XFACTOR= 0.0000019124
##YFACTOR= 1.7729580000
##FIRSTX=   1.100833
##FIRSTY= 23405.000000
##LASTX=   3.013200
##NPOINTS= 2352
##MAXY= 1757321.000000
##MINY= -15637.000000
##DELTAX=   0.000813
##XYDATA= (X++(Y..Y))
575628 13201 12818 13348 12900 13117 12578 12933 12759 12369 12243 12155 12499 12118 12119 12097 11915 11891 11518 11368 11309 11220 11302
584539 11302 11620 11397 10924 10976 10791 11037 11198 10971 10980 10659 10007 10256 10314 9945 10084 10467 10248 9865 9480 9826
593024 9826 9827 9625 9639 9335 9761 9379 9423 9120 9446 8911 9017 9003 9032 8831 9058 8482 9135 8600 8809 8236 8665
601997 8665 8464 8245 8295 7844 7957 7609 7796 7903 7905 7710 7859 8054 7562 7543 7265 7439 7837 7369 7275 6988 7114
610907 7114 7099 6889 6772 6978 7416 7070 6961 6948 6230 6778 6610 6874 5962 6053 6153 6189 6780 6690 5931 6319 6031
619828 6031 6257 5873 6058 5980 5727 5929 5667 5918 5347 5793 5733 6234 5589 5401 5473 5376 5702 5899 5048 5581
628365 5581 5442 5439 5127 5088 4705 5403 5250 4818 4798 4896 5129 4683 4803 5381 4805 4754 4810 4815 4773 4984 4944 4555 4141
638136 4141 4532 4376 4675 4405 4690 4163 4543 4459 3823 4561 4459 4889 4276 4084 4368 4107 4290 4420 4427 4079
646622 4079 4092 4177 4341 4304 4315 4461 3769 4443 3832 4304 3302 3967 3839 4035 3989 3692 3841 4004 4360 4535
655169 4535 3446 3817 4076 3839 4108 3645 4320 3869 3838 3324 3502 4053 3989 3681 3203 3740 3621 3284 3298 3498
663654 3498 3464 3232 3094 3110 2881 3091 3455 3223 3565 3156 3255 3366 3367 2856 3309 2951 3033 2603 2761 3257 3007
672575 3007 2609 2407 3143 3516 3362 2734 2637 2358 2550 2264 2490 2549 3099 2678 2345 2840 3379 2544 2223 2532
681112 2532 2543 3063 2505 2235 2198 2233 2284 2533 2685 2699 2404 2415 2255 2152 2487 2663 2447 2577 2678 2465 2397
690023 2397 2725 2173 2686 2665 2678 2460 2375 2440 2588 2416 2387 2269 2456 2761 2621 2811 2444 2797 2072 2275 2557
698943 2557 2731 3134 2857 2711 2979 2181 2622 2305 2791 3032 2877 2489 2831 2878 3226 2936 2606 2833 3071
707055 3071 2891 3068 2451 2493 3118 2767 3212 2995 2973 3310 3257 3093 3005 3099 3191 3183 3623 3075 3462 3636 3392 3124
716401 3124 3481 3432 3389 3740 3441 2966 3674 3132 3703 3706 4212 3916 3984 3865 3522 3509 3871 3621 3785 3843 3815 3706
725737 3706 3749 3741 3768 3773 3579 4111 4344 4168 4189 3772 4127 4458 4130 3873 4368 4199 4196 4441 4133 4504 4546 4129
735135 4129 4403 4499 4010 4542 3950 3965 4261 4151 4417 5039 4590 4701 4354 4249 4626 4583 4839 4746 5208 4346
743620 4346 4742 4458 4810 4843 4465 5019 5204 5094 4608 4914 5455 5451 5464 4930 5306 5484 4838 5011 5140 5228 5714
752541 5714 5423 5569 5394 5652 5553 5718 6104 5795 5707 5315 5799 5583 5796 5604 5845 5860 6127 5572 6229 5926
761078 5926 6911 6252 6147 6345 6238 6515 6440 6446 6209 6312 6621 6882 7004 6529 7255 6643 7025 6559 6693 7177
769573 7177 7159 7369 7332 7313 7423 7771 7741 7904 7764 7790 7978 8238 8281 8178 7959 7662 8171 8021 8498 7974 7889
778484 7889 8169 8620 8634 8728 8952 9113 9336 9175 9283 9638 9711 9738 9934 9480 10104 9836 9756 9388 9783 10084 10521
787457 10521 10212 10180 10692 10769 10480 10391 10555 10555 10611 10279 10996 10995 11370 11723 11879 12144 12180 12818 12445 11809 11125 11664
796792 11664 11825 11451 11810 11427 11815 12096 12091 12508 12812 12540 12587 12805 12861 12729 12694 13573 13001 13839 13295 13145
805288 13145 12273 13148 13122 13797 13642 13655 13721 13759 13988 13757 13950 13514 13444 13674 13672 13822 13563 14203 14312 14487 14950
814250 14950 15018 15286 15495 15607 14921 15079 15295 15205 15489 15264 15602 15881 16128 15950 16357 15974 15357 16100 16281
822310 16281 16398 16452 16500 16431 16590 16933 16482 17290 17321 17379 17395 17515 17987 17971 18052 18779 18452 18136 19055 18858 19047
831231 19047 18451 18777 18735 18896 18908 19341 19082 19433 19369 19528 19525 20161 19977 20554 20283 20948 21069 21331 21030 21210
839768 21210 21386 21690 21483 21960 22060 22338 22278 22060 22378 22733 22754 22773 23236 23851 23695 24075 24895 25201 25556 25323
848253 25323 25345 25339 25936 25454 25862 26016 26132 26657 26800 27376 27373 27330 27643 27593 27681 28370 28485 28971 28913 29115 28969 29643
857599 29643 30550 30578 31231 31506 31781 31882 32267 32620 32683 32287 32043 32190 32360 32568 33105 33228 33199 33597 33946 34387
866136 34387 35128 35103 35987 35752 35463 36122 37017 36881 37269 37587 37923 38112 38889 38929 39029 39264 39405 40022 40138
874206 40138 40456 40705 41475 42003 42249 42362 42639 42840 44289 45504 46032 46344 47609 48494 49774 51961 53885
881457 53885 56037 58768 61967 69825 80361 85427 85510 78299 70593 71522 76764 89675 99979 91352
887390 91352 73910 62972 66183 71018 75881 82735 93470 106336 119208 133718 148203 161261
892515 161261 161730 155048 158448 148279 130636 125792 125070 137460 152897 157628 138574 133144 134321
898012 134321 142776 153618 167853 189791 219788 200149 177271 175897 175383 187094 200342 208952
903137 208952 209174 228895 247627 276179 305425 323929 310572 232105 164746 151255 149268 138420
908261 138420 135649 137712 151255 161537 175534 199886 235135 259813 269284 257320 242159 240333
913333 240333 233711 228740 247462 237591 212202 183414 145937 129623 136838 149484 141955 150797
918458 150797 155963 156279 154198 168112 166377 124398 106543 104449 103771 111421 128357 149755 169882
923955 169882 176648 164172 138187 117182 110973 95922 85193 78082 86207 80807 58698 56244
929080 56244 56399 56188 56893 57138 55987 55665 56805 58549 61289 64193 61027 58213 61859 63467 59490
935438 59490 56944 55879 54874 54340 53700 52110 52057 52167 52084 52617 52667 52846 53679 55134 56823 58333 60102
942689 60102 61060 59731 60885 61522 61082 61240 62826 64667 65638 66588 68624 71624 74428 77307 80726 81993
949473 81993 84828 87467 89005 90063 89892 93486 99421 108562 117345 130581 147908 170997 200307
955023 200307 215148 204834 208284 221855 224442 210765 182834 178088 173781 151589 150204 165790
960147 165790 172243 176708 187439 188105 187528 216009 226401 217238 227715 264562 307473 331507 343700
965645 343700 386676 433463 457129 451962 451478 387237 345677 368422 375735 342375 321747 314718
970769 314718 315826 293467 290977 285738 294828 309733 309397 308828 316234 336014 366300 386405 420920
976277 420920 454613 469366 484081 480700 504934 507343 466399 422776 405908 394185 333237 260464
981401 260464 266349 276357 254394 248207 251450 281145 285606 267847 260688 253174 268055 288494
986526 288494 315450 331509 315596 305276 297932 296911 305707 296693 287108 263076 229796 205306
991598 205306 181159 149374 128324 115621 114715 112906 99085 89526 86034 88127 92938 103745 112174
997148 112174 120194 143085 172340 168905 144590 153881 149466 99029 79137 72621 65670 55596
1002220 55596 51740 44725 42546 41049 39241 38335 37058 35647 35098 34388 34074 33797 33221 32889 32323 32348 31754
1009481 31754 31461 30113 30147 29836 29608 29207 28565 27851 27304 26798 26491 25890 25864 25878 25232 25066 24578 24664 24009 24553
1017966 24553 24312 23955 24172 23273 22950 22648 22626 22988 22824 22633 22830 23173 22753 23483 23009 23042 22924 22302 22106
1026078 22106 21755 21975 21903 21594 21168 21703 21465 21113 21170 20985 21273 20971 21245 20977 20944 20542 20726 20579 20269 20141
1034563 20141 20041 20363 20213 19751 19802 19684 19703 18721 18715 18268 18332 17901 17934 17941 17959 17387 17560 17048 16812 16698 17051 16860
1043909 16860 16884 16789 16311 15808 15777 15871 15698 15012 15268 14963 15030 14617 14297 14345 14180 13978 13914 13688 13551 13497 13426 12747
1053308 12747 13207 12948 13075 12639 12728 12614 11849 12054 12089 12073 11484 11661 10960 11252 10379 10484 10141 10227 10326 9992
1061793 9992 10329 9618 9263 9261 9416 9529 8865 9372 9001 9463 9199 8359 8605 8860 8488 8140 8106 7800 7673 7466
1070278 7466 7058 7045 6961 6660 6777 6811 6795 6640 6457 6861 6470 6424 6789 6401 6959 7321 7219 5990 6468 6092
1078825 6092 5984 5771 6141 5448 5116 4964 4788 5006 5154 4670 4890 4707 4456 4563 4508 5089 4912 5145 5077 5452
1087310 5452 4633 5328 5259 4808 4578 4769 4836 4522 4024 3663 3580 3850 3744 3403 3271 3583 3760 4057 3725 4393
1095795 4393 4458 5184 6230 6462 6657 6679 6913 6213 6063 6125 5701 5425 5047 4337 3339 3583 3259 3357 2934 2892
1104343 2892 2825 2922 2746 3102 3478 3598 3769 3988 3754 3826 4967 5568 5943 5912 5729 5942 5368 4976 4371 3813
1112828 3813 3581 3079 2991 2440 2032 1789 1496 1311 1608 1606 1749 1622 1610 1369 1998 1983 2581 3298 2974 3281 3346
1121749 3346 3164 2480 1992 2041 2189 2214 1104 780 516 994 826 379 329 110 698 609 655 782 980 893 1042
1130711 1042 1204 1564 1995 1917 1786 1265 1684 1940 1889 1542 3410 5797 10004 10920 31391 77339 22217
1137920 22217 -8820 769 -120 434 133 683 375 -100 262 718 743 630 840 848 1066 1423 1427 1442 958 1061
1146458 1061 1044 186 185 399 472 -182 -707 -288 191 -141 -834 -1123 -844 -437 -792 -1189 -721 -762 -703 -1108 -631
1155378 -631 -636 169 -606 -257 -544 127 -158 38 -701 -342 -479 -131 -271 -200 -471 -321 -543 -358 -499 -271
1163863 -271 -42 -79 192 725 684 1263 1499 1747 1840 1437 1411 1597 1707 1359 989 927 1518 1336 1412 1822 1589
1172784 1589 2315 2323 2003 2863 2852 3136 2984 3151 3641 4241 4282 4305 4766 5324 5828 5494 5873 5631 4693 5071 4990
1181747 4990 4823 4480 4306 4216 3847 3770 3060 3179 3124 3069 3412 3375 3090 3485 3675 4357 4500 4742 4653 5592 5778
1190667 5778 5481 5385 5540 5878 5575 5391 4891 5154 5285 5727 5502 5624 5638 5631 5693 6746 8170 8960 9345 8903
1199152 8903 9611 10631 11891 11300 11201 11247 12269 13835 14811 15593 17757 20958 24315 28217 33427 39790
1205988 39790 46232 53989 67042 83979 96918 126448 183251 252898 330706 420630 540273 639215
1211113 639215 676209 607722 421673 360670 394749 344393 235750 154429 127021 125375 126313
1215749 126313 132281 139563 145277 151494 168507 197983 230897 277833 345671 400756 439609 476259
1220874 476259 517223 598485 720759 796198 851859 991180 919841 722860 624486 543686 473173
1225573 473173 401412 337398 274268 240189 218289 208049 198878 188076 185230 194202 194092 198114
1230645 198114 208480 233443 282935 343752 388567 446684 490254 517519 523212 534775 525679 445043
1235770 445043 335592 257044 188830 163724 153011 144028 132019 120750 112570 107310 103638 98386
1240842 98386 95342 93014 90145 87772 86057 84771 83396 81916 80101 78016 76173 74178 72815 70794
1246827 70794 68074 66391 64087 62250 60111 57944 55868 54698 53929 52546 50873 49573 48033 47049 46240
1253175 46240 45009 44464 43763 43029 42658 42054 41690 41249 40355 40161 39370 38745 38154 37620 37865 37511 36516 36530 35860
1261287 35860 35723 35474 35111 34992 34400 33786 33324 32787 32735 32200 32000 32323 32285 32429 32210 31993 32380 32131 31876
1269347 31876 31920 31885 31585 31177 31414 31153 30129 30110 30051 30008 29482 29411 28816 29132 28757 28427 27974 28139 28923 28633
1277894 28633 28041 28156 28083 28277 28026 27623 27947 27646 27076 26588 26904 26423 26014 25909 25759 25646 25633 25494 25309
1285954 25309 24537 24138 23786 23491 23596 23612 23481 22284 22590 22904 22355 21831 21899 21796 21579 21135 21477 20446 20122
1294014 20122 20106 20093 19797 19183 19248 19501 19205 18549 17887 17786 17764 17392 16453 16023 16352 15875 15354 15612 15483 15211
1302551 15211 14835 14742 14501 14210 14186 14454 13881 13439 13016 13174 12708 12532 12418 12420 11842 11828 11463 11085 11510 11387
1311046 11387 11032 11113 10737 10798 10469 10113 10290 9806 9649 9320 9489 9104 9137 9113 8686 8973 8676 8873 9084 9287
1319532 9287 9756 9931 10528 10791 9909 10091 10286 10942 10678 10691 10293 8847 8116 8062 7596 7519 7238 6729 6500 6517
1328069 6517 6150 6823 6361 6748 6603 6716 7021 7545 7106 8133 8587 8393 8099 8617 8432 7702 7636 7808 7093
1336139 7093 6791 6140 5685 4764 4524 4488 4244 4098 3815 3988 4215 3501 3618 3472 4131 3793 4093 4073 4601 4495
1344624 4495 4094 3935 3848 3780 4165 3442 2948 2483 1884 1653 1685 1610 1404 1300 1173 1231 992 1056 642 504 277
1353587 277 382 491 636 467 86 -203 -87 -347 -60 -457 -409 -127 -677 -679 -509 -958 -872 -1065 -959 -1070 -1422
1362507 -1422 -1490 -1717 -1895 -1666 -1756 -1797 -1625 -1834 -2008 -2096 -2182 -1907 -2342 -2661 -2476 -2120 -2170 -2324 -2790 -2882 -2305
1371470 -2305 -2910 -2873 -2843 -3288 -3005 -3561 -3135 -3615 -3272 -3595 -3052 -3529 -3989 -4030 -3743 -3485 -3679 -4107 -3838 -3812
1379965 -3812 -4393 -4547 -4182 -4049 -4298 -4104 -4480 -4305 -4454 -4650 -4649 -4808 -4609 -5025 -5108 -4661 -5356 -5148 -4974 -5481
1388450 -5481 -5087 -5178 -4889 -5191 -5468 -5495 -4952 -5270 -5503 -5160 -5510 -5628 -5771 -5630 -5808 -5708 -5430 -5831 -5804 -5874
1396988 -5874 -5902 -5919 -5949 -5983 -6100 -5978 -6021 -6379 -6398 -6403 -6072 -6429 -6102 -6415 -6381 -6454 -6675 -6475 -6345 -6663 -6685 -6367 -6731
1406759 -6731 -6745 -6820 -6551 -6723 -6616 -6542 -6892 -6734 -6689 -6894 -6863 -6785 -6772 -6990 -6621 -6832 -7064 -6519 -6920 -7027 -7295
1415679 -7295 -6857 -7102 -6997 -7071 -7015 -6764 -7024 -7261 -7063 -7353 -7103 -7109 -7195 -6822 -7370 -7239 -7115 -7415 -7274 -7073 -7690
1424590 -7690 -6810 -7211 -7444 -7790 -8023 -7277 -7062 -6925 -6930 -7188 -7229 -7833 -7204 -7193 -7357 -7596 -7400 -7447 -7940 -7907 -7758
1433563 -7758 -7653 -7401 -7510 -7599 -7363 -7324 -7550 -8152 -7822 -7729 -7349 -7711 -7751 -7660 -7533 -8226 -8472 -7780 -7623 -8312 -7901
1442473 -7901 -8151 -7622 -7771 -8017 -8258 -7846 -7688 -7645 -7871 -7783 -7750 -7438 -7217 -7685 -7996 -8005 -7897 -8099 -8089 -8178 -8318
1451394 -8318 -8173 -7733 -8611 -8688 -8294 -7703 -7901 -7575 -7844 -7333 -6976 -7511 -7882 -7259 -7063 -7125 -7414 -7396 -7909 -8181
1459931 -8181 -7947 -7476 -7546 -8205 -8404 -7758 -7623 -8123 -8229 -7327 -7764 -7362 -7683 -7860 -7083 -6963 -6678 -6360 -6875
1467991 -6875 -6811 -6460 -6950 -7515 -8176 -7947 -7325 -7609 -7803 -8637 -7430 -7449 -7471 -7940 -8015 -7740 -7503 -7498 -7899 -7743 -7437
1476911 -7437 -7217 -7367 -6931 -7151 -6812 -6880 -6976 -7335 -7760 -7555 -7384 -8200 -8107 -8205 -7892 -7712 -8408 -8187 -7843 -7397
1485449 -7397 -7851 -7904 -8094 -7714 -7799 -7841 -7598 -7614 -7670 -7239 -7405 -7794 -7359 -7507 -7927 -7991 -7398 -7437 -7540 -7505 -7696 -7689
1494795 -7689 -7143 -7395 -7003 -7187 -7617 -6882 -6886 -7298 -7842 -7507 -7485 -7223 -6943 -7434 -6905 -6845 -6701 -6943 -6543 -6972
1503280 -6972 -6793 -7157 -7076 -7245 -6930 -6874 -6889 -6556 -7193 -6452 -6943 -6433 -7099 -6300 -6287 -6015 -6399 -6803 -6749 -6473 -6840
1512253 -6840 -6705 -6951 -6631 -6665 -6775 -6473 -6344 -5954 -6317 -6641 -6789 -6999 -6515 -6082 -6584 -6710 -6878 -6459 -6050
1520312 -6050 -6101 -6269 -6131 -6040 -5777 -5708 -5847 -5713 -6352 -6274 -6573 -6307 -6065 -6134 -6114 -6573 -6219 -5416 -5450 -5601 -5688 -5396
1529700 -5396 -5122 -5482 -5551 -5509 -5161 -5164 -5320 -5623 -5341 -5636 -4941 -5742 -5425 -5771 -6099 -6443 -5937 -5860 -5632 -5586 -5551
1538621 -5551 -5594 -5621 -5308 -5069 -5070 -5047 -5024 -5315 -4961 -5747 -5515 -5678 -5237 -5789 -5243 -6047 -5824 -5261 -5254 -5157 -5389 -5600
1547967 -5600 -5292 -5882 -5601 -5346 -5636 -5585 -4913 -5364 -5346 -5004 -5038 -4801 -4871 -5288 -5342 -5712 -5171 -5207 -5003 -5423 -5135
1556877 -5135 -5366 -4922 -4520 -4835 -4707 -5336 -4919 -5050 -4441 -4448 -4745 -4868 -4593 -4724 -4889 -4726 -4306 -4499 -4874 -4703
1565415 -4703 -4667 -4642 -4304 -4603 -4615 -4361 -4121 -4111 -4531 -3932 -4050 -3699 -4412 -4137 -4157 -4240 -3562 -4297 -3953 -4130 -3771
1574335 -3771 -3600 -4164 -3420
##END=
