##TITLE=Unknown
##JCAMP-DX= 5.00 $$From Command Line Converter 1.0
##DATA TYPE= NMR Spectrum
##DATA CLASS=  XYDATA

##ORIGIN= Exported from Command Line Converter 1.0
##OWNER= SVB
##$URL= http://wwwchem.uwimona.edu.jm:1104/software/jcampdx.html
##SPECTROMETER/DATA SYSTEM= NUTS EXPORT
##.OBSERVE FREQUENCY= 300.149506
##.OBSERVE NUCLEUS= ^1H
##INSTRUMENTAL PARAMETERS= 1H
##XUNITS= PPM
##YUNITS= ARBITRARY UNITS
##XFACTOR= 0.0000035013
##YFACTOR= 3.5404570000
##FIRSTX=   0.449892
##FIRSTY= 9201.000000
##LASTX=   3.951200
##NPOINTS= 2153
##MAXY= 3534337.000000
##MINY= -6120.000000
##DELTAX=   0.001627
##XYDATA= (X++(Y..Y))
128492B598Pp2%M9o4J02m0P6j8m7l9K5J93j29J83j42p7Q1MK6K3lP8m5l8P0j02
141054B699N2Q3%p2J9J77j11j59R4n1J05j00J77p0k7K9l3J13j6P1J24J8r4k1J21
152657C128p8K8mm6o4J51j6O6M1Q9k39L4J68j33J53n1J25P1m9J71p1j43J9N8l2
164271C376n2J58L9q7J35J91l8o5L8j12P1n0p1l2P7q3R3r5M9J33p6Q2P9lJ5R7
176368C869j50O4KJ47n6Q5O6L2l7p3J46n0J1PJ20J20N1j5R5m9O5m4m5k8J16J51
188436D600NK8P6J9k4J70J71o2J91k58P8N1J60J48r9L9K92j1K12N53P02J263J618
199139I922l886o06R4L5J46N3K94J64K8J55N81Q01J824L07l629j99L9M7P3K18
208436F461O76P31M93P16j431j107j67J81J78M7Q4J63O20O5O40N80P50R08k377
$$ y = [2598, 2605, 2533, 2533, 2582, 2518, 2620, 2580, 2656, 2638, 2591, 2552, 2577, 2770, 2641, 2824, 2682, 2605, 2686, 2690, 2716, 2739, 2736, 2814, 2769, 2731, 2801, 2699, 2751, 2834, 2834, 2762, 2781, 2958, 2847, 2688, 2782, 2731, 2836, 2736, 2913, 2843, 2816, 2845, 2812, 2925, 2909, 2980, 3104, 3122, 3028, 3007, 3128, 3050, 3078, 3074, 3028, 2964, 3115, 3099, 3165, 3206, 3295, 3056, 3090, 3258, 3125, 3278, 3227, 3352, 3423, 3374, 3545, 3474, 3331, 3350, 3408, 3376, 3324, 3482, 3521, 3434, 3569, 3760, 3722, 3657, 3695, 3583, 3654, 3604, 3533, 3501, 3578, 3495, 3588, 3493, 3542, 3675, 3599, 3681, 3760, 3757, 3772, 3869, 3719, 3783, 3785, 3932, 3876, 3961, 4027, 4059, 4022, 3949, 4095, 4045, 4056, 4063, 4183, 4303, 4354, 4339, 4434, 4385, 4450, 4406, 4361, 4333, 4449, 4600, 4605, 4633, 4709, 4728, 4704, 4874, 5045, 4983, 5174, 4916, 4994, 5045, 5205, 5353, 5254, 5293, 5585, 5574, 5786, 6339, 7041, 8304, 9922, 6036, 5430, 5524, 5559, 5705, 5758, 6052, 6216, 6244, 6399, 6980, 7781, 9605, 9912, 6283, 6084, 6123, 6170, 6243, 6461, 7137, 7868, 8361, 9077, 7646, 6539, 6372, 6553, 6731, 6778, 6862, 7025, 7645, 7710, 8350, 8930, 9680, 10588, 8211]
217252H211m16K13j02J2j8J65M25k5j682Q36Q54N9L04r4RL47p7j31M60N2K56o48
227479I010j493O88J096j01r5o09q25J243K085k5L64L69J251J121N59m73j876
235382A2289pK6o51q61L054J083N58n7J328K386K09M04j609o45L32K14M93J3N69
244215A9128N18P55p5J43J480N41N6N97M54P04O91J085R93O75J479J196J551K866
252584C4837P86K646L039M524L425Q517J0781J5932J2440K0145O6510J06152K38567
258618E28301M69970q46648r4459n895M138M084M920O687J7304J1354K6114Q1321
264187B07191J32283L09755K82950q28035n0005q089k520l164q454k621k76n47
269756B8468l824K019L01K274k465k879j445r48j176j848j359r51j248l87J57
$$ y = [8211, 7795, 8008, 7906, 7918, 7900, 8065, 8490, 8465, 6783, 7619, 8473, 8532, 8836, 8742, 8751, 9098, 9021, 8890, 9350, 9402, 9658, 9010, 7517, 8205, 9301, 9200, 9105, 8496, 7671, 8914, 10999, 10974, 11338, 11707, 12958, 14079, 14638, 14165, 12289, 12282, 12308, 11657, 10796, 13850, 14933, 15491, 15434, 16762, 19148, 19357, 19761, 18152, 17507, 17839, 18053, 18546, 18559, 19128, 19646, 20401, 20326, 20469, 21949, 22490, 22546, 23143, 23597, 24301, 24992, 26077, 27070, 27745, 29224, 30420, 31971, 34837, 35623, 38269, 41308, 45832, 49257, 57774, 68555, 84487, 96927, 117072, 183582, 289734, 528301, 998271, 151623, 57164, 51269, 55407, 59491, 64411, 71098, 88402, 99756, 125870, 207191, 339474, 649229, 932179, 104144, 54139, 46050, 43530, 40366, 31912, 29291, 29015, 28468, 24644, 26663, 26964, 29238, 26773, 23894, 22449, 21501, 20325, 18477, 17118, 16167, 14919, 14532, 14689]
276731A4689l429r65j377J637p37p35N77m80m38m51K60N09P05j49l030q6P54l42
285099F912l54M36Q57J559P79k000K58O17o2o73r79r0N2O8k82L95M67J996j335
293932H621j632l49K89K6N96n12j963k0K32k30J06j97j28k49k12K44O70J388J513
302765H193l053k767O18P95K79p29n83L7j10m9J34L24P83J997L745n293j559k92
311133B470L11K1o57n3k2j15m1R2J61O50J128K553j679j26J212l630p76k07J10
319938A402o8qp6J74m8L10N65J026J903m04l322l65Or7j4J00k33J8p9q6r0NM7
330640F66j69J65r5M3k24m0j18J30l5r7rr6rj05j6M5RL2j13rj79M4J24n3N7k06
342719b58N6j41L0Q1O3j25l5k0L5l8N5j59J22j38n7N4%j7Q7j63K7P4j60nk0P3
$$ y = [14689, 11260, 10295, 8918, 10555, 9818, 9083, 9660, 9180, 8742, 8291, 8551, 9060, 9765, 9616, 6586, 6500, 7254, 6912, 6558, 6994, 7851, 9410, 10189, 8189, 8447, 9064, 9002, 8329, 7350, 7260, 7312, 7380, 7098, 7493, 7960, 9956, 8621, 6989, 6640, 6929, 6955, 7551, 7039, 5076, 5056, 5288, 5058, 5164, 4967, 4839, 4590, 4378, 4622, 5292, 6680, 8193, 5140, 2373, 2991, 3786, 4065, 3336, 2753, 2790, 2680, 2631, 2765, 3089, 3872, 5869, 9614, 4321, 2762, 2470, 2781, 2802, 2145, 2092, 2070, 1955, 1914, 2006, 2167, 2817, 3945, 6498, 4819, 4693, 5905, 2275, 1499, 1292, 1402, 1334, 1326, 1250, 1424, 1376, 1686, 2251, 3277, 5180, 4776, 1454, 1089, 1095, 998, 984, 1084, 851, 869, 790, 704, 614, 619, 666, 497, 662, 567, 610, 386, 346, 228, 358, 323, 226, 217, 121, 112, 7, -9, 36, 45, 77, -36, -45, -224, -180, -56, -109, -52, -258, -202, -343, -313, -232, -169, -294, -329, -349, -314, -352, -297, -456, -334, -472, -529, -475, -475, -492, -405, -568, -541, -467, -627, -632, -652, -579]
354787e79j12P6p2j12N3L8K4l1k1LK9L3p8m3M7o1J06r1Q2j59K0O2Jo4P4q8R4o1
367824h30OP3L1j07n9O6o6K1J7J02k0j30K0j2J28p1O7j13L5M5j00K33p4o4K9j95
379892i68J76MNM4n6j4J06j19p1J31J00j27K3q1k0K9J06m0L6n0M2j15J30N3%J1
391989f65j02J20n8r3K8J8o9j38M3l65L08L62J6O4lj77j9q6qK18j46mj89l21N22
403592g44J28K0q7J42J86j38o4j20K7q4M0j5K9j27K21j14K30j05j33J49r9kq4
414266g44l0J33nOm4N8L6k74R3k4K08j3l7qq6nR9Q1q8j04R2M33l84m7J16n5j41
426839g34L9R8k8q9K37J05k8J88j057Q25K94l0j23Nj11J01j6J38m7J31l9L32j056
437513h65J338k04j45n0j88j21qJ68k2J07K3P8K51J32p25K37j55p2M5l0J06Q3
$$ y = [-579, -691, -615, -687, -799, -746, -708, -684, -715, -736, -733, -704, -671, -749, -792, -745, -806, -700, -791, -709, -868, -848, -786, -785, -849, -775, -863, -769, -830, -824, -751, -720, -827, -886, -820, -886, -865, -848, -746, -766, -896, -876, -888, -760, -831, -764, -877, -842, -797, -897, -664, -738, -802, -773, -968, -792, -788, -783, -739, -795, -809, -703, -822, -893, -762, -662, -789, -766, -847, -867, -838, -732, -772, -736, -786, -744, -859, -729, -676, -676, -665, -767, -647, -705, -798, -770, -752, -821, -959, -916, -1281, -973, -611, -595, -531, -534, -711, -730, -816, -824, -606, -752, -756, -945, -1266, -744, -616, -596, -683, -541, -355, -493, -557, -677, -650, -734, -694, -709, -680, -807, -586, -700, -470, -575, -708, -559, -658, -660, -744, -774, -641, -646, -640, -684, -626, -590, -864, -771, -795, -587, -600, -637, -645, -731, -736, -637, -556, -644, -748, -656, -223, -607, -654, -538, -593, -734, -695, -597, -625, -714, -477, -372, -400, -212, -1269, -444, -150, -180, -303, -298, -409, -308, -324, -186, -233, -102, -141, 191, -865, 473, 269, 124, 74, -114, -235, -243, -75, -97, 10, 33, 111, 362, 494, -231, 6, -149, -221, -176, -206, -100, -17]
447740a7J76p4J36n0K70k15N5pj37j9N4R0k83j05N9K03K8K59k24J23k34J02p5
458414A15qJ86P4n17J41K06k9rJ14o8r3J28j49R3R7L6L1j34K18l9j0J24N7O4j69
470046D59n6J79j03R4J39P0o4J23mJ8J28K81M11M75o94k61O3L73L41M45p28j32
480255A557p9J35J76L58P15J285L48o56L01J955M245l997k317r24p8j79K85M81
488623C611O93J322J921K184K989Q907Q336j6377o179j604n67o3J83P31Q14J532
496062H433L212O147J1363K3308j2711k2306p033k078j107k19K62Q53J040J998
502561A1162M572Q772J9304K2554l2015j8134n465j866r96l31J76M60R50J998
509088A1141M327Q968J9397J539k5879q530k674j360n53k80r6J88M49J364K609
$$ y = [-17, 159, 85, 221, 171, 441, 226, 281, 274, 137, 118, 172, 262, -21, -126, -67, 136, 164, 423, 199, 322, 88, 190, 115, 107, 293, 367, -150, -9, 197, 168, 159, 273, 205, 112, 240, 91, 184, 281, 317, 348, 214, 432, 393, 383, 507, 564, 628, 459, 403, 582, 479, 573, 712, 782, 718, 841, 837, 855, 983, 1264, 1675, 2150, 1456, 1195, 1258, 1631, 1972, 2417, 1689, 1557, 1478, 1613, 1789, 2147, 2862, 4147, 4495, 3839, 4140, 6095, 10340, 6343, 4026, 3102, 3024, 2845, 3130, 3611, 4304, 5626, 7547, 9731, 12720, 21627, 29963, 13586, 7407, 5803, 5236, 5173, 5356, 6087, 6901, 8433, 11645, 17792, 29155, 52463, 39752, 17446, 10413, 8335, 7228, 7009, 7271, 8124, 9164, 11162, 15734, 24506, 43810, 66364, 34349, 16215, 10750, 8884, 7888, 7557, 7733, 8193, 9143, 11141, 15468, 24436, 43833, 45372, 19493, 10963, 8289, 6929, 6376, 6096, 6000, 6188, 6637, 8001, 10610]
516034A0610N663J0663q494r760k821p70n48l18j23k26J10jM17Q93J874K663m305
523938E527j872n21j83k06R2k35j32R0r6R5m6L40R0r09j6J1j50J79L9k74o9Ml7
534629A721P9j97k8j6M8j39M7j0K11j42j24j38J18m9j0m3j87O7L8j7kM5m4o1k6
546244A141n9J40l11K64k00j2J30j2R3k7J70J6j58K74J03o1l28j71j16P5n9L9
556471I31J35J12p5m4j98K3%P4K4K1J8Q5q0J37o3M9k41l3j06L9p1L2J15l0j39
568103G15Q8J35j7Q8L8j03j65j63Q2j32p8n0K0n2K41M97M33K38N88K30j50m72
578312B011l49k55p3J46pj8J11J90N9M9N6p2J08N7Q2n1K4j12P5M1j92J08lO6L7
589944B088J7P3J68P4J34k5K10O3K16J65L89K42M26K50P77R66J340J427K641N746
$$ y = [10610, 16273, 26936, 18442, 8682, 5861, 5091, 4543, 4225, 4102, 3876, 3986, 3985, 4402, 5295, 7169, 9832, 5527, 3655, 3134, 2951, 2745, 2837, 2602, 2470, 2560, 2464, 2559, 2513, 2853, 2943, 2034, 2018, 2029, 1879, 2058, 2097, 1823, 1754, 1758, 1721, 1800, 1603, 1575, 1559, 1607, 1468, 1515, 1505, 1716, 1574, 1450, 1312, 1430, 1381, 1371, 1328, 1141, 1208, 1246, 1229, 1227, 1272, 1228, 1167, 1141, 1082, 1222, 911, 1175, 975, 963, 1093, 1081, 1174, 1147, 1317, 1333, 1175, 1449, 1552, 1491, 1163, 992, 876, 951, 892, 931, 1066, 1178, 1103, 1059, 861, 884, 884, 958, 982, 1003, 1021, 1106, 1026, 1163, 1100, 1149, 908, 875, 769, 808, 737, 769, 884, 854, 715, 803, 938, 921, 1009, 1047, 944, 779, 616, 698, 566, 488, 438, 458, 406, 647, 1144, 1577, 1815, 2403, 2633, 2483, 2011, 1662, 1407, 1334, 1480, 1473, 1455, 1566, 1756, 1815, 1864, 1920, 1848, 1956, 2013, 2095, 2044, 2068, 1956, 2031, 2072, 1880, 1988, 1985, 2051, 2088, 2105, 2178, 2346, 2420, 2554, 2529, 2739, 2802, 3018, 3183, 3572, 3814, 4240, 4490, 5267, 6233, 7573, 9000, 11641, 17387]
599224A7387R509J2804J8471K4606J9181P289l462m194q877j8879k4163j8109
604793C1563j0599m738k053j279o99m62p75j82L9M68m08j54r48o72p64n41n32
612686G264m16m58l89m45k45k52k42k09j33k24k01k63k41k12k72r4k13J3L58l10
621995B816j04L2j60P4N26j14j45j14J31M0j94p8r2J22J42j06J45l3m1O0J3k25
632222B695Q2k01j00qJ02l8j77m3l0K0j56n0L7O0j03p3p3k3q9j0j71N1r3k2j57
643836A430O2j54N4l1o5P5m1L3j87J00m0N9j63M1k%j81j6O5j24L7%m1R1j05O3
655904I60k4J8J60L55P16J890j721r34j78k2j05l0l7J7l5J18K66K88R44K338N76
665667E560l623n49j47l5j05p3k2M9P0J2N4K39O84J366j723o66l1p8J8j42N4j2
$$ y = [17387, 26896, 39700, 58171, 82777, 101958, 109247, 105785, 101591, 92714, 73835, 49672, 31563, 20964, 16226, 14173, 12894, 12195, 11733, 10958, 10776, 10815, 11283, 10875, 10721, 9773, 9101, 8337, 7796, 7264, 6848, 6390, 6001, 5556, 5311, 5059, 4817, 4608, 4475, 4251, 4050, 3787, 3546, 3334, 3062, 2968, 2755, 2768, 3126, 2816, 2712, 2744, 2584, 2658, 3184, 3070, 2925, 2811, 2942, 2982, 2788, 2710, 2618, 2740, 2882, 2776, 2921, 2888, 2847, 2907, 2920, 2695, 2777, 2576, 2476, 2468, 2570, 2532, 2355, 2312, 2282, 2302, 2146, 2096, 2133, 2193, 2090, 2017, 1944, 1921, 1832, 1822, 1651, 1702, 1609, 1587, 1430, 1492, 1338, 1392, 1361, 1296, 1371, 1330, 1363, 1176, 1276, 1236, 1295, 1132, 1173, 1171, 1171, 990, 974, 1039, 915, 952, 952, 911, 1002, 897, 960, 936, 954, 1114, 1469, 2185, 4075, 2354, 1420, 1242, 1220, 1115, 1085, 1048, 1065, 1030, 1148, 1414, 1702, 2646, 4984, 5560, 1937, 1388, 1241, 1206, 1101, 1028, 1006, 1055, 1125, 1137, 1191, 1430, 2114, 3480, 1757, 1091, 1060, 982, 1000, 858, 912, 900]
675904I00K8j74O5n3n2n4o9K6r6M3N1K2qq4M0p1J00j73K8Jn0J07J2K9l9l4R6j79
688913D12J4M8j30P7NJ9l1q7P4K5qQn7l0J17j79J16%j9r9N2k7K0Rk2K2L0J0j14
702386B55O6J1p6L1k2j00O0o8l2Q9L3j04M5M5j02Nj8Q0o4j6m5k0j23N0p7l7j40
714919b74k08K59Q72k90l3qo2n7j03k7j8L8j47m6k44P01K86r9p9q6O5r9j76J41
726086C06Q9r6p2O4N8jm8rj8L6m2m9N4r6MP5L4j51N6%J03j14k4J1l8J12K6n0M5
739559B65j39J36p0nJ07j56L7K9l6J12r9J83q0r3L3M9n3K7r4J37l1q7O2oj11L6
751627A53m6P6N5Mm5QO5L9j43JO7q8l5P1l3l6J80Lj21P5n5P5J2n9o2l4K2J48j4
765128B83k0n8j26J48q8P0j0K6j43J27qN2N4j41O1J13K6J04j97nn2j38J69j32
$$ y = [900, 928, 754, 819, 766, 714, 660, 591, 617, 521, 564, 615, 637, 629, 545, 585, 514, 614, 441, 469, 470, 420, 527, 539, 568, 529, 495, 591, 412, 426, 474, 344, 421, 426, 445, 414, 327, 401, 426, 418, 426, 369, 339, 456, 277, 393, 393, 374, 275, 327, 300, 320, 329, 307, 329, 359, 369, 255, 321, 332, 256, 287, 265, 165, 225, 157, 125, 214, 247, 143, 188, 233, 131, 136, 118, 198, 134, 118, 73, 53, -70, -20, -97, -134, -274, -482, -223, 649, 359, 326, 318, 256, 199, 96, 69, 51, 89, -58, -104, -348, 353, 639, 540, 461, 375, 440, 341, 165, 306, 395, 299, 227, 291, 349, 348, 300, 291, 273, 309, 267, 218, 272, 176, 180, 255, 289, 138, 194, 194, 297, 183, 159, 170, 132, 244, 270, 220, 265, 126, 262, 192, 187, 294, 138, 175, 204, 168, 280, 181, 364, 284, 191, 224, 273, 220, 247, 153, 290, 259, 172, 234, 228, 117, 153, 107, 183, 238, 242, 197, 205, 270, 309, 166, 167, 234, 146, 111, 182, 149, 113, 293, 296, 175, 250, 195, 270, 282, 223, 161, 127, 149, 297, 283, 263, 205, 79, 227, 139, 209, 199, 225, 82, 209, 201, 253, 307, 166, 227, 340, 366, 470, 273, 268, 216, 78, 247, 115]
776267A15L6j05R4M7NK8K2k20k0J81j46N6M6J23j81Q8O8o3l7M8J86j48l8Lj1J48
788335C25q1r1J09k6K6J7j24J6q2K0NK4j7P7L7M9J62k96rL8n3oJ3j5p0N6j19N0
801372C5Q3M62o60L64o6K8P2p2N3k2Rl8N2k9p2M%j52K05n9k2MonL6j32M1j0R5
814845A98r9nR4p0PP2n5M4%j1K9k8L4j24N3lJ10l4l2j35K03j99J85j02Q8Kq8l1
827853A03orJ9m3N3J25j20M7j6l2M4K4p5J3P0q8J05j90R9J9J10p5Jl0j9J11k06
840386C4J33M7J5j49J32N7j3j00n4Rl2R6j01j9J32jj03J7P6m5M3m1R1j91m0J07
852483A00p3M5O3r2P7jL9k7o1J07j78J73Nn9M8j10M0q1J21j51Q4O9N6k06J97q5
864562A00QO9r1l3Q7K5j07Pk9N8p5J42m6Q7j42K8j9pRk7jM3j6K4J38m5q3l3J32
$$ y = [115, 151, 46, 140, 187, 192, 220, 242, 22, 2, 183, 37, 93, 139, 262, 81, 169, 237, 174, 137, 185, 371, 223, 185, 188, 177, 325, 244, 153, 262, 236, 262, 279, 155, 171, 89, 109, 114, 138, 121, 198, 235, 284, 446, 150, 141, 179, 126, 120, 133, 118, 48, 104, -15, 35, 118, 580, -80, 284, 218, 246, 318, 246, 299, 277, 286, 248, 300, 271, 199, 203, 203, 51, 256, 197, 175, 179, 173, 168, 204, 72, 113, 103, 198, 99, 94, 188, 118, 125, 197, 142, 186, 186, 175, 204, 176, 210, 86, 139, 136, 246, 212, 180, 45, 248, 49, 234, 132, 220, 222, 134, 103, 97, 88, 107, 64, 117, 242, 122, 169, 153, 121, 165, 189, 114, 127, 197, 109, 214, 24, 123, 142, 252, 177, 178, 148, 129, 240, 34, 167, 214, 229, 80, 212, 269, 256, 156, 102, 111, 79, 175, 74, 55, 187, 186, 83, 100, 176, 131, 174, 133, 224, 33, -7, 100, 27, 72, 135, 43, 120, 119, 158, 131, 70, 177, -1, 172, 177, 118, 166, 56, 96, 15, 136, -15, 69, 138, 194, -12, 185, 100, 108, 177, 86, 53, 140, 165, 58, 65, 36, 94, 19, 161, 115, 202, 60, 88, 69, 62, 71, 44, 43, 86, 70, 94, 232, 187, 104, 71, 203]
878035B03j99J8jm7NL6m1K21k07q0L5R4op0Q5m2j57J36L9j7KK8N6o0L5j6l3O5
891032H2r7l3M6L4RO4k02N8J10J9m2qJ7j26O3M0P0J26L08P79K20j117j13m1l9
902664B27j8%L6r7J19J17J57N72J070j761j35Q9k11j08J5J14r9R8M4Mk01N4L8
913338A24r1M5r1NLK3j5l2J19K73J17K44M26r43k07n8j79J31J7p4J37K79n2K31
924506D32K43L18l52l37j67R9l3j25J16j11L75m72n08K38L35j54J44l5L3n7k8
934250d6J7K8p1J21o64o3L04J1M3k39k86p69Q38M21R5J0J64K21L68M12o25l29
944477c9j79l14l25q4Q17mK45k57N71J028m00L29q12l43j43J32j16j07K1J63j77
954250Fkl6l69M48j74p7k07j61j7j1k38j45j17l01l28J324j231J41j32r7M99K66
$$ y = [203, 4, 22, 21, -26, -21, 15, -26, 195, -12, -92, -57, 37, 31, -39, 46, 4, -153, -17, 22, 5, 7, 35, 91, 31, 66, 50, 17, 82, -15, -48, -2, 32, 41, 105, -97, -39, 71, 90, 48, 40, 57, -69, -6, 34, 104, 230, 538, 1317, 1537, 420, 307, 266, 227, 209, 209, 245, 148, 267, 384, 541, 1113, 2183, 422, 287, 376, 165, 57, 72, 186, 87, 185, 229, 233, 32, 86, 124, 33, 78, -13, -8, -5, 18, 3, -29, 90, 363, 480, 724, 1150, 207, 0, -58, -237, -106, -89, -163, -26, 253, 201, 432, 675, 993, 641, 304, 137, 236, 203, 78, 194, 83, 458, -14, -522, -284, 51, -103, 41, 6, 39, -18, -46, -29, -1, -72, 49, -615, -678, -374, -363, -320, -559, -845, -1614, -776, -355, -260, -250, -86, 135, 503, 915, 290, -39, -218, -532, -857, -941, -124, -128, 117, -140, 431, 1459, 1059, 1388, 576, 233, 90, 222, 106, -1, 20, 183, 6, 4, -32, -401, 47, -127, -204, -411, -572, -589, -600, -838, -983, -1100, -1401, -1729, -405, -1636, -1495, -1627, -1724, -1225, -959]
964460i59R83J676K808P307K0228L6877J12117J96173k94009l4186j2180n906
970029C0929n669j536j79J777N096J3899L0920Q2957K40207k87801n0773j4883
975627D4944l934p966l258k091j347j272j379r44n24n6K5k263n46o26o58q27q22
983520A6456n38q07p46o23n31o31j041K92n8o07k15n2m30l03k69j60q2j29l21
992335I205n40R2l37L7l51L77J9P68k70l73J13L0j65l99l55k7J40n8k40J95K29
1002098H090O45q77l04j61J6Q1K9M3r05j39M8L1q4j89o1k79j09J49k14M82k99p67
1012335E226mJ97r4K7j18j47o6j64j20Jq3r8m0K2j50R7l7k7m2o4P8j40r4M1j49
1023939D052j58K0k1J94p9Q7k5k03j08mK9q8k8q7O5P1J5R2L28J91J14J265j579
$$ y = [-959, 24, 1700, 4508, 11815, 32043, 68920, 181037, 377210, 83201, 49015, 36835, 30929, 25260, 23724, 23545, 25322, 30418, 44317, 75237, 158194, 398401, 110600, 59827, 44944, 41010, 33044, 29786, 27695, 26348, 25076, 23697, 22753, 22229, 22173, 22198, 19935, 19389, 18763, 18105, 17278, 16456, 15918, 15111, 14365, 13742, 13211, 12580, 11539, 11831, 11773, 11166, 10951, 10899, 10469, 10166, 9897, 9737, 9655, 9526, 9205, 8665, 8757, 8420, 8457, 8106, 8483, 8502, 9270, 9000, 8627, 8740, 8770, 8605, 8206, 7851, 7824, 7964, 7906, 7666, 7861, 8090, 8735, 7858, 7554, 7393, 7409, 7490, 7519, 7562, 6657, 6518, 6566, 6597, 6513, 6324, 6263, 5984, 5875, 6024, 5810, 6292, 5993, 5226, 5222, 5419, 5325, 5352, 5234, 5087, 5021, 4857, 4737, 4738, 4655, 4557, 4517, 4539, 4389, 4486, 4449, 4422, 4380, 4316, 4394, 4254, 4160, 4201, 4052, 3894, 3914, 3893, 4087, 4008, 4095, 4070, 3867, 3759, 3755, 3784, 3696, 3668, 3581, 3646, 3717, 3732, 3824, 4152, 4343, 4457, 5722, 4143]
1034641D143k54k11oj1k33O8j50M11J29N87k95P67o06o55j17l5j93m6P9j08N7l7
1044840C284J64l7k82r1J38l8j58n2k5KNk16J37O4k8o1k8q1J9m7K3q8J4O8j03L5
1056947B618j65j89j52R4K16K2M8J5j87J47j5N0k1j0q0l99j1L17q5J4l9L8l2N7
1068086B251%o2m8O2j05k6Q0l2J2n6P6j33l5Q8m2rJ36j10j6j05O5j0JJ1m6j31J75
1080648A991j56O3Q7jm2r2L8JL2n5J56r3j18J19m9o5J2l6k3PJ26k08M1J66o3m2
1092726A796m0N5r7k3K9Q9rJ1l8oo7P9o4L6N3j58J0O2J0m4l9L8J06J3j12rl1j83
1105724A467O6J45Nj73RJ38N6k04O6k6oon1O7M6p9J2k3J8pn3R8L0oq7O7M6j93J43
1119197A565k9Po7J92J3k07P8mj3k0q4O6K3p8J42q2Pj73J47N6
$$ y = [4143, 3889, 3678, 3672, 3661, 3428, 3496, 3346, 3757, 3886, 4473, 4178, 4945, 4339, 3684, 3567, 3532, 3339, 3293, 3372, 3264, 3321, 3284, 3448, 3411, 3129, 3038, 3176, 3138, 2980, 2928, 2903, 2905, 2910, 2694, 2831, 2895, 2867, 2806, 2778, 2697, 2716, 2669, 2692, 2604, 2618, 2686, 2583, 2618, 2453, 2264, 2112, 2206, 2422, 2444, 2492, 2507, 2320, 2467, 2452, 2502, 2481, 2471, 2391, 1992, 1981, 2298, 2213, 2227, 2188, 2226, 2194, 2251, 2251, 2189, 2141, 2203, 2098, 2072, 2152, 2120, 2132, 2076, 2152, 2019, 1984, 2072, 2030, 2021, 2157, 2047, 2031, 1926, 1991, 1981, 1982, 1993, 1947, 1816, 1991, 1835, 1898, 1985, 1984, 1942, 1850, 1888, 1889, 1921, 1866, 2022, 1929, 1811, 1930, 1881, 1816, 1828, 1792, 1769, 1776, 1902, 1694, 1735, 1901, 1838, 1796, 1756, 1811, 1714, 1691, 1720, 1809, 1800, 1811, 1773, 1767, 1700, 1779, 1715, 1751, 1804, 1646, 1656, 1718, 1728, 1684, 1645, 1683, 1789, 1802, 1690, 1681, 1650, 1467, 1533, 1678, 1683, 1510, 1519, 1657, 1713, 1509, 1575, 1549, 1543, 1537, 1486, 1553, 1599, 1520, 1532, 1509, 1527, 1520, 1467, 1565, 1595, 1589, 1502, 1569, 1615, 1422, 1565, 1536, 1543, 1476, 1668, 1681, 1474, 1552, 1548, 1535, 1515, 1431, 1497, 1520, 1442, 1584, 1502, 1509, 1336, 1483, 1539]
##END=
