##TITLE=Unknown
##JCAMP-DX= 5.00 $$From Command Line Converter 1.0
##DATA TYPE= NMR Spectrum
##DATA CLASS=  XYDATA

##ORIGIN= Exported from Command Line Converter 1.0
##OWNER= SVB
##$URL= http://wwwchem.uwimona.edu.jm:1104/software/jcampdx.html
##SPECTROMETER/DATA SYSTEM= NUTS EXPORT
##.OBSERVE FREQUENCY= 300.149506
##.OBSERVE NUCLEUS= ^1H
##INSTRUMENTAL PARAMETERS= 1H
##XUNITS= PPM
##YUNITS= ARBITRARY UNITS
##XFACTOR= 0.0000022435
##YFACTOR= 8.4334290000
##FIRSTX=   0.486646
##FIRSTY= 14838.000000
##LASTX=   2.730200
##NPOINTS= 2759
##MAXY= 8425637.000000
##MINY= -7792.000000
##DELTAX=   0.000813
##XYDATA= (X++(Y..Y))
$$ plain form
216913 1759 1932 1883 1829 1934 1889 1894 1908 1973 1959 1959 1981 2012 2111 2063 2132 2076 1833 1914 1835 1875 1907 2170 2022 2076 2151 2006
226375 2006 2054 2045 2023 2100 2037 2051 2079 1998 2107 2006 2050 2050 1992 1947 2042 2009 2051 2020 1882 1894 1716 2015 1753 2322 2144
235429 2144 2400 2294 2192 2114 2191 2125 2181 2159 2052 2156 2184 2083 2159 2148 2093 2152 2081 2136 2047 2138 2115 2016 2163 2106 2455
244484 2455 2173 2340 2360 2258 2384 2217 2332 2281 2228 2293 2262 2292 2231 2260 2330 2239 2410 2283 2368 2285 2330 2428 2347 2535
253175 2535 2381 2362 2210 2131 2175 2302 2254 2202 2352 2293 2333 2348 2360 2361 2385 2316 2369 2375 2348 2383 2415 2474 2438 2374 2326 2390 2234
262963 2234 2351 2392 2479 2481 2551 2499 2586 2523 2456 2481 2497 2543 2550 2552 2623 2566 2497 2583 2552 2583 2668 2610 2543 2612 2621 2744 2697 2680 2676 2600
273839 2600 2550 2624 2644 2663 2686 2674 2583 2763 2644 2705 2764 2706 2687 2844 2779 2737 2734 2828 2871 2842 2698 2774 2784 2730 2818 2750 2881
283663 2881 2882 2862 2850 2881 2910 2933 2948 2970 2934 2955 2957 3003 3027 3015 3005 3021 3066 3043 2993 3036 3005 2992 3058 3093 3141 3076 3143 3014 3131
$$ packed form
216913A759J73m9n4J05m5NJ4O5j4%K2L1R9m8O9n6k43Q1p9M0L2K63j48N4P5j45
226375B006M8rk2P7o3J4K8q1J09j01M4%n8m5R5l3M2l1j38J2j78K99k62N69j78
235429B144K56j06j02p8P7o6N6k2j07J04K8j01P6j1n5N9p1N5q9R1k3r9J47n7L49
244484B455k82J67K0j02J26j67J15n1n3O5l1L0o1K9P0r1J71j27Q5q3M5R8q1J88
253175B535j54j9j52p9M4J27m8n2J50n9M0J5J2JK4o9N3Ok7L5L2N9l6o4m8O4j56
262963B234J17M1Q7KP0n2Q7o3o7K5J6M6PKP1n7o9Q6l1L1Q5n8o7O9RJ23m7j7mp6
273839B600n0P4K0J9K3j2r1J80j19O1N9n8j9J57o5m2lR4M3k9j44P6J0n4Q8o8J31
283663B881Jk0j2L1K9K3J5K2l6K1KM6K4j2j0J6M5k3n0M3l1j3O6L5M8o5O7j29J17
$$ plain form
294177 3131 3077 3112 3018 3114 3152 3119 3123 3146 3194 3218 3183 3229 3251 3298 3303 3352 3376 3358 3318 3352 3289 3348 3344 3390 3481 3407 3481 3533 3567 3588
305053 3588 3597 3648 3686 3710 3703 3781 3907 4145 4391 4614 5134 5894 6634 4877 4153 3830 3926 4219 4511 4898 5942
312657 5942 7245 6739 5044 4076 3855 3913 3860 3939 3976 4046 4075 4149 4241 4470 4744 5166 5502 6436 7432 5448 4606
320252 4606 4064 4205 3861 4415 4942 6186 7706 7253 5182 4192 4026 3977 4026 4081 4093 4278 4280 4299 4277 4305 4395
327901 4395 4489 4646 4700 4927 4764 4959 4723 4678 3968 4194 4296 4347 4479 4420 4567 4530 4467 4570 4619 4566 4670 4669 4693
336230 4693 4751 4804 4821 4796 5025 4956 5041 5001 5155 5068 5022 5012 5037 5039 5027 5149 5003 5069 5051 5103 5150 4992 4936 4912 5022 5171
345647 5171 5083 5243 5563 5281 5310 5345 5292 5267 5408 5533 5412 5671 5658 5571 5630 5795 5765 5782 5799 6004 6046 6293 6036
353976 6036 5891 5814 5966 6205 6147 6337 6816 6965 7221 7505 8070 9133 7166 7137 6939 7063 7078 6925 6993 6918
$$ packed form
294177C131n4L5r4R6L8l3MK3M8K4l5M6K2M7NM9K4j8m0L4o3N9mM6R1p4P4N2L4K1
305053C588RN1L8K4pP8J26K38K46K23N20P60P40j757p24l23R6K93K92L87J044
312657E942J303n06j695r68k21N8n3P9L7P0K9P4R2K29K74M22L36R34R96j984q42
320252D606n42J41l44N54N27J244J520m53k071r90j66m9M9N5J2J85KJ9k2K8R0
327901D395R4J57N4K27j63J95k36m5p10K26J02N1J32n9J47l7o3J03M9n3J04jK4
336230D693N8N3J7k5K29o9Q5m0J54q7m6j0K5Kj2J22j46O6j8N2M7j58n6k4J10J49
345647E171q8J60L20k82K9L5n3k5J41J25j21K59j3q7N9J65l0J7J7K05M2K47k57
353976F036j45p7J52K39n8J90M79J49K56K84N65J063j967k9j98J24J5j53O8p5
$$ plain form
361253 6918 6979 6973 7110 7181 6884 6930 7225 7354 7304 7353 7690 7776 7748 7986 8423 8772 9029 9632 10781 8646 8231
368857 8231 8002 8265 8355 8438 8511 8438 8490 8582 8685 8627 8285 8299 8724 8990 8984 9037 9281 9420 9478 9463 9481 9448 9756 9604
377549 9604 9410 9324 9695 9905 10065 10385 10445 10441 10449 10521 10577 10653 10758 10812 11022 11123 11231 11393 11416 11604 11808 11824 12060
385914 12060 12490 12563 12029 12286 12872 13027 12834 12847 13246 13556 13957 14239 14151 14157 14287 14480 14824 15260 15397 15743
393156 15743 15993 16287 17027 17013 17484 17983 18382 18175 18296 20865 22901 22238 22655 23670 23550 24606 25527 26583
399664 26583 27815 28904 30577 32686 34479 37762 41993 47341 52557 54680 56451 61237 69233 83392
404757 83392 109624 149055 202811 304296 624971 915907 237480 57493 32440 29867 29239
408718 29239 32562 36938 36240 37547 40438 38478 38193 40753 44946 49865 54108 55035 56289 58830 67321
$$ packed form
361253F918O1oJ37P1k97M6K95J29n0M9L37Q6k8K38M37L49K57O03J149k135m15
368857H231k29K63R0Q3P3p3N2R2J03n8l42J4M25K66oN3K44J39N8j5J8l3L08j52
377549I604j94q6L71K10J60L20O0mQP2N6P6J05N4K10J01J08J62K3J88K04J6K36
385914A2060M30P3n34K57N86J55j93J3L99L10M01K82q8OJ30J93L44M36J37L46
393156A5743K50K94P40j4M71M99L99k07J21K569K036o63M17J015j20J056R21J056
399664B6583J232J089J673K109J793L283M231N348N216K123J771M786P996J4159
404757H3392K6232L9431N3756J01485L20675K90936o78427j79987k5053k573o28
408718B9239L323M376o98J307K891j960k85K560M193M919M243R27J254K541Q491
$$ plain form
414174 67321 81837 108489 148587 202371 303630 607967 999076 256446 54641 26268
417817 26268 23376 20974 23134 26193 25547 23907 26138 21407 18574 17816 17566 17330 16627 16431 16065 15318
423599 15318 15127 15079 14780 14795 14298 14175 16491 18947 16741 15431 14779 14305 14035 13885 13058 12788 12416 11859
430107 11859 11565 10999 10699 10453 10222 9699 9251 8586 8244 8222 7953 7978 7653 7759 7457 6672 5844 6717 6954
437022 6954 6514 6143 6249 6155 6263 6026 6056 5884 5724 5774 5633 5538 5319 5094 4953 4779 4645 4430 4535 4703
444255 4703 4776 4444 4381 4552 4502 4326 3981 4136 4439 4619 4514 4570 4557 4539 4618 4810 4897 4316 4261 4361 4464 4478
452266 4478 4389 4309 4340 4376 4489 4710 4951 5135 5284 4704 4631 4615 4451 4413 4352 4305 4458 4339 4291 4099 4127 4165 3435
460595 3435 3263 3418 3298 3302 3246 3049 3113 2995 3197 3239 3215 3462 3807 3234 2853 2821 2576 2673 2936 2560 2550 2457
$$ packed form
414174F7321J4516K6652M0098N3784J01259L04337L91109p42630k01805k8373
417817B6268k892k402K160L059o46j640K231m731k833p58k50k36p03j96l66p47
423599A5318j91m8k99J5m97j23K316K456k206j310o52m74k70j50q27k70l72n57
430107A1859k94n66l00k46k31n23m48o65l42k2k69K5l25J06l02p85q28Q73K37
437022F954m40l71J06r4J08k37L0j72j60N0j41r5k19k25j41j74j34k15J05J68
444255D703P3l32o3J71n0j76l45J55L03J80j05N6j3j8P9J92Q7n81n5J00J03J4
452266D478q9q0L1L6J13K21K41J84J49n80p3j6j64l8o1m7J53j19m8j92K8L8p30
460595C435j72J55j20Mn6j97O4j18K02M2k4K47L45n73l81l2k45R7K63l76j0r3
$$ plain form
468553 2457 2329 2026 1807 1761 1732 1670 1541 1547 1394 1289 1214 1027 804 963 908 847 989 832 766 558 570 470
476520 470 296 682 596 507 565 425 355 198 113 136 34 107 -29 -47 -128 -57 -128 -97 -291 -241 -323 -362 -384 -463 -393
485619 -393 -365 -484 -508 -503 -468 -426 -495 -544 -530 -529 -557 -556 -654 -535 -397 -457 -345 -156 -345 -698 -720 -682 -759 -771 -687 -655 -710
495407 -710 -578 -503 -514 -428 -264 130 432 1449 2801 2680 862 -181 -505 -529 -259 -298 -170 -252 -248 -628 -695
503002 -695 -587 -579 -365 -452 -275 -314 -272 -297 -250 -106 -39 330 720 1603 3145 3218 1305 87 -249 -258 -321 -173
510969 -173 -237 -269 -178 -146 -147 -440 -373 -248 -307 -278 -243 -238 -237 -299 -290 -230 -327 -345 -278 -369 -341 -285 -386 -309 -338 -262 -392 -409 -402
521482 -402 -388 -412 -447 -474 -498 -465 -455 -466 -422 -239 -507 -603 -553 -537 -564 -530 -580 -534 -579 -666 -526 -653 -679 -640 -728 -679 -613
531306 -613 -584 -563 -701 -741 -672 -693 -505 -410 -512 -692 -740 -711 -802 -758 -707 -796 -711 -769 -734 -770 -775 -730 -794 -797 -804 -822 -750 -852
$$ packed form
468553B457j28l03k19m6k9o2j29Oj53j05p5j87k23J59n5o1J42j57o6k08J2j00
476520D70j74L86q6q9N8j40p0j57q5K3j02P3j36j8q1P1p1L1j94N0q2l9k2p9P0
485619c93K8j19k4NL5M2o9m9J4Jk8Jr8J19J38o0J12J89j89l53k2L8p7j2Q4L2n5
495407g10J32P5j1Q6J64L94L02J017J352j21j818j043l24k4K70l9J28q2Ml80o7
503002f95J08QK14q7J77l9M2k5M7J44O7L69L90Q83J542P3j913j218l36ro3J48
510969a73o4l2R1L2jk93O7J25n9K9L5NJo2RO0r7j8O7r1K8N6j01P7k9P6j30j7P
521482d02J4k4l5k7k4L3J0j1M4J83k68r6N0J6k7L4n0M6m5q7J40j27k6L9q8M9O6
531306f13K9K1j38m0O9k1J88R5j02j80m8K9r1M4N1q9Q5n8L5l6nM5o4lpj8P2j02
$$ plain form
541457 -852 -717 -828 -912 -832 -822 -833 -751 -796 -839 -788 -710 -647 -833 -764 -831 -811 -839 -856 -831 -761 -790 -799 -792 -760 -855 -831 -757 -713
551608 -713 -798 -768 -761 -718 -715 -812 -722 -729 -781 -731 -730 -712 -730 -817 -688 -737 -698 -642 -721 -698 -658 -712 -684 -780 -746 -825 -731 -714 -714 -673 -748
562846 -748 -716 -764 -768 -703 -730 -770 -726 -746 -747 -827 -809 -797 -775 -755 -787 -706 -750 -763 -753 -788 -752 -728 -695 -735 -705 -740 -761 -733 -763 -758
573722 -758 -700 -768 -804 -758 -797 -799 -681 -725 -734 -698 -797 -753 -743 -830 -588 -722 -689 -684 -744 -765 -702 -682 -737 -751 -743 -712 -661 -722 -646
584235 -646 -647 -698 -488 -660 -669 -616 -562 -498 -616 -574 -652 -720 -731 -910 -804 -924 -778 -681 -823 -667 -693 -745 -788 -888 -690
593290 -690 -758 -706 -738 -700 -601 -652 -724 -670 -618 -700 -620 -701 -695 -692 -557 -659 -568 -623 -565 -579 -592 -612 -671 -618 -631 -598 -583 -585 -607
603803 -607 -686 -645 -609 -645 -587 -675 -600 -635 -589 -672 -626 -546 -545 -632 -604 -535 -576 -579 -602 -610 -531 -667 -612 -592 -517 -541 -644 -581 -625
614308 -625 -569 -613 -652 -583 -643 -527 -639 -612 -548 -572 -643 -590 -655 -664 -561 -600 -570 -437 -568 -547 -508 -606 -474 -575 -463
$$ packed form
541457h52J35j11q4Q0J0j1Q2m5m3N1P8O3j86O9o7K0k8j7K5P0k9rPL2r5K4P4M4
551608g13q5L0PM3Lr7R0pn2N0JJ8j8q7J29m9L9N6p9K3M0n4K8r6L4p9R4J7%M1p5
562846g48L2m8mO5k7m0M4k0jq0J8J2K2K0l2Q1m4j3J0l5L6K4L3m0L0l5k1K8l0N
573722g58N8o8l6M6l9kJ18m4rL6r9M4J0q7K42j34L3No0k1O3K0n5j4QL1N1o1P6
584235f46jn1K10j72rN3N4O4j18M2p8o8j1j79J06j20J46R7j42J56k6n2m3j00J98
593290f90o8N2l2L8R9n1p2N4N2q2Q0q1OLJ35j02R1n5N8j4j3k0n9N3j3L3J5kk2
603803f07p9M1L6l6N8q8P5l5M6q3M6Q0Jq7K8O9m1lk3qP9j36N5K0P5k4j03O3m4
614308f25N6m4l9O9o0J16j12K7O4k4p1N3o5rJ03l9L0J33j31K1L9r8J32j01J12
$$ plain form
623370 -463 -505 -601 -512 -533 -516 -627 -566 -510 -463 -580 -560 -554 -529 -486 -513 -495 -484 -511 -520 -539 -485 -442 -483 -408 -430 -402 -463 -495 -383
633920 -383 -450 -405 -455 -481 -447 -542 -480 -493 -471 -442 -502 -459 -460 -424 -471 -393 -423 -407 -402 -448 -423 -423 -375 -489 -436 -445 -440 -424 -383 -377 -345
645122 -345 -436 -437 -329 -481 -392 -454 -432 -436 -461 -441 -445 -457 -393 -412 -374 -446 -386 -431 -358 -373 -335 -366 -378 -376 -416 -352 -469 -274 -366
655671 -366 -310 -283 -277 -378 -318 -351 -309 -356 -286 -344 -263 -302 -231 -310 -312 -323 -302 -304 -363 -277 -305 -316 -314 -239 -268 -369 -395 -310 -386 -336
666547 -336 -359 -342 -371 -385 -402 -323 -321 -308 -262 -175 -203 -225 -288 -231 -249 -217 -271 -264 -321 -475 -441 -118 -206 -128 -195 -185 -295 -352
676698 -352 -226 -248 -220 -284 -210 -238 -152 -277 -321 -213 -300 -111 -407 -358 -540 -427 -476 -508 -588 -546 -260 -214 -178 -175 -188
685752 -188 -195 -200 -98 -197 -108 -214 -62 -85 -139 -176 -213 -333 -276 -449 -407 -301 -294 -305 -246 -266 -256 -246 -289 -289 -363 -381 -271
695540 -271 -289 -221 -213 -239 -226 -196 -189 -217 -95 -186 -160 -250 -153 -249 -206 -223 -234 -180 -223 -199 -177 -192 -157 -173 -190 -131 -205 -236 -181
$$ packed form
623370d63m2r6Q9k1J7j11O1N6M7j17K0OK5M3k7J8J1k7rj9N4M3m1P5k2K8o1l2J12
633920c83o7M5n0k6L4r5O2j3K2K9o0M3jL6m7P8l0J6Nm6K5%M8j14N3rNJ6M1OL2
645122c45r1jJ08j52Q9o2K2mk5K0mj2O4j9L8p2O0m5P3j5L8l1j2Km0O4j17J95r2
655671c66N6K7Oj01O0l3M2m7P0n8Q1l9P1p9kj1K1kn9Q6k8j1KP5k9j01k6Q5p6N0
666547c36k3J7k9j4j7P9KJ3M6Q7k8k2o3N7j8L2n4Pn7j54L4L23q8P8o7J0j10n7
676698c52J26k2K8o4P4k8Q6j25m4J08q7J89k96M9j82J13m9l2q0M2K86M6L6Lj3
685752a88pnJ02r9Q9j06J52k3n4l7l7j20N7j73M2J06Pj1N9k0J0J0m3%p4j8J10
695540b71j8O8Qk6J3L0Pk8J22r1K6r0R7r6M3j7j1N4m3K4K2j5L5j6j7N9p4l1N5
$$ plain form
706054 -181 -188 -176 -99 -135 -43 -97 -111 -196 -125 -133 -83 -99 -83 26 -177 -52 -92 -79 -65 -136 -182 -136 -84 -68 -89 -80 -58 -76 -24
716558 -24 -60 -129 23 25 67 -36 -52 -92 -141 -83 -113 -58 -86 -59 -100 -58 -74 -89 -19 -121 -54 -159 -71 -86 -65 23 -30 -49
726709 -49 -58 -90 -133 -138 13 -37 -30 -25 -48 -78 -15 -101 -39 -38 -56 42 15 -26 -59 -30 9 -65 -13 -9 -131 -148 -67 -60 64 73 99 7
738310 7 34 -12 3 9 75 52 53 -26 49 32 25 120 73 39 65 -103 198 88 142 281 180 117 26 -19 -153 -53 47
748098 47 -80 80 113 -2 84 27 37 23 60 -5 113 23 125 23 164 252 133 212 84 -130 23 -96 168
756472 168 152 300 198 175 230 62 148 86 74 169 120 188 86 107 70 144 116 156 78 137 226 176 161 362 51 883
765889 883 174 684 -95 2 -87 -54 8 42 -45 68 -2 -58 -30 -4 54 56 100 134 122 102 190 139 244 235 418 139
775306 139 797 30 304 -323 -232 -78 -90 10 55 -95 113 28 94 199 55 86 87 45 119 2 127 47 68
$$ packed form
706054a81pJ2P7l6R2n4j4q5P1qN0j6J6J09k03J25m0J3J4p1m6M6N2J6k1RK2j8N2
716558b4l6o9J52KM2j03j6m0m9N8l0N5k8K7m1M2j6j5P0j02O7j05Q8j5K1Q8n3j9
726709d9rl2m3nJ51n0PNk3l0O3q6O2Jj8R8k7m1l3K9L9p4N2Mj22j7Q1PJ24RK6r2
738310GK7m6J5OO6k3Jp9P5j7pR5m7l4K6j68L01j10N4J39j01o3r1m5j34J00J00
748098D7j27J60L3j15Q6n7J0j4L7o5J18r0J02j02J41Q8j19P9j28k14J53j19K64
756472A68j6J48j02k3N5j68Q6o2j2R5m9O8j02K1l7P4k8M0p8N9Q9n0j5K01l11Q32
765889H83p09N10p79R7q9L3O2L4q7J13p0n6K8K6N8KM4L4j2k0Q8n1J05rJ83k79
775306A39O58p67K74o27R1J54j2J00M5j50K08q5O6J05j44L1Jm2P4j17J25q0K1
$$ plain form
783635 68 69 -25 -86 120 -93 158 280 265 369 309 311 187 266 253 221 193 192 192 132 222 182 180 235 263 187 180 274 149 411
794148 411 280 280 294 214 72 97 77 96 138 173 118 170 90 154 190 169 232 139 195 191 239 222 353 216 343 264 206
803937 206 176 179 147 201 256 332 261 329 178 248 270 312 305 290 336 236 322 352 372 319 278 355 375 265 245 336 277 346
814079 346 348 360 349 244 251 354 368 350 354 350 324 285 313 390 365 347 341 391 458 444 501 497 387 437 642 582 452 395 393 428
824999 428 459 451 442 488 407 465 366 462 439 482 497 504 484 575 500 520 466 582 495 503 460 533 543 598 593 561 443 530 466 475 483
836238 483 528 487 470 438 499 468 496 588 586 547 556 620 681 683 705 770 818 749 752 797 819 719 626 673 619 643 583 621 596 648
847113 648 709 757 738 815 829 1051 1293 1623 2270 2451 3150 2734 2589 2481 3246 2894 4675 2890 2881 1728 1139
854717 1139 952 996 870 908 910 819 816 829 920 844 864 872 908 834 962 952 1021 1108 1167 1045 948 782 792 859 825 949 915
$$ packed form
783635F8Jr4o1K06k13K51J22j5J04o0Kj24P9j3l2k8j%o0R0m0kN5K8p6pR4j25K62
794148D11j31%J4q0j42K5k0J9M2L5n5N2q0O4L6k1O3r3N6mM8j7J31j37J27p9n8
803937B06l0Ll2N4N5P6p1O8j51P0K2M2pj5M6j00Q6L0K0n3m1P7K0j10k0R1n9O9
814079C46KJ2j1j05PJ03J4j8Mmk6l9K8P7k5j8oN0O7j4N7mj10N0K05o0j30n7kL5
824999D28L1qrM6q1N8r9R6k3M3J5Pk0R1p5K0n4J16q7Qm3P3J0N5nl2j18Q7o4RQ
836238D83M5m1j7l2O1l1K8R2kl9RO4O1KK2O5M8o9LM5K2j00r3M7n4K4o0L8k5N2
847113F48O1M8j9P7J4K22K42L30O47J81O99m16j45j08P65l52J781j785rj153n89
854717A139j87M4j26L8Kr1lJ3R1p6K0QL6p4J28j0O9Q7N9j22r7j66J0O7l4J24l4
$$ plain form
864497 915 927 845 909 880 904 903 942 912 913 1030 1008 1079 1049 1133 1161 1225 1269 1249 1330 1334 1347 1358 1367 1354 1279 1233 1199 1140 1132 1034 1165
875744 1165 1080 1154 1112 1171 1167 1222 1230 1161 1098 1172 1167 1136 1189 1254 1224 1167 1093 1107 1130 1180 1196 1238 1259 1144 1198 1181 1248 1145 1215
886249 1215 1103 1098 1212 1180 1384 1413 1344 1465 1285 1425 1253 1532 1490 1619 1723 1622 1624 1561 1546 1565 1520 1582 1636 1703
894940 1703 1692 1714 1624 1672 1620 1711 1841 1897 2058 2408 3145 3054 3899 3059 3092 2590 2264 2311 2200 2253 2167 2279 2259
903314 2259 2236 2109 2119 1769 1925 2027 2078 2339 2162 2363 2367 2451 2482 2574 2515 2617 2775 3255 3230 2725 2760 2696 2876
911643 2876 2898 2945 2856 2753 2743 2841 2949 2994 2993 3169 3113 3267 3446 3575 3547 3642 3864 4132 4620 5232 6272 9009
919610 9009 8188 6551 6520 6168 5775 5726 6017 6207 6657 7168 7983 9001 10389 12183 14295 16170 17283
925755 17283 17110 16078 14373 13064 11933 11130 10841 11524 14295 22421 20570 15896 16084 14071 10297
$$ packed form
864497I15J2q2O4k9K4jL9l0JJ17k2P1l0Q4K8O4M4k0Q1MJ3J1Rj3p5m6l4n9qr8J31
875744A165q5P4m2N9mN5Qo9o3P4nl1N3O5l0n7p4J4K3N0J6M2K1j15N4j7O7j03P0
886249A215j12nJ14l2K04K9o9J21j80J40j72K79m2J29J04j01Ko3j5J9m5O2N4O7
894940A703j1K2r0M8n2R1J30N6J61L50P37r1Q45q40L3n02l26M7j11N3q6J12k0
903314B259k3j27J0l50J56J02N1K61j77K01MQ4L1R2n9J02J58M80k5n05L5o4J80
911643B876K2M7q9j03j0R8J08M5jJ76n6J54J79J29k8R5K22K68M88O12J040K737
919610I009q21j637l1l52l93m9K91J90M50N11Q15J018J388J794K112J875J113
925755A7283j73j032j705j309j131q03k89O83K771Q126j851m674J88k013l774
$$ plain form
931211 10297 8663 7932 7251 7006 6776 6868 6693 6803 6798 7126 7027 7496 7512 8063 8559 8506 9971 11571 12557 17085
938444 17085 22232 36007 34081 27573 32443 31637 21789 17033 15071 14800 14812 15810 17858 18543 21760
943908 21760 21127 23438 23895 26988 32863 44025 63483 95215 160271 404375 347170 695203
948277 695203 385144 405598 198448 90406 79157 77365 58173 45982 41129 36898 35912 32887
952600 32887 31855 29527 28319 26897 26254 25543 24950 24210 24279 23640 23786 24291 26110 26524 31614 35415 41498
958790 41498 39482 37786 47839 55399 41691 30907 25831 23342 21667 20904 20169 19433 18903 18235 17952
964201 17952 17391 17088 16861 16354 16390 16523 16185 16100 16278 16137 18718 20533 20224 21870 29240 32711 25951
970391 25951 19301 16218 14624 13901 13351 12930 12493 12044 11706 11316 11132 10880 10777 10881 10566 10571 10351 10261 10281
$$ packed form
931211A0297j634p31o81k45k30R2j75J10nL28r9M69J6N51M96n3J465J600R86M528
938444A7085N147J3775j926o508M870q06r848m756j962k71J2R98K048O85L217
943908B1760o33K311M57L093N875J1162J9458L1732O5056K44104n7205L48033
948277F95203l10059K0454k07150j08042j1249j792j9192j2191m853m231r86l025
952600C2887j032k328j208j422o43p11n93p40O9o39J46N05J819M14N090L801O083
958790D1498k016j696J0053P560j3708j0784n076k489j675p63p35p36n30o68k83
964201A7952n61l03k27n07L6J33l38q5J78j41K581J815l09J646P370L471o760
970391B5951o650l083j594p23n50m21m37m49l38l90j84k52j03J04l15Nk20r0K0
$$ plain form
977261 10281 10594 10831 10703 10722 11627 14575 15669 12832 10786 9794 9362 9182 9103 9015 8884 8880 8749 8693 8729 8690
984503 8690 8704 8632 8759 8717 8816 8703 8513 8333 8232 8361 8509 8587 9141 9033 8500 8215 8194 8135 8038 7981 7802 7590
992505 7590 7574 7420 7432 7388 7202 7310 7233 7210 7216 7347 7296 7723 7461 7469 7202 7063 6984 6948 6779 6888 6632 6558 6440
1000834 6440 6443 6295 6292 6162 6069 6026 5973 5930 5696 5718 5435 5382 5373 5223 5421 5115 5125 5105 5009 4924 4714 4857 4805 4800 4889 4761
1010251 4761 4616 4614 4497 4461 4433 4295 4292 4239 4245 4243 4404 4577 4721 4766 4722 4716 4720 4673 4695 4802 4947 5093 5318 5686 6219
1019314 6219 6969 7739 8645 9600 10273 11447 13179 16758 23846 40125 67506 100195 144199 156191
1024408 156191 164497 133047 99644 62559 39820 26700 22951 21082 20229 19014 17986 16925 16228
1029094 16228 15975 15916 15751 15868 16046 15943 16570 17278 19419 23621 33230 53587 67091 113903 102835
$$ packed form
977261A0281L13K37j28J9R05K948J094k837k046r92m32j80p9q8j31mj31n6L6l9
984503H690J4p2J27m2R9j13j90j80j01J29J48P8N54j08n33k85k1n9r7n7j79k12
992505G590j6j54J2m4j86J08p7k3OJ31n1M27k62Qk67j39p9l6j69J09k56p4j18
1000834F440Lj48lj30r3m3n3m3k34K2k83n3rj50J98l06J0k0r6q5k10J43n2nQ9j28
1010251D761j45kj17l6k8j38ln3OkJ61J73J44M5m4oMm7K2J07J45J46K25L68N33
1019314F219P50P70R06R55O73J174J732L579P088J6279K7381L2689M4004J1992
1024408A56191Q306l1450l3403l7085k2739j3120l749j869q53j215j028j061o97
1029094A6228k53n9j65J17J78j03O27P08K141M202R609K0357J3504M6812j1068
$$ plain form
1034558 102835 143331 104641 102178 68728 48681 34764 26143 22947 21680 20456 19157 17968 16842
1039245 16842 16125 15606 15193 15135 16134 15238 16862 14828 14385 13182 12621 12427 12389 12182 12387 12140 12092 11707 11427
1046159 11427 11244 10924 10619 10441 10219 10016 9786 9523 9428 9133 9035 8849 8645 8492 8335 8238 8074 7970 7757 7600
1053392 7600 7450 7361 7223 7244 7133 7041 7017 6971 6784 6740 6649 6581 6520 6506 6411 6177 6261 6162 6092 5924 5868 5799 5735 5603 5652
1062447 5652 5619 5602 5484 5464 5375 5330 5259 5279 5154 5276 5219 5277 5202 5184 5113 5184 5039 4992 4885 4877 4898 4837 4852 4805 4799 4862 4831
1072279 4831 4938 4861 4882 4779 4786 4675 4671 4577 4631 4566 4524 4479 4557 4374 4406 4346 4301 4148 4231 4114 4084 4031 4027 3941 3836 3800
1081696 3800 3820 3837 3829 3799 3850 3722 3662 3586 3641 3521 3575 3557 3501 3459 3368 3337 3298 3245 3174 3079 3068 2983 2963 2876 2887 2879 2916 2819
1091847 2819 2890 2687 2767 2632 2649 2671 2621 2567 2588 2564 2559 2557 2563 2504 2413 2453 2350 2296 2360 2286 2233 2198 2206 2210 2105 1995 2038 2004
$$ packed form
1034558A02835M0496l8690k463l3450k0047j3917q621l196j267j224j299j189j126
1039245A6842p17n19m13n8R99q96J624k034m43j203n61j94l8k07K05k47m8l85k80
1046159A1427j83l20l05j78k22k03k30k63r5k95r8j86k04j53j57r7j64j04k13j57
1053392G600j50q9j38K1j11r2k4m6j87m4r1o8o1j4r5k34Q4r9p0j68n6o9o4j32M9
1062447E652l3j7j18k0q9m5p1K0j25J22n7N8p5j8p1P1j45m7j07qK1o1J5m7oO3l1
1072279D831J07p7K1j03Pj11mr4N4o5m2m5P8j83L2o0m5j53Q3j17l0n3mq6j05l6
1081696C800K0J7ql0N1j28o0p6N5j20N4j8n6m2r1l1l9n3p1r5j1q5k0q7J1qL7r7
1091847B819P1k03Q0j35J7K2n0n4K1k4nkOn9r1M0j03n4O4p4n3l5QMj05j10M3l4
$$ plain form
1101998 2004 2078 1917 1943 1958 1870 1977 1893 1958 1877 1850 1904 1845 1889 1781 1787 1797 1761 1762 1729 1744 1745 1626 1697 1576 1571 1555 1596 1578
1112140 1578 1584 1607 1634 1591 1620 1617 1773 1942 2133 2438 2286 2348 1973 1832 1753 1535 1631 1651 1592 1640 1585 1587 1591 1549 1519 1471
1121565 1471 1562 1522 1411 1550 1455 1534 1489 1524 1538 1695 1839 2072 2007 2208 2053 1793 1723 1521 1529 1460 1548 1547 1444 1551
1130257 1551 1477 1559 1417 1488 1406 1430 1467 1348 1394 1381 1406 1430 1343 1394 1310 1273 1304 1354 1404 1370 1321 1278 1388 1299 1272 1358 1269
1140081 1269 1335 1275 1310 1226 1245 1249 1288 1209 1212 1156 1204 1179 1206 1230 1246 1322 1207 1206 1239 1195 1198 1308 1132 1237 1218 1133 1190 1151
1150232 1151 1012 1040 1054 1066 1067 1010 1099 1111 1035 1083 1018 1018 983 960 1016 1009 1132 1032 992 1015 887 990 902 944 966 946 1054
1160011 1054 1042 1003 1012 1016 997 991 991 1003 901 949 914 976 953 892 890 955 920 866 937 1013 996 989 1007 1010 941 951 878 836 836 865 854 915
1171621 915 911 869 863 949 913 864 925 916 918 906 824 881 875 895 875 797 831 856 805 808 842 797 914 824 835 904 816 809 748 801 856 795
$$ packed form
1101998B004P4j61K6J5q8J07q4O5q1k7N4n9M4j08OJ0l6Jl3J5Jj19P1j21nj6M1j8
1112140A578OK3K7m3K9lJ56J69J91L05j52O2l75j41p9k18R6K0n9M8n5KMm2l0m8
1121565A471R1m0j11J39r5P9m5L5J4J57J44K33o5K01j55k60p0k02Qo9Q8jj03J07
1130257A551p4Q2j42P1q2K4L7j19M6j3K5K4q7N1q4l7L1N0N0l4m9m3J10q9k7Q6q9
1140081A269O6o0L5q4J9ML9p9Ln6M8k5K7K4J6P6j15jL3m4LJ10j76J05j9q5N7l9
1150232A151j39K8J4J2Jn7Q9J2p6M8o5%l5k3N6pJ23j00m0K3j28J03q8M2K2k0J08
1160011A054j2l9RMj9o%J2j02M8l5O2k3o1kO5l5n4P1P6j7pJ8Lo9J0p3m2%K9j1O1
1171621I15mm2oQ6l6m9O1rKj2q2N7oK0k0p8L4K5n1LL4m5J17r0J1O9q8po1N3N5o1
$$ plain form
1183222 795 858 818 856 860 759 795 790 745 823 848 827 804 805 824 781 777 744 786 808 813 802 785 814 741 724 653 725 726 753 778 780 782
1194823 782 795 796 784 731 764 748 800 724 708 751 791 774 797 719 749 773 711 757 879 786 892 757 751 766 834 730 782 803
1204974 803 751 823 711 719 706 712 776 705 754 782 666 700 864 749 789 747 711 686 674 690 728 737 691 679 683 692 484 590
1215124 590 494 689 655 743 810
$$ packed form
1183222G95O3m0L8Mj01L6nm5P8K5k1k3JJ9m3ml3M2K2Nj1j7K9p3j7p1P2JK7K5KK
1194823G82J3Jj2n3L3j6N2p6j6M3M0j7K3p8L0K4o2M6J22r3J06j35oJ5O8j04N2K1
1204974H03n2P2j12Qj3OO4p1M9K8j16L4J64j15M0m2l6k5j2J6L8Rm6j2MRk08J06
1215124E90r6J95l4Q8O7
##END=
