##TITLE=Unknown
##JCAMP-DX= 5.00 $$From Command Line Converter 1.0
##DATA TYPE= NMR Spectrum
##DATA CLASS=  XYDATA

##ORIGIN= Exported from Command Line Converter 1.0
##OWNER= SVB
##$URL= http://wwwchem.uwimona.edu.jm:1104/software/jcampdx.html
##SPECTROMETER/DATA SYSTEM= NUTS EXPORT
##.OBSERVE FREQUENCY= 300.149506
##.OBSERVE NUCLEUS= ^1H
##INSTRUMENTAL PARAMETERS= 1H
##XUNITS= PPM
##YUNITS= ARBITRARY UNITS
##XFACTOR= 0.0000033653
##YFACTOR= 17.2459110000
##FIRSTX=  -0.127640
##FIRSTY= 5266.000000
##LASTX=   3.237600
##NPOINTS= 4138
##MAXY= 17200916.000000
##MINY= -44995.000000
##DELTAX=   0.000813
##XYDATA= (X++(Y..Y))
$$ plain form
-37929 305 288 286 280 271 260 302 274 253 272 301 298 263 299 268 263 300 300 281 300 286 311 299 299 305 313 310 320 329 313 280 295 313 285 359
-29706 359 303 322 320 332 317 304 376 318 360 343 335 317 262 313 138 93 -168 -291 545 491 231 345 171 306 240 327
-23428 327 289 299 290 288 271 251 278 278 280 276 244 271 282 282 253 276 317 297 283 284 280 288 281 302 269 280 275 256 296 295 256 280 278 280 233 310
-14721 310 322 297 319 297 338 322 331 318 333 307 306 324 313 320 332 337 312 335 331 320 353 329 325 356 363 322 337 332 344 368 373 352 363
-6746 363 353 394 365 388 376 375 402 420 446 430 487 459 504 568 670 518 540 555 590 639 734 826 1025 1343 1565 2133
-462 2133 3245 6374 3462 387 317 361 363 327 289 347 334 352 348 386 444 552 351 312 349 352 343 343 318 328 340 326
5816 326 325 313 336 314 309 326 318 292 291 293 289 299 335 295 311 314 302 271 312 290 292 269 284 294 316 321 286 296 276 306 296 301 307 296
14039 296 283 298 257 291 302 296 300 291 286 307 288 319 282 303 288 296 302 286 313 300 332 330 351 413 291 311 282 312 300 313 307 315 286
$$ packed form
-37929C05j7korj1M2k8k1J9K9ll5L6l1nL7%j9J9j4K5j2%OQlJ0Rj6l3J5J8k8P4
-29706C59n6J9kJ2j5j3P2n8M2j7qj8n5N1j75m5k61j23Q36n4k60J14j74J35o6Q7
-23428C27l8J0rkj7k0K7%Kml2K7J1%k9K3M1k0j4JmQpK1l3J1nj9M0jl9K4kKm7P7
-14721C10J2k5K2k2M1j6Rj3J5k6jJ8j1PJ2Nk5K3mj1L3k4mL1Pm1J5nJ2K4Nk1J1
-6746C63j0M1k9K3j2jK7J8K6j6N7k8M5O4J02j52K2J5L5M9R5R2J99L18K22N68
-462B133J112L129k912l075p0M4Kl6l8N8j3J8mL8N8J08k01l9L7Lr%k5J0J2j4
5816C26jj2K3k2nJ7qk6jKmJ0L6m0J6Lj2l1M1k2Kk3J5J0K2Nl5J0k0L0j0NOj1
14039B96j3J5m1L4J1oMrnK1j9L1l7K1j5QOj6K7j3L2kK1O2j22K0k9L0j2J3oQk9
$$ plain form
22014 286 299 287 299 301 321 284 270 309 301 281 318 312 278 296 315 334 303 306 310 288 291 292 278 291 299 321 340 298 275 286 284 301 298 291
30237 291 301 312 321 307 306 293 302 300 298 289 319 273 291 298 308 270 321 282 296 332 343 292 304 285 265 310 323 336 323 333 357 402
37971 402 426 306 269 287 294 287 287 268 310 298 272 280 287 307 286 287 315 289 326 264 287 242 274 319 232 388 455 1097 1213 43
45222 43 228 266 344 226 322 279 290 285 260 321 283 294 285 302 292 293 323 321 289 340 300 293 266 328 277 292 305 286 313 309 311 283
52961 283 268 300 304 280 321 310 278 313 305 296 291 300 316 291 309 285 278 300 330 311 297 304 282 282 318 285 309 295 288 289 287 298 299 303 319
61420 319 303 297 287 304 292 302 284 307 295 309 324 300 302 288 284 288 323 327 322 325 293 326 326 294 289 318 325 300 276 284 339 321 301 328
69644 328 304 314 315 297 294 315 271 294 332 318 292 292 315 294 300 306 331 302 332 332 336 315 279 320 302 321 320 286 303 340 332 326 314 279
77837 279 280 275 281 298 305 309 308 294 292 282 327 303 321 327 321 307 309 299 313 295 309 279 309 330 302 283 320 301 292 298 302 312 315 325 315 287
$$ packed form
22014B86J3j2J2KK0l7j4L9qk0L7ol4J8J9J9l1LMk2LJj4J3QK2J9m2k3J1kJ7lp
30237B91J0J1Rj4jj3RkkrL0m6J8PJ0l8N1l9J4L6J1n1J2j9k0M5J3J3j3J0K4M5
37971D02K4j20l7J8Pp%j9M2j2k6QPK0k1JK8k6L7o2K3m5L2M5q7J56O7O42J16j170
45222D3J85L8P8j18R6m3J1nk5O1l8J1rJ7j0JL0kl2N1m0pk7O2n1J5J3j9K7mKk8
52961B83j5L2Mk4M1j1l2L5qrnRJ6k5J8k4pK2L0j9j4Pk2%L6l3K4j4pJkJ1JMJ6
61420C19j6oj0J7j2J0j8K3j2J4J5k4Kj4mML5MnLl2L3%l2nK9Pk5k4QN5j8k0K7
69644C28k4J0Jj8lK1m4K3L8j4k6%K3k1OOK5k9L0%Mk1l6M1j8J9jl4J7L7qoj2l5
77837B79JnOJ7PMjj4kj0M5k4J8Ooj4Kj0J4j8J4l0L0K1k8j9L7j9rOMJ0LJ0j0k8
$$ plain form
86543 287 315 302 301 293 291 300 290 312 315 286 305 335 260 310 303 300 302 308 304 310 308 289 305 295 287 327 299 294 297 293 288 327 288 287 301 310 317 329 313
95975 313 318 318 306 316 328 299 322 287 323 325 300 334 297 308 293 288 304 365 323 292 305 351 335 339 325 348 373 364 383 355 362 380
103715 380 345 264 287 288 297 320 307 292 305 284 331 304 333 299 313 331 327 332 334 323 313 306 312 314 312 299 316 282 307 297 313 326 280
111690 280 322 290 329 333 338 324 328 306 326 308 309 288 319 328 302 314 328 326 344 338 317 314 305 325 304 305 325 318 280 297 277 309 299 313
119913 313 283 341 328 311 275 344 312 290 292 355 372 357 320 306 325 321 320 338 300 277 320 322 321 326 322 325 317 308 321 311 347 345 325 334 331
128378 331 338 318 318 331 326 314 324 343 312 325 329 304 317 338 337 329 317 312 306 307 283 282 342 324 357 326 343 344 316 328 346 323 340 315
136596 315 348 346 320 332 320 334 324 292 336 325 336 326 367 337 335 369 435 361 327 334 320 324 355 360 331 321 337 346 318 350 321 362
144335 362 336 331 338 329 358 310 313 318 338 323 350 347 335 327 330 295 305 334 354 332 337 347 339 327 316 358 308 325 362 337 335 334 316 320 315 295
$$ packed form
86543B87K8j3jqkRj0K2Lk9J9L0p5N0plKOmOkj9J6j0qM0k8nLmnL9l9jJ4RPJ2j6
95975C13N%j2J0J2k9K3l5L6Kk5L4l7J1j5nJ6O1m2l1J3M6j6Mj4K3K5rJ9k8PJ8
103715C80l5q1K3JRK3j3j5J3k1M7k7K9l4J4J8mNKj1j0pOKkj3J7l4K5j0J6J3m6
111690B80M2l2L9MNj4Mk2K0j8Jk1L1Rk6J2J4kJ8ok1lrK0k1JK0pl8J7k0L2j0J4
119913C13l0N8j3j7l6O9l2k2KO3J7j5l7j4J9mjJ8l8k3M3KjNmLqrJ3j0L6kk0Rl
128378C31Pk0%J3nj2J0J9l1J3Mk5J3K1jqj2noJk4jO0j8L3l1J7Jk8J2J8k3J7k5
136596C15L3kk6J2j2J4j0l2M4j1J1j0M1l0kL4O6p4l4Pj4ML1Nk9j0J6Rk8L2k9M1
144335C62k6nPrK9m8LNK0j5K7lj2qLl5J0K9K0k2NJ0qj2j1M2n0J7L7k5kjj8Mnk0
$$ plain form
153012 295 317 341 340 342 318 346 337 351 327 347 311 302 330 338 324 304 342 316 345 332 327 321 340 342 338 336 329 334 322 328 337 323 312 329 337 337 326
161960 326 306 286 310 290 282 355 402 397 369 390 360 332 329 338 386 359 326 341 350 362 347 354 326 353 357 338 356 353 355 315 401 329 345
169936 345 403 295 389 329 355 366 318 328 353 303 359 325 344 342 358 351 319 373 341 345 352 328 362 361 341 340 351 345 352 301 354 362 400
177917 400 352 367 341 344 348 339 364 363 353 326 381 347 359 325 362 337 352 358 350 351 328 357 396 374 379 326 379 373 374 361 367 357 357 368 359
186382 359 368 357 361 353 355 382 354 359 360 366 359 377 357 386 374 369 374 356 365 380 382 339 349 355 354 367 375 375 371 360 371 360 348 347 363 381 340 388
195572 388 353 382 353 362 401 370 375 368 373 386 371 398 357 373 360 365 372 371 398 383 360 382 358 388 390 376 400 351 365 357 353 351 376 387
203795 387 383 348 371 386 382 372 367 393 363 369 360 355 394 357 380 379 379 365 378 390 359 385 383 392 409 382 403 347 374 369 396 391 400 400 381 375
212472 375 374 371 372 375 383 390 387 389 392 398 424 392 362 352 410 353 378 356 385 363 397 405 363 377 353 391 358 402 358 372 390 407 396 402 397
$$ packed form
153012B95K2K4jKk4K8rJ4k4K0l6rK8Qj4k0L8k6K9j3noJ9KmkpNj2ORj4j1J7Q%j1
161960C26k0k0K4k0qP3M7nk8K1l0k8lRM8k7l3J5RJ2j5Pk8K7Mj9J8lKm0Q6p2J6
169936C45N8j08R4o0K6J1m8J0K5n0N6l4J9kJ6pl2N4l2MPk4L4jk0jJ1oPn1N3QL8
177917D00m8J5k6LMrK5jj0k7N5l4J2l4L7k5J5OqJk3K9L9k2Nn3N3oJj3Oj0%J1r
186382C59Rj1MqKK7k8NJOpJ8k0K9j2nNj8RJ5Km3J0OjJ3Q%mj1J1j1j2jJ6J8m1M8
195572C88l5K9k9RL9l1NpNJ3j5K7m1J6j3NPjK7j5k3K2k4L0Kj4K4m9J4qmkK5J1
203795C87ml5K3J5mj0nK6l0OrnL9l7K3j%j4J3J2l1K6kRJ7k7K1n6K7nK7nR%j9o
212472C75jlJLQPlKLOK6l2l0j0N8n7K5k2K9k2L4Qm2J4k4L8l3M4m4J4J8J7j1On
$$ plain form
220931 397 367 344 391 372 364 383 365 425 416 400 372 370 380 409 390 403 391 377 441 408 377 431 446 423 427 437 400 418 420 412 379 395
228670 395 426 376 396 401 430 410 405 427 391 422 386 436 398 401 412 403 394 389 406 405 411 437 438 408 397 422 413 417 407 441 413 460 431 434 411
237135 411 430 413 445 450 444 437 476 475 490 523 509 518 538 651 606 467 451 436 432 446 430 421 428 416 396 419 440 445 432 421 460 455 424
245111 424 455 459 449 452 423 456 473 468 465 466 470 494 456 510 532 485 499 510 494 498 511 459 477 503 505 525 547 551 584 605 600 600 571 577 572
253576 572 566 554 535 559 532 522 547 528 543 517 521 508 506 511 535 518 516 502 532 529 534 526 520 529 512 535 516 555 549 583 557 540 541 585 563
262040 563 537 569 567 585 583 557 597 593 568 589 607 610 626 702 640 579 668 649 651 609 625 672 622 651 639 701 694 716 763 742 764 792
269774 792 871 1001 1199 1486 2039 3561 3509 1446 965 856 752 736 763 855 902 972 993 926 894 866 920 957 1006
275327 1006 1086 1127 1185 1244 1442 1736 2237 3013 4340 6495 6921 4305 3298 2444 1837 1429 1244 1197 1137 1126
$$ packed form
220931C97l0k3M7j9qJ9j8O0rj6k8kJ0K9j9J3j2j4O4l3l1N4J5k3MJ0l7J8Kql3J6
228670C95L1n0K0NK9k0nK2l6L1l6N0l8LJ1rrnJ7jOK6Jl0j1K5rMj0L4k8M7k9Lk3
237135D11J9j7L2NopL9jJ5L3j4RK0J13m5j39j6j5mJ4j6rPj2k0K3K1Nj3j1L9nl1
245111D24L1Mj0Lk9L3J7nlJMK4l8N4K2m7J4J1j6MJ3n2J8K6KK0K2ML3K1n%k9On
253576E72oj2j9K4k7j0K5j9J5k6Mj3kNK4j7kj4L0lNqoRj7K3j9L9oL4k6j7JM4k2
262040E63k6L2kJ8kk6M0mk5K1J8LJ6P6o2o1Q9j9Km2J6M7n0K9j2O2pK2M7k1K2K8
269774G92P9J30J98K87N53J522n2k063m81j09j04j6K7R2M7P0K1o7l2k8N4L7M9
275327A006Q0M1N8N9J98K94N01P76J327K155M26k616j007q54o07m08j85m7o0j1
$$ plain form
280179 1126 1105 1067 1051 1096 1069 987 939 915 896 905 901 873 920 882 767 678 821 1546 1367 1213 1140 1114 1078 1097 1074 1082 1051
286704 1051 1060 1048 1066 1103 1106 1097 1071 1064 1085 1104 1205 1369 1759 2058 2330 2622 4547 5166 1423 1103 1136 1122 1088 1112
292498 1112 1119 1133 1067 1060 1053 1005 1084 1087 1034 1024 1009 1092 1073 1045 1070 1033 1051 1061 1019 1099 1077 1110 1185 1155 1150 1170 1210 1199 1202 1252 1213
299990 1213 1206 1089 1195 1249 1119 994 1144 1021 944 1123 1249 1367 1362 1259 1053 875 794 748 855 1041 1009 999
305301 999 1007 940 998 1110 1002 911 1039 1129 1122 1054 1023 1082 1153 1123 1069 1150 1223 1251 1221 1176 1228 1236 1231 1273 1468 1622 1780 1896
312063 1896 1966 1584 1676 1887 2063 1935 1962 1799 1779 1813 2128 2394 2633 2960 3377 4177 5021 3599 2797 2454
316920 2454 2301 2224 2210 2194 2177 2171 2225 2260 2287 2365 2433 2487 2420 2137 2053 2156 2250 2291 2134 2222 2237 2293 2336 2313 2383 2450 2433
323440 2433 2361 2272 2233 2380 2450 2529 2540 2520 2561 2530 2633 2738 2885 3185 3873 4217 3074 2872 2958 2991 2950 2688 2662
$$ packed form
280179A126k1l8j6M5k7q2m8k4j9Rmk8M7l8j15q9J43P25j79j54p3k6l6J9k3Ql1
286704A051Rj2J8L7Lrk6pK1J9J01J64L90K99K72K92J925O19l743l20L3j4l4K4
292498A112PJ4o6ppm8P9Ln3j0j5Q3j9k8K5l7J8J0m2Q0k2L3P5l0nK0M0j1LN0l9
299990A213pj17J06N4j30j25J50j23p7J79J26J18nj03k06j78q1m6J07J86l2j0
305301I99Qo7N8J12j08r1J28R0po8l1N9P1l0n4Q1P3K8l0m5N2QnM2J95J54J58J16
312063A896P0l82R2K11J76j28K7j63k0L4L15K66K39L27M17Q00Q44j422q02l43
316920B454j53p7j4j6j7oN4L5K7P8O8N4o7k83q4J03R4M1j57Q8J5N6M3k3P0O7j7
323440B433p2q9l9J47P0P9J1k0M1l1J03J05J47L00O88L44j143k02Q6L3m1k62k6
$$ plain form
328992 2662 2466 2407 2574 2701 2673 2644 2658 2833 2866 2431 2533 2800 2767 2561 2540 2544 2817 2973 3313 4099 5409 4659
334303 4659 4353 4774 5356 5091 5140 4788 4347 5162 5993 7136 8034 10014 10748 11420 12863 15329 18459 22879
338671 22879 28030 33334 41308 37271 41543 59616 95089 139794 215132 368809 746131 997390
341554 997390 262358 108279 78154 59978 54097 51267 51846 50497 44427 40386 36219 33490 31979
344708 31979 31307 31840 30651 28963 28454 27746 26399 25641 24778 23130 21371 20342 19504 19101 19012 18619 18242
348804 18242 17927 17733 17440 16862 16597 16211 15700 15254 14785 14622 14412 13767 13366 13325 13118 12787 12530 12353 12232
353414 12232 11978 11412 11095 10781 10473 10353 10256 10062 9853 9622 9301 9046 8879 8680 8584 8458 8121 7914 7800
357994 7800 7710 7746 7719 7681 7483 7359 7242 7238 7265 7219 7238 7266 7237 7233 7175 6997 7135 7182 7161 6856 6654 6747 6764 6761 6784 6755
$$ packed form
328992B662j96n9J67J27k8k9J4J75L3m35J02K67l3k06k1MK73J56L40P86J310p50
334303D659l06M21N82k65M9l52m41Q15Q31J143Q98J980P34O72J443K466L130M420
338671B2879N151N304P974m037M272J8073L5473M4705P5338J53677L77322K51259
341554I97390p35032j54079l0125j8176n881k830N79j349o070m041m167k729j511
344708C1979o72N33j189j688n09p08j347p58q63j648j759j029q38m03q9l93l77
348804A8242l15j94k93n78k65l86n11m46m69j63k10o45m01m1k07l31k57j77j21
353414A2232k54n66l17l14l08j20r7j94k09k31l21k55j67j99r6j26l37k07j14
357994G800r0L6k7l8j98j24j17mK7m6J9K8k9mn8j78J38M7k1l05k02R3J7lK3k9
$$ plain form
364272 6755 6760 6763 6737 6681 6687 6740 6856 6876 6927 6770 6870 6710 6681 6581 6635 6590 6560 6565 6573 6665 6679 6310 6050 6025 6000 5766 5838
370797 5838 6044 6075 6096 6200 6223 6162 6118 6115 6173 6073 5939 5927 5970 5892 5862 5798 5774 5704 5579 5570 5583 5564 5476 5313 5379 5440
377105 5440 5384 5278 5252 5180 5238 5348 5187 5081 4922 4607 4400 4384 4419 4410 4516 4396 4041 4081 4015 3724 3693 3790 3676
382658 3676 3482 3486 3405 3456 3322 3290 3275 3220 3173 3160 3162 3084 3059 3040 2958 2980 2927 2855 2846 2808 2834 2804 2713 2677 2659 2688 2624 2586 2571
389666 2571 2505 2492 2491 2425 2434 2462 2417 2351 2288 2248 2233 2234 2211 2152 2128 2079 2147 2114 2110 2093 2067 2034 2069 2046 1998 1973 1990 1980 1917 1934
396917 1934 1867 1781 1707 1699 1619 1514 2054 2639 2449 2249 2256 2281 2287 2205 2220 2317 2270 2258 2291 2278 2340 2474 2630 2924 3447
402953 3447 4083 4684 4867 4458 3825 3195 2669 2492 2438 2389 2336 2288 2284 2228 2175 2146 2132 2111 2122 2097 2064 2015 2019 1945 1978
408989 1978 1976 1971 1919 1965 1851 1843 1836 1793 1789 1788 1852 1804 1763 1747 1737 1708 1697 1637 1662 1635 1617 1610 1589 1591 1577 1603 1554 1543 1506 1481 1506 1485
$$ packed form
364272F755NLk6n6ON3J16K0N1j57J00j60k9j00N4m5l0NQR2J4l69k60k5k5k34P2
370797E838K06L1K1J04K3o1m4lN8j00j34j2M3p8l0o4k4p0j25rJ3j9q8j63O6O1
377105E440n6j06k6p2N8J10j61j06j59l15k07j6L5rJ06j20l55M0o6k91l1R7j14
382658C676j94Mq1N1j34l2j5n5m7j3Kp8k5j9q2K2n3p2rl8K6l0r1l6j8K9o4l8j5
389666B571o6j3jo6RK8m5o6o3m0j5Jk3n9k4m9O8l3mj7k6l3L5k3m8k5J7j0o3J7
396917A934o7q6p4qq0j05N40N85j90k00PK5Oq2J5R7m7j2L3j3O2J34J56K94N23
402953C447O36O01J83m09o33o30n26j77n4m9n3m8mn6n3k9j4k1J1k5l3m9Mp4L3
408989A978knn2M6j14qpm3mjO4m8m1j6j0k9j1o0K5k7j8pk1Kj4K6m9j1l7k5K5k1
$$ plain form
416723 1485 1449 1475 1512 1481 1440 1395 1387 1375 1380 1390 1385 1376 1347 1336 1306 1323 1292 1239 1304 1285 1249 1250 1206 1229 1196 1231 1202 1210 1195 1209 1196
424221 1196 1152 1183 1175 1175 1154 1154 1121 1132 1103 1120 1067 1098 1098 1061 1083 1076 1049 1022 1036 1020 1015 1015 997 1015 1052 1020 1042 1028 1024 998 1002 1015 1047
432197 1047 1012 987 970 976 952 950 962 934 952 970 945 920 907 929 937 929 917 924 922 919 905 919 900 883 884 889 882 869 885 872 885 846 851 854
440420 854 852 848 845 828 798 813 802 806 836 806 790 795 791 788 779 781 798 782 772 754 763 772 754 779 775 754 711 764 727 759 723 722 774 711 745
448884 745 702 715 736 693 720 694 679 691 724 687 695 664 683 681 664 658 664 665 667 657 621 642 641 651 633 610 652 648 652 648 623 651 655 648 632
457344 632 618 617 650 628 644 651 634 652 663 610 646 601 486 549 577 563 549 556 544 561 586 554 588 582 591 576 569 530 585 550 575
464841 575 551 563 556 547 580 557 579 558 509 596 522 536 525 524 519 524 524 527 554 579 577 711 186 433 431 454 469 462 475 489 476 502
472575 502 506 475 462 522 498 522 523 506 479 492 494 466 480 487 486 480 473 463 493 466 475 492 503 493 496 465 461 433 438 461 482 458 469 487
$$ packed form
416723A485l6K6L7l1m1m5qj2NJ0nrk9j1l0J7l1n3O5j9l6Jm4K3l3L5k9Qj5J4j3
424221A196m4L1q%k1%l3J1k9J7n3L1%l7K2pk7k7J4j6n%j8J8L7l2K2j4mk6MJ3L2
432197A047l5k5j7Ok4kJ2k8J8J8k5k5j3K2Qqj2Pklj4J4j9j7JNpj3J6j3J3l9NL
440420H54kmlj7l0J5j1ML0l0j6NmlrKJ7j6j0j8RRj8K5mk1m3N3l7L2l6jN2o3L4
448884G45m3J3K1m3K7k6j5J2L3l7Ql1J9kj7oOJKj0l6K1jJ0j8k3M2mMmk5K8Mpj6
457344F32j4jL3k2J6Pj7J8J1n3L6m5j15O3K8j4j4Pj2J7K5l2L4oRj5pl9N5l5K5
464841E75k4J2prL3k3K2k1m9Q7p4J4j1jnN%LK7K5kJ34n25K47kK3J5pJ3J4j3K6
472575E02Ml1j3O0k4K4Jj7k7J3Kk8J4Pjopj0L0k7RJ7J1j0Ll1mk8NK3K1k4J1J8
$$ plain form
480798 487 488 497 468 481 492 476 463 465 444 464 438 453 460 454 444 455 447 438 444 450 419 414 450 432 431 406 466 479 418 408 422 449 438 433 433
489258 433 404 404 425 395 410 425 403 434 412 398 387 372 443 429 417 402 390 402 408 424 385 383 397 386 386 412 377 387 397 380 360
496755 360 377 397 354 363 390 390 383 378 349 383 382 363 365 373 393 368 378 352 361 370 386 369 342 348 337 342 335 375 390 419 400 384 343 350 334
505214 334 368 406 369 350 349 355 340 347 355 372 340 353 346 347 350 338 361 326 344 352 384 375 328 301 332 338 376 270 386 235 439 316
512924 316 301 302 388 273 344 320 328 326 302 298 302 307 334 331 278 286 343 347 322 292 318 317 300 297 305 354 363 366 288 314 300 292 304 284 278 329
521631 329 301 326 288 275 251 284 286 272 297 282 267 256 293 259 247 255 250 258 254 273 279 260 285 265 272 238 297 249 244 300 293 254 282
529607 282 283 282 271 254 253 275 264 227 227 275 253 250 223 227 241 247 268 263 243 260 241 239 243 258 245 268 264 261 284 308 343 313 275 241 251
538071 251 235 235 219 247 227 235 223 239 236 213 217 206 208 237 183 219 217 164 207 209 189 218 207 216 194 215 241 235 212 218 200 221 196 207
$$ packed form
480798D87JRk9J3J1j6j3Kk1K0k6J5Poj0J1qrOOl1nL6j8jk5O0J3o1j0J4K7j1n%
489258D33k9%K1l0J5J5k2L1k2j4j1j5P1j4j2j5j2J2OJ6l9kJ4j1%K6l5J0J0j7k0
496755C60J7K0m3RK7%pnk9L4jj9KQK0k5J0k6RRJ6j7k7Oj1NpM0J5K9j9j6m1Pj6
505214C34L4L8l7j9jOj5PQJ7l2J3pJLj2K3l5J8QL2rm7k7L1OL8j06J16j51K04j23
512924C16j5JQ6j15P1k4Qkk4mMNK7ln3QN7Mk5l0K6jj7lQM9RLp8K6j4qJ2k0oN1
521631C29k8K5l8j3k4L3Kj4K5j5j5j1L7l4j2QnQmJ9Oj9K5k0Pl4N9m8nN6pl9K8
529607B82Jjj1j7jK2j1l7%M8k2lk7MJ4OK1nk0J7j9kMJ5j3K3mlK3K4L5l0l8l4J0
538071B51j6%j6K8k0Qj2J6lk3Mj1KK9n4L6kn3M3Kk0K9j1Rk2K1K6ok3Oj8K1k5J1
$$ plain form
546294 207 190 204 213 173 219 212 204 225 249 213 235 235 229 244 256 212 203 221 206 203 219 196 172 234 206 193 204 205 200 201 192 218 251 250 209
554759 209 270 253 250 253 230 184 243 236 207 217 193 192 174 177 195 169 145 187 139 164 158 165 163 198 215 179 172 154 192 166 182 139 169
562735 169 156 125 147 142 159 150 143 118 166 109 155 140 126 150 150 158 147 120 141 115 132 148 125 143 110 122 104 113 134 130 101 118
570469 118 121 112 110 102 108 134 104 90 129 125 142 178 245 341 581 1060 1887 1464 631 399 368 315 278 291 208 234 217 198 177
577477 177 155 170 170 146 147 150 306 239 163 163 119 124 67 103 282 320 243 198 243 182 205 181 203 160 167 146 170 175 201 161 139
584970 139 158 119 106 162 153 274 430 485 591 1189 1503 653 312 241 218 219 174 184 189 150 151 133 139 129 131 104 120 90
591737 90 113 83 104 93 46 70 99 60 77 85 63 87 114 99 94 98 79 103 86 91 79 75 73 92 60 -4 -1 -8 -51 -28 78 92 70
599718 70 54 -29 -90 -127 -143 -155 -109 -88 -90 -132 -115 -136 -125 -122 -152 -145 -155 -140 -150 -205 -189 -186 -105 -128 -134 -125 -94 -144 -162 -136 -182 -175 -147
$$ packed form
546294B07j7J4Rm0M6pqK1K4l6K2%oJ5J2m4rJ8j5lJ6k3k4O2k8j3J1JnJrK6L3jm1
554759B09O1j7lLk3m6N9pk9J0k4jj8LJ8k6k4M2m8K5oPkL5J7l6pj8L8k6J6m3L0
562735A69j3l1K2nJ7rpk5M8n7M6j5j4K4%Qj1k7K1k6J7J6k3J8l3J2j8RK1mk9J7
570469A18LrkqOK6l0j4L9mJ7L6O7R6K40M79Q27m23q33k32l1n3l7J3q3K6j7j9k1
577477A77k2J5%k4JLJ56o7p6%m4Nn7L6J79L8p7m5M5o1K3k4K2m3Pk1K4NK6m0k2
584970A39J9l9j3N6rJ21J56N5J06N98L14q50l41p1k3Jm5J0Nl9Jj8Oj0Kk7J6l0
591737I0K3l0K1j1m7K4K9l9J7Qk2K4K7j5nMj9K4j7Nj2mkJ9l2o4Lpm3K3J06J4k2
599718G0j6q3o1l7j6j2M6K1km2J7k1J1Ll0Pj0J5j0n5J6LQ1k3oRL1n0j8K6m6PK8
$$ plain form
607694 -147 -124 -90 -35 -16 -4 -80 -113 -61 14 8 -69 -108 -127 -135 -63 9 63 147 340 599 846 676 355 198 152 53 6
614219 6 3 -11 -35 -16 -33 -24 -37 15 5 -19 -97 -149 -150 -121 -125 -157 -154 -184 -171 -160 -146 -41 -62 -88 -158 -214 -219 -199 -240 -211 -280 -216
621953 -216 -268 -322 -323 -363 -357 -385 -398 -388 -436 -420 -457 -451 -445 -576 -624 -717 -778 -748 -743 -754 -863 -841 -869 -953 -1184 -1270 -1262 -1307 -1450 -1591
629203 -1591 -1715 -1744 -1821 -1896 -1854 -1828 -1840 -1904 -1902 -1762 -1784 -1783 -1568 -1149 -1181 23 -1215 -1124 -1764 -1908 -2233 -2326 -2112
634756 -2112 -1404 -1012 -2006 -2475 -2610 -2329 -1651 1799 9853 21824 43637 94623 224905 323862 159756
638393 159756 67879 45298 35250 30041 27006 23989 22119 20638 20219 19414 17620 16679 16104 15934
641765 15934 15492 14785 14377 14056 13522 13137 12747 12140 11398 10902 10498 10188 10049 9847 9653 9480 9379 9284 9134
646375 9134 9214 9274 9624 10597 15959 10662 8846 8325 7939 7827 7663 7464 7310 7194 7126 7037 6825 6627 6476
$$ packed form
607694a47K3L4N5J9J2p6l3N2P5op7l9j9qP2P2N4Q4J93K59K47j70l21j57m6r9m7
614219Flj4k4J9j7Rj3N2j0k4p8n2jK9ml2Ll0J3J1J4J05k1k6p0n6nK0m1K9o9O4
621953b16n2n4jm0Ok8j3J0m8J6l7OOj31m8r3o1L0Nj1j09K2k8q4k31q6Qm5j43j41
629203a591j24k9p7p5M2K6j2o4KJ40k2JK15M19l2J204j238R1o40j44l25r3K14
634756b112P08L92r94m69j35K81O78L450Q054J1971K1813N0986J30282R8957j64106
638393A59756r1877k2581j0048n209l035l017j870j481m19q05j794r41n75j70
641765A5934m42p07m08l21n34l85l90o07p42m96m04l10j39k02j94j73j01r5j50
646375I134Q0O0L50R73N362n297j816n21l86j12j64j99j54j16o8q9k12j98j51
$$ plain form
650955 6476 6351 6228 6150 6032 5969 5844 5742 5631 5530 5414 5341 5243 5118 5035 4954 4879 4881 4823 4824 4701 4640 4631 4535 4528 4508
656991 4508 4502 4466 4457 4415 4372 4337 4328 4337 4333 4262 4133 4107 4114 4139 4063 4096 4063 4067 4050 3999 3962 4008 4025 4002 4023 4021 3957 3939 3967 3964 3924 3882
664725 3882 3917 3827 3895 3859 3961 3802 3669 3675 3661 3611 3588 3603 3603 3619 3622 3649 3619 3611 3580 3566 3539 3511 3510 3491 3517 3512 3492 3493 3413 3393
671975 3393 3371 3399 3388 3341 3316 3299 3313 3316 3311 3282 3257 3285 3299 3272 3243 3176 3075 2945 2927 2944 2972 2975 2972 2868 2818 2837 2741 2707 2731
678984 2731 2701 2631 2634 2603 2565 2557 2548 2522 2477 2496 2458 2486 2591 2602 2685 2966 2945 3037 2970 2846 2612 2567 2460 2404 2354 2347 2339 2333 2288
685993 2288 2246 2250 2233 2219 2184 2192 2199 2163 2149 2138 2117 2133 2190 2231 2346 2391 2454 2460 2413 2321 2203 2146 2102 2060 2035 2020 2004 1976 1968 1953
693243 1953 1901 1924 1890 1836 1812 1754 1751 1869 2058 2036 1983 1969 1955 2013 1977 2010 2137 2095 1897 1915 1906 1858 1917 1887 1958 2009 2075
699798 2075 2257 2779 3662 3354 2542 2282 2160 2129 2100 2030 2002 1975 1973 1979 1945 1945 1944 1928 1918 1896 1870 1887 1851 1902 1828 1873 1834
$$ packed form
650955F476j25j23p8j18o3j25j02j11j01j16p3r8j25q3q1p5Kn8Jj23o1rr6pk0
656991D508ol6rm2m3l5rRmp1j29k6PK5p6L3l3Mj7n1l7M6J7k3K1ko4j8K8lm0m2
664725C882L5r0O8l6J02j59j33Oj4n0k3J5%J6LK7l0ql1j4k7k8jj9K6nk0Jq0k0
671975C393k2K8j1m7k5j7J4Lnk9k5K8J4k7k9o7j01j30j8J7K8Llj04n0J9r6l4K4
678984B731l0p0Ll1l8qrk6m5J9l8K8J05J1Q3K81k1R2o7j24k34m5j07n6n0pqom5
685993B288m2Mj7j4l5QPl6j4j1k1J6N7M1J15M5O3Om7r2j18n7m4m2k5j5j6k8qj5
693243A953n2K3l4n4k4n8lJ18J89k2n3j4j4N8l6L3J27m2j98J8rm8N9l0P1N1O6
699798B075J82N22Q83l08q12k60j22l1k9p0k8k7kOl4%jj6j0k2k6J7l6N1p4M5l9
$$ plain form
706318 1834 1831 1830 1750 1834 1716 1743 1455 2334 2696 1945 1871 1662 1791 1670 1641 1656 1627 1650 1628 1693 1679 1613 1636 1589 1618
712354 1618 1581 1612 1576 1586 1598 1602 1580 1565 1536 1578 1531 1579 1571 1571 1544 1532 1577 1540 1524 1543 1551 1540 1561 1507 1546 1537 1511 1511 1496 1484 1479 1484
720094 1484 1418 1457 1478 1453 1459 1456 1431 1451 1407 1406 1446 1438 1419 1389 1404 1396 1408 1407 1401 1429 1400 1431 1412 1383 1386 1349 1384 1369 1375 1380 1349 1367 1388
728069 1388 1360 1345 1354 1350 1335 1337 1358 1312 1321 1321 1320 1282 1328 1306 1311 1298 1282 1314 1286 1320 1268 1269 1266 1266 1266 1304 1307 1252 1271 1252 1268 1253 1250 1279 1230
736534 1230 1242 1245 1252 1234 1225 1249 1228 1241 1207 1214 1226 1227 1212 1224 1242 1206 1194 1198 1214 1207 1171 1206 1167 1207 1203 1228 1173 1171 1213 1183 1179 1185 1187 1182 1192
744999 1192 1172 1145 1159 1145 1160 1162 1175 1161 1122 1153 1161 1146 1145 1139 1170 1159 1127 1129 1142 1117 1126 1123 1103 1132 1155 1115 1114 1087 1115 1110 1122 1137 1132
752974 1132 1102 1121 1131 1098 1099 1113 1091 1140 1100 1115 1110 1111 1110 1127 1113 1102 1063 1041 1055 1066 1076 1095 1073 1089 1100 1080 1108 1119 1068 1085
760225 1085 1059 1057 1045 1058 1077 1064 1061 1054 1076 1032 1062 1061 1067 1001 1070 1045 1023 1067 1062 1055 1047 1044 1044 1065 1081 1117 1118 1102 1052 1060 1002 1033 1024 1030 1023 1041
$$ packed form
706318A834ljq0Q4j18K7k88Q79L62p51p4k09J29j21k9J5k9K3k2O5j4o6K3m7K9
712354A618l7L1l6J0J2Mk2j5k9M2m7M8q%k7j2M5l7j6J9Qj1K1n4L9rk6%j5j2nN
720094A484o6L9K1k5Olk5K0m4jM0qj9l0J5qJ2joK8k9L1j9k9Ll7L5j5ONl1J8K1
728069A388k8j5Rmj5KK1m6R%jl8M6k2Nj3j6L2k8L4n2Jl%%L8Ln5J9j9J6j5lK9m9
736534A230J2LPj8rK4k1J3l4PJ2Jj5J2J8l6j2MJ6pl6L5l9M0mK5n5kM2l0mOKnJ0
744999A192k0k7J4j4J5KJ3j4l9L1Qj5joL1j1l2KJ3k5Rlk0K9K3m0jk7K8nJ2J5n
752974A132l0J9J0l3JJ4k2M9m0J5nJjJ7j4j1l9k2J4J1J0J9k2J6J1k0K8J1n1J7
760225A085k6kj2J3J9j3lpK2m4L0jOo6O9k5k2M4npql%K1J6L6Jj6n0Qn8L1rOpJ8
$$ plain form
768902 1041 1046 1045 1032 1007 1008 999 1002 1030 1001 1016 1001 1027 987 1031 1033 1039 1061 1099 1082 1096 1061 1045 1049 1017 1027 1045 1018 1011 1015 1033 1030 1033 1008 1038
777125 1038 1014 1018 1012 1027 1013 1037 1050 1012 1020 978 1000 1044 1029 1049 1004 1026 1032 978 1002 1002 982 990 981 981 1001 1007 975 1005 944 999 990 991 986 974
785348 974 978 967 971 978 963 993 990 1005 993 985 963 970 953 978 980 992 956 969 989 984 963 961 917 987 964 949 922 959 952 946 954 952 956 936 948 956
794054 956 981 959 951 948 955 947 954 933 935 942 942 959 934 926 930 915 935 960 943 952 936 930 956 921 939 949 911 932 912 922 932 942 950 946 918 932
802761 932 928 941 913 935 929 949 942 921 906 890 945 920 925 910 911 942 938 965 928 928 942 931 901 914 902 964 870 907 932 929 938 896 893 902
810978 902 900 915 920 909 926 899 912 915 915 909 882 928 934 900 888 911 932 928 932 934 970 951 925 865 891 869 887 859 899 886 906 926 906
818960 906 897 891 903 890 912 903 879 876 895 897 878 853 886 900 886 925 939 917 898 904 880 891 895 893 910 914 841 905 871 854 864 849 862
826935 862 875 858 887 881 913 900 876 858 894 888 876 891 887 850 883 884 880 852 867 913 864 891 843 900 862 811 863 957 836 894 928
$$ packed form
768902A041Njj3k5JrLK8k9J5j5K6m0M4KOK2L8j7J4l5j6Ml2J0J8k7pMJ8lLk5L0
777125A038k4MoJ5j4K4J3l8Qm2K2M4j5K0m5K2On4K4%k0Qr%K0Ol2L0o1N5rJnj2
785348I74Mj1MPj5L0lJ5j2qk2Pj7K5KJ2l6J3K0nk1km4P0k3j5k7L7poQkMk0J2Q
794054I56K5k2qlPqPk1KP%J7k5qMj5K0K5j7Rj6oK6l5J8J0l8K1k0J0J0J0Qmk8J4
802761I32mJ3k8K2oK0pk1j5j6N5k5Nj5JL1mK7l7%J4j1l0J3j2O2r4L7K5lRm2lR
810978I02kJ5Nj1J7k7J3L%ok7M6Ol4j2K3K1mMKL6j9k6o0K6k2J8k8M0j3K0K0k0
818960I06roJ2j3K2rk4lJ9Kj9k5L3J4j4L9J4k2j9Ok4J1MkJ7Mp3O4l4j7J0j5J3
826935H62J3j7K9oL2j3k4j8L6oj2J5ml7L3Jmk8J5M6m9K7m8N7l8n1N2R4j21N8L4
$$ plain form
834427 928 835 846 886 896 895 896 893 877 873 875 883 863 864 862 896 841 864 869 896 874 880 878 844 828 859 894 864 871 857 863 851 853 873 898 850 862
843134 862 871 865 842 849 881 882 866 869 866 845 881 862 886 858 843 858 886 865 845 861 858 861 861 875 873 847 856 870 883 858 872 866 877 855 861
851569 861 841 842 852 849 851 850 844 835 858 865 849 850 834 839 854 819 865 844 857 825 852 847 872 856 868 857 857 854 871 851 814 833 827 859 821
860034 821 874 849 855 843 856 861 837 845 854 860 813 831 855 852 854 837 841 826 857 868 839 851 866 856 821 831 820 841 840 837 870 841 843 865
868257 865 865 825 819 806 849 845 836 849 843 839 826 824 842 855 831 825 817 832 854 834 841 809 841 845 824 809 832 811 842 856 882 854 835 822
876474 822 840 869 857 870 844 841 803 809 883 833 871 797 865 859 854 851 820 833 832 844 842 799 851 801 836 836 839 850 849 837 849 843 839 852 861
884939 861 823 852 849 847 820 821 837 835 833 849 841 853 797 808 833 823 839 837 799 815 846 805 842 837 841 822 853 842 833 807 848 834 825 850
893162 850 806 799 816 818 830 852 830 800 805 816 810 809 843 822 854 804 825 810 807 835 837 827 813 835 849 831 828 833 807 832 809 830 840
$$ packed form
834427I28r3J1M0J0jJlj6mKQk0JkL4n5K3NK7k2Okl4j6L1L5l0Pj4Oj2KK0K5m8J2
843134H62Rok3PL2Jj6Llk1L6j9K4k8j5J5K8k1k0J6lL%J4kk6RJ4J3k5J4oJ1k2O
851569H61k0JJ0lKjorK3Pj6Jj6NJ5l5M6k1J3l2K7nK5j6J2j1%lJ7k0l7J9oL2l8
860034H21N3k5Oj2J3Nk4QROm7J8K4lKj7Mj5L1J1k9J2J5j0l5J0j1K1jlL3k9KK2
868257H65%m0oj3M3mrJ3omj3kJ8J3k4oqJ5K2k0Pl2L2Mk1j5K3k1L1J4K6k8j9j3
876474H22J8K9j2J3k6ll8OP4n0L8p4O8onll1J3jJ2km3N2n0L5%LJ1jj2J2omJ3R
884939H61l8K9lkk7JJ6kkJ6qJ2n6J1K5j0J6kl8J6L1m1L7nMj9L1j1rk6M1j4rK5
893162H50m4pJ7KJ2K2k2l0NJ1ojL4k1L2n0K1j5lK8Kj0j4K2J4j8lNk6K5k3K1J0
$$ plain form
901138 840 829 823 827 856 826 834 812 870 842 757 834 811 823 868 829 825 822 813 812 820 824 839 824 830 803 827 859 831 831 824 858 826 811 821 793
909602 793 805 827 816 845 790 868 830 851 798 811 818 835 808 819 849 830 837 806 825 803 823 833 815 825 844 806 816 831 836 846
916853 846 826 833 797 831 838 825 811 831 813 823 846 821 824 797 823 812 818 826 825 805 812 846 847 810 823 854 833 829 834 807 795 808 811 829
925076 829 775 814 822 813 862 846 824 808 855 830 831 831 829 808 822 797 817 838 837 828 823 836 817 834 823 847 824 829 837 836 815 818 836 793 804
933511 804 860 799 829 826 910 798 662 391 599 714 735 761 781 781 771 821 792 775 808 798 790 795 835 793 782 800 779 818
940302 818 805 830 817 763 803 792 831 804 804 793 801 829 800 787 774 832 803 792 793 786 824 797 843 829 805 815 819 813 844 812 820 788
948012 788 799 790 834 813 818 800 820 825 809 808 796 832 784 802 819 817 802 816 832 796 810 817 779 805 833 807 788 847 810 826 833 841 790
956017 790 822 778 818 803 830 834 798 808 770 814 804 833 766 850 824 774 854 804 765 847 828 799 789 813 842
$$ packed form
901138H40j1oMK9l0Qk2N8k8q5P7k3J2M5l9mlrjQMJ5j5Ok7K4L2k8%pL4l2j5J0k8
909602G93J2K2j1K9n5P8l8K1n3J3PJ7k7J1L0j9Pl1J9k2K0J0j8J0J9l8J0J5NJ0
916853H46k0Pl6L4Pj3j4K0j8J0K3k5Lk7K6j1OQjk0PL4Jl7J3L1k1mNk7j2J3LJ8
925076H29n4L9QrM9j6k2j6M7k5J%kk1J4k5K0K1jrnJ3j9J7j1K4k3NQjk1LJ8m3J1
933511H04N6o1L0lQ4j12j36k71K08J15K1K6K0%j0N0k9j7L3j0qNM0m2j1J8k1L9
940302H18j3K5j3n4M0j1L9k7%j1QK8k9j3j3N8k9j1JpL8k7M6j4k4J0MoL1l2Ql2
948012G88J1rM4k1Nj8K0Nj6jj2L6m8J8J7kj5J4J6l6J4Pl8K6K8k6j9N9l7J6PQn1
956017G90L2m4M0j5K7Ml6J0l8M4j0K9o7Q4k6n0Q0n0l9Q2j9k9j0K4K9
##END=
