##TITLE= S#258975
##JCAMP-DX= 5.00 $$ JEOL NMR v1.10
##DATA TYPE= NMR SPECTRUM
##DATA CLASS= NTUPLES
##NUM DIM= 1
##ORIGIN= DELTA_NMR
##OWNER= NMR
##SPECTROMETER/DATA SYSTEM= DELTA_NMR
##.OBSERVE FREQUENCY= 7.5568234259928E+01
##.OBSERVE NUCLEUS= ^13C
##.DELAY= (5.14E+01,5.14E+01)
##.ACQUISITION MODE= SIMULTANEOUS
##.FIELD= 7.0586013
##.FILTER WIDTH= 8.6618213122048E-01
##.ACQUISITION TIME= 1.7334272
##.SPINNING RATE= 13
##.OBSERVE 90= 9.5
$$ ------------------------
$$ JEOL SPECIFIC PARAMETERS
##$FILENAME= C:\NMR/eb-13.jdf
##$TITLE= S#258975
##$AUTHOR= NMR
##$CREATION=  2-FEB-2018 07:07:11
##$REVISION=  2-FEB-2018 07:14:24
##$CONTENT= CARBON NMR EXPERIMENTn
##$INSTRUMENT= DELTA_NMR
##$SITE= Center College ECP+ 300
##$NODENAME= nmr2
##$DIMENSIONS= 1
##$STORAGE= FLOAT
##$X_FORMAT= COMPLEX
##$X_CURR_POINTS= 32768
##$X_START= 225.07631 $$ppm
##$X_STOP= -25.06868 $$ppm
##$X_TITLE= 13C                            
##$X_ZERO_POINT= 0.39976
##$X_FREQ_FLIP= FALSE
##$X_POINTS= 32768
##$X_PRESCANS= 4
##$X_DOMAIN= 13C
##$X_OFFSET= 100 $$ppm
##$X_FREQ= 75.56823 $$MHz
##$X_SWEEP= 18.90359 $$kHz
##$X_RESOLUTION= 0.57689 $$Hz
##$SOLVENT= CHLOROFORM-D
##$TEMP_GET= 21.9 $$dC
##$ACQ_DELAY= 51.4 $$us
##$DIGITAL_FILTER= FALSE
##$FILTER_FACTOR= 1
##$FILTER_WIDTH= 9.446 $$kHz
##$FILTER_MODE= BUTTERWORTH
##$TRANSITION_RATIO= 0.9
##$ORDERS
##$FACTORS
##$LOCK_STRENGTH= 561
##$LOCK_LEVEL= 200
##$LOCK_GAIN= 26
##$LOCK_OSC_OFFSET= 25.6519 $$kHz
##$LOCK_PHASE= 187 $$deg
##$LOCK_OSC_STATE= 2H OSC ON
##$X_ANGLE= 30 $$deg
##$X90= 9.5 $$us
##$X90_HI= 9 $$us
##$X90_LO= 35 $$us
##$X_90_WIDTH= 9.5 $$us
##$X_PULSE= 3.16667 $$us
##$RELAXATION_DELAY= 1 $$s
##$SCANS= 32
##$PROBE_ID= 1412
##$ITERATIONS= 1
##$FIELD_STRENGTH= 7.0586 $$T
##$TEMP_SET= 25 $$dC
##$SPIN_SET= 15 $$Hz
##$SPIN_GET= 13 $$Hz
##$HE_LEVEL= 75 $$%
##$N2_LEVEL= 77 $$%
##$CHANGER_SAMPLE= 0
##$ADC_CARD= 16/1MHz/20
##$EXPERIMENT= single_pulse_dec
##$OBS_NOISE= WAUGH
##$IRR_NOISE= WALTZ
##$TRI_NOISE= WALTZ
##$QUA_NOISE= WAUGH
##$OBS_PWIDTH= 1 $$us
##$IRR_PWIDTH= 50 $$us
##$TRI_PWIDTH= 1 $$us
##$QUA_PWIDTH= 1 $$us
##$IRR_DOMAIN= 1H
##$IRR_FREQ= 300.52966 $$MHz
##$RECVR_GAIN= 15
##$IRR90= 9.2 $$us
##$TRI90= 10 $$us
##$QUA90= 10 $$us
##$IRR90_HI= 10 $$us
##$QUA90_HI= 10 $$us
##$IRR90_LO= 50 $$us
##$TRI90_LO= 10 $$us
##$QUA90_LO= 10 $$us
##$IRR_OFFSET= 5 $$ppm
##$MOD_RETURN= 1
##$TOTAL_SCANS= 32
##$X_ACQ_DURATION= 1.73343 $$s
##$DELAY_OF_START= 1 $$s
##$ACTUAL_START_TIME= 886403126
##$CLIPPED= FALSE
##$DC_BALANCED= FALSE
##$TRI90_HI= 10 $$us
##$SPIN_LOCK_90= 100 $$us
##$SPIN_LOCK_ATTN= 24.4 $$dB
##$DEUT_GRAD_SHIM_90= 213 $$us
##$DEUT_GRAD_SHIM_ATTN= 9 $$dB
##$IRR_CODE= 146
##$LOCK_STATE= LOCK ON
##$AUTOLOCK_LEVEL= 200
##$SAWTOOTH_RANGE= 4
##$LOCK_STATUS= IDLE
##$LOCK_SETTLE_POINT= 4096
##$LOCK_ACHIEVE_POINT= 0
##$SPIN_ACTION= SPIN ON
##$SPIN_STATE= SPIN ON
##$SPIN_STATUS= SPIN ON
##$SPIN_GAS_SOURCE= AIR
##$TEMP_ACTION= TEMP OFF
##$TEMP_STATE= TEMP OFF
##$TEMP_STATUS= TEMP OFF
##$TEMP_COMP= 0
##$TEMP_DELAY= 0 $$s
$$ [...]
##$VT_PID_STD_WB_H_CBL= 10
##$VT_PID_STD_WB_H_CBH= 0
##$VT_PID_STD_WB_H_HC= 2.4
##$VT_PID_STD_WB_H_HL= 70
##$VT_PID_STD_WB_M_PB= 1.5
##$VT_PID_STD_WB_M_TI= 30
##$VT_PID_STD_WB_M_TD= 5
##$VT_PID_STD_WB_M_CBL= 9.9
##$VT_PID_STD_WB_M_CBH= 2.3
##$VT_PID_STD_WB_M_HC= 2.5
##$VT_PID_STD_WB_M_HL= 70
##$VT_PID_STD_WB_L_PB= 1.3
##$VT_PID_STD_WB_L_TI= 29
##$VT_PID_STD_WB_L_TD= 5
##$VT_PID_STD_WB_L_CBL= 20
##$VT_PID_STD_WB_L_CBH= 20
##$VT_PID_STD_WB_L_HC= 0.6
##$VT_PID_STD_WB_L_HL= 100
##$VT_PID_LONG_0_H_PB= 1.5
##$VT_PID_LONG_0_H_TI= 30
##$VT_PID_LONG_0_H_TD= 5
##$VT_PID_LONG_0_H_CBL= 9.9
##$VT_PID_LONG_0_H_CBH= 2.3
##$VT_PID_LONG_0_H_HC= 2.5
##$VT_PID_LONG_0_H_HL= 70
##$VT_PID_LONG_0_M_PB= 1.5
##$VT_PID_LONG_0_M_TI= 30
##$VT_PID_LONG_0_M_TD= 5
##$VT_PID_LONG_0_M_CBL= 9.9
##$VT_PID_LONG_0_M_CBH= 2.3
##$VT_PID_LONG_0_M_HC= 2.5
##$VT_PID_LONG_0_M_HL= 70
##$VT_PID_LONG_40_H_PB= 1.5
##$VT_PID_LONG_40_H_TI= 30
##$VT_PID_LONG_40_H_TD= 5
##$VT_PID_LONG_40_H_CBL= 9.9
##$VT_PID_LONG_40_H_CBH= 2.3
##$VT_PID_LONG_40_H_HC= 2.5
##$VT_PID_LONG_40_H_HL= 70
##$VT_PID_LONG_40_M_PB= 1.5
##$VT_PID_LONG_40_M_TI= 30
##$VT_PID_LONG_40_M_TD= 5
##$VT_PID_LONG_40_M_CBL= 9.9
##$VT_PID_LONG_40_M_CBH= 2.3
##$VT_PID_LONG_40_M_HC= 2.5
##$VT_PID_LONG_40_M_HL= 70
##$SAMPLE_ACTION= LOADED
##$SAMPLE_STATE= LOAD
##$SAMPLE_STATUS= LOADED
##$AUTOSHIM_MODE= AUTOSHIM OFF
##$AUTOSHIM_DELAY= 3600 $$s
##$AUTOSHIM_TRACK= AUTOSHIM OFF
##$SHIM_MAX_RECALL= MAX FOUND
##$SHIM_NAMES= SHIM_Z0
##$SHIM_Z0= 9189
##$SHIM_Z1= 5127
##$SHIM_Z2= -27
##$SHIM_Z3= -2829
##$SHIM_Z4= -240
##$SHIM_Z5= 46
##$SHIM_Z6= -33
##$SHIM_X= -14
##$SHIM_XZ= 16
##$SHIM_XZ2= 0
##$SHIM_XZ3= 0
##$SHIM_X2= -7
##$SHIM_X2Z= -40
##$SHIM_X3= 0
##$SHIM_Y= 1608
##$SHIM_YZ= 13
##$SHIM_YZ2= 10
##$SHIM_YZ3= 0
##$SHIM_Y2= -11
##$SHIM_Y2Z= -20
##$SHIM_Y3= 0
##$NUM_SCANS= 69
##$END_TIME= 886403416.0
##$LOCAL_TIME= 886403229
##$PROBE_ATN= 0
##$PROBE_TUNE= 3853
##$PROBE_MATCH= 5069
##$PROBE_COARSE= NONE
##$LF_TUNE_DIAL= 0
##$LF_MATCH_DIAL= 0
##$HF_TUNE_DIAL= 0
##$HF_MATCH_DIAL= 0
##$PASS_RIPPLE= 0.01 $$dB
##$STOP_RIPPLE= 60 $$dB
##$PROBE_RECOVERY= 0 $$us
##$AF_DELAY_RATIO= 0
##$VERSION= 4.3.3
##$X_ACQ_TIME= 1.73343 $$s
##$DEAD_TIME= 0 $$us
##$DELAY= 0 $$us
##$PHASE_PRESET= 3 $$us
##$UNBLANK_TIME= 2 $$us
##$INITIAL_WAIT= 1 $$s
##$NORMALIZED= TRUE
$$ END OF JEOL SPECIFIC PARAMETERS
$$ -------------------------------
##NTUPLES= NMR SPECTRUM
##VAR NAME= FREQUENCY,    SPECTRUM/REAL, SPECTRUM/IMAG, PAGE NUMBER
##SYMBOL=   X,            R,             I,             N
##VAR TYPE= INDEPENDENT,  DEPENDENT,     DEPENDENT,     PAGE
##VAR FORM= AFFN,         ASDF,          ASDF,          AFFN
##VAR DIM=  32768, 32768, 32768, 2
##UNITS= PPM,     ARBITRARY UNITS, ARBITRARY UNITS, 
##FIRST=  2.25076309295504E+02, 1.17785565064792E+02, 1.21832859004459E+02, 1
##LAST=  -2.50686752434227E+01, -1.30673395615544E+02, -1.04952071881059E+02, 2
##FACTOR=  7.63405208102439E-03, 1.35682777543082E-03, 1.35682777543082E-03, 1
##PAGE= N=1
##DATA TABLE=(X++(R..R)), XYDATA
$$ [...]
##PAGE= N=2
##DATA TABLE=(X++(I..I)), XYDATA
20260g0237754J64134379j47098835J31323878r7631635M7055004J3748987p157867
$$ -70237754 93896625 -53202210 78121668 -19509967 27545037 41294024 34136157
20253C4136157P5237659j95738146L9786903J16294944P6059224j28521996j82854305
$$ 34136157 109373816 -86364330 -46577427 69717517 145776741 17254745 -165599560
20246a65599560J52723908Q2466853j29835243J0586410J68048873j69083695M737115
$$ -165599560 -12875652 69591201 -60244042 -49657632 118391241 -50692454 -45955339
20239d5955339J4313881m2116271J6593944J5824423L348228J36545172n181674r0584975
$$ -45955339 -31641458 -73757729 -57163785 -41339362 -37991134 98554038 93372364 2787389
20231B787389o3599887K4740333o983159j1179228M7597884P3293847k05780730J03177798
$$ 2787389 -60812498 -36072165 -43055324 -54234552 -6636668 66657179 -139123551 -35945753
20223c5945753j22446901J60641180K7472532p614031k1399371M9583498o232711
$$ -35945753 -158392654 2248526 29721058 22107027 707656 50291154 44058443
20216D4058443j53672792J06312504l7614844J43751791p6990741L0297941Q585506
$$ 44058443 -109614349 -3301845 -40916689 102835102 25844361 56142302 64727808
20209F4727808j4581300K8910063O9272561j12835805K4795126R947344p4807946R1412594
$$ 64727808 50146508 79056571 148329132 35493327 60288453 70235797 -4572149 86840445
20201H6840445M716248p2410644J53451771j28531465m8202798j6516925K3782232
$$ 86840445 91556693 19146049 172597820 44066355 -4136443 -20653368 3128864
20194C128864J13509464m6265341J393201j09626456k4696205O6230444O5111515
$$ 3128864 116638328 70372987 71766188 -37860268 -62556473 3673971 68785486
20187F8785486j33656849Q2784435l1298582N3375544n6291989l2331740R9779117
$$ 68785486 -64871363 17913072 -13385510 39990034 -16301955 -48633695 51145422
20180E1145422j54662858R3826916N8175098k3640700K0242395n3338314n1915804
$$ 51145422 -103517436 -9690520 48484578 24843878 45086273 -8252041 -60167845
20173f0167845j25431273M9423132M6385770j1828026K16582985n1787152j58050022
$$ -60167845 -185599118 -136175986 -89790216 -101618242 114964743 63177591 -94872431
20166i4872431Q7640483q0325021J52667722O305051l5887632J1698005j6901681
$$ -94872431 -7231948 -87556969 65110753 71415804 35528172 47226177 30324496
20159C0324496k02869561J49351763l1433955Q2324264j2699637O1139012j38539938
$$ 30324496 -172545065 -23193302 -54627257 27697007 14997370 76136382 -62403556
20152f2403556n5402379M7449597N6243231J40925961K7741499j136738k00081799n386852
$$ -62403556 -117805935 -70356338 -14113107 126812854 154554353 153417615 -46664184 -52051036
20144e2051036j87778301K11612368l2183217R7739997l5590401o5826206L9228508
$$ -52051036 -239829337 -28216969 -60400186 37339811 1749410 -64076796 -24848288
20137b4848288j6664550R1651097n7765481J5153496k9035290J6800156m4113255N5464885
$$ -24848288 -41512838 50138259 -7627222 7526274 -21509016 -4708860 -48822115 6642770
20129F642770l7593574K9914499J3299535j13252212J19074553Q5676467r7692940
$$ 6642770 -30950804 -1036305 12263230 -100988982 18085571 103762038 6069098
20122F069098K7748431O4366946n0761235m0774865p431178J39755180n6356987k3070592
$$ 6069098 33817529 98184475 47423240 6648375 -782803 138972377 82615390 59544798
20114E9544798k092315k4841373j45378697K01977472m062249O0834672o8135934q6556068
$$ 59544798 57452483 32611110 -112767587 89209885 85147636 145982308 77846374 -8709694
20106h709694Q791031j5770585O3236831o6101801l192799J18503245j16815810Q4020902
$$ -8709694 81337 -15689248 47547583 -18554218 -21747017 96756228 -20059582 63961320
20098F3961320j65526476K3247099n5303476K72126592k34583828M1400208r0820249
$$ 63961320 -101565156 -78318057 -133621533 138505059 -96078769 -54678561 -145498810
20091a45498810l3910426J80887849J35488946k26216788q105246J13211359k6461905
$$ -145498810 -179409236 1478613 136967559 -89249229 -97354475 15856884 -10605021
20084a0605021k2664482P4326977p6640822l731892R9669833p5719515j54151444
$$ -10605021 -33269503 41057474 -35583348 -39315240 60354593 -15364922 -169516366
20077a69516366J27259227N5734089O7289065K500822p7213113k8991110O5494479
$$ -169516366 -42257139 13476950 80766015 83266837 6053724 -22937386 42557093
20070D2557093K0796319k788403j75392653L9429749J8208122o9936080J37642745
$$ 42557093 63353412 60565009 -114827644 -75397895 -57189773 -127125853 10516892
20063A0516892O2729595j19104632J38266063k33777928O2459013N738131R6154083
$$ 10516892 73246487 -45858145 92407918 -141370010 -78910997 -73172866 22981217
20056B2981217o5469047M7204540K3908582k3866479r0637633m1148833K30134314
$$ 22981217 -42487830 4716710 28625292 4758813 -85878820 -127027653 103106661
20049A03106661n0400760j56616216Q2443827n979538l1852419O455728J63616423
$$ 103106661 52705901 -103910315 -21466488 -27446026 -59298445 -52842717 110773706
20042A10773706q2342672o955772K9936835m607933n8044704J3507800n2340899J41249776
$$ 110773706 28431034 21475262 51412097 46804164 -11240540 2267260 -50073639 91176137
20034I1176137l1252324o8093549K9765296Q4563264r2646492j9652943J10059663
$$ 91176137 59923813 -8169736 21595560 106158824 13512332 -6140611 103919052
20027A03919052l0753559m6270441P1942791j28830308J3761011m3369707R0296189
$$ 103919052 73165493 26895052 98837843 -29992465 -16231454 -59601161 30695028
20020C0695028J794468M9863832l6084925j45467533J64656625l2265474q5356290
$$ 30695028 32489496 82353328 46268403 -99199130 65457495 33192021 -52164269
20013e2164269J4892713O9277104O6981601j41422954J679779r531295k0382322Q5871316
$$ -52164269 -37271556 32005548 98987149 -42435805 -40756026 -50287321 -70669643 15201673
20005A5201673O5183281J52794430j84278030n1710823j4368747j79678P923111M7851476
$$ 15201673 80384954 233179384 48901354 -2809469 -17178216 -17357894 -9434783 38416693
19997C8416693K5798365r4239426J19545824j80826901K07888665j20615369j03526415
$$ 38416693 64215058 -30024368 89521456 -91305445 116583220 -4032149 -107558564
19990a07558564M9636684K2723783J6403266M3450111Q8509427k25520477j244948
$$ -107558564 -57921880 -35198097 -18794831 24655280 113164707 -112355770 -113600718
19983a13600718J53277769j12064938o9274207J46853347m1177359J83031950k49837746
$$ -113600718 39677051 -72387887 -141662094 5191253 -35986106 147045844 -102791902
19976a02791902m3041256J98454013o4653072l4532428J21017660J14158470j77328357
$$ -102791902 -145833158 52620855 -12032217 -46564645 74453015 188611485 11283128
19969A1283128j53919430J16016348N2925376N0937737q7895858J71869827o4024572
$$ 11283128 -142636302 -26619954 26305422 77243159 -10652699 161217128 97192556
19962I7192556q9109074N3494452j12221006P5200011l014589P6211360j32003398
$$ 97192556 8083482 61577934 -50643072 24556939 21542350 97753710 -34249688
19955c4249688L8885894K5971505q7272138J09448453m1856102j11798322K58550422
$$ -34249688 4636206 30607711 -56664427 52784026 10927924 -100870398 157680024
19948A57680024j52259244M2501399p2424853J6213500q1930196Q9537426M3291313
$$ 157680024 5420780 47922179 -24502674 -8289174 -90219370 -681944 42609369
19941D2609369m6986608j2225420L9348219j23459560L3806253J42499116j42379575
$$ 42609369 -4377239 -16602659 22745560 -100714000 -66907747 75591369 -66788206
19934f6788206J65243645L0240811q4528584Q241948r9416444R6762423j45982456
$$ -66788206 98455439 128696250 44167666 52409614 -47006830 49755593 -96226863
19927i6226863J31131705m3958398L9202629m6164335Q9007964j46943341K07233843
$$ -96226863 34904842 -9053556 30149073 -16015262 72992702 -73950639 133283204
19920A33283204j00349525n0848957R5768095j01013845r9793497K02708348k00239269
$$ 133283204 32933679 -17915278 77852817 -23161028 -122954525 79753823 -120485446
19913a20485446L3577549n8956957K15759490j02678043j7059601r0550174Q8436716
$$ -120485446 -86907897 -145864854 69894636 -32783407 -49843008 -140393182 -51956466
19906e1956466K1310850o087716R2970612j97301750J62035926L7362520l6782693
$$ -51956466 -30645616 -36733332 56237280 -141064470 20971456 58333976 21551283
19899B1551283p0228607n0119981J86938168j55399750j6422811J25777938p3019317
$$ 21551283 -48677324 -98797305 88140863 -67258887 -83681698 42096240 -30923077
19892c0923077k846810k9336863J64449143j43621480o1198475K10022962k19254273
$$ -30923077 -33769887 -63106750 101342393 -42279087 -103477562 106545400 -112708873
19885a12708873J26076726K2157680L2311013j09686785J6577639m5092652Q7894429
$$ -112708873 13367853 35525533 67836546 -41850239 -25272600 -70365252 17529177
19878A7529177K25966550j90361156P1738437n3323678j51892291j1050428R8605039
$$ 17529177 243495727 53134571 124873008 71549330 -80342961 -91393389 7211650
19871G211650r4448318M6361352N0234595P6621407j43417815k3405629L2144345M1668155
$$ 7211650 -87236668 -40875316 9359279 85980686 -57437129 -80842758 -48698413 -7030258
19863g030258J50234442n1919720p2808101k4666359k12701467K15891220K8448426
$$ -7030258 143204184 91284464 18476363 -6189996 -218891463 -3000243 25448183
19856B5448183J8540527n4544738J037899J9428227Q9458850l31219035K48806432
$$ 25448183 43988710 -10556028 -9518129 9910098 99368948 -231850087 16956345
19849A6956345l3313890O1787954J5583357l3337044m3696801q9448498Q4648795q8503838
$$ 16956345 -16357545 45430409 61013766 27676722 -16020079 -105468577 -20819782 -109323620
19841a09323620K2631514M2825139Q2644844m5800318J22611316j14081426j29215722
$$ -109323620 -86692106 -43866967 38777877 -7022441 115588875 1507449 -127708273
19834a27708273J36439419J04517594j11230562J29515903j73919010l2369284j2823318
$$ -127708273 8731146 113248740 2018178 131534081 -42384929 -74754213 -87577531
19827h7577531n8452676J06562624Q3490070Q7129071j41295356m3764616J87885222
$$ -87577531 -146030207 -39467583 44022487 131151558 -10143798 -53908414 133976808
19820A33976808k39122753R8351168J80181357j71904279l0825618O4645011k05158579
$$ 133976808 -105145945 -6794777 173386580 1482301 -29343317 35301694 -169856885
19813a69856885K24681638j63424360J49446350J5385605L5621276j92777581k8849279
$$ -169856885 54824753 -108599607 40846743 56232348 91853624 -100923957 -129773236
19806a29773236K24518973n3111305j23602650R5928149n69610J02121828o5207736
$$ -129773236 94745737 41634432 -81968218 13959931 13390321 115512149 50304413
19799E0304413o9074032m3102302j31018145K08978145K8094091o2734747q1788251
$$ 50304413 -18769619 -61871921 -192890066 16088079 44182170 -18552577 -100340828
19792a00340828J78076406j48725702J84501037j20634494K1867001q4969346R0589189
$$ -100340828 77735578 -70990124 113510913 -7123581 14743420 -70225926 20363263
19785B0363263j10401893m7446294J31748725L7893370n6256951J12808438k0863636
$$ 20363263 -90038630 -137484924 -5736199 32157171 -24099780 88708658 67845022
19778F7845022k32519884J69040246o2704295j1565697O7438539M9345087k17914508
$$ 67845022 -164674862 4365384 -58338911 -69904608 -2466069 46879018 -171035490
19771a71035490J45224272j07447739P3870481J76901738q0348841m5934804k3602527
$$ -171035490 -25811218 -133258957 -59388476 117513262 37164421 -8770383 -32372910
19764c2372910r8520105j7556353J71608558N1960914j61426743N9683321J66613289
$$ -32372910 -130893015 -148449368 23159190 75120104 -86306639 -26623318 139989971
19757A39989971k21900547M7965362L9252705q9901283J42567260r3207731p439636
$$ 139989971 -81910576 -33945214 5307491 -84593792 57973468 -35234263 -42673899
19750d2673899N0169239j07454394J2214074J05283999J1218741q2651059R5829234
$$ -42673899 7495340 -99959054 -87744980 17539019 28757760 -53893299 41935935
19743D1935935q0480499J33450618j68585402J27907701m0133751j7256634Q6946567
$$ 41935935 -38544564 94906054 -73679348 54228353 14094602 -3162032 83784535
19736H3784535q300944N589443o4132849n6083569L7952081q5150975J14271795R2676919
$$ 83784535 75483591 81073034 16940185 -39143384 -1191303 -86342278 27929517 120606436
19728A20606436j19206447k02828R76613M8710386J3817510m0558125J9164747k6957455
$$ 120606436 1399989 1197161 2173774 50884160 64701670 24143545 43308292 16350837
19720A6350837j6859853K2142659k6217356p5490388J05473735k922326m758312N2306434
$$ 16350837 -509016 21633643 -4583713 -80074101 25399634 22477308 17718996 70025430
19712G0025430j31326158m8539209J45045487l4675153L331572j29980820N8355076
$$ 70025430 -61300728 -109839937 35205550 530397 3861969 -126118851 -67763775
19705f7763775l7282690O2436552k442283J2562088M857198N5684950L204629r0992468
$$ -67763775 -105046465 -42609913 -45052196 -32490108 -27632910 28052040 31256669 -59735799
19697e9735799j3720489r585610P4315495O85743O4395609j4620609j1013903k6160480
$$ -59735799 -73456288 -83041898 -8726403 -8040660 56354949 41734340 30720437 4559957
19689D559957J38095929r2022086r837831o2569994K2569416J32613130o5612631P7587489
$$ 4559957 142655886 50633800 40795969 -21774025 795391 133408521 67795890 145383379
19681A45383379j45200161m8296386O1604261K2116147J00302516j56575167O4082845
$$ 145383379 183218 -48113168 13491093 35607240 135909756 -20665411 43417434
19674D3417434l4804079M8718981j29591612k6006855M6519197k6987507J33070284
$$ 43417434 8613355 57332336 -72259276 -98266131 -51746934 -78734441 54335843
19667E4335843j1710770o7531648n6634482J43919745n8012069k5380580K4386522
$$ 54335843 42625073 -24906575 -81541057 62378688 4366619 -21013961 3372561
19660C372561j33263131N2834828Q2427860l9328941m5571552J41736900O4944370
$$ 3372561 -129890570 -77055742 5372118 -33956823 -79528375 62208525 127152895
19653A27152895j5650308j851328j30766955J40751806j62194561M2924422J366619
$$ 127152895 111502587 109651259 -21115696 119636110 -42558451 365971 1732590
19646A732590R1545653j2526440L5928818N4881109j48193812J24283197j33346784
$$ 1732590 93278243 80751803 116680621 171561730 23367918 147651115 14304331
19639A4304331J29754862j78253568L9457002j12170427K48345035j68143743m3149005
$$ 14304331 144059193 -34194375 5262627 -106907800 141437235 -26706508 -69855513
19632f9855513Q8216240n5941099L9435532M6989540j17839560O5395183J8365280
$$ -69855513 18360727 -37580372 1855160 48844700 -68994860 -3599677 14765603
19625A4765603J4431782p7054111K6841090N6276971J5832560o3504344j2678595k2478076
$$ 14765603 29197385 -47856726 -21015636 35261335 51093895 -12410449 -25089044 -47567120
19617d7567120q1777393N3312397O5249311K17397j8673968O4621221n5333094o9648303
$$ -47567120 -129344513 -76032116 -10782805 -10565408 -29239376 35381845 -19951249 -89599552
19609h9599552l5841483K26307814j06113807P1231277l823515j24919557J41041612
$$ -89599552 -125441035 100866779 -5247028 65984249 62160734 -62758823 78282789
19602G8282789j17403682R1536990j63269875J50431235k1805395q5750199R8882958
$$ 78282789 -39120893 52416097 -110853778 39577457 17772062 -67978137 30904821
19595C0904821J12518563j13440967L6862092l7455253R6243080p3378640m100064
$$ 30904821 143423384 29982417 66844509 29389256 125632336 52253696 48153632
19588D8153632r3442056N7824789j3474949j45001475Q9671371K0601779r8507507
$$ 48153632 -45288424 12536365 -938584 -145940059 -56268688 -35666909 -134174416
19581a34174416K40658792j06559227N6122159J891459L824073l3260082K6910694
$$ -134174416 106484376 -74851 56047308 57938767 61762840 28502758 55413452
19574E5413452k6671320o5880413j27086684J45706623p2557830P2494542P7554424
$$ 55413452 28742132 -37138281 -164224965 -18518342 -91076172 -18581630 58972794
19567E8972794j29110276J87258951j26383025n5775133R6801489R1794205k04588910
$$ 58972794 -70137482 117121469 -9261556 -65036689 31764800 123559005 -81029905
19560h1029905O2033911J5243936k340403j06906000R1697945L2389502J85076668
$$ -81029905 -18995994 -3752058 -6092461 -112998461 -21300516 11088986 196165654
19553A96165654j36181896j29142509Q3081102j04712198J81329339p1617013J7921804
$$ 196165654 59983758 -69158751 13922351 -90789847 90539492 18922479 36844283
19546C6844283p0851395N6904200J1797225p3103684p9850941J68887584j05176294
$$ 36844283 -34007112 22897088 34694313 -38409371 -118260312 50627272 -54549022
19539e4549022P9549966K6236864j30710132O6714794J21539229m1307775L2581043
$$ -54549022 25000944 51237808 -79472324 -12757530 108781699 67473924 100054967
19532A00054967j18316904P2725642j037162N6287707j69025116O7734199P63093N2629051
$$ 100054967 -18261937 54463705 53426543 109714250 -59310866 8423333 9186426 61815477
19524F1815477q4699606J51741980l4739199j17935606K03102979q0478625j02546033
$$ 61815477 -22884129 128857851 94118652 -23816954 179286025 98807400 -3738633
19517c738633J19513409j30401972m2157986J68714313j06584934P0325326m4407442
$$ -3738633 115774776 -14627196 -56785182 111929131 5344197 75669523 31262081
19510C1262081r9795588J03234333j5461732L0250673N874455j29315995J15457983
$$ 31262081 -68533507 34700826 19239094 49489767 55364222 -73951773 41506210
19503D1506210j70946334K21696292l3535112j14139124N067731J06408136n1928514
$$ 41506210 -129440124 92256168 58721056 -55418068 -50350337 56057799 4129285
19496D129285l5660895j32011160K9356494J10455889j1811302O7477119N3885307
$$ 4129285 -31531610 -163542770 -134186276 -23730387 -35541689 31935430 85820737
19489H5820737j33347053o3295712J39121717l5467399L1681699n4339600Q837704
$$ 85820737 -47526316 -110822028 28299689 -7167710 24513989 -29825611 -20987907
19482b0987907m1326128J00886489r9008441Q479136n290878J28732945j04838178
$$ -20987907 -62314035 38572454 -60435987 -51956851 -57247729 71485216 -33352962
19475c3352962J01412447j53303174L3621868M5419116m8997962R0367524J991762
$$ -33352962 68059485 -85243689 -51621821 -6202705 -55200667 35166857 37158619
19468C7158619k6538007N6291012n4410348r6476576l3215222J37320719M1520474
$$ 37158619 10620612 66911624 12501276 -83975300 -117190522 20130197 61650671
19461F1650671q2032678L8588687p1912578l9335130R7178632K5808602k3087029q4254941
$$ 61650671 -20382007 18206680 -53705898 -93041028 4137604 29946206 6859177 -77395764
19453g7395764Q9225322p6313795J0660422q4058869J94201286j26205391o290005
$$ -77395764 11829558 -64484237 -53823815 -137882684 56318602 -69886789 -76176794
19446g6176794M6702270p7163461N7042445p811389J32622135J8715380K3442783
$$ -76176794 -29474524 -106637985 -49595540 -57406929 75215206 93930586 117373369
19439A17373369j26104522L8573629j22821750K3471187m1042378R4459384M2311281
$$ 117373369 -8731153 29842476 -92979274 -69508087 -110550465 -16091081 26220200
19432B6220200j44779788Q8664861Q726096L1730522N474960O0583758l4301957J33289831
$$ 26220200 -118559588 -29894727 -21168631 10561891 16036851 76620609 42318652 175608483
19424A75608483k46255478J74507467j48682156p2751848P1461930l7292708R2129223
$$ 175608483 -70646995 103860472 -44821684 -117573532 -46111602 -83404310 8724913
19417H724913j18949669J71323434q5144630K59534969k03383136O1135523m6832363
$$ 8724913 -110224756 61098678 -24045952 235489017 32105881 93241404 46409041
19410D6409041R6016498j02746324p2948018l0514303p3021216J31205307L6275123
$$ 46409041 142425539 39679215 -33268803 -63783106 -136804322 -5599015 30676108
19403C0676108J00198233j43932630O3555217n4857219L08920J10969416j06175144
$$ 30676108 130874341 -13058289 50496928 -4360291 -4051371 106918045 742901
19396G42901M5904827j19773990R4158834r5558196j6017815M0318411O4858075j2236033
$$ 742901 46647728 -73126262 21032572 -74525624 -90543439 -50225028 14633047 2397014
19388B397014L6122812o9215576j4513588l2920428L2582325M5329747K7756025n9119723
$$ 2397014 38519826 -30695750 -45209338 -78129766 -45547441 -217694 27538331 -31581392
19380c1581392N6209543Q4805508j94430307J29921537j03266867Q1082853L6113895
$$ -31581392 24628151 109433659 -84996648 44924889 -58341978 22740875 58854770
19373E8854770l5796932n8446244L1313399O7364501p2383761m088741q5968364j7666102
$$ 58854770 23057838 -35388406 -4075007 63289494 -9094267 -13183008 -99151372 -116817474
19365a16817474J75563882L1527160n3792934K6610855j04025636P2925775k5089516
$$ -116817474 58746408 90273568 36480634 63091489 -40934147 31991628 6902112
19358F902112j6915428l5659019r977992Q807010Q2861666O8176n8628263O7747335
$$ 6902112 -10013316 -45672335 -55650327 -46843317 36018349 36086525 -22541738 45205597
19350D5205597M2276021Q0899573j64448844m796768j00239485Q9639067r6100772
$$ 45205597 87481618 168381191 3932347 -864421 -101103906 -11464839 -107565611
19343a07565611J26345740J43622521j21112034P058173J3587250j29486185J26134337
$$ -107565611 18780129 162402650 41290616 48348789 61936039 -67550146 58584191
19336E8584191J4376380j5880390j04422520J39090286j28879087K438786J94767755
$$ 58584191 72960571 57080181 -47342339 91747947 -37131140 -34692354 160075401
19329A60075401k48046113K6060043K15523085j34710791J01455400j34998486n175694
$$ 160075401 -87970712 -61910669 153612416 18901625 120357025 -14641461 -19817155
19322a9817155o653869J06038979m8088510n7119349n494069L5403997j1367590o6029027
$$ -19817155 -26471024 79567955 31479445 -25639904 -31133973 4270024 -7097566 -73126593
19314g3126593J2224364M4402450q1756875J27999399j18436730m7145253O0536337
$$ -73126593 -60902229 -16499779 -98256654 29742745 -88693985 -135839238 -75302901
19307g5302901L4197266j25639787K20945066j90086382Q4378196l133976j02729406
$$ -75302901 -41105635 -166745422 54199644 -135886738 -51508542 -54642518 -157371924
19300a57371924J3996006Q3058657m4592793M7048303j11063149J19811865N4438787
$$ -157371924 -143375918 -60317261 -104910054 -57861751 -168924900 -49113035 5325752
19293E325752j04052927J82953021k00882564K15296929j79252776J8456672J22851264
$$ 5325752 -98727175 84225846 -116656718 98640211 -80612565 -62155893 60695371
19286F0695371j06871447k0653730N3508146k5589204m5367919J02193671r4551296
$$ 60695371 -46176076 -66829806 -13321660 -38910864 -84278783 17914888 -76636408
19279g6636408j102078J38626103m4335323j39185189L7574193J33739693j6293823
$$ -76636408 -77738486 60887617 16552294 -122632895 -85058702 48680991 32387168
19272C2387168j23095740J53388148j34759433J03731356j694231O8500891j35294584
$$ 32387168 -90708572 62679576 -72079857 31651499 29957268 98458159 -36836425
19265c6836425M2885104l515041K1939665M1868462j89104120J65922531j12125836
$$ -36836425 6048679 2533638 24473303 66341765 -122762355 43160176 -68965660
19258f8965660P5738411N531059l8952716J30377554m0398975J8599982j14017849
$$ -68965660 6772751 12303810 -26648906 103728648 63329673 81929655 -32088194
19251c2088194P7144559j36627089l8955231J43366940l0773168m643781N5317415
$$ -32088194 45056365 -91570724 -130525955 12840985 -17932183 -22575964 32741451
19244C2741451J0229016j86466579K30903345j51714180J28598479k2702463L5260216
$$ 32741451 42970467 -143496112 87407233 -64306947 64291532 41589069 76849285
19237G6849285j33394899n7458454R3290831p2418666L9939454J80784737l5750633
$$ 76849285 -56545614 -114004068 -20713237 -93131903 -53192449 127592288 91841655
19230I1841655r383311J9492103o8257003j21854990J30025403J53326810j16696462
$$ 91841655 82458344 101950447 33693444 -88161546 41863857 195190667 78494205
19223G8494205k91402756K44409662M4492093j13774534J16557406N8718991k4639621
$$ 78494205 -212908551 31501111 75993204 -37781330 78776076 137495067 112855446
19216A12855446o7270549M4490519l2052480p8720833J20502518j47697749L0520582
$$ 112855446 45584897 90075416 58022936 -20697897 99804621 -47893128 -17372546
19209a7372546O6740307o6200093N8303420R262482m0490316Q1739261k459915l8083357
$$ -17372546 49367761 -16832332 41471088 50733570 10243254 91982515 89522600 51439243
19201E1439243m0246524r0630799Q4178490M7199060r7179435k1869370J20700870
$$ 51439243 11192719 -79438080 4740410 51939470 -45239965 -67109335 53591535
19194E3591535l3106210l1766276k506914L5276566l5075677M4870668M2083743o9147075
$$ 53591535 20485325 -11280951 -13787865 21488701 -13586976 31283692 73367435 4220360
19186D220360r122131N0228570r1501126J21693799j0960093k45455837J92385506
$$ 4220360 -4901771 45326799 -46174327 75519472 64559379 -180896458 11489048
19179A1489048O4690862l9362411k00806571J70721938J08400227j7599473l3710484
$$ 11489048 76179910 36817499 -163989072 6732866 115133093 97533620 63823136
19172F3823136n1693874n4152442K2844815p576605j02261370K39273691j52439997
$$ 63823136 12129262 -42023180 -19178365 -26754970 -129016340 110257351 -42182646
19165d2182646N7482089j1728700M2072256p1616170n3003018J26228865O9249195
$$ -42182646 15299443 3570743 45642999 -25973171 -78976189 47252676 116501871
19158A16501871j60957342K7179912L1503439J18141558r5178301m2353500k3328140
$$ 116501871 -44455471 -17275559 14227880 132369438 37191137 -5162363 -28490503
19151b8490503J67203426k46879300J45903888K9882835q0458296J03336810j1467716
$$ -28490503 138712923 -108166377 37737511 67620346 -12837950 90498860 79031144
19144G9031144m8025150l9138614n9515938J59665268M0628447p6321381r1794803
$$ 79031144 31005994 -8132620 -67648558 92016710 132645157 56323776 -35471027
19137c5471027j07681981O2996224J75598136j33954691J19046888n6650160j03588314
$$ -35471027 -143153008 -80156784 95441352 -38513339 80533549 23883389 -79704925
19130g9704925O4994177L1569792j773289M7145571j602675j66709849M9185184L0686770
$$ -79704925 -14710748 16859044 15085755 62231326 60628651 -106081198 -56896014 -26209244
19122b6209244J0509698J0823239L0684101n2759062P6067927p9853407J31514218
$$ -26209244 -15699546 -4876307 25807794 -26951268 49116659 -30736748 100777470
19115A00777470j55479378N5899457r836949p8730238J47595447o0094460q8046673
$$ 100777470 -54701908 1197549 -8639400 -87369638 60225809 131349 -87915324
19108h7915324P0851554M6231021m4854833L2428389L78596P0554545j04113787J71138041
$$ -87915324 -17063770 29167251 -15687582 16740807 17119403 87673948 -16439839 154698202
19100A54698202o6878868j59008923J31926903P4339028K220320k10365714J9246610
$$ 154698202 87819334 -71189589 60737314 135076342 137296662 -73069052 -53822442
19093e3822442J08202272n3803366J38640809q2571448l4818903N9856067N840528
$$ -53822442 54379830 576464 139217273 56645825 21826922 81682989 87523517
19086H7523517m3068972m6947536j23265117N3531401N7102300K589993p5315411O8195195
$$ 87523517 44454545 -2492991 -125758108 -72226707 -15124407 -12534414 -87849825 -19654630
19078a9654630O9623188r6857122Q7513647R6107203l62567078K09895091p9502606
$$ -19654630 49968558 -46888564 40625083 136732286 -225834792 -15939701 -95442307
19071i5442307l4941454L1594327P8111176L8796118p1829187r4370223K32416195
$$ -95442307 -130383761 -98789434 -20678258 18117860 -53711327 -148081550 84334645
19064H4334645o5935184q9058215J067428Q5162946Q4285377j50073475K4393383P2593516
$$ 84334645 18399461 -70658754 -69591326 15571620 99856997 -50216478 -25823095 46770421
19056D6770421L1716260j10514934Q1975037o7262210L8975897j91005377J74162473
$$ 46770421 78486681 -32028253 49946784 -17315426 21660471 -169344906 4817567
19049D817567K2938041j50842268J28483006Q8339821o7398598K5813442j16307188
$$ 4817567 27755608 -123086660 5396346 93736167 26337569 52151011 -64156177
19042f4156177O6854518l9379908k1891933J29702184j85509541P4675808O9621865
$$ -64156177 2698341 -36681567 -58573500 71128684 -114380857 -39705049 29916816
19035B9916816o3556955L1110134l0437916P7540900R6501420n3350503j1045006j9732070
$$ 29916816 -33640139 -2530005 -32967921 44572979 141074399 87723896 76678890 56946820
19027E6946820p7494681J33468660r8247912J2154709J0567172M5964256m4361093
$$ 56946820 -20547861 112920799 14672887 26827596 37394768 83359024 38997931
19020C8997931o0989573P2787149j16504635J65395873p3600245j7117879O2055147
$$ 38997931 -21991642 50795507 -65709128 99686745 26086500 8968621 71023768
19013G1023768n8856956N1205572r6082081M0344799j4883137j44741681J87986364
$$ 71023768 12166812 63372384 -32709697 7635102 -7248035 -151989716 35996648
19006C5996648r6925553P6906836j35763564N7042881J27313835k9959779n4419823
$$ 35996648 -60928905 15977931 -119785633 -62742752 64571083 34611304 -19808519
18999a9808519M4770460j31531015J24484464q6492953j3471827K9769263p2036166
$$ -19808519 24961941 -106569074 17915390 -68577563 -82049390 -52280127 -124316293
18992a24316293J11483036Q5756370n1122496J2712090j19816778J69135839o4230799
$$ -124316293 -12833257 72923113 21800617 34512707 -85304071 83831768 19600969
18985A9600969m60995l8644122L2248568o7587624Q0455655N286041l7514948m5997098
$$ 19600969 19139974 -19504148 12744420 -54843204 25612451 30898492 -6616456 -52613554
18977e2613554J35412443k7881349j71060591J32137529j08190391k5730582J76567940
$$ -52613554 82798889 54917540 -116143051 15994478 -92195913 -117926495 58641445
18970E8641445j43984553K0790068M0574153r8169171J91808083n5736571j01038000
$$ 58641445 -85343108 -64553040 -23978887 -122148058 69660025 13923454 -87114546
18963h7114546J56228778k607501l6809899j99562459J50219569m3218544K7220695
$$ -87114546 69114232 66506731 29696832 -169865627 -19646058 -62864602 -35643907
18956c5643907j14957514J21222016J30513780p0363933O2023458r6658733j14345906
$$ -35643907 -150601421 -29379405 101134375 30770442 92793900 -3864833 -118210739
18949a18210739O4526492J84999241j15064847m580664j86960577P4684211M4077279
$$ -118210739 -53684247 131314994 16250147 11669483 -175291094 -100606883 -56529604
18942e6529604N1509614j06453473K01599089o948479J8306836j73917358J52048651
$$ -56529604 -5019990 -111473463 90125626 83177147 101483983 -72433375 79615276
18935G9615276k79136429K94406704Q8138344k70224062M099428P4452475K8969514
$$ 79615276 -199521153 94885551 183023895 -87200167 -83100739 -8648264 20321250
18928B0321250J56081279p8017876l0136009L314259k4490635J8518986n0364065M9238910
$$ 20321250 176402529 98384653 68248644 71562903 47072268 65591254 15227189 64466099
18920F4466099q2534983J43043861J05463485m00997966p0479857K42430558l4014502
$$ 64466099 -18068884 124974977 230438462 -170559504 -241039361 1391197 -32623305
18913c2623305R9230524o4607441q2022600n8237898J09571060P9924055j19774977
$$ -32623305 66607219 1999778 -80022822 -138260720 -28689660 51234395 -68540582
18906f8540582j12258698J94717937o0985358O0104783r5274187j06485777J94456361
$$ -68540582 -180799280 13918657 -47066701 13038082 -82236105 -188721882 5734479
18899E734479K6760879K4408427j52383769J54741472j22895371P5679472M4835912
$$ 5734479 32495358 56903785 -95479984 59261488 -63633883 12045589 56881501
18892E6881501j02654612k1342007O4982029k471860M9006562j06555052J47737943
$$ 56881501 -45773111 -67115118 -2133089 -4604949 44401613 -62153439 85584504
18885H5584504k16724329Q8427786Q1628607m3654487l0348130O1982169l9980510
$$ 85584504 -131139825 -42712039 38916568 -4737919 -35086049 26896120 -13084390
18878a3084390j3506151J6287369m5794606j8915222J54697689k7817685j1628947r361638
$$ -13084390 -26590541 -10303172 -56097778 -75013000 79684689 51867004 40238057 30876419
18870C0876419r1461347n6779643O1758519J40454466k15236199R2250529K07942125
$$ 30876419 -60584928 -117364571 -55606052 84848414 -130387785 -38137256 169804869
18863A69804869j65458729M8292771J5710164j22708438J01581261m0171271O6310174
$$ 169804869 4346140 52638911 68349075 -54359363 47221898 7050627 73360801
18856G3360801j51689765J00758918l3102662J4489707J56272209k72272600J46964851
$$ 73360801 -78328964 22429954 -10672708 3816999 160089208 -112183392 34781459
18849C4781459J58268069k6846150j77323676M157058j5588883q7084093L8910367
$$ 34781459 193049528 166203378 -11120298 -6963240 -22552123 -109636216 -70725849
18842g0725849K0258254j7697156J6125063Q0443905k7117895l7079120L2102782
$$ -70725849 -50467595 -68164751 -52039688 28404217 1286322 -35792798 -3690016
18835c690016J08572352k5095258n0468572r8545446j1058869N5767431n1352077M4678097
$$ -3690016 104882336 79787078 29318506 -69226940 -80285809 -24518378 -75870455 -31192358
18827c1192358n5996446P6112919O8868049L997571k7921551k1969067L1754116J8145511
$$ -31192358 -87188804 -11075885 57792164 61789735 33868184 11899117 43653233 61798744
18819F1798744r6212194p9452038Q2048944j92528596K19766731k1738971m1570117
$$ 61798744 -34413450 -113865488 -31816544 -224345140 -4578409 -26317380 -67887497
18812f7887497J380610J8669760R9109168j13111127J7055740n8698917J42840100
$$ -67887497 -66506887 -47837127 51272041 -61839086 -44783346 -103482263 39357837
18805C9357837J2801030j49932358J47853873o2028020p5156771L3291994k1936268
$$ 39357837 52158867 -97773491 50080382 -11947638 -87104409 -53812415 -75748683
18798g5748683J31068862j28394639J31418468o3130757J879376M7172446j8062706
$$ -75748683 55320179 -73074460 58344008 -4786749 -2907373 44265073 26202367
18791B6202367M0516293m3193116q5643272K5942733P9278753l659759o8560713N6544584
$$ 26202367 66718660 23525544 -62117728 -36174995 43103758 39443999 -29116714 27427870
18783B7427870n2398677m3027611Q8075441k04281449J75476649R9308842j89554034
$$ 27427870 -24970807 -67998418 20077023 -184204426 -8727777 90581065 -98972969
18776i8972969J26037636M48523p5813285j1160276Q5584657L3462156j02094969R775117
$$ -98972969 27064667 27513190 -48300095 -59460371 26124286 59586442 -42508527 -32733410
18768c2733410K8192596N0447709p6198070N7448192l3634071J73526319j37717251
$$ -32733410 -4540814 45906895 -30291175 27157017 -6477054 167049265 29332014
18761B9332014p628188p4340784O8111113P270559p0382553K07544116j13273118q6185524
$$ 29332014 21703826 -52636958 15474155 22744714 -47637839 159906277 46633159 -39552365
18753c9552365J75737825j01862805r186046L4236415k2899976n4046269R4370627
$$ -39552365 136185460 34322655 25136609 59373024 36473048 -17573221 76797406
18746G6797406r6191148j39357611J37739525L532059N3933086N690182r4434738
$$ 76797406 -19393742 -158751353 -21011828 -17479769 36453317 42143499 -52291239
18739e2291239J15666526r7162250J58776772j17022187M5785782j53523003M2992727
$$ -52291239 63375287 -33786963 124989809 7967622 53753404 -99769599 -56776872
18732e6776872l0011151N8807142L9760409o6945777R4400164n9833832P0908983L672387
$$ -56776872 -86788023 -27980881 11779528 -55166249 39233915 -20599917 50309066 53981453
18724E3981453j43111320J74731029r854233m8872010j45448097J07519426l5857457
$$ 53981453 -89129867 85601162 75746929 26874919 -118573178 -11053752 -46911209
18717d6911209N6178468r0385098Q7423033n631706K3596261o0653562O3568977m637594
$$ -46911209 9267259 -81117839 6305194 673488 24269749 -36383813 27185164 22547570
18709B2547570p0207886k5723267K27544897p2227864j76230706K2897468J95679124
$$ 22547570 -47660316 -73383583 154161314 81933450 -94297256 -71399788 124279336
18702A24279336q4120296j68974482J42264004P2113606p7896544l8916810K2140430
$$ 124279336 40159040 -128815442 13448562 85562168 7665624 -31251186 -9110756
18695i110756R7861294j04790793J20869963n1983464l3793486m4674788K814618J1580098
$$ -9110756 88750538 -16040255 104829708 52846244 19052758 -25622030 -22807412 -11227314
18687a1227314J7617958k06390895J95079973p3423547j7752873J10802540M3523236
$$ -11227314 6390644 -200000251 -4920278 -78343825 -96096698 14705842 58229078
18680E8229078j15517646O9350581r8187302q4048536J30636000j1224152M663696
$$ 58229078 -57288568 12062013 -86125289 -170173825 -39537825 -50761977 -46098281
18673d6098281o3129869O9915151K1008998J09904276k8334808K6867199k4151513
$$ -46098281 -109228150 -39312999 -18304001 91600275 63265467 90132666 65981153
18666F5981153q4377181N0031811Q1536947n1896351p4289527J138367J46448447
$$ 65981153 -18396028 31635783 113172730 61276379 -13013148 -11874781 134573666
18659A34573666j06911865K0943982J05974083q9497200P954437k3532754j33371356
$$ 134573666 27661801 48605783 154579866 65082666 73037103 49504349 -83867007
18652h3867007J75169370p0886893p0966036J38943205q1776368J17925505r5516123
$$ -83867007 91302363 20415470 -50550566 88392639 6616271 124541776 29025653
18645B9025653o2662579p1796762Q3597886Q9853340j10168732M2865207j23394941
$$ 29025653 -33636926 -105433688 -21835802 68017538 -42151194 714013 -122680928
18638a22680928J17790048n8770810J27983264Q2265708q6426213n5630672Q7246385
$$ -122680928 -4890880 -63661690 64321574 146587282 60161069 4530397 91776782
18631I1776782j10343397m0243356o4291156J03175273J51898328j96448237M3753074
$$ 91776782 -18566615 -58809971 -123101127 -19925854 131972474 -64475763 -20722689
18624b0722689O0178426k7180670Q4370799R7623927J0266248k19212463l6720423
$$ -20722689 39455737 12275067 96645866 194269793 204536041 -14676422 -51396845
18617e1396845q6952975J64145429p0635421n0738240O7924216j3342749q1099497
$$ -51396845 -138349820 25795609 -44839812 -95578052 -27653836 -40996585 -122096082
18610a22096082K15001498j09827281j07954291N344506J72954213l3961203l4671463
$$ -122096082 92905416 -16921865 -124876156 -119531650 53422563 19461360 -15210103
18603a5210103l8335729o0214692N4780598M8234287M4744160Q474277r580203r256380
$$ -15210103 -53545832 -113760524 -58979926 -10745639 33998521 42472798 32892595 23636215
18595B3636215J55240058j55260669o3548477L6564033j3958951J90813616j20745232
$$ 23636215 178876273 23615604 -39932873 -3368840 -17327791 173485825 52740593
18588E2740593M4158027r1558054q2585911J46030789j31500J6729537k2687801j02213657
$$ 52740593 96898620 5340566 -77245345 68785444 68653944 85383481 62695680 -39517977
18580c9517977L5058175o0887387M9034680M8513865n3267087P3014941j2899003J68197
$$ -39517977 -4459802 -65347189 -16312509 32201356 -21065731 51949210 39050207 39218404
18572C9218404r7563187J00748396j15305877k2832897J41194287j63362100J18164961
$$ 39218404 -58344783 42403613 -72902264 -95735161 45459126 -117902974 261987
18565B61987Q4825442j030265o9971243k0568959q5748167R3427725R4746087r4445562
$$ 261987 85087429 84057164 14085921 -6483038 -92231205 1196520 95942607 1497045
18557A497045J53954530m9734431j25555251P4783150k9062465L6938112J4562517
$$ 1497045 155451575 105717144 -19838107 54945043 25882578 62820690 77383207
18550G7383207N4463624j78385710O1856889J9831605o493473j7201077p8893998L5223551
$$ 77383207 131846831 -46538879 15318010 35149615 28656142 11455065 -67438933 -32215382
18542c2215382N9687752l598658j9406457M6300102j05118784P4768830k4069764j0766124
$$ -32215382 27472370 23873712 4467255 50767357 -54351427 20417403 -3652361 -14418485
18534a4418485m9797685r33327Q1365474O4866326l8372563j35511084J56423401L7660050
$$ -14418485 -64216170 -65149497 16215977 81082303 42709740 -92801344 63622057 101282107
18526A01282107j3741018m1514240j0073604o0984671n8358817J60738913J04534053
$$ 101282107 87541089 46026849 35953245 -25031426 -83390243 77348670 181882723
18519A81882723q7135756m7522933m3969276M7151552j4423546j4069973k9506095
$$ 181882723 94746967 47224034 3254758 50406310 35982764 21912791 -7593304
18512g593304L5429449o3128240o306597L0129342l0262597m455047N7340705P1902523
$$ -7593304 27836145 -35292095 -41598692 -11469350 -41731947 -46186994 11153711 83056234
18504H3056234L336925j17874510o918143O2560869n772180J05172208n2289088o7750439
$$ 83056234 86393159 -31481351 -38399494 24161375 18389195 123561403 71272315 3521876
18496C521876M0073582N5800714N680559l6950667Q7937775m6810822q2824178J1834282
$$ 3521876 43595458 99396172 105076731 68126064 156063839 109253017 26428839 38263121
18488C8263121Q3883210j39345899J11591012M0604739m1268616p8439177j19057353
$$ 38263121 122146331 -17199568 94391444 134996183 93727567 15288390 -103768963
18481a03768963J04586568p8022101J70327979j28865437J82758677m03958261K21415223
$$ -103768963 817605 -77204496 93123483 -35741954 147016723 -256941538 -35526315
18474c5526315l8569754J77436113j67588434J6533880j20258092J09701388j8721362
$$ -35526315 -74096069 103340044 -64248390 -47714510 -167972602 -58271214 -76992576
18467g6992576O1188423p4233216J57483800r9983722n2627833Q1866156p9984416Q384314
$$ -76992576 -15804153 -90037369 67446431 -32537291 -85165124 -3298968 -83283384 -74899070
18459g4899070L9194639o8572178J52484326j60153559Q5626302o743168J0484020
$$ -74899070 -35704431 -104276609 48207717 -111945842 -26319540 -33062708 -22578688
18452b2578688J05712093o327970m3720660j36495138K8429370J71989214o5949570
$$ -22578688 83133405 76805435 33084775 -103410363 -74980993 97008221 31058651
18445C1058651p018005l8771529r9114061K06566916J7315826j53637404N7450517
$$ 31058651 24040646 -14730883 -113844944 92721972 110037798 -43599606 13850911
18438A3850911j5497639q5229563J34892757q6123127l045954L1569877N3576933J221621
$$ 13850911 -1646728 -86876291 48016466 -38106661 -41152615 -9582738 43994195 45215816
18430D5215816o6429899J1695618o7634516M0245744R6294100N9641495N814859k22376824
$$ 45215816 -21214083 -9518465 -77152981 -36907237 59386863 119028358 124843217 -97533607
18422i7533607J80300195n8599239n444815o7330096j2946624R4569027j18967129
$$ -97533607 82766588 24167349 18722534 -48607562 -61554186 33014841 -85952288
18415h5952288K14519045j37366591N3616824J41468587j63329812J12197545j61980206
$$ -85952288 128566757 -8799834 44816990 186285577 22955765 135153310 -26826896
18408b6826896J4943264k098155j601904Q76023Q5510996n6854577m6452709P7926295
$$ -26826896 -11883632 -13981787 -15583691 -14707668 70803328 13948751 -32503958 45422337
18400D5422337J1636208r89134Q5912150n9640673j56548456M797776J4004108J9132366
$$ 45422337 57058545 56069411 141981561 82340888 -74207568 -69409792 -55405684 -36273318
18392c6273318J00108425p0397427J11255800k7098543j3118594k0349023K3440001
$$ -36273318 63835107 -6562320 104693480 77594937 64476343 44127320 67567321
18385F7567321n9753513Q2674073r8520635J22939629m4802529j17117978O584247
$$ 67567321 7813808 90487881 -8032754 114906875 70104346 -47013632 -40429385
18378d0429385Q9860675j2137343Q2642328j68522764N8698094j3709485O5425739
$$ -40429385 49431290 37293947 119936275 -48586489 10111605 -3597880 61827859
18371F1827859l3741562k0554477L8107306J04866529j53866822J22074934j60278645
$$ 61827859 28086297 7531820 45639126 150505655 -3361167 118713767 -41564878
18364d1564878Q0272657m2279328n863157O8594298K1676098j16529483J18534949
$$ -41564878 38707779 -3571549 -9434706 59159592 80835690 -35693793 82841156
18357H2841156m8281740k0218447L5752942K4463211P3058686j24268382J38557615
$$ 82841156 34559416 14340969 50093911 74557122 147615808 23347426 161905041
18350A61905041j02412929q2041611J25858959j63155135J33313523N6334591m5936656
$$ 161905041 59492112 -22549499 103309460 -59845675 73467848 129802439 83865783
18343H3865783m2466807M8907202N2391622j33171601M5601461O9725499j44933829
$$ 83865783 41398976 90306178 142697800 9526199 55127660 124853159 -20080670
18336b0080670J33060554r8835651j7132857o015218O5174362r7249684J34774202
$$ -20080670 112979884 14144233 -2988624 -9003842 56170520 -41079164 93695038
18329I3695038r3137058O2654265j6801329M0758120k02248534J49478557j15313289
$$ 93695038 557980 63212245 46410916 87169036 -115079498 34399059 -80914230
18322h0914230Q0972137o3573760L1088903J7788406J9971462m4018367P888793N1787766
$$ -80914230 57907 -63515853 -32426950 -14638544 5332918 -38685449 -30796656 20991110
18314B0991110J50180313j83122071K7611580p282954K76956q6060723Q6865640k609523
$$ 20991110 171171423 -11950648 15660932 8377978 8654934 -77405789 9459851 6850328
18306F850328l5604701l4463782R9298286k3132298N0932174j04398111m1071116
$$ 6850328 -28754373 -63218155 36080131 12947833 63880007 -40518104 -81589220
18299h1589220J66049851p8259233N4581619o5284239q9044978O9994532J1729466
$$ -81589220 84460631 6201398 60783017 -4501222 -93546200 -23551668 -11822202
18292a1822202J31496585m1584900k06686218J49337046n1055701J06913851p1944473
$$ -11822202 119674383 78089483 -128596735 20740311 -30315390 76598461 4653988
18285D653988K5517095j28997068N7703496N1212635R9390560q2772479m5562169Q1064082
$$ 4653988 30171083 -98825985 -41122489 10090146 109480706 26708227 -18853942 62210140
18277F2210140j46914470O5748185j46649776J13152877j2193857O2648280M8177563
$$ 62210140 -84704330 -18956145 -165605921 -52453044 -64646901 -1998621 46178942
18270D6178942j00442639J17959432j68659005j3393355J27925958O0495684J11251247
$$ 46178942 -54263697 63695735 -104963270 -118356625 9569333 70065017 181316264
18263A81316264k82240313Q1683075j9878129O014177J36056988q5563452M7786876
$$ 181316264 -100924049 -19240974 -39119103 -33104926 102952062 17388610 65175486
18256F5175486Q0637392M8086420j46415086k0709725j0676554L6701867L1395979
$$ 65175486 145812878 193899298 47484212 26774487 16097933 52799800 84195779
18249H4195779J1945865L1734053j48613579j3509318J00018045J14127776j09074629
$$ 84195779 96141644 127875697 -20737882 -34247200 65770845 179898621 70823992
18242G0823992K169428o9679451J36744573l8343658j79192311J15835897m9792559
$$ 70823992 72993420 3313969 140058542 101714884 -77477427 38358470 -11434089
18235a1434089l3347379J05832173j64053154K35006295k81505824J83097588r8972639
$$ -11434089 -44781468 61050705 -103002449 132003846 -149501978 33595610 -65377029
18228f5377029J30885024j74439421Q4062493J3926423M1208350j4275118o6618322
$$ -65377029 65507995 -108931426 -24868933 -10942510 30265840 15990722 -50627600
18221e0627600Q0451931l3374554K6117219M4320046n1837635q1757251Q1763015Q5023183
$$ -50627600 29824331 -3550223 22566996 66887042 15049407 -66707844 15055171 100078354
18213A00078354m2862329P816821l3130241k9880651m4558299J46300435j76130554
$$ 100078354 57216025 65032846 31902605 2021954 -42536345 103764090 -72366464
18206g2366464n2867657Q6289143j73829447J63733154l7380561o243575n3244050
$$ -72366464 -125234121 -38944978 -212774425 -49041271 -86421832 -92665407 -145909457
18199a45909457J10015584o7922501O0564710m2672701n1912571J00013794l550537
$$ -145909457 -35893873 -103816374 -43251664 -85924365 -137836936 -37823142 -41373679
18192d1373679k9614458j40845347J58024153J3882231K1687219m8676281J9339757
$$ -41373679 -70988137 -211833484 -53809331 -39927100 -18239881 -66916162 -47576405
18185d7576405l5393921m6526667J63687136J310885l6243204j8776887K6023934l7911074
$$ -47576405 -82970326 -129496993 34190143 35501028 -742176 -19519063 6504871 -31406203
18177c1406203O527024P0088179M8125817n9875509p3946020r8306556J83859111q3825993
$$ -31406203 -24879179 45209000 93334817 33459308 -40486712 -138793268 45065843 -38760150
18169c8760150o4999117Q3919195J0781093M4563244J8597743O4625617p1268535
$$ -38760150 -103759267 -19840072 -9058979 35504265 54102008 118727625 47459090
18162D7459090j89729651J6731397J88727012L799106j53947745J4463431O1956122
$$ 47459090 -142270561 -125539164 63187848 66986954 -86960791 -72497360 -10541238
18155a0541238k4010909R7271780P9209712k04308924Q5006602m8431408P5429077
$$ -10541238 -34552147 62719633 141929345 -62379579 22627023 -25804385 49624692
18148D9624692o4774284N7697619q6047075P9821358J10143904j13634565j3616534
$$ 49624692 -15149592 42548027 -43499048 36322310 146466214 32831649 19215115
18141A9215115J30529757j10073329J30904219q2123165o5849521j05047576N1849554
$$ 19215115 149744872 39671543 170575762 88452597 22603076 -82444500 -30594946
18134c0594946o5086608N149052J01428506M2045565p6100144O8284664N286706Q387703
$$ -30594946 -95681554 -90532502 10896004 52941569 -23158575 45126089 50412795 58800498
18126E8800498j46211458J7948627K0604476M922760M5861800r2234672J52278161
$$ 58800498 -87410960 -69462333 -48857857 -43935097 1926703 -90307969 61970192
18119F1970192o9350552l7022656N3520523O1933405j29667029R7565984L0549264
$$ 61970192 -7380360 -44403016 9117507 71050912 -58616117 38949867 69499131
18112F9499131M7686314r5170699m0942528O7572451l4997920r708547L5496973k510196
$$ 69499131 117185445 22014746 -18927782 48644669 13646749 3938202 39435175 36924979
18104C6924979M226688m2904483L521777m4584786Q8983832m1714668k0621550J79761854
$$ 36924979 41151667 -1752816 1768961 -42815825 46168007 4453339 -16168211 163593643
18096A63593643k12992560n2729182J19469169q1502740J85913262j74283659J92322890
$$ 163593643 -49398917 -102128099 17341070 -64161670 121751592 -52532067 139790823
18089A39790823j23230889j33357725L0180227P6136110o9223593L3576373P2330677
$$ 139790823 16559934 -116797791 -86617564 -10481454 -79705047 -46128674 26202003
18082B6202003k7877536j2912781l2289007J49981306q4920132Q7964264r8587649
$$ 26202003 -1675533 -14588314 -46877321 103103985 18183853 106148117 7560468
18075G560468q3580820K32796063j67583910O3028733o8079469P78076J10729844N22807
$$ 7560468 -76020352 156775711 -10808199 52220534 -15858935 -15080859 95648985 96171792
18067I6171792p7322331K6115266Q1170940j42294788L2821972o5014915M1684587
$$ 96171792 18849461 44964727 126135667 -16159121 16662851 -48352064 -6667477
18060f667477J1694645k650462q958652Q56639m1748260L8353672P7280934M743123
$$ -6667477 5027168 2376706 -6581946 -5725307 -47473567 -9119895 68161039 72904162
18052G2904162n9538072r7530981J20942281j37506088J45042255j20449509K481427
$$ 72904162 13366090 -84164891 36777390 -100728698 44313557 -76135952 -73654525
18045g3654525q922491Q2261630k1669121l8334282P5923128K4739386M9614539j77387220
$$ -73654525 -82577016 -315386 -21984507 -60318789 15604339 40343725 89958264 -87428956
18037h7428956q829276N5399152k2041124L2457641J16798665n7095381j156231j0308572
$$ -87428956 -96258232 -40859080 -62900204 -30442563 86356102 29260721 28104490 17795918
18029A7795918j37264241K54986928j91230622J63553460j41415324P3582385k9132087
$$ 17795918 -119468323 135518605 -55712017 107841443 -33573881 40008504 10876417
18022A0876417N2869251N48003m8827850m058107J18242688r2305936M5840105N4617667
$$ 10876417 63745668 64293671 15465821 11407714 129650402 37344466 83184571 137802238
18014A37802238j81753979J08229010m584627r1822235M1002527J5241453J06626982
$$ 137802238 -43951741 64277269 59692642 -32129593 8872934 24114387 130741369
18007A30741369j29937158N207804j9157083j17283124J48377425p4915850K6192557
$$ 130741369 804211 6012015 -13145068 -130428192 17949233 -56966617 -30774060
18000c0774060k5044230J33981904p6518713N1438770j06725582M7646137j3443548
$$ -30774060 -55818290 78163614 1644901 53083671 -53641911 -5995774 -19439322
17993a9439322K19188529k49213739j11520742K35334470r8528748Q5799386o5960770
$$ -19439322 199749207 -49464532 -160985274 74349196 -24179552 61619834 -4340936
17986d340936Q4267504O434123r5821698n2317210O3520238K27372320j75671673Q7205926
$$ -4340936 79926568 86360691 -9461007 -61778217 1742021 229114341 53442668 140648594
17978A40648594j11700566J5373765j5618914N7852133L4370531j78299771J12872229
$$ 140648594 28948028 44321793 28702879 86555012 120925543 -57374228 55498001
17971E5498001p7834831n3618469K50243093j24803538p8795023K2273836p0857388
$$ 55498001 -22336830 -75955299 174287794 49484256 -29310767 -7036931 -77894319
17964g7894319k2746258J47867795l1994023j2313613j8703911j00465184J32904802
$$ -77894319 -100640577 47227218 15233195 2919582 -15784329 -116249513 16655289
17957A6655289j91143448J25658142N4436509K55718j05587568o7907870J39534027
$$ 16655289 -174488159 -48830017 5606492 5862210 -99725358 -167633228 -28099201
17950b8099201J12507511P7861866k12522389L2280973N281483k2733619p1410554
$$ -28099201 84408310 162270176 -50252213 -17971240 -12689757 -35423376 -106833930
17943a06833930m9970174J91344984j7167780M855211r7796770J3720331J32960877
$$ -106833930 -156804104 34540880 17373100 22228311 -75568459 -61848128 71112749
17936G1112749R4987190j53847703K2344934p5215921M384419k6426882P6988305
$$ 71112749 166099939 12252236 34597170 -40618751 -36234332 -62661214 14327091
17929A4327091j12513060Q7201991j0085496r7067930J27325347K2806473j74836867
$$ 14327091 -98185969 -10983978 -21069474 -118137404 9187943 31994416 -142842451
17922a42842451J71387159J2737056j1387392q2009524N3547919L554515j62719232
$$ -142842451 28544708 41281764 29894372 -52115152 1432767 4987282 -157731950
17915a57731950Q9508563J34203492j17245971N3987083O8253259j26449204J00966359
$$ -157731950 -68223387 65980105 -51265866 2721217 70974476 -55474728 45491631
17908D5491631j14770418J92137440m0626995n5127844P3493875p0329797n2644842
$$ 45491631 -69278787 122858653 82231658 27103814 100597689 30267892 -22376950
17901b2376950m7463871N8526184R0478680j46471315R6858896j21404001O2106479
$$ -22376950 -69840821 -11314637 79164043 -67307272 29551624 -91852377 -29745898
17894b9745898J31342499j35540078J87749602n466058j21408130J36212076k23996469
$$ -29745898 101596601 -33943477 153806125 148340067 26931937 163144013 -60852456
17887f0852456j11285P926324J27033532j20380961M3284805j53457887R6390824J6963353
$$ -60852456 -60963741 -53037417 73996115 -46384846 -3100041 -156557928 -60167104 -43203751
17879d3203751N0763025l6989725Q0923286M1820598j44065531N3922249m107567n233789
$$ -43203751 7559274 -29430451 51492835 93313433 -50752098 3170151 -937416 -6171205
17871f171205j5727539k7529926J6499929n6640067J00709353q0620351J2028046K4719276
$$ -6171205 -21898744 -49428670 -32928741 -89568808 11140545 -69479806 -57451760 -32732484
17863c2732484K14526669j98895197J5028531j2161414M6072012n0526040M1793160
$$ -32732484 181794185 -17101012 -2072481 -14233895 31838117 -18687923 23105237
17856B3105237j03459629J02905367l9994799N5464797p6439096R3227751L6965054
$$ 23105237 -80354392 22550975 -17443824 38020973 -38418123 54809628 91774682
17849I1774682q5782977J25661029p9839356j17766926j825716J03346563m6684776
$$ 91774682 5991705 131652734 51813378 -65953548 -67779264 35567299 -11117477
17842a1117477K7453985q5628020P9502285j3886340l4733658l2283264J08363512
$$ -11117477 16336508 -69291512 10210773 -3675567 -38409225 -70692489 37671023
17835C7671023k8095657n663071k6322239q1683031J6726651j3564102Q2694518P1753891
$$ 37671023 9575366 3912295 -22409944 -104092975 -87366324 -100930426 -18235908 53517983
17827E3517983p6650530J30682154k0488562j99566920O0991077R750205Q2499252
$$ 53517983 -23132547 107549607 87061045 -112505875 -51514798 -41764593 40734659
17820D0734659p5508329j57508794Q2111313R9423254L5802499J9656658m5000528
$$ 40734659 -34773670 -192282464 -110171151 -10747897 25054602 44711260 -289268
17813b89268K4125602L5796192o4481281J905808J12504370k00197081N4137274P0297942
$$ -289268 23836334 59632526 -4848755 -2942947 109561423 -90635658 -36498384 33799558
17805C3799558k0472864j09041625L1111627q719733J43018778j2574199m5171000
$$ 33799558 13326694 -95714931 -64603304 -73323037 69695741 57121542 11950542
17798A1950542m5305361Q5377662p1582908M5829765L6758576m0390687k10475002
$$ 11950542 -33354819 52022843 -19560065 26269700 63028276 22637589 -187837413
17791a87837413K23061488n0152288M0012202l4417082J01625114l1235295R085649
$$ -187837413 35224075 -14928213 25083989 -9333093 92292021 61056726 70142375
17784G0142375o7256924l5272619J30160649L3938622j33974856M8356883k5392863
$$ 70142375 2885451 -32387168 97773481 131712103 -2262753 46094130 20701267
17777B0701267j00309129J04752898J14641993j24882570m4320173o5917279J31681403
$$ 20701267 -79607862 25145036 139787029 14904459 -29415714 -95332993 36348410
17770C6348410r3207531M4537976o5078804J13081673o7465627N9671710k4616217
$$ 36348410 -56859121 -12321145 -77399949 35681724 -31783903 27887807 3271590
17763C271590O3694639j08311254O2164795l0410864J2636758j26942781K6363308l184308
$$ 3271590 66966229 -41345025 20819770 -9591094 3045664 -123897117 -97533809 -100718117
17755a00718117J16551122J8363676o157747m3804675l9617650J17221257j43868210
$$ -100718117 15833005 34196681 28038934 -15765741 -55383391 61837866 -82030344
17748h2030344J37040458r9671601J1562515j5252451N0366987q5263564J23908016
$$ -82030344 55010114 -44661487 -33098972 -48351423 2015564 -83248000 40660016
17741D0660016p1341375N4351067l8938461j05974367P8521307J630635J51668299
$$ 40660016 -30681359 23669708 -15268753 -121243120 -42721813 -41091178 110577121
17734A10577121j11399797k5083781M2699157l3411146j32493464J21509696J30226656
$$ 110577121 -822676 -25906457 16792700 -16618446 -149111910 -27602214 102624442
17727A02624442n4517761o9407622J04241597j47559626J5761159j3504658P6445221
$$ 102624442 48106681 -21300941 82940656 -64618970 -48857811 -62362469 14082752
17720A4082752N770390K1047832J69326383j91965230O9277356p1842621P034370
$$ 14082752 19853142 40900974 210227357 18262127 87539483 15696862 22731232
17713B2731232J15926845j75436321M9514202j45218898J69663712L4922927j24393602
$$ 22731232 138658077 -36778244 12735958 -132482940 37180772 72103699 -52289903
17706e2289903J26498153R9304338k49451827J61510786l8740615j13249508Q1744294
$$ -52289903 74208250 173512588 -75939239 85571547 46830932 -66418576 15325718
17699A5325718R4293691j09308882j42388463J4460949J60769111K1430299J3165068
$$ 15325718 109619409 310527 -142077936 -127616987 33152124 54582423 67747491
17692F7747491j9600968n1423920Q5009997M7557506j18157980L8245662q5225914
$$ 67747491 48146523 -3277397 81732600 129290106 11132126 49377788 -35848126
17685c5848126J40633158p7551133R8529764j36585316j9315029J23410575L8826971
$$ -35848126 104785032 27233899 125763663 -10821653 -30136682 93273893 132100864
17678A32100864p3182004L2800831j65048532J20666796N8903387j68006283J33991384
$$ 132100864 58918860 91719691 -73328841 47337955 106241342 -61764941 72226443
17671G2226443j57948995K82590329m9266284j49631751j5156067l6343356L7013057
$$ 72226443 -85722552 196867777 147601493 -2030258 -17186325 -53529681 -16516624
17664a6516624N6577953j5080060J18396621o4039232R1579487j69697940j00153252
$$ -16516624 40061329 24981269 143377890 79338658 170918145 1220205 -98933047
17657i8933047K10894634p7362652J62403131j40243068l7004496j09813073k5996276
$$ -98933047 111961587 34598935 197002066 56758998 19754502 -90058571 -116054847
17650a16054847J45960528J41398317p9863123M5973772n4579248j41974519J14268829
$$ -116054847 29905681 171303998 91440875 137414647 82835399 -59139120 55129709
17643E5129709q8231662J33350109O3285724k08872872J4976989J14027382j54771795
$$ 55129709 -33101953 100248156 163533880 -45338992 -30362003 83665379 -71106416
17636g1106416J27915044k2527380P9959165j5683825q0552495J3664523q9250142
$$ -71106416 56808628 34281248 114240413 98556588 18004093 31668616 -57581526
17629e7581526j4868199m831168J91522742n9797780j51200004R7198554J03125242
$$ -57581526 -72449725 -77280893 114241849 54444069 -96755935 442619 103567861
17622A03567861J6061994j00698162k4604539J36505395j02604057j1910787l9313860
$$ 103567861 119629855 18931693 -5672846 130832549 28228492 16317705 -22996155
17615b2996155L9618442M9252836l2542895m2977835M3634945n4326687j9721462P4842819
$$ -22996155 16622287 65875123 33332228 -9645607 33989338 -20337349 -40058811 34784008
17607C4784008j15972691K9049029k5246582J18579824k9394768Q0860675j54432106
$$ 34784008 -81188683 -52139654 -77386236 41193588 11798820 92659495 -61772611
17600f1772611M6559591j8665706M631480j03189699K24559743j82714305O2780411
$$ -61772611 -15213020 -33878726 -29247246 -132436945 92122798 -90591507 -27811096
17593b7811096Q231692J6900953J10248565k6160666q1087268L0722664M5059392k4730384
$$ -27811096 -19579404 -2678451 107570114 81409448 322180 31044844 76104236 51373852
17585E1373852j06403381M9063050j1622780J53354743j33871429Q3360104K3570827
$$ 51373852 -55029529 -5966479 -17589259 135765484 1894055 85254159 108824986
17578A08824986N0390835j43091087L4079640O8207492j61681753M958239R2578133
$$ 108824986 159215821 16124734 50204374 118411866 -43269887 -38311648 54266485
17571E4266485J17976396j70333784M3113490j30881509J98612919L5543747j06120344
$$ 54266485 172242881 1909097 45022587 -85858922 112753997 148297744 42177400
17564D2177400r142262m2293770L8425661m8359707j27538231K05566073k9248345
$$ 42177400 33035138 -9258632 29167029 -19192678 -146730909 58835164 29586819
17557B9586819P0990137p6655905J75199309k20891298q2761644Q8663031J2003075
$$ 29586819 100576956 23921051 199120360 -21770938 -104532582 -15869551 -3866476
17550c866476J2435311n3559361N3130895q715671Q565447N9980415n7282836r681971
$$ -3866476 8568835 -44990526 8140369 -575302 7990145 67970560 10687724 1005753
17542A005753J04645308j67740688m6614836L6798140M2332082K0643845M625426P6737358
$$ 1005753 105651061 -62089627 -108704463 -71906323 -29574241 -8930396 -4304970 72432388
17534G2432388n5250151L550104n4409695J8652748L7639562K0935180j6332152j19450332
$$ 72432388 17182237 20732341 -33677354 -15024606 22614956 43550136 27217984 -92232348
17526i2232348Q1812259k7084141L3896915R9801911J1489203p6766632n4763750
$$ -92232348 -10420089 -37504230 -3607315 96194596 107683799 30917167 -23846583
17519b3846583J34713666q3771557j05552800K2063309K4998236P8940352o2035610
$$ -23846583 110867083 27095526 -78457274 -56393965 -31395729 47544623 -14490987
17512a4490987N6954737M2628704j41079792J27995849K5834948L069028k54719972
$$ -14490987 42463750 85092454 -55987338 72008511 97843459 100912487 -153807485
17505a53807485J14496083O4219804l6663100L1220715r0433336M3181251n6401201
$$ -153807485 -39311402 24908402 -11754698 19466017 -70967319 -27786068 -84187269
17498h4187269o6186740K74268807j78817318N563599J59784427k6403619l3392527
$$ -84187269 -150374009 123894798 -54922520 -49358921 110425506 84021887 50629360
17491E0629360j01891497n0458678R6334607M7796477P9328461m1529703q8838133
$$ 50629360 -51262137 -101720815 -5386208 42410269 121738730 80209027 -8629106
17484h629106j61454271K47795576k6214366J43933558j19429447K3573238o9182003
$$ -8629106 -170083377 77712199 51497833 195431391 76001944 99575182 30393179
17477C0393179q2825987J16855711J0066308n0024417Q965926m8066815Q2397660m1599722
$$ 30393179 -52432808 64422903 74489211 24464794 33430720 -14636095 67761565 26161843
17469B6161843j06746225J58597721p2993466l8783424O6749099q8465738J50827697
$$ 26161843 -80584382 78013339 5019873 -33763551 32985548 -55480190 95347507
17462I5347507j52345173j9775255J15969045j11019252M0881021Q4503803j90324095
$$ 95347507 -56997666 -76772921 39196124 -71823128 -30942107 53561696 -136762399
17455a36762399Q8923323o5113170L7533237J23420110l8442581J35645178k25630156
$$ -136762399 -47839076 -112952246 -75419009 48001101 9558520 145203698 -80426458
17448h0426458R8091405M0319379l1782692j11067528o6105937K64003511j60709130
$$ -80426458 17664947 57984326 26201634 -84865894 -150971831 113031680 -47677450
17441d7677450O9879409P8139875K0001529j78934706K9727592P2414445N0007173
$$ -47677450 22201959 100341834 120343363 -58591343 -28863751 43550694 93557867
17434I3557867j44494323M6303618p8746813J18170208q6966359j4975222J80118818
$$ 93557867 -50936456 -4632838 -83379651 34790557 -52175802 -67151024 112967794
17427A12967794j66414921O5356376K6709422n0440172O0414431j71524779K9727873
$$ 112967794 -53447127 11909249 38618671 -11821501 48592930 -122931849 -93203976
17420i3203976J14438889n8555942R1719909L2149133j43260993J07932620n9903059
$$ -93203976 21234913 -37321029 54398880 86548013 -56712980 51219640 -8683419
17413h683419J3423106J79628704j81208058P2947614p3903033n0148864K1182113
$$ -8683419 4739687 184368391 3160333 76107947 2204914 -47943950 -26761837
17406b6761837l7248623J98324414r8638281J8197167Q8541577k65582199J08988923
$$ -26761837 -64010460 134313954 35675673 53872840 142414417 -123167782 -14178859
17399a4178859J10967877j55413689P8001463n9389026J20136253k09040451O5237891
$$ -14178859 96789018 -58624671 19376792 -40012234 80124019 -128916432 -63678541
17392f3678541J56878384k29659978J68213357O5644432j71725334j887901R8792614
$$ -63678541 93199843 -136460135 31753222 97397654 -74327680 -76215581 22577033
17385B2577033J4165468k5690182O1388275j81179241J47447850j26884381P052853
$$ 22577033 36742501 11052319 72440594 -108738647 38709203 -88175178 -81122325
17378h1122325N3535919J84359198j63611520N9691419k3948217m090020J7058367l66726
$$ -81122325 -27586406 156772792 -6838728 52852691 28904474 24814454 41872821 41506095
17370D1506095M2253306q4086745L5226870j24580156Q5158375J8298k4424782k8798264
$$ 41506095 83759401 -327344 34899526 -89680630 -4522255 -4503957 -28928739 -57727003
17362e7727003L04885823k97111817K19406856j45190478J4751194L1679290k22876211
$$ -57727003 247158820 -49952997 169453859 24263381 39014575 70693865 -152182346
17355a52182346R0560189M9202178j3601692O2405706q7431837j7502010J7560817
$$ -152182346 -61622157 -12419979 -26021671 36384035 -51047802 -68549812 -50988995
17348e0988995M0850054J51581088o2149690j30586420R1581565l1850880N2521669
$$ -50988995 -10138941 141442147 79292457 -51293963 40287602 8436722 60958391
17341F0958391o7845352Q312435Q342921P2394175q1860190n0989729J15015069k3586672
$$ 60958391 -6886961 1425474 9768395 82162570 302380 -50687349 64327720 40741048
17333D0741048J80771465j20723461J5871551l7628472k13609534R0325543J68845955
$$ 40741048 221512513 100789052 116660603 79032131 -134577403 -44251860 124594095
17326A24594095k37819074J52610604q7521368L1070564J1959002R826563J25371370
$$ 124594095 -113224979 39385625 -48135743 -17065179 -5106177 4720386 130091756
17319A30091756n4975910j7357122j30749843R0122459k7048403q8481603n4556182
$$ 130091756 75115846 57758724 -72991119 17131340 -9917063 -98398666 -152954848
17312a52954848J9685915J54051069m3026357O1032822n0426082N3189705j2018350
$$ -152954848 -133268933 20782136 -22244221 38788601 -11637481 41552224 29533874
17305B9533874J17284268o8177395j27797742Q4928878O4015347J0068816j39886472
$$ 29533874 146818142 78640747 -49156995 35771883 99787230 109856046 -30030426
17298c0030426k8490769L1385422P886349J44974056j08373749q8117974J13639029
$$ -30030426 -58521195 -27135773 -19249424 125724632 17350883 -70767091 42871938
17291D2871938M9918842j22306601k5034079M6014335L8598936J07393645j67333904
$$ 42871938 92790780 -29515821 -54549900 -8535565 30063371 137457016 -29876888
17284b9876888R8018663r7816143j08022825P3613840J23625463j47863453n9185304
$$ -29876888 68141775 -29674368 -137697193 -64083353 59542110 -88321343 -147506647
17277a47506647J18539514R2132605q5434982R7872968j5447456M0207735j13620511
$$ -147506647 -28967133 63165472 -22269510 75603458 60156002 100363737 -13256774
17270a3256774M3856796J08927074k75150339K3835580J67385873k2199751o7231788
$$ -13256774 30600022 139527096 -135623243 -111787663 55598210 33398459 -33833329
17263c3833329J75471989j63747709J07577047q4305809M2064676M2401314k7973945
$$ -33833329 141638660 -22109049 85467998 1162189 43226865 85628179 57654234
17256E7654234q7444469l2291696J80633214j71963019o5595726L844521K13791477
$$ 57654234 -29790235 -62081931 118551283 -53411736 -119007462 -115162941 98628536
17249I8628536k41243071J23581193o217445L3676779j23541931O2888853J19402497
$$ 98628536 -142614535 -19033342 -25250787 8425992 -115115939 -52227086 67175411
17242F7175411j04840654j24150380J06477994l2324633J36476220o9850515k0037881
$$ 67175411 -37665243 -161815623 -55337629 -87662262 48813958 -21036557 -41074438
17235d1074438k6295650K0706546L1396555N4771355j63435382K09740440q6811955
$$ -41074438 -67370088 -46663542 -15266987 39504368 -123931014 85809426 -1002529
17228a002529k7263566M1537949L6732514l7783594j8050878J48123771m8232799j3807308
$$ -1002529 -28266095 13271854 50004368 12220774 -5830104 142293667 94060868 80253560
17220H0253560j30774062M088797l6405752N381322N9507540N2344050J17911608p6182273
$$ 80253560 -50520502 -46431705 -82837457 -77456135 -17948595 34395455 152307063 76124790
17212G6124790p4290222J287430R5508309j13785316J03158394o2213740j19430783
$$ 76124790 1834568 3121998 98630307 -15155009 88003385 25789645 -93641138
17205i3641138M3549104J04346497N9803956j12680424Q9404430n8157433N9551681
$$ -93641138 -50092034 54254463 114058419 1377995 90782425 32624992 92176673
17198I2176673o1119575n0420641J25095775j57234820R7518854J2507193j03895492
$$ 92176673 31057098 -19363543 105732232 -51502588 46016266 58523459 -45372033
17191d5372033O2098068J61774371j41862381J29648063k23701221J3147945M5856376
$$ -45372033 16726035 178500406 36638025 166286088 -57415133 -44267188 1589188
17184A589188m2023310P6061132j07465370J25168974q9678072M5434976O560163k3325958
$$ 1589188 -40434122 35627010 -71838360 53330614 -36347458 9087518 15647681 -7678277
17176g678277l8119004Q7948703l4873070j15758643J88512307k12420637J32778083
$$ -7678277 -45797281 42151422 7278352 -108480291 80032016 -132388621 389462
17169C89462p5836128J8683649p0060982J83173843j12195160l3680006P1710950K0111338
$$ 389462 -75446666 -56763017 -126823999 56349844 -55845316 -89525322 -17814372 2296966
17161B296966q8690491O7518955J20184257j20819348P537674J4446609n8713990
$$ 2296966 -86393525 -18874570 101309687 -19509661 -11971987 2474622 -56239368
17154e6239368J34526107j15296497p2867229K86803158j36518592l6450968j8572119
$$ -56239368 78286739 -37009758 -109876987 176926171 40407579 3956611 -14615508
17147a4615508k9647883M3374552N2061535L1815137j191957r182103p839303l804149
$$ -14615508 -44263391 -888839 51172696 82987833 81795876 72613773 64774470 60970321
17139F0970321m0175180o461864p2003773P2897590P1029802j48155489R5936199
$$ 60970321 20795141 14333277 -57670496 15227094 86256896 -61898593 34037606
17132C4037606j05776373J49785163j05154779P8076583l5200009N1268401k7553766
$$ 34037606 -71738767 78046396 -27108383 50968200 15768191 67036592 39482826
17125C9482826k08588984O0753313J33915464p0799354O7848066k096293J1378611
$$ 39482826 -169106158 -108352845 25562619 -45236735 22611331 20515038 31893649
17118C1893649j28935962k4597194J36587143r871271L129961J9153036O0888830
$$ 31893649 -97042313 -121639507 14947636 5076365 8206326 27359362 88248192
17111H8248192J61280988m22070403K12500824J02987557j87242924n4521710J68577667
$$ 88248192 249529180 -172541223 39959601 142947158 -44295766 -98817476 69760191
17104F9760191m3773527L7631310r7089282M2445168M6586538J40866015j88172969
$$ 69760191 25986664 63617974 -33471308 8973860 55560398 196426413 8253444
17097H253444R5446666K3746145j06655015n8605871k1134299J33009644j59538567
$$ 8253444 103700110 127446255 20791240 -37814631 -58948930 74060714 -85477853
17090h5477853Q6836838J39850460k20607129k7786814K01233930o5979575J26897638
$$ -85477853 1358985 141209445 -79397684 -107184498 94049432 28069857 154967495
17083A54967495j12157910J3521881j9802624j66263319J08394580L674897N5672901
$$ 154967495 42809585 56331466 36528842 -129734477 -21339897 -17665000 38007901
17076C8007901J7989128j32106189J08418762J3074959j52498975J83994524R09935
$$ 38007901 55997029 -76109160 32309602 45384561 -107114414 76880110 77790045
17069G7790045k8542620j09262153P1653273r0552981L132614O9852882J6389902L6765915
$$ 77790045 49247425 -60014728 11638545 -78914436 -75781822 -5928940 10460962 47226877
17061D7226877M7510872j48154634J71506766j29738177K0424032n6678508o8068103
$$ 47226877 94737749 -53416885 118089881 -11648296 8775736 -47902772 -115970875
17054a15970875K37381237j55480689J2999863R7828070k00488934J37413091L1621123
$$ -115970875 121410362 -34070327 -21070464 76757606 -123731328 13681763 45302886
17047D5302886M7388199J617073r8657878l3681684J68851698k44675931M1947299
$$ 45302886 92691085 94308158 -4349720 -38031404 130820294 -113855637 -71908338
17040g1908338J25917100N64737p1183949O3523173O770705L4975319j10422952q7926258
$$ -71908338 54008762 54573499 -16610450 46912723 53683428 88658747 -21764205 -109690463
17032a09690463J97378902L5602348P8732812k01439909R0435848j44630709j0491748
$$ -109690463 87688439 123290787 202023599 583690 91019538 -53611171 -64102919
17025f4102919L0734553J61310024n5798239P877216q7464476N7155848M8753091
$$ -64102919 -33368366 127941658 72143419 80020635 -7443841 49712007 98465098
17018I8465098j18393289O1673004K07897248j87751034l7913697L7875806p9503663
$$ 98465098 -19928191 41744813 249642061 61891027 23977330 61853136 -17650527
17011a7650527m5038071Q81438O6875287q652241Q2891396r4017242j06750818K52679984
$$ -17650527 -62688598 -61807160 5068127 -3584114 79307282 -14709960 -121460778 131219206
17003A31219206j09586282J09125742m8745137r3260268M8995701J12604383j84231821
$$ 131219206 21632924 130758666 82013529 -11246739 37748962 150353345 -33878476
16996c3878476j8829024P9371660o1567714m7179821J23624921j19358162K31661821
$$ -33878476 -52707500 26664160 -34903554 -82083375 41541546 -77816616 153845205
16989A53845205k2574339K881601j29285128o3674928m779654O5688084J11613541
$$ 153845205 131270866 134152467 4867339 -58807589 -63587243 2100841 113714382
16982A13714382k16073114j5381721P0358321q3223892R3893184j23576286K17849316
$$ 113714382 -102358732 -117740453 -47382132 -130606024 -36712840 -160289126 57560190
16975E7560190K54375478k18348894j10494142R740435j4867088L3438655j8018450
$$ 57560190 311935668 93586774 -16907368 -7166933 -22034021 11404634 -6613816
16968f613816O2526740o0334943j32181846R4188167q5785911J68280590J0951945
$$ -6613816 55912924 -4422019 -136603865 -42415698 -128201609 40078981 51030926
16961E1030926p4631805K07225097o7803496j1804263j07174700J01296818L406228
$$ 51030926 -23600879 183624218 115820722 104016459 -3158241 98138577 101544805
16954A01544805R4559827j59449906M6817419k8776211O1136189q1960975J33470558
$$ 101544805 196104632 36654726 83472145 54695934 115832123 33871148 167341706
16947A67341706j40297096N3010909K2990554N9282386j3634690n6486342j32648879
$$ 167341706 27044610 80055519 103046073 162328459 148693769 92207427 -40441452
16940d0441452J23820488J0186257m1386828M2611389r2087187L6729288o2257410
$$ -40441452 83379036 93565293 52178465 94789854 2702667 39431955 -22825455
16933b2825455J16302268j43246135M6444022O2500301m5416812n3045028L1292287
$$ -22825455 93476813 -49769322 -3325300 59175001 13758189 -39286839 -7994552
16926g994552O8093898p1596291Q4683336M353667j63791968j56872533K42514078
$$ -7994552 60099346 -11496945 73186391 77540058 -86251910 -243124443 -610365
16919f10365J38955187j38406682k17317851K73787297j19995539N0054796J78814807
$$ -610365 138344822 -61860 -217379711 56407586 -63587953 -13533157 165281650
16912A65281650M2436978J64942010l47784179p156460m6858858j61432740K079581
$$ 165281650 207718628 372660638 24876459 17719999 -29138859 -190571599 -188492018
16905a88492018J78054451R886555L5451012j21230279J18411432k4542925R3616152
$$ -188492018 -10437567 -551012 34900000 -86330279 32081153 7538228 101154380
16898A01154380l6557496r1559636l8448851P0946748j44144038J86444514L13442
$$ 101154380 64596884 -26962752 -65411603 5535145 -138608893 47835621 48149063
16891D8149063j32084579J51277995j18145045O3136799n9226111R2237201P2779676
$$ 48149063 -83935516 67342479 -50802566 12334233 -46891878 45345323 118124999
16884A18124999k25639774M7113006J45533539m0079541L128252L20277713l13440166
$$ 118124999 -107514775 -60401769 85131770 45052229 48180481 368458194 55018028
16877E5018028l3397476j19533163J87065590j80607147J16990767q7636273J73761474
$$ 55018028 21620552 -97912611 89152979 -91454168 25536599 -62099674 111661800
16870A11661800j29455065R9623267n0718031R5140664n940403l012970m8524496O75639
$$ 111661800 -17793265 81830002 31111971 126252635 120312232 117299262 68774766 69450405
16862F9450405N7407324m0658695n120047L3893447n2447784n3019859J06482602o7732446
$$ 69450405 126857729 86199034 81078987 114972434 62524650 9504791 115987393 48254947
16854D8254947J15508324j27599934K24446375j90127855o133805K0324126R3935243
$$ 48254947 163763271 36163337 260609712 70481857 64348052 84672178 178607421
16847A78607421Q67897554r33555183j61919379J51702085p7265784l776954M5392094
$$ 178607421 1046504975 112949792 -48969587 102732498 25466714 21689760 67081854
16840F7081854J37597452j26420211l7688005M4316485J28428014j03074160K73566766
$$ 67081854 204679306 78259095 40571090 84887575 213315589 110241429 383808195
16833C83808195Q8871204L81682961j105420676o77449711N12412682J92951305J6532768
$$ 383808195 472679399 854362360 -251058316 -928508027 -416095345 -223144040 -206611272
16826b06611272J93709614Q97165M4451560j33820325P4241567M2700259K88653556
$$ -206611272 -12901658 -12004493 32447067 -101373258 -27131691 15568568 304222124
16819C04222124k70775958k02349792J0854461j33518008o79583069J065324792J1415149
$$ 304222124 33446166 -168903626 -158049165 -291567173 -971150242 94174550 105589699
16812A05589699o5026347n1554701r9732132N2515092N8348104k1644807N2198296
$$ 105589699 40563352 -10991349 -110723481 -58208389 139715 -21505092 30693204
16805C0693204o1784344M0528110O361335j3482184J19883067J490087O4086248j65586743
$$ 30693204 -31091140 9436970 15798305 2316121 122199188 123689275 187775523 22188780
16797B2188780j88893407K00530727j8301313l0587868J54824805l0876285P2739060
$$ 22188780 -166704627 33826100 15524787 -15063081 139761724 108885439 181624499
16790A81624499n106720J23989519N77086107q17383883l2562168P832267j78734557
$$ 181624499 176517779 300507298 877593405 60209522 27647354 35479621 -143254936
16783a43254936l60260484N84967043n7148841M8514718j57832J33313573j05607256
$$ -143254936 -503515420 81451623 24302782 72817500 72659668 205973241 100365985
16776A00365985J56347150l5589959O5175930P8910472j81702229j400029069N41985504
$$ 100365985 256713135 221123176 286299106 365209578 183507349 -1216521720 -674536216
16769f74536216K35160088J75143760M4609244L8206257m6251125N3299000J60870840
$$ -674536216 -439376128 -264232368 -219623124 -181416867 -227667992 -174368992 -13498152
16762a3498152j52638283O0842362q0500183M3248403j77470287N5449650o73122752
$$ -13498152 -166136435 -105294073 -185794256 -142545853 -320016140 -264566490 -937689242
16755i37689242R18967653K8849173O797195j30168256j51692892K64966942j11357209
$$ -937689242 -18721589 10127584 16924779 -113243477 -264936369 30573 -111326636
16748a11326636Q8374978P2511354k72779839K92421754L23186r5037086J53550721
$$ -111326636 -22951658 49559696 -223220143 69201611 69524797 -25512289 128038432
16741A28038432p1401060k5310567m9599571O2021291J6337350L4546667j54456769
$$ 128038432 56637372 31326805 -18272766 43748525 60085875 94632542 -59824227
16734e9824227R3923685M8405799K6967044j88191419k3061914J63383361j13639147
$$ -59824227 34099458 82505257 109472301 -78719118 -101781032 61602329 -52036818
16727e2036818Q2218762j07794164L6330173j2032147r8103075K31536432j04862937
$$ -52036818 30181944 -77612220 -41282047 -53314194 -151417269 80119163 -24743774
16720b4743774r4545401m5908844J26785275K1792829j09474927P5483773M24318
$$ -24743774 -119289175 -165198019 -38412744 -16619915 -126094842 -50611069 -50186751
16713e0186751J03640956m2431857P0701823j28451232L5364486k8716082j6706862
$$ -50186751 53454205 11022348 81724171 -46727061 -11362575 -40078657 -56785519
16706e6785519m0964216m7771396n5382683K14593060p5335637J32658954j05586013
$$ -56785519 -97749735 -145521131 -200903814 13689246 -61646391 71012563 -34573450
16699c4573450q303042N964824J38126433j08508594k8750299k6949763j5365759q2666742
$$ -34573450 -42876492 -36911668 101214765 -7293829 -36044128 -62993891 -78359650 -161026392
16691a61026392N5465316R591358J8915919O5154452N3255855M1429479k61658296
$$ -161026392 -105561076 -95969718 -77053799 -11899347 41356508 82785987 -178872309
16684a78872309J76291139o3986423r899397q266436J19376240Q7267138k31686081
$$ -178872309 -2581170 -66567593 -76466990 -84733426 34642814 121909952 -109776129
16677a09776129M5657885j8549958P0106680O1973822j888718L8053728n4555715
$$ -109776129 -64118244 -82668202 -12561522 49412300 47523582 85577310 31021595
16670C1021595j79029939p831174J14592089K6560763L7742968K7084382l622135n1953907
$$ 31021595 -148008344 -155839518 -41247429 -14686666 23056302 50140684 46518549 -5435358
16662e435358j04088128j552342J02042416L5411762J4273050j47572721L7108819
$$ -5435358 -109523486 -111075828 -9033412 26378350 40651400 -106921321 -69812502
16655f9812502k8309405R7123228M5467958m0626409J05435881k0825499o8905767
$$ -69812502 -98121907 -998679 44469279 3842870 109278751 88453252 19547485
16648A9547485j03503274n141678J54155599j10388314J01500230q6327366m965371
$$ 19547485 -83955789 -89097467 65058132 -45330182 56170048 -30157318 -35122689
16641c5122689N2765017q1107876J25008319n3660911M7392891O363466m0627668k9777129
$$ -35122689 17642328 -63465548 61542771 7881860 55274751 61638217 21010549 -8766580
16633h766580Q5711003n3694342l551875j64313203J00183111j36835522J31287342
$$ -8766580 76944423 23250081 19698206 -144614997 -44431886 -181267408 -49980066
16626d9980066J02693299o2978340Q4797858k26096684K48644451j11174197l337400
$$ -49980066 52713233 -10265107 74532751 -151563933 97080518 -14093679 -17431079
16619a7431079r75704r2477296O2737659J63334197k49579867J41383252L02001J43802012
$$ -17431079 -18406783 -110884079 -48146420 115187777 -134392090 6991162 7293163 151095175
16611A51095175l8040475k61844187K49425840J7219459r4345468O5542597j82165163
$$ 151095175 113054700 -148789487 100636353 117855812 23510344 89052941 -93112222
16604i3112222J25080919k01184226J81535694Q1135747j63123638J52611883J18737174
$$ -93112222 31968697 -169215529 12320165 93455912 -69667726 82944157 201681331
16597B01681331j42083070j02249877M7846615k169326J24497173j38458132m1070110
$$ 201681331 59598261 -42651616 5194999 3025673 127522846 -10935286 -52005396
16590e2005396k9287371J03258127r9736698P8522163J17672455p7239975n1748603
$$ -52005396 -81292767 21965360 -77771338 750825 118423280 41183305 -10565298
16583a0565298Q6611346j07796370p005839P979884K2286534j58134901J12291360
$$ -10565298 76046048 -31750322 -38756161 -30776277 -8489743 -166624644 -54333284
16576e4333284J01795698q0013377K0759494n911259P520829J30351629m5896742
$$ -54333284 47462414 -32550963 -11791469 -17702728 -10181899 120169730 74272988
16569G4272988j04787703Q4665534p4808748m0367354J20911900j15961527L0579423
$$ 74272988 -30514715 54150819 -20657929 -61025283 59886617 -56074910 -25495487
16562b5495487m0030481J51772570j26756609m2662649J10227783M5843713k23297070
$$ -25495487 -65525968 86246602 -40510007 -83172656 27055127 72898840 -150398230
16555a50398230K68091142J537398R784595m9000640j51673581J99495988j08850603
$$ -150398230 117692912 119230310 129014905 80014265 -71659316 127836672 18986069
16548A8986069m5716503O8813102J9177739J6793740j27311683K58469260j61771829
$$ 18986069 -26730434 42082668 61260407 78054147 -49257536 209211724 47439895
16541D7439895o9745208N6189795J08096344q9587170k0197054P3952915J2793149
$$ 47439895 -22305313 33884482 141980826 52393656 32196602 106149517 118942666
16534A18942666l0418211o7426951J93039L2879447l4776955O1099957L2975782j77134980
$$ 118942666 88524455 21097504 21290543 54169990 19393035 80492992 113468774 -63666206
16526f3666206J79610816K6217477q6266990J31875162k05565324K8676666M5685256
$$ -63666206 115944610 142162087 55895097 187770259 -17795065 10881601 56566857
16519E6566857J33134657k54059644L0587250J37835680j21056806P0572582P8063817
$$ 56566857 189701514 -64358130 -33770880 104064800 -16992006 53580576 131644393
16512A31644393n4532680K0384666O3856076j94078155L4032504m9686026J32127322
$$ 131644393 77111713 97496379 161352455 -32725700 1306804 -48379222 83748100
16505H3748100l7507489J3479628j53440210O3695644J65617889j78937139R6884713
$$ 83748100 46240611 59720239 -93719971 -30024327 135593562 -43343577 53541136
16498E3541136j20999721J77330374n8784304j1023953j48460762J67185857o1645833
$$ 53541136 -67458585 109871789 51087485 40063532 -108397230 58788627 -2857206
16491b857206N17183130l03430014j07765972k38311549P4566032P6953839o392847
$$ -2857206 514325924 210895910 103129938 -135181611 -60615579 16338260 9945413
16484I945413M1644252K3441522Q8426554r1654133K25096J2195048K27596520j38446473
$$ 9945413 51589665 75031187 163457741 71803608 72028704 84223752 311820272 173373799
16476A73373799J55970256J4428557q33515252K56925580J62800725k8656285L3769544
$$ 173373799 329344055 343772612 -489742640 -232817060 -70016335 -98672620 -64903076
16469f4903076j430812j81616860K76739857k4842692r7983178J75448339k54989856
$$ -64903076 -66333888 -247950748 28789109 3946417 -94036761 81411578 -173578278
16462a73578278J21666433j01484560O8073791m53130564L15917760O8474648J4032495
$$ -173578278 -51911845 -153396405 -85322614 -538453178 -222535418 -154060770 -140028275
16455a40028275p1797712J44244965l7777172O4245276o6276529J0360964P0392987
$$ -140028275 -211825987 -67581022 -105358194 -41112918 -107389447 -97028483 -26635496
16448b6635496l0684064j01866542K01651866j6439917p1464949K5453530J00654320
$$ -26635496 -57319560 -159186102 42465764 26025847 -45439102 -19985572 80668748
16441H0668748j0060836n1766446k0760991K0344937n7931108J1755640j06750126
$$ 80668748 70607912 18841466 -1919525 18425412 -39505696 -27750056 -134500182
16434a34500182K01468668J01874446j16609058J25095102j06388352l6732046l6943857
$$ -134500182 66968486 168842932 52233874 177328976 70940624 34208578 -2735279
16427b735279k6667656J09333383l9576872O0030635K7053272o1905109j36521143
$$ -2735279 -29402935 79930448 40353576 100384211 127437483 65532374 -70988769
16420g0988769l1290822J63492029M7331620j49191545Q9661735o3923914m7876369
$$ -70988769 -102279591 61212438 108544058 -40647487 49014248 -14909666 -62786035
16413f2786035l5216489K1693949j4990173M5906506P1614214j5092185q5233254p5158538
$$ -62786035 -98002524 -76308575 -91298748 -45392242 26221972 11129787 -74103467 -149262005
16405a49262005J16328047O3958494N6016526q6054986J38434644k04641419L5714916
$$ -149262005 -32933958 31024536 87041062 986076 139420720 -65220699 -29505783
16398b9505783l0743685j02012751J51227251j45572765J88339081J09741284r9641084
$$ -29505783 -60249468 -162262219 -11034968 -156607733 31731348 141472632 41831548
16391D1831548r348964K0839155o6635454l5229115Q5655858R5559022q7743628j20147637
$$ 41831548 32482584 53321739 -13313715 -48542830 37113028 132672050 44928422 -75219215
16383g5219215N858288n6342721K5447926K15626568k55720878J67756873J3846102
$$ -75219215 -69360927 -125703648 -100255722 115370846 -140350032 27406841 41252943
16376D1252943n8024649j2288435j04443067J80318062q2669298J88062304q3061376
$$ 41252943 -16771706 -29060141 -133503208 46814854 -35854444 152207860 69146484
16369F9146484j51407207K8392840M1106065m6248849O4883562M0095157j43722154
$$ 69146484 -82260723 -53867883 -12761818 -59010667 5872895 45968052 -97754102
16362i7754102J59697082o8538698M1128180n8487103N6759153p7391462Q0788904
$$ -97754102 61942980 -6595718 34532462 -23954641 32804512 -44586950 36201954
16355C6201954M9204533m4327596j45694158J03716728M0904856l6977563k2021680
$$ 36201954 85406487 41078891 -104615267 -898539 40006317 3028754 -18992926
16348a8992926L1369136j4878847n6287112M4873384j31356540N8818427N2476543
$$ -18992926 12376210 -2502637 -58789749 -13916365 -145272905 -86454478 -33977935
16341c3977935o0565620J62613397N19106o3219661j38792859J28815825o9805990
$$ -33977935 -94543555 68069842 68588948 5369287 -133423572 -4607747 -74413737
16334g4413737N9002240k9356078Q8820619o7207614L1477857j68323264Q1893269
$$ -74413737 -15411497 -44767575 44053044 -23154570 8323287 -159999977 -78106708
16327g8106708J44327915k9327566o6895578J78625043k49544048J56045994j24613891
$$ -78106708 66221207 36893641 -30001937 148623106 -100920942 55125052 -69488839
16320f9488839L1973370Q7266221j23957867J01749299j8203550j02814837J18753326
$$ -69488839 -37515469 49750752 -74207115 27542184 9338634 -93476203 25277123
16313B5277123r9534591J99960011j61941796J3939294J4913768K0998470o897493
$$ 25277123 -74257468 125702543 -36239253 -22299959 -7386191 13612279 6714786
16306F714786M1983459n5182694r9626064N0503373J0152603O1235354o1225655J19177039
$$ 6714786 48698245 -6484449 -106110513 -55607140 -45454537 15780817 -45444838 73732201
16298G3732201r5934213k4824630M6622145Q449953j5043093Q482615J04919120j57365712
$$ 73732201 -22202012 -47026642 -404497 8045456 -6997637 1484978 106404098 -50961614
16290e0961614n8147486L4155616K0769657P7573629k9347620j23338433K62123917
$$ -50961614 -109109100 -74953484 -54183827 23389802 -5957818 -129296251 132827666
16283A32827666j14823123q0619553O0426439P2294621r103730j38953340m2949323
$$ 132827666 18004543 -62615010 -2188571 70106050 61002320 -77951020 -120900343
16276a20900343N0860794J7579489J4371100M1765341j19040550O4405571j9431638
$$ -120900343 -70039549 -52460060 -38088960 3676381 -115364169 -50958598 -70390236
16269g0390236K8910851K1546595n1570451L3026738R2526619j57921828o9381102
$$ -70390236 -41479385 -19932790 -71503241 -38476503 54050116 -103871712 -173252814
16262a73252814P6471952J77358040j87399577M4377203n7584374J41448847j28725312
$$ -173252814 -96780862 80577178 -106822399 -62445196 -120029570 21419277 -107306035
16255a07306035L8066332J83755097j87950822O2015572p5703164l368924M1247418
$$ -107306035 -69239703 114515394 -73435428 -11419856 -87123020 -90491944 -49244526
16248d9244526N1765309o6283336N4371540j54444366N3846353N6215329J33643735
$$ -49244526 2520783 -63762553 -9391013 -163835379 -109989026 -53773697 79870038
16241G9870038j07807474k9921155k6863149k8763345J69919106j39476065P1898782
$$ 79870038 -27937436 -57858591 -84721740 -113485085 56434021 -83042044 -11143262
16234a1143262J08385348j1885194p246960J0807470j72059072J39091155o4048367
$$ -11143262 97242086 85356892 78109932 88917402 -83141670 55949485 -8098882
16227h098882M7836003N0879864j19861501n6599823J03141274J08461461k1731199
$$ -8098882 39737121 90616985 -29244516 -85844339 17296935 125758396 104027197
16220A04027197j05051065N2066794q4074660k835082O6509178j09138918j3482801
$$ 104027197 -1023868 51042926 -33031734 -35866816 30642362 -78496556 -91979357
16213i1979357J24782809p6083807L8217090o87882j439011L6724307J6855256l6143102
$$ -91979357 32803452 -43280355 -5063265 -5751147 -7190158 29534149 46389405 10246303
16205A0246303m3380341N0422907j55183803J11231786m5059946j2258203R1475871
$$ 10246303 -33134038 17288869 -137894934 -26663148 -71723094 -83981297 7494574
16198G494574k1425203J32730773r4070035O1348053o9092393o5061347R255070j349542
$$ 7494574 -13930629 118800144 24730109 86078162 16985769 -48075578 -38820508 -40170050
16190d0170050n0285787P4234177q9581418J71154556k04209376N7270245N3117139
$$ -40170050 -90455837 -16221660 -105803078 65351478 -138857898 -81587653 -28470514
16183b8470514J4190693n3209341O4621791K68638o28555l4241029n5544983l7587516
$$ -28470514 -14279821 -67489162 -2867371 -2598733 -3227288 -37468317 -93013300 -130600816
16175a30600816K7107724Q062629j56762717K58903249o5503587j9467957N7874670
$$ -130600816 -103493092 -95430463 -252193180 6710069 -58793518 -78261475 -20386805
16168b0386805p774481p1174166K05219953J8688068j77476737M9195225P9223372
$$ -20386805 -28161286 -99335452 105884501 124572569 -52904168 -3708943 75514429
16161G5514429j98126034M9358310O1828847r746917J6755138J18993022j58888004
$$ 75514429 -122611605 -73253295 -11424448 -21171365 -4416227 114576795 -44311209
16154d4311209P9065710R777671J5686829J20501147k50960193l460267N7898937M475049
$$ -44311209 34754501 44532172 60219001 180720148 -70240045 -73700312 -15801375 -11326326
16146a1326326p3394326K9775971P7663700J4109236Q4692067R945523j31192401o7606324
$$ -11326326 -84720652 -54944681 22719019 36828255 121520322 131465845 273444 -67332880
16138f7332880J22751153j47863206J23974397j20501788L1582359M5829262j09640618
$$ -67332880 55418273 -92444933 31529464 -88972324 -57389965 -11560703 -121201321
16131a21201321O7504059J75704053j57561418J73095466k20528257J54871417q1803886
$$ -121201321 -53697262 122006791 -35554627 137540839 -82987418 71883999 -9919887
16124i919887M2766978l8399795k7518225r2023009J95498791o9908029J00617954
$$ -9919887 32847091 -5552704 -33070929 -125093938 70404853 496824 101114778
16117A01114778o9550729j41181357J36282364m8469686R1671098q5070451O1375918
$$ 101114778 31564049 -109617308 26665056 -21804630 69866468 -15203983 46171935
16110D6171935j48798289Q540149J29303066o3096209n8518504K86700799j67582606
$$ 46171935 -102626354 -94086205 35216861 -27879348 -86397852 200302947 32720341
16103C2720341L3841050r0805324j59783521J69885323R714242J22490499k91037535
$$ 32720341 66561391 -24243933 -184027454 -14142131 -4427889 118062610 -172974925
16096a72974925J54260439j4064254L7801509M9786531m5410572l9376635K06495748
$$ -172974925 -18714486 -32778740 5022769 54809300 9398728 -29977907 176517841
16089A76517841k27851562p103091J87990430q8831695J1757687m0132713J74812331
$$ 176517841 -51333721 -58436812 129553618 40721923 52479610 12346897 187159228
16082A87159228j91006035q7792073J58117393p9394410j728991J8830236J161149
$$ 187159228 -3846807 -91638880 66478513 -12915897 -14644888 4185348 5346497
16075E346497R2177669m5615530N7772173k8480529K2725971j71754183P7964059J9999929
$$ 5346497 97524166 51908636 109680809 81200280 103926251 -67827932 10136127 30136056
16067C0136056k4289860K3174067k4658039L7791285j13463090N4298985Q7135955
$$ 30136056 5846196 29020263 4362224 42153509 -71309581 -17010596 70125359
16060G0125359M1263661l1242875j59882720o1528711P4147092l30068m6340580q247160
$$ 70125359 111389020 80146145 -79736575 -141265286 -67118194 -67448262 -113788842 -122036002
16052a22036002j958008L2384328P4084116m3916583n178890L6915761J85273569
$$ -122036002 -123994010 -91609682 -17525566 -61442149 -66621039 -29705278 155568291
16045A55568291k85443623J07104179j59858945P9458112J27420558J0816667j27540510
$$ 155568291 -129875332 -22771153 -182630098 -103171986 24248572 35065239 -92475271
16038i2475271Q7083029J0169173L3077308K5214971j9610870p1236124J60528201
$$ -92475271 -5392242 4776931 37854239 63069210 43458340 -27777784 132750417
16031A32750417k13764374O7800921J5932295p2782437J93059729K1941056r728565
$$ 132750417 -81013957 -13213036 2719259 -70063178 122996551 144937607 135209042
16024A35209042j21968194k5470821K5858291O6138968K8032141j84709950m168627
$$ 135209042 13240848 -12229973 13628318 79767286 107799427 -76910523 -81079150
16017h1079150J01206929k4626933j09930745J69337788p6772624J35375450r5853979
$$ -81079150 20127779 -4499154 -114429899 54907889 -21864735 113510715 17656736
16010A7656736m0863954J4129154n218213M6576399j9414367r4030528l940740K6936831
$$ 17656736 -23207218 -9078064 -14296277 32280122 12865755 -81164773 -85105513 -58168682
16002e8168682J60871009n3050405o2945884k5443068K5301965l8801816N9263914
$$ -58168682 102702327 49651922 -13293962 -38737030 -13435065 -52236881 7027033
15995G027033O2988458j4820123l1440532N9356841n5646502j24687954J89023422
$$ 7027033 70015491 55195368 23754836 83111677 27465175 -97222779 91800643
15988I1800643j60811849J04471696O8717919j40014045k9458978Q0172125l5496816
$$ 91800643 -69011206 35460490 104178409 -35835636 -65294614 14877511 -20619305
15981b0619305l7745443J66913976k38557565K4050633J43589617m6420893K5755393
$$ -20619305 -58364748 108549228 -130008337 -105957704 37631913 -8788980 16966413
15974A6966413M2646581p2699215J4709786O1271825k6632472r1904451J14936617
$$ 16966413 59612994 -13086221 1623565 62895390 36262918 -55641533 59295084
15967E9295084r6738272N5243615q7358974J63904048j50809290J61619473N1447990
$$ 59295084 -37443188 17800427 -69558547 94345501 -56463789 105155684 156603674
15960A56603674q8869324o6114845N4696809j97382514J24549290M7339591k8342708
$$ 156603674 67734350 1619505 56316314 -141066200 -16516910 30822681 2479973
15953B479973j4160447O4413253P1108730P6295203k30402318J89647248j94124109
$$ 2479973 -11680474 52732779 123841509 200136712 -30265606 159381642 -34742467
15946c4742467n023223m9298689q803831k2327303Q6405797R5262164m1350640n4457418
$$ -34742467 -39765690 -89064379 -97868210 -120195513 -33789716 61472448 20121808 -34335610
15938c4335610k6767555J15596802J5318517l3231628j02117233L4152076o3242695
$$ -34335610 -61103165 54493637 69812154 36580526 -65536707 -31384631 -94627326
15931i4627326J5615318J37047618j68276189J656979R2188373J14046049j22970109
$$ -94627326 -79012008 58035610 -110240579 -108583600 -16395227 97650822 -25319287
15924b5319287M3763156m0112294J1165677n0417334O2301369j04085149J29936115
$$ -25319287 18443869 -21668425 -10502748 -60920082 1381287 -102703862 27232253
15917B7232253J9068546j9577081J11775435j73142534J04592578J1758621k42563939
$$ 27232253 46300799 26723718 138499153 -34643381 69949197 81707818 -160856121
15910a60856121R5016513J2643268R8298943j32064984R1899143M301103q5748940
$$ -160856121 -65839608 -53196340 45102603 -86962381 4936762 9237865 -76511075
15903g6511075R4458339J8457094q5449591O9768605j21967391J38983239r6611748
$$ -76511075 17947264 36404358 -49045233 20723372 -101244019 37739220 -58872528
15896e8872528o614692q1648609P4686062M8142783K2725705j32013000J27408089
$$ -58872528 -65487220 -147135829 -72449767 -24306984 -1581279 -133594279 -6186190
15889f186190p5662912M8440825m9630060Q8311806M5605510j45849761J43949089
$$ -6186190 -81849102 -33408277 -83038337 5273469 50878979 -94970782 48978307
15882D8978307r7555313p2146446r1637441P5965636K10972723k2495409o4991664
$$ 48978307 -48577006 -120723452 -212360893 -136395257 74577466 52082057 -12909607
15875a2909607m9313608Q4902928l8469739K5222847K25723702j24448621l5291730
$$ -12909607 -62223215 22679713 -15790026 9432821 235156523 110707902 75416172
15868G5416172r5796793M8856634L3819191m8426094J6280969k7025384K61236557
$$ 75416172 -20380621 28476013 62295204 13869110 30150079 3124695 264361252
15861B64361252k14551391j01588289N0740463N5182980J08732078j33499502J85652919
$$ 264361252 49809861 -51778428 -1037965 54145015 162877093 29377591 215030510
15854B15030510k67349774M9021313N5796001j05379254O0065093K5812079Q498495
$$ 215030510 -52319264 -3297951 52498050 -52881204 7183889 32995968 41494463
15847D1494463J21966457n4947700q6931903J6111142J8498708m912476o332046o5680907
$$ 41494463 163460920 108513220 21581317 37692459 56191167 51278691 44946645 -20734262
15839b0734262L8145691p2301515K8254714M4409284K153049k2302215k073147J04858547
$$ -20734262 17411429 -54890086 -26635372 17773912 19926961 -2375254 -4448401 100410146
15831A00410146r4919522R3933673k8786010j01886727r381762K5836870M9447809
$$ 100410146 5490624 99424297 70638287 -31248440 -40630202 -14793332 34654477
15824C4654477q7754803m5346823K28880720j82956019j4110314J44162813k9956429
$$ 34654477 -53100326 -98447149 130433571 -52522448 -66632762 77530051 47573622
15817D7573622m2807918P5895044n705748j49597549m5839261R8737756M0853530J1838360
$$ 47573622 4765704 80660748 74955000 -74642549 -120481810 -21744054 19109476 30947836
15809C0947836P0553495j31435081M648067O0444758M633114L5079819K6681321q3632550
$$ 30947836 101501331 -29933750 -25285683 35159075 39792189 74872008 101553329 17920779
15801A7920779r9457800P8876327j57641762J99644215q8327283J13057436m7100578
$$ 17920779 -81537021 -2660694 -160302456 39341759 -48985524 64071912 16971334
15794A6971334N1711695j1707542J6984558J1683352j59778607J03656770j02581336
$$ 16971334 68683029 56975487 73960045 85643397 -74135210 29521560 -73059776
15787g3059776J5622469j25282189Q9761150J40315228k1361745j2882430j56469872
$$ -73059776 -57437307 -182719496 -92958346 47356882 25995137 13112707 -143357165
15780a43357165K38147584k95534267J53591089R1006454n8625981q4979138J54121306
$$ -143357165 94790419 -200743848 -47152759 43853695 -14772286 -99751424 54369882
15773E4369882j19492177J66299730j23411502J33476357q939546m9033912j39743908
$$ 54369882 -65122295 101177435 -22234067 111242290 102302744 53268832 -86475076
15766h6475076k71571J03442834p1277853P319287N6522390j0288996q9381189M9538438
$$ -86475076 -86746647 16696187 -54581666 -47262379 9260011 -1028985 -90410174 -40871736
15758d0871736m7343554R6794960m3831088O3097990L026547K7878461k5130844n6641766
$$ -40871736 -88215290 8579670 -35251418 27846572 30873119 58751580 33620736 -23021030
15750b3021030p5014931N4907779k1010066M8781000n466709M3646549r6068151k4691348
$$ -23021030 -98035961 -43128182 -64138248 -15357248 -20823957 22822592 -73245559 -97936907
15742i7936907l5884655O9271178L7158366m3899169l4600285J39893249j72772347
$$ -97936907 -133821562 -64550384 -27392018 -71291187 -105891472 34001777 -138770570
15735a38770570j599648n802017Q5482113q511427J7394305l9533322M7482424o8864135
$$ -138770570 -140370218 -146172235 -60690122 -69201549 -51807244 -91340566 -43858142 -112722277
15727a12722277j2421734M5606223R7880505j6774182M7292956j18748836Q7709053
$$ -112722277 -125144011 -79537788 18342717 1568535 48861491 -69887345 17821708
15720A7821708n1643379j7574005R3888363N2397749j72410386J06465540j17553091
$$ 17821708 -33821671 -51395676 42492687 94890436 -77519950 28945590 -88607501
15713h8607501j6424935O4771033N8397623K5417730l6473825r6863469R8070164j0503982
$$ -88607501 -105032436 -40261403 18136220 43553950 7080125 -89783344 8286820 -2217162
15705b217162J5264161p2061109J1683302L2149584r832171K8123500M961146p7523001
$$ -2217162 13046999 -59014110 -47330808 -15181224 -25013395 3110105 8071251 -69451750
15697f9451750R5131014M0379944j6293004j6218587j30359258J14331545K7995529
$$ -69451750 25679264 66059208 49766204 33547617 -96811641 17519904 45515433
15690D5515433j56204825L1905338N5880896J03315089k11576611L2666527J26183008
$$ 45515433 -110689392 -78784054 -22903158 80411931 -131164680 -98498153 27684855
15683B7684855O7814072q8213564Q6420979q4194699Q8578429j22608605K5816927
$$ 27684855 95498927 7285363 93706342 9511643 98090072 -24518533 1298394
15676A298394J06210868j30054876j64012966K74516393r3663821m8847248l8086560
$$ 1298394 107509262 -22545614 -186558580 87957813 -5706008 -54553256 -92639816
15669i2639816L570368J84970109o3426963k415053j35595265J18953704j32976489
$$ -92639816 -89069448 95900661 32473698 30058645 -105536620 13417084 -119559405
15662a19559405M7315577k6907572Q6007205L8565312j71230360J43377474j21192707
$$ -119559405 -72243828 -99151400 -13144195 25421117 -145809243 -2431769 -123624476
15655a23624476J45604040Q8985231j59792662O7636288r1790247o4192977J04363339
$$ -123624476 21979564 110964795 -48827867 18808421 -72981826 -137174803 -32811464
15648c2811464p3814621J98389625P720319m8278069M7857445p7380781j80835528
$$ -32811464 -106626085 91763540 99483859 51205790 99063235 21682454 -159153074
15641a59153074K32716716m6184917L9307278j36099724N4939386l1065677N7645288
$$ -159153074 73563642 27378725 66686003 -69413721 -14474335 -45540012 12105276
15634A2105276q4771516R5427067O0828330j15958242J00755328j15164684M404239
$$ 12105276 -72666240 22760827 83589157 -32369085 68386243 -46778441 -42374202
15627d2374202j08713586P8190574J07841783P210364m7600438K8775098N5951803
$$ -42374202 -151087788 -72897214 34944569 42154933 -5445505 23329593 79281396
15620G9281396j78962920J24744563j1711602O1222834j1284646p6178320j1305096
$$ 79281396 -99681524 25063039 13351437 74574271 63289625 -12888695 -24193791
15613b4193791J0269043n5480821m6869449K31956481m8628507r7928609j0055715
$$ -24193791 -13924748 -69405569 -116275018 115681463 67052956 -30875653 -40931368
15606d0931368J22917324o7223996j6534271Q3297357n1005336P797625K7093032k4429919
$$ -40931368 81985956 14761960 -1772311 81525046 30519710 38317335 65410367 40980448
15598D0980448p1454685l1668255J2022361P6923159J7849441r9856050K29091117
$$ 40980448 -30474237 -62142492 -50120131 26803028 44652469 -55203581 173887536
15591A73887536k74987012L7732586O197552J4900089J05223634l855667k05129513
$$ 173887536 -101099476 -63366890 -57169338 -42269249 62954385 59098718 -146030795
15584a46030795M0617457Q7533892n3589225k1186800J44559154n6688877J02788548
$$ -146030795 -105413338 -17879446 -71468671 -92655471 51903683 -4785194 98003354
15577I8003354j51961830J03031603j58918764R4355605j22040899N9046167R7367177
$$ 98003354 -53958476 49073127 -109845637 -15490032 -137530931 -78484764 18882413
15570A8882413o5918375K7394082R4277781j95826609m2371753J67782759o8486288
$$ 18882413 -47035962 -19641880 74635901 -121190708 -163562461 4220298 -64265990
15563f4265990q876568l8972719L3865702O5630236Q2182670j13264403J16324278
$$ -64265990 -73142558 -112115277 -78249575 -12619339 69563331 -43701072 72623206
15556G2623206O2364292k3194131r2978809j13322182J18360662M4468752j19774630
$$ 72623206 134987498 111793367 18814558 -94507624 23853038 68321790 -51452840
15549e1452840l1498484K28387565p8119633j9860907q472138Q621700o3892325L1319736
$$ -51452840 -82951324 145436241 67316608 47455701 38983563 47605263 -16287062 15032674
15541A5032674R028482j23318033l2585450M9693090J45573735N4506458q9362882
$$ 15032674 24061156 -99256877 -131842327 -82149237 63424498 117930956 28568074
15534B8568074j38763752J22465754o9287612j66171j02552034J26418829n0030066
$$ 28568074 -110195678 12270076 -57017536 -57183707 -159735741 -33316912 -83346978
15527h3346978l5071023O3296880J7194357o1557542p6958166J76256400J12952882
$$ -83346978 -118418001 -55121121 -37926764 -99484306 -176442472 -186072 112766810
15520A12766810n7697870j12353532M0006353q2815066J41692378j04549243J28161477
$$ 112766810 55068940 -57284592 -17278239 -100093305 41599073 -62950170 65211307
15513F5211307m2816567j24449493J19575647n1474567p208076q6374432K14202378
$$ 65211307 22394740 -102054753 17520894 -33953673 -41161749 -127536181 86666197
15506H6666197L065607j37666819L4266797j740784R3554830j36151687L3629573K62957
$$ 86666197 89731804 -47935015 -13668218 -15409002 78145828 -58005859 -24376286 -24113329
15498b4113329J19093429j94461881M6992663Q8703125n0686037j47115668l2871056
$$ -24113329 94980100 -99481781 -52489118 36214007 -14472030 -161587698 -194458754
15491a94458754K86985013o9509129o885255P1083564k05695250K6324091J28020343
$$ -194458754 92526259 23017130 16131875 87215439 -118479811 -92155720 35864623
15484C5864623J03169035k23332950j900783J50898775j79256854n3166215J48324704
$$ 35864623 139033658 -84299292 -86200075 64698700 -114558154 -167724369 -19399665
15477a9399665l5377044R2012672k681521k2747892l6540992J21837976q1862828l4319098
$$ -19399665 -54776709 37235963 34554442 11806550 -24734442 97103534 15240706 -19078392
15469a9078392O676502n3058370J79986253j00739059r2032858o0385205J47384725
$$ -19078392 -12401890 -65460260 114525993 13786934 -78245924 -138631129 8753596
15462H753596J33765537j36418998m0037856o533875q0525662J10846202J39676519
$$ 8753596 142519133 6100135 -33937721 -40471596 -120997258 -10151056 129525463
15455A29525463k96663915R882501J54777099J19238905P8138459l55094792J13549460
$$ 129525463 -167138452 -157255951 -2478852 116760053 194898512 -160196280 -46646820
15448d6646820Q0383311J9471041J368993p0951313l2127306O5817328Q8880220m5000524
$$ -46646820 33736491 53207532 54576525 -16374788 -48502094 17315234 106195454 61194930
15440F1194930l0041487q9978732P6331349L7769120q0612646p1829039j679828J69845437
$$ 61194930 31153443 -58825289 17506060 55275180 -25337466 -97166505 -98846333 70999104
15432G0999104j32937009K7926992K0889527P2409935m8254624M0389327j10535942O85605
$$ 70999104 -61937905 -34010913 -13121386 59288549 11033925 51423252 -59112690 -58427085
15424e8427085P6679435j1175601n0485131J2521785j6809310P104590R3759592J9874765
$$ -58427085 18252350 7076749 -43408382 -30886597 -47695907 -40591317 53168275 73043040
15416G3043040o3916957j1708280K2592305Q666331p8313816M0924358L0715896l7442871
$$ 73043040 9126083 -2582197 20010108 28676439 -49637377 -8713019 22002877 -15439994
15408a5439994M8049018r5253305K874466M8928660O919198j3596537p0223506R2945412
$$ -15439994 32609024 -62644281 -59769815 -10841155 -3921957 -17518494 -87742000 5203412
15400E203412l9130315j1937434O3746469n7069531J76049809j51735423n1538930n22990
$$ 5203412 -33926903 -45864337 17882132 -39187399 136862410 -14873013 -66411943 -66934933
15392f6934933N7191719n8368674O0711777L2733111J688292o5889866J20490663o8291411
$$ -66934933 -9743214 -68111888 -7400111 25333000 27021292 -38868574 81622089 13330678
15384A3330678K1471799M6214555J0675793n6218983R937463o292546M879876M2522654
$$ 13330678 34802477 81017032 91692825 35473842 45411305 39118759 43998635 86521289
15376H6521289J6662816r8829912N4825357k7703310n6321627m1984509J51983166
$$ 86521289 103184105 4354193 59179550 31476240 -24845387 -66829896 85153270
15369H5153270o7925040n1017017J1574280o7513996n25242J57651631j97201502J5532529
$$ 85153270 17228230 -33788787 -22214507 -89728503 -90253745 67397886 -129803616 -114271087
15361a14271087N9231044j24713910J44912825L0495912j64801633J24760959O8185890
$$ -114271087 -55040043 -179753953 -34841128 -4345216 -169146849 -44385890 23800000
15354B3800000o2781008P1733065J5294694j79989426R9079249J08580442l3802966
$$ 23800000 -38981008 32752057 48046751 -131942675 -32863426 75717016 41914050
15347D1914050M6883867p5195171L1758906j05899070J60705920r7074384Q0069604
$$ 41914050 88797917 13602746 45361652 -60537418 100168502 3094118 83163722
15340H3163722l0153583P933525j8287641p2248974L3412208J3416563l7455225Q6067324
$$ 83163722 53010139 60943664 42656023 -29592951 3819257 17235820 -20219405 65847919
15332F5847919N6841481j64660121l7000305L3938610J5577877L1367575j51130351
$$ 65847919 122689400 -41970721 -78971026 -45032416 -29454539 1913036 -149217315
15325a49217315J89783997j6909141l7830789J9759821j606295L4978962o3056998J842745
$$ -149217315 40566682 23657541 -14173248 5586573 3980278 38959240 -24097758 -22255013
15317b2255013N1120436o8540811J12404649n2903859r639171R5309402o4648137J8229309
$$ -22255013 28865423 -39675388 72729261 19825402 10186231 105495633 40847496 59076805
15309E9076805P0611773R890141j01933671j4467434P0839486n7658948j7539064J793874
$$ 59076805 129688578 139578719 37645048 23177614 94017100 36358152 18819088 20612962
15301B0612962M8807606q339491M7960090j05185463o3065947M3940191P0365967
$$ 20612962 69420568 61081077 109041167 3855704 -59210243 -15270052 55095915
15294E5095915j88616828J34506125P613283j193826J2038241o6941940k4122067M1189293
$$ 55095915 -133520913 985212 8598495 7404669 19442910 -47499030 -71621097 -30431804
15286c0431804L7651845o2864525J1291625K573692J5614702J12300722r3828049N0890892
$$ -30431804 7220041 -55644484 -44352859 -41779167 -26164465 86136257 -7691792 43199100
15278D3199100K5923373O422987n7326413L8130150P569800O191832j4452785o8911970
$$ 43199100 69122473 75545460 18219047 56349197 63918997 70110829 55658044 -13253926
15270a3253926q768395Q3555090k4458275L2552566j01373333r049793K21043085
$$ -13253926 -22022321 61532769 37074494 69627060 -31746273 -40796066 180247019
15263A80247019j48399371j0142158o5375720P4271535j7560287j5531486j7241280
$$ 180247019 31847648 21705490 -43670230 30601305 13041018 -2490468 -19731748
15256a9731748j85971207J65332736l0255422P1565888j14481855Q7085485j04709024
$$ -19731748 -205702955 -40370219 -70625641 940247 -113541608 -26456123 -131165147
15249a31165147P7360613R3361235n6764381j72451759K30263073o5259467j4310964
$$ -131165147 -53804534 39556701 -17207680 -189659439 40603634 -24655833 -38966797
15242c8966797p7817670j8241270J12197224J57159501k57793677J61511534r6861283
$$ -38966797 -116784467 -135025737 -22828513 134330988 -123462689 38048845 -58812438
15235e8812438R3589896j74123459R7882685O8018827n2231954N9005085M6107763l115331
$$ -58812438 34777458 -139346001 -41463316 26555511 -25676443 33328642 79436405 76321074
15227G6321074j10212782K922854K8931768m7007732J13665435K2835413j15478981
$$ 76321074 -33891708 -30968854 -2037086 -49044818 64620617 87456030 -28022951
15220b8022951k6646812o9479291J4281995M1117069J85562634L888232o2331237m4039829
$$ -28022951 -54669763 -124149054 -109867059 -68749990 116812644 120700876 58369639 14329810
15212A4329810l7548474j01360076Q4292727R070114J4325752l2605466k39999k786657
$$ 14329810 -23218664 -124578740 -40286013 -31215899 -16890147 -49495613 -49735612 -52522269
15204e2522269r9046418J56076869K5926524M8938657q7260187o1321916k1890069
$$ -52522269 -151568687 4508182 30434706 79373363 -7886824 -69208740 -91098809
15197i1098809P3535278k8588892k0003349j73592627K90035118J5497348k7254824
$$ -91098809 -17563531 -46152423 -66155772 -239748399 50286719 65784067 38529243
15190C8529243n4422715N7882251o3308399q638439R2348609o353603k31634473J91939676
$$ 38529243 -15893472 41988779 -21319620 -29958059 62390550 56036947 -175597526 16342150
15182A6342150J63702948j62138083k6016981m2862243j0993386J21269276m7595816
$$ 16342150 180045098 17907015 -8109966 -50972209 -61965595 59303681 11707865
15175A1707865o7809143J31241625l7627581l7610325p287783q9109137O1754588
$$ 11707865 -56101278 75140347 37512766 -97559 -7385342 -96494479 -34739891
15168c4739891J21323157p9043214j09086154j6552464P5756011M6096898J03803450
$$ -34739891 86583266 7540052 -101546102 -118098566 -42342555 3754343 107557793
15161A07557793p9086999j5704467o4284740J8795628J04455398p7196249J1971038
$$ 107557793 28470794 12766327 -51518413 -32722785 71732613 -5463636 6507402
15154F507402j35824374N9140304l2336569Q8533589J2291089K3605561M6422091M0289231
$$ 6507402 -129316972 -70176668 -102513237 -13979648 -1688559 21917002 68339093 108628324
15146A08628324n4424975j5124986J6138144k0948518M628565N1993857o6666328
$$ 108628324 54203349 39078363 55216507 34267989 38896554 90890411 24224083
15139B4224083j89559411J41291303q6174017K77406058j33693680N9628922j10799022
$$ 24224083 -165335328 -24044025 -110218042 167188016 33494336 93123258 -17675764
15132a7675764J26143270j4338931m4958001j67513668J30473205r925369P2351912
$$ -17675764 108467506 94128575 49170574 -118343094 12130111 2204742 74556654
15125G4556654r2276561K222976j09314450J46569541n636192o8156178O7356613K0806300
$$ 74556654 -17719907 -15496931 -124811381 21758160 16121968 -52034210 15322403 36128703
15117C6128703J33652342j54812983j0236090O7274574j22269586J20595306j08409061
$$ 36128703 169781045 14968062 4731972 72006546 -50263040 70332266 -38076795
15110c8076795R5832876j32386062o5929458P1734536M3057164J69607977k7605844
$$ -38076795 57756081 -74629981 -140559439 -68824903 -25767739 143840238 116234394
15103A16234394p4823811m2645467J06932206j48849150J0474893O7644085j32035302
$$ 116234394 41410583 -1234884 105697322 -43151828 -32676935 34967150 -97068152
15096i7068152m301048N2949813k6218918L0484536r905302J88367123j14234215R9001262
$$ -97068152 -101369200 -48419387 -74638305 -44153769 -54059071 134308052 20073837 119075099
15088A19075099m2857672j03406191J13822859n9991748J2600276q8436743j43336807
$$ 119075099 76217427 -27188764 86634095 26642347 39242623 -49194120 -192530927
15081a92530927P6321640J18520117J07685786n5412480j1206220q2464912M7813890
$$ -192530927 -116209287 2310830 109996616 54584136 43377916 -39086996 8726894
15074H726894m2396373L7072564q6820927M6739090r936247N8250810j27880580K0093605
$$ 8726894 -33669479 3403085 -83417842 -36678752 -46614999 11635811 -116244769 -96151164
15066i6151164Q1994542J24947882j28688271j9699831J6166087r4575133R3353505
$$ -96151164 -14156622 110791260 -17897011 -37596842 -21430755 -116005888 -22652383
15059b2652383M3046171n2158151J83572568j50227666r0167723J30710180p4919199
$$ -22652383 20393788 -31764363 151808205 1580539 -88587184 42122996 -32796203
15052c2796203j291625N4984910L3516221k09091482N6426779O8266270Q6328135l2413408
$$ -32796203 -34087828 20897082 54413303 -154678179 -98251400 -29985130 56343005 23929597
15044B3929597R451870p0625381O4988158N5553540j46804521q2975258K24928119
$$ 23929597 33381467 -37243914 27744244 83297784 -63506737 -146481995 78446124
15037G8446124p2154246n1792880Q3836758k67406566R4142640J44363631o1333894
$$ 78446124 6291878 -45501002 38335756 -229070810 -134928170 9435461 -51898433
15030e1898433K02505689p3413060j61586498Q1089796K4891293l733787q0820248
$$ -51898433 150607256 77194196 -84392302 -3302506 21588787 17855000 -62965248
15023f2965248Q4881679J9880290j15895230K3865248q3730115j1699679J41226071
$$ -62965248 21916431 41796721 -74098509 -50233261 -133963376 -145663055 -4436984
15016d436984M3094647N7008360m0216676l770653j66689552Q2934974j071499R7944722
$$ -4436984 38657663 95666023 55449347 51678694 -115010858 -32075884 -33147383 64797339
15008F4797339o8162282m6430262j7990824j3469868P135899M7153673O5514989o5609477
$$ 64797339 -3364943 -49795205 -67786029 -81255897 -74119998 -26966325 38548664 -27060813
15000b7060813J31026517j23056947r1714088L1304550K9604753K0762696k0769855
$$ -27060813 103965704 -19091243 -110805331 -79500781 -49896028 -29133332 -49903187
14993d9903187O0720500P7684914j09974568J04276221n0273005N4550255P966700
$$ -49903187 10817313 88502227 -21472341 82803880 32530875 87081130 95047830
14986I5047830j65163636Q9190250J51311097j65746888l236186J8861389N8999091
$$ 95047830 -70115806 19074444 170385541 4638653 1402467 20263856 79262947
14979G9262947q6666674J08600757J25273574j75636657k7205211j2981953m9627609
$$ 79262947 -7403727 101197030 226470604 50833947 23628736 10646783 -38980826
14972c8980826K17780341k10506250L9823136n6069976J68837835r0884968l670818
$$ -38980826 178799515 -31706735 8116401 -47953575 120884260 29999292 26328474
14965B6328474o4455173J03847796l5500288J76863923k13043416k1448543L8445261
$$ 26328474 -38126699 65721097 30220809 207084732 -5958684 -27407227 11038034
14958A1038034L4983696O9886065r2457586m0820462P7152830L4079825q66825p2754998
$$ 11038034 46021730 115907795 23450209 -17370253 59782577 93862402 92995577 20240579
14950B0240579P4199173N339850J6821833o5133929m4720700o3209147K00606084j253374
$$ 20240579 94439752 99779602 116601435 51467506 6746806 -56462341 144143743 142890369
14942A42890369q1507656p5967241k8566266K4049537q2725479J38558677J3728578
$$ 142890369 61382713 -14584528 -43150794 -19101257 -101826736 36731941 50460519
14935E0460519r4518185L2990268J39066293j17694714j02362912J86408457j28987361
$$ 50460519 -44057666 -11067398 127998895 10304181 -92058731 94349726 -34637635
14928c4637635L0242937k8482957L9837226m4807484Q3421787k40475308J31718724
$$ -34637635 -4394698 -32877655 6959571 -37847913 45573874 -194901434 -63182710
14921f3182710K11847617j36015175l2003595J46835039p9492719j32416861N4238666
$$ -63182710 148664907 12649732 -19353863 127481176 47988457 -84428404 -30189738
14914c0189738J00851338j03230275J10605797o846513N1116938l83218892L75406706
$$ -30189738 70661600 -32568675 78037122 71190609 122307547 -260911345 114495361
14907A14495361j08403300J62378278M6184046j94106355k8665687J01164857q5294724
$$ 114495361 6092061 168470339 214654385 20548030 -8117657 93047200 7752476
14900G752476m5931065J00786616L22687J50152716j48460599p2273027j0649887n0524384
$$ 7752476 -38178589 62608027 62930714 213083430 64622831 -7650196 -18300083 -68824467
14892f8824467J75229543j22252701N7309463J936891P4486077J1658756k7110513
$$ -68824467 106405076 -15847625 41461838 43398729 117884806 129543562 102433049
14885A02433049o4107255O3570562O5068194o6475607j23457242l1500807J8569499
$$ 102433049 38325794 101896356 166964550 100488943 -22968299 -54469106 -35899607
14878c5899607L8999547j09694210J20243225J3242738M2619797P4697431j74428664
$$ -35899607 3099940 -106594270 13648955 26891693 69511490 144208921 -30219743
14871c0219743Q9853331n6620882K3406474j32722293K97960516l75398087J85679261
$$ -30219743 59633588 3012706 26419180 -106303113 191657403 -183740684 1938577
14864A938577o2835211J03700435j52926684Q7841062J08901501m1176922r1386273
$$ 1938577 -60896634 42803801 -110122883 -22281821 86619680 45442758 -45943515
14857d5943515Q6880576m0097578J12474068j62723064J0940189K2784576Q6554374
$$ -45943515 40937061 839483 113313551 -49409513 -38469324 -15684748 70869626
14850G0869626j19554769M3827398j37873451J88789487j68168952J80312010j31522326
$$ 70869626 -48685143 -4857745 -142731196 46058291 -122110661 58201349 -73320977
14843g3320977k2588921P0881852P8186343j20168959q090417J799446P7016692o0364239
$$ -73320977 -95909898 -25028046 53158297 -67010662 -75101079 -73301633 3715059 -56649180
14835e6649180J15828594n3551301q665668q3665531J29544958l5657606J6021222
$$ -56649180 59179414 5628113 -3037555 -86703086 42841872 7184266 23205488
14828B3205488R4858608j10817791q773204J61125827p2888077Q4693699j51963976
$$ 23205488 118064096 7246305 -1526899 159598928 86710851 171404550 19440574
14821A9440574k9658361J00661987j911346j78236979J27088945J4537715J0484797
$$ 19440574 -10217787 90444200 88532854 -89704125 37384820 51922535 62407332
14814F2407332K9996572j44933332k9314310J07400413J02097419n3829978J8168946
$$ 62407332 92403904 -52529428 -81843738 25556675 127654094 73824116 91993062
14807I1993062k20063575L6774042J12797909L0705209q7751670Q6551990p2859952
$$ 91993062 -128070513 -91296471 21501438 52206647 -35545023 51006967 -21852985
14800b1852985r4941104O276924J63667570l0291649M3677625m5681776j17028661
$$ -21852985 -116794089 -110517165 53150405 22858756 66536381 20854605 -96174056
14793i6174056M8786621K3925626L0276262O770070n5811974K35506632l68725144
$$ -96174056 -47387435 -23461809 6814453 13584523 -42227451 193279181 -175445963
14786a75445963J21974797K4131283L9913525J01657581j5447132p3874373m4842535
$$ -175445963 -53471166 -29339883 10573642 112231223 96784091 22909718 -21932817
14779b1932817k7615859M9758748k8290940n8377461J7970463L7026996l7505056R210935
$$ -21932817 -49548676 210072 -28080868 -86458329 -68487866 -31460870 -68965926 -59754991
14771e9754991N0187148m4348826L713413M6510870q5990866q9688388O3258163J29151103
$$ -59754991 -9567843 -53916669 -50203256 -3692386 -89683252 -179371640 -116113477 13037626
14763A3037626O294706j5425715k1552900n9563175P8862402O9270672l4597292k0682929
$$ 13037626 19332332 3906617 -17646283 -77209458 1652944 70923616 36326324 15643395
14755A5643395p9822672J02584134j72730531J60074378P2607500j39784491J0084550
$$ 15643395 -64179277 38404857 -134325674 25748704 98356204 -41428287 -31343737
14748c1343737k8478627l4342894J92974759q6984477j826019k0338629m8089321l106061
$$ -31343737 -59822364 -94165258 98809501 11825024 9999005 -10339624 -58428945 -61535006
14740f1535006o7428423O6353017R7959516O679878o2805777j21544319j6541589
$$ -61535006 -128963429 -62610412 35349104 42028982 -20776795 -142321114 -158862703
14733a58862703J63354070k06697221P7714291J45528536m8100348N1372846j01836338
$$ -158862703 4491367 -202205854 -124491563 21036973 -27063375 24309471 -77526867
14726g7526867M7598286J71638777j2520278K1309123k33927180N5010344n5430215
$$ -77526867 -29928581 141710196 129189918 150499041 -83428139 -28417795 -83848010
14719h3848010R4167631k8180857k54045k8954092l2569914K47445790J18052833
$$ -83848010 10319621 -17861236 -18115281 -47069373 -79639287 167806503 285859336
14712B85859336k69191011j17471232J28730792m0272635p0798256K0008767j1469556
$$ 285859336 16668325 -100802907 27927885 -12344750 -83143006 -63134239 -74603795
14705g4603795M8451654k6831620j00297513J45118118j37725125J35516615J03440810
$$ -74603795 -26152141 -52983761 -153281274 -8163156 -145888281 -10371666 93069144
14698I3069144Q816012k02083090o98238l2548765J86837895l8774885j40194267P3787034
$$ 93069144 101885156 -100197934 -100896172 -133444937 53392958 14618073 -125576194 -51789160
14690e1789160J29969640j69492231n8144808Q2064573Q6047753p5844323K98305931
$$ -51789160 78180480 -91311751 -149456559 -67391986 18655767 -57188556 241117375
14683B41117375j25461453j42263960J58582146n3704300j2983902n6783895j09875628
$$ 241117375 115655922 -26608038 131974108 78269808 65285906 8502011 -101373617
14676a01373617j5995742L793750J10873243q3492630R7840511J17335262j32925825
$$ -101373617 -117369359 -113575609 -2702366 -86194996 11645515 128980777 -3945048
14669c945048J3932301P3829924m0589115n171748m1104419N042229l7178013r930724
$$ -3945048 9987253 83817177 43228062 38056314 -3048105 1994124 -35183889 -45114613
14661d5114613q320042J60042835p2261704M7623569J47560426k64980539O3651414
$$ -45114613 -53434655 106608180 34346476 81970045 229530471 -35450068 28201346
14654B8201346J30383073r4510283N0755012m8347749n5224322K02089308k25169388
$$ 28201346 158584419 64074136 114829148 66481399 11257077 213346385 -11823003
14647a1823003L3074889Q132863L1606443j20144207P4126109J3211263k137450o4867313
$$ -11823003 21251886 29384749 60991192 -59153015 14973094 28184357 26046907 -38820406
14639c8820406J97449381j78716949J60229260p3107832J6419319J36133126l26370511
$$ -38820406 158628975 -20087974 140141286 67033454 83452773 219585899 -106784612
14632a06784612j25278709J31731219N4604264r6940994K38507351j5629862q6613184
$$ -106784612 -232063321 -100332102 -45727838 -142668832 95838519 80208657 -6404527
14625f404527M8760347R560616J562278K9032823q265307Q7526670o8047055j69336416
$$ -6404527 42355820 51916436 53478714 82511537 74246230 161772900 93725845 -75610571
14617g5610571K4026819O0208329J4386176p62614Q7532340j96957017J36574185
$$ -75610571 -51583752 8624577 23010753 22248139 109780479 -87176538 49397647
14610D9397647j85898869K34216624q8699679n4973772N8393197P5973518o2435708
$$ 49397647 -136501222 97715402 9015723 -45958049 12435148 88408666 25972958
14603B5972958m3421750m9339555k2068291L1636884R5740227o38648n7649956Q8560261
$$ 25972958 -17448792 -66788347 -88856638 -57219754 38520473 37881825 -19768131 68792130
14595F8792130Q0394809p3150018K44959p2782522j7858492j02187606K15304260r7592310
$$ 68792130 149186939 76036921 76281880 3499358 -14359134 -116546740 98757520 1165210
14587A165210j05919357J09497834q6153191L1979128p6697481J31250353M418783
$$ 1165210 -104754147 4743687 -81409504 -49430376 -126127857 5122496 9541279
14580I541279K4760159m4913380n088280j61994920J33712401j29990252O3923345
$$ 9541279 34301438 -10611942 -15700222 -177695142 -43982741 -173972993 -110049648
14573a10049648O6455332J1661052l4773230l8844162L5008440J38445621o7536482
$$ -110049648 -43594316 -31933264 -66706494 -105550656 -70542216 67903405 366923
14566C66923o212430L8040363N6963082o0712831o3354840O0140983N6057195q5599306
$$ 366923 -5845507 32194856 89157938 28445107 -34909733 25231250 81288445 -4310861
14558d310861q8672315J30073965R5175644p4530859m1166239P7660618r9263357n7481950
$$ -4310861 -92983176 37090789 132266433 57735574 16569335 94229953 -5033404 -62515354
14550f2515354K01564916j08237686p1379758n2387259J15730273k3480269j72813250
$$ -62515354 139049562 30811876 -40567882 -92955141 22775132 -705137 -173518387
14543a73518387Q6451736o385550J25989371k3635840j40492587L9131905L6067443
$$ -173518387 -87066651 -93452201 32537170 8901330 -131591257 -92459352 -56391909
14536e6391909M1690795L7145591K1613828j87712714L20620774k04432972j6618783
$$ -56391909 -14701114 22444477 44058305 -143654409 176966365 -27466607 -44085390
14529d4085390l2734011P8676453L1994891Q3213158k474312p8344142j02990767
$$ -44085390 -76819401 1857052 33851943 117065101 114590789 36246647 -66744120
14522f6744120K06670865J04580262q0182584n2547903q4209306P050698Q4406570
$$ -66744120 139926745 244507007 164324423 111776520 27567214 34617912 119024482
14515A19024482r8338741O5295018j64331278J38066318L036196q243485k2909340
$$ 119024482 20685741 85980759 -78350519 59715799 62751995 54508510 31599170
14508C1599170j06474518P8387932R6379557M062648p6227127n0014606j01849122
$$ 31599170 -74875348 3512584 99892141 103954789 27727662 -22286944 -124136066
14501a24136066J4164798N3718320j2855320K4076993m4302071J17140528q9597142
$$ -124136066 -109971268 -56252948 -69108268 -45031275 -89333346 27807182 -61789960
14494f1789960k4218504J70730520k14365148J42826404j2953235r863970p2001638
$$ -61789960 -86008464 84722056 -129643092 13183312 230077 -9633893 -81635531
14487h1635531L4344742J9084209N7981088j32868592J64615482L7719017K5527044
$$ -81635531 -47290789 -28206580 29774508 -103094084 61521398 99240415 124767459
14480A24767459o8799533n5012343o7691810R4558843O9945962p6496126o0688439
$$ 124767459 55967926 955583 -66736227 27822616 97768578 21272452 -39415987
14473c9415987O6195034m193540L9058309j127819M849194r8482271M1772415J01575549
$$ -39415987 26779047 22585507 61643816 60515997 65365191 -33117080 8655335 110230884
14465A10230884k40584082J31387975L9476735p0849356M8269353n1085039Q9857541
$$ 110230884 -130353198 1034777 40511512 -30337844 17931509 -33153530 56704011
14458E6704011j1846693M5981641r1204461M2201586o2619199l2725406j2210996n340861
$$ 56704011 44857318 90838959 -365502 41836084 -20783115 -53508521 -65719517 -71060378
14450g1060378N6012737O3554574l2185871L0682423J2441295Q3389222j59425104
$$ -71060378 -15047641 48506933 16321062 47003485 59444780 142834002 -16591102
14443a6591102P1416043q6322305k2031150Q4943392m5864664q7494865O6755671
$$ -16591102 54824941 -31497364 -53528514 31414878 -14449786 -101944651 -35188980
14436c5188980J03647624k2222608n4183774j07767441J40174544J5818159L775116
$$ -35188980 68458644 46236036 -7947738 -115715179 24459365 40277524 44052640
14429D4052640O337124j69032563J13084788k9670994O5905308o716293j19652994
$$ 44052640 50389764 -118642799 -5558011 -35229005 30676303 23960010 -95692984
14422i5692984M0505245P7710530J2572762q1549684k4024692Q3383916R8303475l7535296
$$ -95692984 -55187739 22522791 35095553 -46454131 -70478823 12905093 111208568 73673272
14414G3673272O241949j18931609q4644399J89560267m2559147n8742276k7051212
$$ 73673272 79915221 -39016388 -123660787 65899480 23340333 -35401943 -62453155
14407f2453155l5835122J55761371M0790330j19969665J14875444J6837684j75846254
$$ -62453155 -98288277 57473094 98263424 -21706241 93169203 110006887 -65839367
14400f5839367J86264751n1965805p7107959l5199490N882857R4336603o0572862O7970973
$$ -65839367 120425384 68459579 -8648380 -43847870 -37965013 56371590 -4201272 63769701
14392F3769701o8960099J70256356p7438153j47036854J3389704K1372847K9453180
$$ 63769701 -5190398 165065958 87627805 -59409049 -46019345 -24646498 4806682
14385D806682p9722784M5523736j5143616R1968078J0313191j56666038K2221824O3447790
$$ 4806682 -74916102 -29392366 -44535982 47432096 57745287 -98920751 -76698927 -13251137
14377a3251137j5282803p2940115L6556484M5907376k2409201O9114514Q736302J6777270
$$ -13251137 -28533940 -101474055 -64917571 -19010195 -41419396 27695118 36431420 53208690
14369E3208690o0769605K3976674N5984755j3838776j12244812j6266042O7294060
$$ 53208690 -7560915 16415759 72400514 58561738 -53683074 -69949116 -2655056
14362b655056J43615847j52628855m856267n402128L7073678q9707959J68466087K0913935
$$ -2655056 140960791 -11668064 -16524331 -21926459 15147219 -74560740 93905347 114819282
14354A14819282j39670488p5317103o443885J67003594o3673059K9557148K0049177
$$ 114819282 -24851206 -100168309 -106612194 60391400 -3281659 26275489 46324666
14347D6324666l8808262n0935936j33162041K34253044j04599818L1729065Q8819826
$$ 46324666 7516404 -43419532 -176581573 57671471 -46928347 -15199282 73620544
14340G3620544K4791932j60191532N6113145J1843712P6275630r0733201K0519945
$$ 73620544 98412476 -61779056 -5665911 6177801 82453431 -8279770 12240175
14333A2240175k1827060o1749313M1005856m1910979K59303544k11928844L041975
$$ 12240175 -9586885 -71336198 -30330342 -72241321 187062223 -24866621 -21824646
14326b1824646O1071093N134582N78947n6129700R6168305k2006432j646588m7888553
$$ -21824646 39246447 44381029 44959976 -11169724 84998581 62992149 61345561 13457008
14318A3457008m6122453k3583999L2541778N627530L2386670l1409810j18283598
$$ 13457008 -32665445 -56249444 -23707666 -18080136 14306534 -17103276 -135386874
14311a35386874J58182007j1946749j02592941J97555962k37306348J53001183j26237267
$$ -135386874 22795133 10848384 -91744557 105811405 -131494943 21506240 -104731027
14304a04731027P7369364m1172906J37828384j00016433l0148406J03956313r3465820
$$ -104731027 -27361663 -68534569 69293815 -30722618 -60871024 43085289 -50380531
14297e0380531J2909905N0473049J8499355P8252158j24553814M7816313N6525287
$$ -50380531 -37470626 13002423 31501778 109753936 -14799878 33016435 89541722
14290H9541722k1314431l6072125K3822243Q7824401j40676446L9942170r2472208
$$ 89541722 68227291 32155166 55977409 143801810 3125364 43067534 -49404674
14283d9404674J57714142p5339968L4746758J4658445r1393107Q0365723L8184917
$$ -49404674 108309468 32969500 67716258 82374703 -9018404 71347319 109532236
14276A09532236m5477217L0597122r4667090j5896178M9096195J0537778j46841436
$$ 109532236 64055019 94652141 -14949 -15911127 33185068 43722846 -103118590
14269a03118590K5276081K26901875j9375163L5300008j2070004k4612093j4661488
$$ -103118590 -77842509 149059366 129684203 164984211 152914207 128302114 113640626
14262A13640626m9594391J8823877j15721956J46287547k68357631K63923118r3462464
$$ 113640626 64046235 82870112 -32851844 113435703 -154921928 109001190 15538726
14255A5538726k8500698L3917187J09919816o3808593N2798967j02170466Q3607632
$$ 15538726 -12961972 20955215 130875031 67066438 119865405 17694939 101302571
14248A01302571k33178056K67754226l19756551L13852887j11150986P6316774p5155068
$$ 101302571 -131875485 135878741 -183877810 129975077 18824091 95140865 19985797
14241A9985797L8338132l3087621n4374678J09738172J7776848k0681871o2544749
$$ 19985797 58323929 25236308 -29138370 80599802 98376650 77694779 15150030
14234A5150030L6942189j90307631N0640236P0208553M8274345P8842197K1206188
$$ 15150030 52092219 -138215412 -87575176 -17366623 30907722 109749919 130956107
14227A30956107k06114487k6475835K10464051k03248376L8437889R1687894p869058
$$ 130956107 -75158380 -101634215 108829836 -94418540 -55980651 35707243 27838185
14220B7838185k1055337o8511580K139077J6516262r0610027J11799125L5936473J8907971
$$ 27838185 6782848 -61728732 -59589655 -43073393 -133683420 -21884295 14052178 32960149
14212C2960149o5618228K4816387k1475147p7572938L7182699J74506982m3877260
$$ 32960149 -32658079 -7841692 -29316839 -106889777 -69707078 104799904 60922644
14205F0922644j30124666j03423001J43641573j20159283J61656508J02462980j73786498
$$ 60922644 -69202022 -172625023 -28983450 -149142733 12513775 114976755 -58809743
14198e8809743J57393227K0165850k45895268J09357552K665494Q5837923p3080785
$$ -58809743 98583484 118749334 -127145934 -17788382 -15122888 70715035 -2365750
14191b365750l7633363P129786Q3581067j22126649j1045612Q6390178j8603647m1412333
$$ -2365750 -39999113 -32869327 50711740 -71414909 -82460521 3929657 -14673990 -56086323
14183e6086323J62512249l2348941j23327623J7238381M3600476j55408968K37477059
$$ -56086323 106425926 74076985 -49250638 -32012257 11588219 -143820749 93656310
14176I3656310j08204406O036654j1319559j3800922j1622033j5967094K56373741
$$ 93656310 -14548096 -8511442 -19831001 -33631923 -45253956 -61221050 195152691
14169A95152691j74149962l4115331O324982P1447776j30638870K1587054K6021203
$$ 195152691 21002729 -13112602 -6787620 64660156 -65978714 -44391660 -18370457
14162a8370457J53968971n7783444q4423773R0367779j73585721J74244782p5203615
$$ -18370457 135598514 77815070 -6608703 83759076 -89826645 84418137 9214522
14155I214522J6372947q1468440k4653186J72390443m4448062P994424r8982392M1225181
$$ 9214522 25587469 -55880971 -80534157 91856286 47408224 55402648 -43579744 -2354563
14147b354563J05155123j14124192k9441705J03035279k15139332K33603438j3699213
$$ -2354563 102800560 -11323632 -40765337 62269942 -152869390 80734048 67034835
14140F7034835j62771333M0424025J4155582m3409161R8973083j888771O1144915
$$ 67034835 -95736498 -55312473 -41156891 -84566052 14407031 12518260 73663175
14133G3663175k96224952K41909836k7690876q3696835N2662604l3340408Q7464606
$$ 73663175 -222561777 19348059 -8342817 -92039652 -39377048 -72717456 14747150
14126A4747150j02408475M8723157M9861381p7060555l3403565K3197852J04960702
$$ 14747150 -87661325 -38938168 10923213 -66137342 -99540907 -76343055 28617647
14119B8617647J7556228j24734397K0873249J40228692j739526j54996326j1211306
$$ 28617647 46173875 -78560522 -57687273 82541419 80801893 -74194433 -85405739
14112h5405739K4401685Q9279522j0286659R5015755k9557002m3173874r3641094
$$ -85405739 -61004054 28275468 17988809 113004564 83447562 40273688 -53367406
14105e3367406J48630814q6776856L4584375r4512935R0040000N3114283j39840775
$$ -53367406 95263408 8486552 43070927 -51442008 38597992 91712275 -48128500
14098d8128500j28833365j7055773L02752487k0666561m7830668n4240931J5605622
$$ -48128500 -176961865 -194017638 108734849 88068288 40237620 -14003311 1602311
14091A602311j8315625l4077241J26731034j39664245n2764234J30244181k9839712
$$ 1602311 -16713314 -50790555 75940479 -63723766 -116488000 13756181 -16083531
14084a6083531j53568529J43747578o8507473J04376013L6028576j07082119L1570895
$$ -16083531 -169652060 -25904482 -94411955 9964058 45992634 -61089485 -29518590
14077b9518590o808746R180234k320481J65561151j26276689N4179923L7108974j30537710
$$ -29518590 -36327336 -27147102 -29467583 136093568 9816879 63996802 101105776 -29431934
14069b9431934j11084118K45248143j17464310j8447145j1628538P3909272J08670984
$$ -29431934 -140516052 104732091 -12732219 -31179364 -42807902 31101370 139772354
14062A39772354k11308272J55334972k9832257M7970614p0695166L1694246q0204519
$$ 139772354 -71535918 83799054 53966797 101937411 31242245 62936491 -17268028
14055a7268028O4812739j29214316Q5043384O1804346J9326169l4276751N8202516
$$ -17268028 47544711 -81669605 3373779 65178125 84504294 50227543 108430059
14048A08430059k7881531n7264306K3208389P9815100k54421937J10039103K0210341
$$ 108430059 80548528 23284222 46492611 126307711 -128114226 -18075123 2135218
14041B135218m1141953R9386035k3703121L2939983K8083097j30726881M6687776m0064532
$$ 2135218 -39006735 60379300 36676179 69616162 97699259 -33027622 13660154 -26404378
14033b6404378j15059212O8661550Q6476081R3088374j28732318r8338165J90109926
$$ -26404378 -141463590 -72802040 13674041 106762415 -21969903 -120308068 69801858
14026F9801858R415731n4484427p4367168K1417792J4401983p1871869L9308497r8322147
$$ 69801858 79217589 24733162 -49634006 -28216214 -13814231 -85686100 -46377603 -144699750
14018a44699750O1138500R5100373J87021572j16637742j9453146j5492035p7216816
$$ -144699750 -83561250 11539123 198560695 81922953 62469807 46977772 -30239044
14011c0239044Q0471740j46402131M7255652J9527255j04145380K15914105m0919328
$$ -30239044 50232696 -96169435 -48913783 -29386528 -133531908 82382197 41462869
14004D1462869M1134631j74141195J20879749o0539078J19135576j36858803N3647150
$$ 41462869 82597500 -91543695 29336054 -31203024 87932552 -48926251 4720899
13997D720899n0447977j1320707p3769238P3406344k8305032J40806698l0901295j0071920
$$ 4720899 -45727078 -57047785 -130817023 -57410679 -85715711 55090987 24189692 14117772
13989A4117772r8640488K0540580k447340p3773945J94789934j33951224q034574J7510825
$$ 14117772 -84522716 -63982136 -66429476 -140203421 54586513 -79364711 -87399285 -69888460
13981f9888460M8404795M3886768r8679225M4935660j0492079K04296026k14644142
$$ -69888460 -21483665 22403103 -76276122 -31340462 -41832541 162463485 -52180657
13974e2180657o4757156J47865142r0484526N8831406K6866807J976679j16839364q376866
$$ -52180657 -116937813 30927329 -59557197 -725791 26141016 28117695 -88721669 -97098535
13966i7098535K82446277j76710303j24485553J32600948M7906789M4611262k07236785
$$ -97098535 185347742 8637439 -115848114 16752834 64659623 109270885 -97965900
13959i7965900O9777903J16387913o6442731j07100007N4376321J5241973N2915487
$$ -97965900 -28187997 88199916 21757185 -85342822 -30966501 -15724528 37190959
13952C7190959j28510057K0142685O6721380j16374976J01830812R4886615q8297032
$$ 37190959 -91319098 -71176413 -4455033 -120830009 -18999197 75887418 -12409614
13945a2409614m244227L1586716J6472756j14812732O4602381o145898K4551102J52798609
$$ -12409614 -16653841 14932875 31405631 -83407101 -18804720 -24950618 -399516 152399093
13937A52399093r5413484n9463052N2327673p4482444q7490378R9940239m9948666
$$ 152399093 56985609 -2477443 49850230 -24632214 -112122592 -12182353 -62131019
13930f2131019P9758350J03597858j77569215N0821588J10928667j8889904k53579698
$$ -62131019 17627331 121225189 -56344026 -5522438 105406229 86516325 -167063373
13923a67063373J94037630j77748726J25405121r3361069K5872196J4273892L693018
$$ -167063373 26974257 -150774469 -25369348 -118730417 -92858221 -78584329 -74891311
13916g4891311L4846867N4013968K7525868o2433331j49003255K02913613M1555166
$$ -74891311 -40044444 13969524 41495392 -20937939 -169941194 32972419 74527585
13909G4527585j92621972o1161524K58840088j87575446J69476258q3535203J33746239
$$ 74527585 -118094387 -179255911 79584177 -107991269 61484989 -22050214 111696025
13902A11696025p7029551q5019330M4353489Q6615528k06310794K09245239m929645
$$ 111696025 34666474 -50352856 -5999367 80616161 -125694633 83550606 78620961
13895G8620961n3046229l5675493k2309849P3565788j0133539m1795077Q7111176j8597353
$$ 78620961 25574732 -10100761 -32410610 41155178 31021639 -10773438 76337738 57740385
13887E7740385j90328905K6731866j6179592J95781484p6979842J6306806r9829080k04120
$$ 57740385 -132588520 -105856654 -122036246 73745238 -3234604 13072202 -86756878 -86960998
13879h6960998Q0631213k4672120m7421783Q7016645j03024768K26681144j00097856
$$ -86960998 -6329785 -31001905 -78423688 8592957 -94431811 132249333 32151477
13872C2151477r2395397k2653283J43791453p870607j8321283j0149707j07902181
$$ 32151477 -60243920 -82897203 60894250 53023643 34702360 24552653 -83349528
13865h3349528N0810598J14911387m4512096q7021849j0936443K7254061J37933156
$$ -83349528 -32538930 82372457 37860361 -49161488 -60097931 -32843870 105089286
13858A05089286R2362721j95760119R1921134l1220177q5949052l0135405J01326822
$$ 105089286 197452007 1691888 93613022 62392845 -23556207 -53691612 47635210
13851D7635210j06315547Q3516630Q8654742O3190372k25812415N3314643m0309711
$$ 47635210 -58680337 24836293 113491035 176681407 -49131008 4183635 -36126076
13844c6126076P4730286o4862300J21306346o8094839P8996659J2267396j51707294
$$ -36126076 38604210 -26258090 95048256 26953417 105950076 118217472 -33489822
13837c3489822J9255382L4788407j3295009l753564r7503010M5654356R152569M951785
$$ -33489822 -14234440 20553967 7258958 3505394 -93997616 -48343260 -39190691 -34238906
13829c4238906N4217894l3702088K4106249k9477534P6272517o5626015O164995m2198685
$$ -34238906 19978988 -13723100 10383149 -19094385 57178132 -8447883 -2282888 -44481573
13821d4481573L7042051q9563607K52377J39983782k17957028J08721543J55856761
$$ -44481573 -7439522 -97003129 -96750752 43233030 -174723998 -66002455 89854306
13814H9854306j42209225m7697358J15727048j8131005l5550572N4445055q9829102
$$ 89854306 -52354919 -100052277 15674771 -2456234 -38006806 16438249 -73390853
13807g3390853J57174583j89138605R2827118j19229159J04634291j3664541N5325678
$$ -73390853 83783730 -105354875 -12527757 -131756916 -27122625 -40787166 14538512
13800A4538512M9207963j10802430K116031j00057581J97337301l4936835N1428403
$$ 14538512 63746475 -47055955 -44939924 -144997505 52339796 17402961 68831364
13793F8831364j07674817N2917555n0998908M7246318k4555943n2790896Q5685179
$$ 68831364 -38843453 14074102 -36924806 10321512 -14234431 -67025327 18659852
13786A8659852P7524179r5802703o9295471O7586454J975192j4141482l5279170Q6829764
$$ 18659852 96184031 381328 -68914143 -1327689 647503 -13493979 -48773149 38056615
13778C8056615p1751927n1155514M5239754L6553700N6560610j38252286J88478468
$$ 38056615 -33695312 -84850826 -39611072 -3057372 53503238 -84749048 103729420
13771A03729420n5683014p3320945L3528178L0806266k9134723L248598l2217779K2136792
$$ 103729420 48046406 -25274539 8253639 39059905 9925182 13173780 -19043999 3092793
13763C092793k1697824K654680N0746837k337576O9952494k16908212J80068011o2296242
$$ 3092793 -18605031 -15950351 34796486 32458910 102411404 -114496808 65571203 3274961
13755C274961j37884601O2054574J89422972j89995367J68118343j178883j06259620
$$ 3274961 -134609640 -72555066 116867906 -73127461 94990882 93811999 -12447621
13748a2447621j1215269P9104636j1112915o7478613j46098987J01997599N1294041
$$ -12447621 -23662890 55441746 44328831 -23149782 -169248769 -67251170 -15957129
13741a5957129n460358L3961440l7111387n3919836J72119338j03570581R9024043
$$ -15957129 -21417487 12543953 -24567434 -78487270 93632068 -9938513 89085530
13734H9085530j24041865R465935J60131657j52638383p8120763J18202276l3586502
$$ 89085530 -34956335 -25490400 134641257 -17997126 -96117889 22084387 -11502115
13727a1502115J61445893j32018078N8979303p3744976J23574851r558162M0309830
$$ -11502115 149943778 17925700 76905003 3160027 126734878 117176716 157486546
13720A57486546j98003276L4011843r8962969J15164284k2031679k0112103J6217878
$$ 157486546 -40516730 -6504887 -105467856 9696428 -12335251 -32447354 -16229476
13713a6229476j8340954O2178930q469219n1261477M4188415n5390407J38869862
$$ -16229476 -34570430 27608500 19139281 -32122196 12066219 -43324188 95545674
13706I5545674j15504299o3897932J2115033J07683667l9731330K1889280O0462469
$$ 95545674 -19958625 -83856557 -71741524 35942143 -3789187 18100093 78562562
13699G8562562k1000858j13736286n8021916J08571176Q2218782p6317998p868136
$$ 78562562 57561704 -56174582 -114196498 -5625322 76593460 275462 -7592674
13692g592674L9828897J27391138k07364681J19896446N8303215k38191406P6594325
$$ -7592674 32236223 159627361 -47737320 72159126 130462341 -107729065 -31134740
13685c1134740O8904168N5201155o6536441r140107M7510525J520704n4170419Q5219106
$$ -31134740 37769428 92970583 26434142 17294035 64804560 66325264 12154845 97373951
13677I7373951j43986052J41671091q1439707q7496379P3872539r1028072J67170209
$$ 97373951 -46612101 95058990 13619283 -73877096 -4557 -91032629 76137580
13670G6137580Q1610594j42072205k0131418q0828648J24254911j43054276R5991476
$$ 76137580 157748174 15675969 -4455449 -85284097 38970814 -104083462 -8091986
13663h091986K1211379l8793697j38983738K46283755q3261902m8290493q490132Q8102058
$$ -8091986 13119393 -25674304 -164658042 81625713 -1636189 -49926682 -58416814 29685244
13655B9685244m804339m1524972l8871737l7155885n0575095J83020380j17011841
$$ 29685244 24880905 -16644067 -55515804 -92671689 -143246784 39773596 -77238245
13648g7238245J99987635j29214411j2089687N1112270j6553740K1750002j18382207
$$ -77238245 122749390 -6465021 -18554708 32557562 16003822 37753824 -80628383
13641h0628383R9502146K9728072r0009510L282423k9742630J37162687n9989464M2601826
$$ -80628383 18873763 48601835 -41407675 -38125252 -67867882 69294805 9305341 51907167
13633E1907167N6588005j5433380o9829805j59269648J00678931j07365241J26963697
$$ 51907167 108495172 93061792 23231987 -136037661 -35358730 -142723971 -15760274
13626a5760274m5803758O2295787k0633248J58461519k15649204J4521556l3056401
$$ -15760274 -61564032 731755 -19901493 138560026 -77089178 -62567622 -95624023
13619i5624023m487868j410555R834018Q7744214r5868470m6912120M1249976L4244286
$$ -95624023 -100111891 -101522446 -91688428 -3944214 -99812684 -146724804 -105474828 -71230542
13611g1230542p6720361m1682928J72244228K9142625j93480885P1033715K1823539
$$ -71230542 -147950903 -189633831 -17389603 11753022 -181727863 -110694148 -88870609
13604h8870609R7345796N6538222n3230720J79299064j01756903j46152423P96613
$$ -88870609 8475187 65013409 11782689 191081753 89324850 -56827573 -56030960
13597e6030960O5051962J7822319j46812118J62184307J89430236k31733585p3671698
$$ -56030960 9021002 26843321 -119968797 42215510 231645746 -87839 -73759537
13590g3759537J08207165R001902j794030J16356224p0736721j00046014J4980502
$$ -73759537 34447628 43449530 41655500 158011724 87275003 -12771011 2209491
13583B209491j37033455J72035733r1385193K1767949r4160852P3927424P1150368
$$ 2209491 -134823964 37211769 -54173424 -32405475 -126566327 -52638903 18511465
13576A8511465p0412935q718281k0074026J47085268p7951834J33919245r8481342
$$ 18511465 -51901470 -60619751 -80693777 66391491 -11560343 122358902 23877560
13569B3877560N0206611o7423079j02734639j2907982N6611110q3169535Q4509873
$$ 23877560 74084171 6661092 -96073547 -108981529 -52370419 -135539954 -51030081
13562e1030081J77364004j60228921j11960488J97157616O7905363j88928110J87646367
$$ -51030081 126333923 -33894998 -145855486 51302130 119207493 -69720617 117925750
13555A17925750j24093259m1536399p4459025N4758552k7094278J02868419j02812747
$$ 117925750 -6167509 -47703908 -122162933 -67404381 -94498659 8369760 -94442987
13548i4442987P3077219J34354343k05505986R6989922O7849375j17845536P8618353
$$ -94442987 -21365768 112988575 -92517411 4472511 72321886 -45523650 33094703
13541C3094703k7982684J6386263q3617989R5809506k2790477r1191790J35913568
$$ 33094703 5112019 21498282 -62119707 33689799 10899322 -80292468 55621100
13534E5621100j51700082J50706254m3312694j0570264q0295777J62526809n6550326
$$ 55621100 -96078982 54627272 11314578 744314 -79551463 82975346 26425020
13527B6425020l8003581Q4686175M9044672j67564982n6208294J1175811k7763718
$$ 26425020 -11578561 73107614 122152286 -45412696 -101620990 -90445179 -118208897
13520a18208897M7221304J35244207q7970997R3431228j73207685L6557163L7034745
$$ -118208897 -70987593 64256614 -23714383 69716845 -103490840 -66933677 -29898932
13513b9898932k5994523k8835207P3767671j8161497j3039763o3308023n4149008M7511304
$$ -29898932 -55893455 -84728662 -10960991 -29122488 -42162251 -105470274 -159619282 -112107978
13505a12107978J11688575l6196973J19276623j54438526l3627228L3217067R9431963
$$ -112107978 -419403 -36616376 82660247 -71778279 -105405507 -72188440 27243523
13498B7243523n7009351O5108658K2874631m9373648O0248641o3719997j24851194
$$ 27243523 -29765828 35342830 58217461 8843813 69092454 5372457 -119478737
13491a19478737J00115843O0549235n7248283R6446271j11587765k0628426O0066348
$$ -119478737 -19362894 41186341 -16061942 80384329 -31203436 -51831862 8234486
13484H234486N9755734j31073686J35001288j06233372L3251153r7363349J42058920
$$ 8234486 67990220 -63083466 71917822 -34315550 -1064397 -98427746 43631174
13477D3631174j00760555O7832064j08261810P5139976L732178N5475855l6633868
$$ 43631174 -57129381 10702683 -97559127 -22419151 -18686973 36788882 155014
13470A55014J8268396j2807602j24668327K09257158j48106827J78661796j43928828
$$ 155014 18423410 5615808 -119052519 90204639 -57902188 120759608 -23169220
13463b3169220j7593658P3082949j45684832L1903274N1862773O1079905q4991178
$$ -23169220 -40762878 32320071 -113364761 -81461487 -29598714 31481191 -53509987
13456e3509987R5789739p5211131M1737714j25470016J05562267Q3180710j82751256
$$ -53509987 42279752 -32931379 8806335 -116663681 -11101414 72079296 -110671960
13449a10671960K7401701p042711R0331703q9372909N5638784L0951983j2414397r5158777
$$ -110671960 -83270259 -90312970 18733 -89354176 -33715392 -2763409 -15177806 -110336583
13441a10336583O6216316N4663812k14690373J09423360j994366n9370044K45045687
$$ -110336583 -44120267 10543545 -204146828 -94723468 -96717834 -156087878 88957809
13434H8957809j13598574K0636590R6062125l9057058O2163962j8878710r2399832
$$ 88957809 -24640765 -4004175 92057950 53000892 115164854 96286144 3886312
13427C886312n9473035P4691855K5666333k1964756j23732596J52124368j3047976L629351
$$ 3886312 -55586723 19105132 44771465 22806709 -100925887 51198481 38150505 41779856
13419D1779856K4731719n4260696K1475235j3509114r869389j57199735J42384401
$$ 41779856 66511575 12250879 33726114 20217000 10347611 -146852124 -4467723
13412d467723o6227586J76297255j03768376J45037477j40187476n4880528o4180468
$$ -4467723 -70695309 105601946 1833570 146871047 6683571 -48196957 -112377425
13405a12377425j6910947J77612598p5615485p6905967M1310482M6594938j2370980
$$ -112377425 -129288372 48324226 -27291259 -104197226 -62886744 -16291806 -28662786
13398b8662786k3892521L0863940R1058541p2202960j04555525q0166941K1777278
$$ -28662786 -52555307 -21691367 69367174 -2835786 -107391311 -187558252 -165780974
13391a65780974M0445615J07801745p4501001J06434799R597940J11952L124240m3077033
$$ -165780974 -125335359 -17533614 -92034615 14400184 23998124 24110076 27234316 -15842717
13383a5842717O6043034j33010486j4750750j8397997K6347856k3950427l8340859
$$ -15842717 50200317 -82810169 -97560919 -115958916 -89611060 -113561487 -151902346
13376a51902346Q4672883P9346551J788356L125200P0044351j16214970K7506100p8801479
$$ -151902346 -67229463 12117088 13905444 17030644 87074995 -29139975 -1633875 -80435354
13368h0435354Q5820473k2346470o4392269J68063062p9343275k9626414O1937506O649829
$$ -80435354 5385119 -16961351 -81353620 86709442 7366167 -22260247 39677259 46327088
13360D6327088n6786036M2186685J2146609p9230585R9855213m6485842K3447465k9865690
$$ 46327088 -10458948 31727737 43874346 -35356239 64498974 18013132 41460597 11594907
13352A1594907M062159j99195598K23482164m4099535l6571904M7355512J30721063
$$ 11594907 15657066 -183538532 39943632 -4155903 -40727807 6627705 137348768
13345A37348768j15693401l701358J3073921j14282373N9385692J22735837j61048539
$$ 137348768 21655367 17954009 31027930 -83254443 -23868751 98867086 -62181453
13338f2181453l9181793P3915652R1962486j61287435J31553737N9961029j45202784
$$ -62181453 -101363246 -27447594 64514892 -96772543 34781194 94742223 -50460561
13331e0460561N9920178j21321305M4227964J808659O7342389k4526306J57138914
$$ -50460561 9459617 -111861688 -67633724 -65825065 1517324 -23008982 134129932
13324A34129932k4557997q2109208q1330475J31353804j52497482J29158242R6915350
$$ 134129932 109571935 27462727 -53867748 77486056 -75011426 54146816 151062166
13317A51062166j89651396o9250705J72523816L3091761n0930892o4510364R3154756
$$ 151062166 -38589230 -107839935 64683881 97775642 46844750 -17665614 75489142
13310G5489142k4984091J20242981j83898867j36490523N726237J21023958M8002300
$$ 75489142 50505051 170748032 -13150835 -149641358 -143915121 -22891163 25111137
13303B5111137L5026072l9012434k4596157P5703571p1016183k8203915J4747884
$$ 25111137 60137209 21124775 -3471382 72232189 1216006 -26987909 -12240025
13296a2240025J06297806r7981110P5109835p7971923n7050979J18730286O6760449
$$ -12240025 94057781 -3923329 71186506 -6785417 -63836396 54893890 121654339
13289A21654339j6741024j01942230j924305m0162344O3253J45305303j04567108j2459643
$$ 121654339 104913315 2971085 1046780 -39115564 -39052311 106252992 1685884 -10773759
13281a0773759j1008182j10502962J81201419K4358530j01471993J71040799j06026242
$$ -10773759 -21781941 -132284903 48916516 73275046 -28196947 142843852 36817610
13274C6817610L2218939n8112690q1150957J7303022R7294504r2199415J3174615n7747115
$$ 36817610 69036549 10923859 -70227098 -52924076 44370428 -47828987 -34654372 -92401487
13266i2401487M4833424j4833551K1725866N6390077m1653466R5701026P5424885
$$ -92401487 -47568063 -62401614 -40675748 15714329 -25939137 69761889 145186774
13259A45186774k67801905J89007258k15431021L2955600J54692307j09264003J037821
$$ 145186774 -122615131 66392127 -149038894 -116083294 38609013 -70654990 -69617169
13252f9617169J6948011O012373L635089O9755125P9152505j15965699O2753452o0267607
$$ -69617169 -52669158 -46656785 -43021696 26733429 105885934 -10079765 52673687 -7593920
13244g593920p5658857J53756556k17308096R7784709J59886377m1139178p3202641
$$ -7593920 -83252777 70503779 -146804317 -49019608 110866769 69727591 -3475050
13237c475050k2659762k9899979p05879R6327360L3840241l0978957j51316801J99005012
$$ -3475050 -26134812 -56034791 -56740670 39586690 73426931 42447974 -108868827 90136185
$$ [...]
-3284e7008756  $$ checkpoint
##END NTUPLES=
##END=
