##TITLE= S#259734
##JCAMP-DX= 5.00 $$ JEOL NMR v1.10
##DATA TYPE= NMR SPECTRUM
##DATA CLASS= NTUPLES
##NUM DIM= 1
##ORIGIN= DELTA_NMR
##OWNER= NMR
##SPECTROMETER/DATA SYSTEM= DELTA_NMR
##.OBSERVE FREQUENCY= 3.00529655924288E+02
##.OBSERVE NUCLEUS= ^1H
##.DELAY= (2.195E+02,2.195E+02)
##.ACQUISITION MODE= SIMULTANEOUS
##.FIELD= 7.0586013
##.FILTER WIDTH= 1.81675738660864
##.ACQUISITION TIME= 3.6339712
##.SPINNING RATE= 14
##.OBSERVE 90= 9.2
$$ ------------------------
$$ JEOL SPECIFIC PARAMETERS
##$FILENAME= C:\NMR/eb-15.jdf
##$TITLE= S#259734
##$AUTHOR= NMR
##$CREATION=  2-FEB-2018 07:07:46
##$REVISION=  2-FEB-2018 07:14:59
##$CONTENT= PROTON NMR EXPERIMENT
##$INSTRUMENT= DELTA_NMR
##$SITE= Center College ECP+ 300
##$NODENAME= nmr2
##$DIMENSIONS= 1
##$STORAGE= FLOAT
##$X_FORMAT= COMPLEX
##$X_CURR_POINTS= 16384
##$X_START= 12.50103 $$ppm
##$X_STOP= -2.50012 $$ppm
##$X_TITLE= 1H                             
##$X_ZERO_POINT= 0.33329
##$X_FREQ_FLIP= FALSE
##$X_POINTS= 16384
##$X_PRESCANS= 0
##$X_DOMAIN= 1H
##$X_OFFSET= 5 $$ppm
##$X_FREQ= 300.52966 $$MHz
##$X_SWEEP= 4.50857 $$kHz
##$X_RESOLUTION= 0.27518 $$Hz
##$SOLVENT= CHLOROFORM-D
##$TEMP_GET= 21.7 $$dC
##$ACQ_DELAY= 0.2195 $$ms
##$DIGITAL_FILTER= FALSE
##$FILTER_FACTOR= 1
##$FILTER_WIDTH= 2.254 $$kHz
##$FILTER_MODE= BUTTERWORTH
##$TRANSITION_RATIO= 0.9
##$ORDERS
##$FACTORS
##$LOCK_STRENGTH= 567
##$LOCK_LEVEL= 200
##$LOCK_GAIN= 26
##$LOCK_OSC_OFFSET= 25.6519 $$kHz
##$LOCK_PHASE= 187 $$deg
##$LOCK_OSC_STATE= 2H OSC ON
##$X_ANGLE= 45 $$deg
##$X90= 9.2 $$us
##$X90_HI= 10 $$us
##$X90_LO= 50 $$us
##$X_90_WIDTH= 9.2 $$us
##$X_PULSE= 4.6 $$us
##$RELAXATION_DELAY= 4 $$s
##$SCANS= 2
##$PROBE_ID= 1412
##$ITERATIONS= 1
##$FIELD_STRENGTH= 7.0586 $$T
##$TEMP_SET= 25 $$dC
##$SPIN_SET= 15 $$Hz
##$SPIN_GET= 14 $$Hz
##$HE_LEVEL= 75 $$%
##$N2_LEVEL= 77 $$%
##$CHANGER_SAMPLE= 0
##$ADC_CARD= 16/1MHz/20
##$EXPERIMENT= single_pulse.exp
##$OBS_NOISE= WAUGH
##$IRR_NOISE= WALTZ
##$TRI_NOISE= WALTZ
##$QUA_NOISE= WAUGH
##$OBS_PWIDTH= 1 $$us
##$IRR_PWIDTH= 50 $$us
##$TRI_PWIDTH= 1 $$us
##$QUA_PWIDTH= 1 $$us
##$RECVR_GAIN= 4
##$IRR90= 9.2 $$us
##$TRI90= 10 $$us
##$QUA90= 10 $$us
##$IRR90_HI= 10 $$us
##$QUA90_HI= 10 $$us
##$IRR90_LO= 50 $$us
##$TRI90_LO= 10 $$us
##$QUA90_LO= 10 $$us
##$MOD_RETURN= 1
##$TOTAL_SCANS= 2
##$X_ACQ_DURATION= 3.63397 $$s
##$DELAY_OF_START= 1 $$s
##$ACTUAL_START_TIME= 886403245
##$CLIPPED= FALSE
##$DC_BALANCED= FALSE
##$TRI90_HI= 10 $$us
##$SPIN_LOCK_90= 100 $$us
##$SPIN_LOCK_ATTN= 24.4 $$dB
##$DEUT_GRAD_SHIM_90= 213 $$us
##$DEUT_GRAD_SHIM_ATTN= 9 $$dB
##$IRR_CODE= 146
##$LOCK_STATE= LOCK ON
##$AUTOLOCK_LEVEL= 200
##$SAWTOOTH_RANGE= 4
##$LOCK_STATUS= IDLE
##$LOCK_SETTLE_POINT= 4096
##$LOCK_ACHIEVE_POINT= 0
##$SPIN_ACTION= SPIN ON
##$SPIN_STATE= SPIN ON
##$SPIN_STATUS= SPIN ON
##$SPIN_GAS_SOURCE= AIR
##$TEMP_ACTION= TEMP OFF
##$TEMP_STATE= TEMP OFF
##$TEMP_STATUS= TEMP OFF
##$TEMP_COMP= 0
##$TEMP_DELAY= 0 $$s
##$TEMP_LIMIT_HI= 150 $$dC
##$TEMP_LIMIT_LO= -100 $$dC
##$TEMP_MELTING= -63 $$dC
$$ [...]
##$VT_PID_STD_WB_H_CBL= 10
##$VT_PID_STD_WB_H_CBH= 0
##$VT_PID_STD_WB_H_HC= 2.4
##$VT_PID_STD_WB_H_HL= 70
##$VT_PID_STD_WB_M_PB= 1.5
##$VT_PID_STD_WB_M_TI= 30
##$VT_PID_STD_WB_M_TD= 5
##$VT_PID_STD_WB_M_CBL= 9.9
##$VT_PID_STD_WB_M_CBH= 2.3
##$VT_PID_STD_WB_M_HC= 2.5
##$VT_PID_STD_WB_M_HL= 70
##$VT_PID_STD_WB_L_PB= 1.3
##$VT_PID_STD_WB_L_TI= 29
##$VT_PID_STD_WB_L_TD= 5
##$VT_PID_STD_WB_L_CBL= 20
##$VT_PID_STD_WB_L_CBH= 20
##$VT_PID_STD_WB_L_HC= 0.6
##$VT_PID_STD_WB_L_HL= 100
##$VT_PID_LONG_0_H_PB= 1.5
##$VT_PID_LONG_0_H_TI= 30
##$VT_PID_LONG_0_H_TD= 5
##$VT_PID_LONG_0_H_CBL= 9.9
##$VT_PID_LONG_0_H_CBH= 2.3
##$VT_PID_LONG_0_H_HC= 2.5
##$VT_PID_LONG_0_H_HL= 70
##$VT_PID_LONG_0_M_PB= 1.5
##$VT_PID_LONG_0_M_TI= 30
##$VT_PID_LONG_0_M_TD= 5
##$VT_PID_LONG_0_M_CBL= 9.9
##$VT_PID_LONG_0_M_CBH= 2.3
##$VT_PID_LONG_0_M_HC= 2.5
##$VT_PID_LONG_0_M_HL= 70
##$VT_PID_LONG_40_H_PB= 1.5
##$VT_PID_LONG_40_H_TI= 30
##$VT_PID_LONG_40_H_TD= 5
##$VT_PID_LONG_40_H_CBL= 9.9
##$VT_PID_LONG_40_H_CBH= 2.3
##$VT_PID_LONG_40_H_HC= 2.5
##$VT_PID_LONG_40_H_HL= 70
##$VT_PID_LONG_40_M_PB= 1.5
##$VT_PID_LONG_40_M_TI= 30
##$VT_PID_LONG_40_M_TD= 5
##$VT_PID_LONG_40_M_CBL= 9.9
##$VT_PID_LONG_40_M_CBH= 2.3
##$VT_PID_LONG_40_M_HC= 2.5
##$VT_PID_LONG_40_M_HL= 70
##$SAMPLE_ACTION= LOADED
##$SAMPLE_STATE= LOAD
##$SAMPLE_STATUS= LOADED
##$AUTOSHIM_MODE= AUTOSHIM OFF
##$AUTOSHIM_DELAY= 3600 $$s
##$AUTOSHIM_TRACK= AUTOSHIM OFF
##$SHIM_MAX_RECALL= MAX FOUND
##$SHIM_NAMES= SHIM_Z0
##$SHIM_Z0= 9189
##$SHIM_Z1= 5127
##$SHIM_Z2= -27
##$SHIM_Z3= -2829
##$SHIM_Z4= -240
##$SHIM_Z5= 46
##$SHIM_Z6= -33
##$SHIM_X= -14
##$SHIM_XZ= 16
##$SHIM_XZ2= 0
##$SHIM_XZ3= 0
##$SHIM_X2= -7
##$SHIM_X2Z= -40
##$SHIM_X3= 0
##$SHIM_Y= 1608
##$SHIM_YZ= 13
##$SHIM_YZ2= 10
##$SHIM_YZ3= 0
##$SHIM_Y2= -11
##$SHIM_Y2Z= -20
##$SHIM_Y3= 0
##$NUM_SCANS= 1
##$END_TIME= 886403266.0
##$LOCAL_TIME= 886403265
##$PROBE_ATN= 0
##$PROBE_TUNE= 0
##$PROBE_MATCH= 2077
##$PROBE_COARSE= NONE
##$LF_TUNE_DIAL= 0
##$LF_MATCH_DIAL= 0
##$HF_TUNE_DIAL= 0
##$HF_MATCH_DIAL= 0
##$PASS_RIPPLE= 0.01 $$dB
##$STOP_RIPPLE= 60 $$dB
##$PROBE_RECOVERY= 0 $$us
##$AF_DELAY_RATIO= 0
##$VERSION= 4.3.3
##$X_ACQ_TIME= 3.63397 $$s
##$DEAD_TIME= 0 $$us
##$DELAY= 0 $$us
##$PHASE_PRESET= 3 $$us
##$UNBLANK_TIME= 2 $$us
##$INITIAL_WAIT= 1 $$s
##$NORMALIZED= TRUE
$$ END OF JEOL SPECIFIC PARAMETERS
$$ -------------------------------
##NTUPLES= NMR SPECTRUM
##VAR NAME= FREQUENCY,    SPECTRUM/REAL, SPECTRUM/IMAG, PAGE NUMBER
##SYMBOL=   X,            R,             I,             N
##VAR TYPE= INDEPENDENT,  DEPENDENT,     DEPENDENT,     PAGE
##VAR FORM= AFFN,         ASDF,          ASDF,          AFFN
##VAR DIM=  16384, 16384, 16384, 2
##UNITS= PPM,     ARBITRARY UNITS, ARBITRARY UNITS, 
##FIRST=  1.2501033903057E+01, 2.67980996411816E+02, 2.04238129500333E+01, 1
##LAST=  -2.50011824950436, 3.8122564198593E+02, 8.26479221604784E+01, 2
##FACTOR=  9.1565355261926E-04, 4.99214770512222E-03, 4.99214770512222E-03, 1
##PAGE= N=1
##DATA TABLE=(X++(R..R)), XYDATA
$$ [...]
9251c9448249j3641764p715212q752041k919314j6938728J6529335K8406421o801900
9243e1281452j4136140j0735712J5790165O693819o750887K9284698J2573205j1568300
9235c0130604r102924J314394K2207526Q174004O639888M961740l398960J0880521
9227A1545585j0850102n505894L3310149J3470530k4116104j1408030L0029783K248208
9219C8724125l6783407J8318656L2544395l3945401l1158579K5648241J1447171l2180721
9211g385520m366443K0959693j8323933k0957168K0490955M534267j1297315J4459555
9203a885909m781762k3803321R137105K3222858j4092324j8279353L3646491o764412
9195c600627n2636115K2989043L8104531j7769120j7132720K9979410J4350099m8478478
$$ plain form
9251 -39448249 -53090013 -60805225 -69557266 -72476580 -89415308 -72885973 -44479552 -51281452
9243 -51281452 -65417592 -76153304 -60363139 -53669320 -60420207 -31135509 -18562304 -30130604
9235 -30130604 -39233528 -37919134 -15711608 -7537604 -897716 4064024 665064 11545585
9227 11545585 695483 -4810411 28499738 41970268 17854164 6446134 36475917 38724125
9219 38724125 1940718 20259374 52803769 18858368 -12300211 13348030 24795201 -7385520
9211 -7385520 -11751963 9207730 -9116203 -30073371 -9582416 -5048149 -16345464 -1885909
9203 -1885909 -6667671 -30470992 -21333887 1888971 -12203353 -30482706 3163785 -3600627
9195 -3600627 -56236742 -33247699 4856832 -12912288 -30045008 -65598 14284501 -34193977
9187c4193977J3477423M7314966k0299142n847315J3111401n318287k5347793l754697
9179b0857421L1179693k2142035m966482K4969897k7496669o569873J2853272J3482802
9171D53184j258723q708949L0572620j6434185j5790180K4493738j1569964M451379L7670
9162F246590k375408M907941j3969280J8460916j1815697r708205K7959972j6234844
9154C471985N96330N180245m593732k092956k9650170Q738894J288675j2137143R314712
9145a9883160k1657463P050407j86257k7128893J9895532K5962346J2444037k1798651
9137b5302102k169302L6719038l4256635j5932210N0383521J1796070l0038083k4163959
9129c2963662J7677554r806433l4288677L2546729J8884643j9438080q104689j9461630
$$ plain form
9187 -34193977 -20716554 26598412 6299270 451955 13563356 8245069 -17102724 -20857421
9179 -20857421 10322272 -11819763 -16786245 8183652 -19313017 -25882890 -13029618 453184
9171 453184 -805539 -9514488 21058132 4623947 -11166233 13327505 1757541 6208920 6246590
9162 6246590 3871182 8779123 -5190157 13270759 1455062 -8253143 19706829 3471985
9154 3471985 4068315 9248560 4654828 2561872 -27088298 -18349404 -17060729 -29197872 -19883160
9145 -19883160 -41540623 -34490216 -34676473 -61805366 -41909834 -15947488 -3503451 -25302102
9137 -25302102 -27471404 9247634 -25009001 -40941211 9442310 21238380 -8799703 -32963662
9129 -32963662 -15286108 -25092541 -59381218 -26834489 -7949846 -27387926 -35492615 -54954245
9121e4954245j0731052R489050J6553889M25306o886022K5446439j9842986n0428868
9113i0928489M5672877N6488774j6230547j119514M7697679J3055211n7755642J5273931
9105A2154280Q4121136r529787k2552837K1932437j2066599l9995488k6916696K7905624
9097C5052070O997322j9751138P351840n0556640k5815082K6227217j4033835P595502
9089b6932744K9036652K4710293m8690328n9456980O8122995O788546m1847635L9953503
9081h315698J9228223l7971835q1885924J5361410N0951787n0036016J9881408J5791534
9073e6995111m1315266k3512520k2103046M5622848J8486531K4171541L6999516n7963691
9065g6609198K3099395L6189343p633670N0099077M5599700L7967471o9210269l8769987
$$ plain form
9121 -54954245 -65685297 -56196247 -39642358 -39217052 -46103074 -20656635 -40499621 -90928489
9113 -90928489 -45255612 11233162 -4997385 -6116899 41580780 54635991 -3119651 12154280
9105 12154280 96275416 86745629 64192792 86125229 74058630 34063142 7146446 35052070
9097 35052070 42049392 22298254 29650094 -20906546 -46721628 -20494411 -34528246 -26932744
9089 -26932744 2103908 26814201 -21876127 -81333107 -13210112 -6421566 -48269201 -8315698
9081 -8315698 10912525 -27059310 -108945234 -93583824 -42632037 -92668053 -72786645 -56995111
9073 -56995111 -98310377 -121822897 -143925943 -98303095 -79816564 -55645023 -18645507 -76609198
9065 -76609198 -53509803 -17320460 -24954130 25144947 70744647 108712118 39501849 731862
9057G31862Q3120011l1186913j7152753M1751266l03111n6658775r8092206M5908446
9049c1882173K6306256n1659212M1767025q703648l6558248l6142228k496832O3388878
9041c5980182l983955M1127897M747900p5070429K7510944J2120747L792876K7016183
9033A281981L7065003J4036317j14693314k518483Q0968064l6700502J317153M4145577
9025B4901796J0586443q9362864n8400171R8380627P985085k4441894N1416990n529154
9017A5536858m3424004l5272894M8055355M7549787l038546M4577129l2707422o0963610
9009a9687347J8877692N767729r55157J8976333L7778044m6002942r8305006L7321348
9001d6229306M1665994l5337258K4042865N6204068k4863188q4235484J2718632O4711565
$$ plain form
9057 731862 83851873 52664960 35512207 77263473 76960362 20301587 -77790619 -31882173
9049 -31882173 -5575917 -57235129 -15468104 -24171752 -60730000 -96872228 -99369060 -35980182
9041 -35980182 -39964137 1163760 5911660 -69158769 -41647825 -29527078 -25734202 1281981
9033 1281981 38346984 52383301 -62310013 -64828496 16139568 -20560934 -19243781 24901796
9025 24901796 35488239 -53874625 -112274796 -13894169 -5909084 -30350978 21066012 15536858
9017 15536858 -27887146 -63160040 -15104685 32445102 29406556 73983685 41276263 -19687347
9009 -19687347 -809655 4958074 4002917 22979250 60757294 14754352 -83550654 -46229306
9001 -46229306 -4563312 -39900570 -15857705 40346363 15483175 -68752309 -56033677 8677888
8993H677888j7007805M13212L5984374k6401521n5036034j0963039K3020446J3172342
8985b8140137J5050176R728244k6680602j3497192J7679875l081913J4090782N4470313
8977C9619546K044870m1571866l403626K0856714j1206104j5756581M1729542Q812528
8969D1125023m7908534Q30522J1979332l751801M456794J3983903J5067469j7865315
8961A7917393M313753K852509j9887659K7089129k368932k1219382J4323441O259746
8953B9279998o945828k2740046K8130904J7535939m3109453L1502741K9562343k7336192
8945C5880406j1492606P385582Q264762m3146132M699570L9829022m4697375j3618370
8937a6895141J0062071j6206545p496661P275714L8667441j3538002j3198541K4438227
$$ plain form
8993 8677888 -8329917 -7916705 28067669 1666148 -53369886 -64332925 -41312479 -28140137
8985 -28140137 -13089961 -3361717 -30042319 -43539511 -25859636 -28941549 -14850767 39619546
8977 39619546 41664416 92550 -3311076 17545638 6339534 -9417047 32312495 41125023
8969 41125023 -6783511 -5952989 6026343 2274542 6731336 20715239 35782708 17917393
8961 17917393 22231146 25083655 5195996 32285125 29916193 8696811 23020252 29279998
8953 29279998 22334170 -405876 27725028 45260967 2151514 33654255 63216598 35880406
8945 35880406 24387800 31773382 40038144 -3107988 1591582 41420604 -3276771 -16895141
8937 -16895141 -6833070 -23039615 -30536276 -23260562 15406879 1868877 -11329664 13108563
8929A3108563l2647428M64155K7410082k961503m871112j2647395L694759l3298014
8921d1747893j3638923N4046289m217297q020180K4643650K693740j1834359p052516
8913e127489M6543740J8969123k7194417J1529776j0622772k7299471j1044478k116471
8905f362459J5377485j2049782j5267904o696070j0950372J4284880J573080J0154594
8897i936548L2486510o617515j5974478L909853J0981006M11904j3247536J2921656
8889A4934852j619272l2724954k647554J313641l495212P516198l039476J285054M10279
8880a8066444M195614N613907n296354K8471273P121481k5590112K0813340J6504998
8872C3767703o820681k684947J8935990K0438265l3148482O504415L2095636k4301232
$$ plain form
8929 13108563 -19538865 -19074710 8335372 5373869 502757 -12144638 -8449879 -41747893
8921 -41747893 -55386816 -1340527 -5557824 -13578004 11065646 13759386 1925027 -5127489
8913 -5127489 41416251 60385374 33190957 44720733 34097961 6798490 -4245988 -6362459
8905 -6362459 9015026 -3034756 -18302660 -24998730 -35949102 -21664222 -20091142 -9936548
8897 -9936548 22549962 15932447 -42031 3867822 14848828 15260732 2013196 14934852
8889 14934852 13315580 -19409374 -22056928 -20743287 -24238499 -16722301 -19761777 -18476723 -18066444
8880 -18066444 -13870830 -8256923 -13553277 14917996 22039477 -3550635 17262705 33767703
8872 33767703 26947022 24262075 43198065 63636330 30487848 36992263 69087899 44786667
8864D4786667k513741M238293r337751k0469896j9329510J6431660k5507492j1064226
8856b2765996J7809585l4930974j492833J1584342J027630O949518K282503L1842531
8848A2306306k2973776j5020654L9876787j9894524j717644J6580333l645125j4556286
8840i044583k8405195K8041730r744744j9438783M8474294j0688461j6209272O630398
8832a0384616N361378P029753j7287960M0884789L957554m3755766K1650481j0780954
8824c325341j4022767J2437396J6852995J6994382l0015201J9473085J0245374l3567592
8816d927669M2611993K5596892p567608n034377l80954K791670m9793975J3180721
8808A6476693M0266004l9530945j2046773j313086j7667266k9268133p948365M9341352
$$ plain form
8864 44786667 42272926 46511219 37173468 16703572 -2625938 13805722 -11701770 -22765996
8856 -22765996 -4956411 -39887385 -41380218 -29795876 -28768246 -21818728 -19536225 12306306
8848 12306306 -10667470 -25688124 14188663 -5705861 -7423505 9156828 5511703 -9044583
8840 -9044583 -37449778 -9408048 -19152792 -38591575 9882719 -805742 -17015014 -10384616
8832 -10384616 -5023238 2006515 -15281445 25603344 29560898 -14194868 7455613 -3325341
8824 -3325341 -17348108 -4910712 11942283 28936665 -1078536 18394549 28639923 -4927669
8816 -4927669 37684324 63281216 55713608 50679231 50298277 53089947 3295972 16476693
8808 16476693 56742697 17211752 5164979 3851893 -13815373 -43083506 -51031871 -1690519
8800a690519r005782j6507695J9431771j9284420m622197J1071737K8781957K5326307
8792C3501159n309694J6829956j4818558j5613686L2250503J1602123R208201N444111
8784G3094115q16126j7086374m3032907J4264018K3150377j7508375m521564j812131
8776B5731033j0237199l5305186j0245561M5786346Q043046j4990833P767557J894267
8768A8443470j5274655j9512271K5343806K8315809j9372345o727164k761076j9153460
8760a0697886p162735P413808J8466289P90685P92080M944597k4365792M292395K7830832
8751B2304273n169426n916051J1746696M599674l8274473k5193516L3514989q708957
8743a1096791l7049250J1811965J3144860k6612804l4100012K1283047K0411767l0537034
$$ plain form
8800 -1690519 -10696301 -27203996 -7772225 -27056645 -31678842 -20607105 8174852 33501159
8792 33501159 28191465 45021421 30202863 14589177 46839680 58441803 67650004 73094115
8784 73094115 72277989 55191615 12158708 26422726 49573103 32064728 27543164 25731033
8776 25731033 15493834 -19811352 -30056913 15729433 23772479 8781646 16549203 18443470
8768 18443470 3168815 -16343456 9000350 37316159 17943814 11216650 8455574 -10697886
8760 -10697886 -17860621 -10446813 8019476 8810161 9602241 14546838 -9818954 -5526559 22304273
8751 22304273 17134847 11218796 22965492 27565166 -10709307 -35902823 -2387834 -11096791
8743 -11096791 -48146041 -36334076 -23189216 -49802020 -83902032 -62618985 -42207218 -72744252
8735g2744252P022555K4128816j0250852j5371784p51165J6271146m392405L675647
8727e2412294K2396580j0472306R737O530708r337003M748182J6645907K1827693j4708404
8718a4771200j6920808J7986740j6555260k0200525J8338774K5948516n444756l5204606
8710d6823125J0378547J4165802k2498290J4210485L9866222J5303724k5007696j1590802
8702a1995133K5185684p001161j83578L3371123Q061289j8235180j9805905L815829
8694A3212968J116370L263707L4006996M71769k2381955K207380j883188j1130431Q263423
8685B7147039L7057437m859256m6812287L034206Q290002k9310336J17360L7241678
8677C1905843J417346m6025134l158643K5137455j6672954J107949L4004879j229803
$$ plain form
8735 -72744252 -65721697 -41592881 -51843733 -67215517 -67966682 -51695536 -56087941 -52412294
8727 -52412294 -30015714 -40488020 -40478283 -33947575 -43284578 -38536396 -21890489 -62796 -14771200
8718 -14771200 -31692008 -13705268 -30260528 -50461053 -32122279 -6173763 -11618519 -46823125
8710 -46823125 -36444578 -22278776 -44777066 -30566581 9299641 24603365 -404331 -11995133
8702 -11995133 13190551 6189390 6005812 39376935 47438224 29203044 9397139 13212968
8694 13212968 14329338 17593045 51600041 52071810 29689855 31897235 30014047 18883616 27147039
8685 27147039 64204476 59345220 12532933 15567139 23857141 -5453195 -5335835 31905843
8677 31905843 33323189 -12701945 -15860588 9276867 -7396087 -6288138 27716741 26486938
8669B6486938l1006332o768392J0372566j2371022K398731K0513172k1538075k6302516
8661c8214930Q810346l49469j3445938J6737248K3758667k5248845k3665323K5817755
8653b5800489P408807j6734638J7655007J8145063k4935881k0800091K1612748J4957680
8645h491794m175374J9317032J1303576j7249468L956726K2648747J1472191J3736443
8637E2518079K1133981r062317l1696734O147495J2845181j8746835K012168J0745172
8629D5896190l5794998m6935232J263978J3558067j9719801M338679K0028316l1219523
8621d8584324k9509819J7613994K0602725J388037J8690470K2811545k7569573j7985468
8613d2542413K8587257Q938291L939317K9760370J0909124l3353375j4113217L2658125
$$ plain form
8669 26486938 -4519394 -11287786 -915220 -13286242 -10887511 9625661 -11912414 -38214930
8661 -38214930 -29404584 -29754053 -43199991 -26462743 -2704076 -27952921 -51618244 -25800489
8653 -25800489 -18391682 -35126320 -17471313 673750 -24262131 -45062222 -23449474 -8491794
8645 -8491794 -12667168 6649864 17953440 703972 4660698 27309445 38781636 52518079
8637 52518079 73652060 64589743 32893009 39040504 51885685 33138850 35151018 45896190
8629 45896190 10101192 -36834040 -35570062 -22011995 -41731796 -37393117 -17364801 -48584324
8621 -48584324 -78094143 -60480149 -39877424 -38489387 -19798917 3012628 -24556945 -42542413
8613 -42542413 -13955156 -5016865 -1077548 28682822 39591946 6238571 -7874646 24783479
8605B4783479m58213o176696L9750982L678203m2283438r188435K9422204k680098
8597C6847988j6535204L7485378O954560m8970893n400971K4551819m297010j4176395
8589A6459272K3584070R852926m4267922p821824J6547378j5136638n923382J0063829
8581C357709m357995k9225647o979497J0574751k2442262L539480K3616070j4017164
8573c5934555j2563659J3892650J5032666j6310946K650550M1575889o301261j6971060
8565a4929726K2820669J2789096j2361293j0962484K6062704J0086477k2505676R666471
8557B0666238P734459p073490n222758k118188J5039686j574599o258111m071283j0781924
8548F340030N464789j6257389j2895671J2962397q534523j8084587j6737498M572196
$$ plain form
8605 24783479 24325266 18148570 57899552 61577755 19294317 10105882 39528086 36847988
8597 36847988 20312784 57798162 64752722 15781829 10380858 34932677 30635667 16459272
8589 16459272 40043342 49896268 5628346 -2193478 14353900 -782738 -6706120 3357709
8581 3357709 -1000286 -30225933 -37205430 -26630679 -49072941 -45533461 -21917391 -35934555
8573 -35934555 -48498214 -34605564 -19572898 -35883844 -33233294 8342595 2041334 -14929726
8565 -14929726 7890943 20680039 8318746 -2643738 23418966 33505443 10999767 20666238
8557 20666238 28400697 21327207 16104449 13986261 29025947 27451348 21193237 17121954 6340030
8548 6340030 11804819 -4452570 -17348241 -4385844 -12920367 -31004954 -47742452 -43170256
8540d3170256L014656k2526948J1280576J2685486q455355k918844j897074J7011844
8532c4975915K261189m851558J0987298o85758Q338819p874946q619007K2895648k044129
8523a4568359j0566746K181089J7441721R000466k6291338J3243937K0934776k0767145
8515i391599m824321J3145502J3723002j8392702j6756770K0180573j0108583o310681
8507a8735579J6639872P639808P120999q894178M365240N875349J688924K2701326n931662
8498C2470099q657649p3841k3128731j7081443r373374R816449q714202l4824607n58013
8489f0125312q313597j6802720N313308J9907442K1990716j2462281j168469K0006950
8481c1653963L89215J2277510J7430521J4727147k050442j8716090O064961R5592k078911
$$ plain form
8540 -43170256 -40155600 -62682548 -51401972 -38716486 -47171841 -50090685 -51987759 -34975915
8532 -34975915 -32714726 -37566284 -26578986 -27264744 -18925925 -26800871 -35419878 -12524230 -14568359
8523 -14568359 -25135105 -22954016 -5512295 3488171 -22803167 -9559230 11375546 -9391599
8515 -9391599 -14215920 -1070418 12652584 -5740118 -22496888 -2316315 -12424898 -18735579
8507 -18735579 -2095707 5544101 12665100 3770922 8136162 14011511 15700435 38401761 32470099
8498 32470099 23812450 23738609 609878 -16471565 -25844939 -16028490 -24742692 -59567299 -60125312
8489 -60125312 -68438909 -85241629 -79928321 -60020879 -38030163 -50492444 -51660913 -31653963
8481 -31653963 -31264748 -18987238 -1556717 13170430 11119988 -7596102 -1531141 -1435549 -3514460
8472c514460J0718424k336401p422113j3382895K014674O209715p282638J2906118L603965
8463A514389j8133527o867817J2220776J2721810j0622999N104252J5175573j8532597
8455g420140r078686K3118103J8136232j0910134q629642M302557k2409771j6868779
8447b9760260J6770109N277818j9650156j5174760j1091989k8583813l660403L8014971
8439d7858483J3759064r345666R951896P798378j9660007J3674752O5891272K4951550
8431E9162756j6931541M889455M15973l0349069n551301M9353178J6972726l4099355
8423D3862822j5999197k1868128l5654410j685894L3535823J3792330k4133562j3211321
8415b1361537l0054412m1410829K0353084L9327770O290385r702136J246914j7379626
$$ plain form
8472 -3514460 7203964 4867563 -2554550 -15937445 -13922771 -7713056 -14995694 -2089576 1514389
8463 1514389 -16619138 -23486955 -11266179 1455631 -9167368 -4063116 11112457 -7420140
8455 -7420140 -16498826 6619277 24755509 13845375 5215733 9518290 -12891481 -29760260
8447 -29760260 -12990151 -7712333 -27362489 -42537249 -53629238 -82213051 -85873454 -47858483
8439 -47858483 -34099419 -43445085 -33493189 -25694811 -45354818 -31680066 34211206 59162756
8431 59162756 42231215 47120670 47536643 17187574 11636273 60989451 77962177 43862822
8423 43862822 27863625 5995497 -29658913 -31344807 2191016 15983346 -8150216 -21361537
8415 -21361537 -51415949 -92826778 -72473694 -33145924 -26855539 -36557675 -35310761 -52690387
8407e2690387m1133576L0095160O3210774R713257j632135O021482j1294208l3994309
8399c1703942P924998N2911644O626644j1437139q251700l1715399k6255922j04401
8391d2005217K8232440J2955794J493610O115115l2189631j8238640K3070042K1281392
8383G14905J0892727P993725J4647818k5562421l9210060J4662881J7009797j672116O940
8374e15804Q053925n622798l6213093l028872K2966114J0383221J0964341O333291N724730
8365A9045055j2152266j4141176R264547J0064430J8199408Q408373q347532o772343
8357B3568496r692993j646083r63914J8286378L0369518m609782j5711502k420938O941897
8348D4121077m885106N36833L8142323J1121055l1618339k0252967R62475m645531
$$ plain form
8407 -52690387 -93823963 -63728803 -518029 9195228 7563093 13584575 2290367 -31703942
8399 -31703942 -23778944 29132700 35759344 24322205 16070505 -15644894 -41900816 -42005217
8391 -42005217 -13772777 -816983 676627 6791742 -25397889 -43636529 -20566487 714905
8383 714905 11607632 19601357 34249175 8686754 -30523306 -15860425 1149372 -522744 -515804
8374 -515804 7538121 1915323 -34297770 -37326642 -14360528 -3977307 6987034 13320325 19045055
8365 19045055 6892789 -7248387 2016160 12080590 30279998 38688371 30340839 23568496
8357 23568496 13875503 12229420 11265506 29551884 59921402 55311620 39600118 37179180 44121077
8348 44121077 39235971 39772804 77915127 89036182 57417843 37164876 38127351 33481820
8340C3481820k0615351J4156581J8163401l2763939l5756948j5599343l078331q098386
8332e0110496K623329K1396993r926683j6135730p023465m190051K1034639K2318873
8324b0012591J8300390J189319k850572N196993k3042420K735398L0110372J291400
8316A2918289j7213626j7223624L977382k1415149k6882111L0857011J7275352j0736493
8308b8442969p213008J1421540J4471349j7659926K0236503L8513510j875960m382188
8300B5068851l453575N129287j4705050j9700727J5822755j2210744k0951766j1400194
8292c6401163j9224740j0063218j7137085N750168N141123r297449J8212361k708385
8284f5728388n807425J6394281J3667003J2042319n66731K4363991J1256654k9359249
$$ plain form
8340 33481820 12866469 27023050 45186451 12422512 -23334436 -38933779 -42012110 -50110496
8332 -50110496 -47487167 -26090174 -36016857 -52152587 -59176052 -63366103 -42331464 -20012591
8324 -20012591 -1712201 -522882 -3373454 1823539 -21218881 -18483483 11626889 12918289
8316 12918289 -4295337 -21518961 -17541579 -38956728 -65838839 -34981828 -17706476 -28442969
8308 -28442969 -35655977 -24234437 -9763088 -27423014 -7186511 31326999 29451039 25068851
8300 25068851 21615276 26744563 12039513 -7661214 8161541 -4049203 -25000969 -36401163
8292 -36401163 -55625903 -65689121 -82826206 -77076038 -71934915 -81232364 -63020003 -65728388
8284 -65728388 -71535813 -55141532 -41474529 -29432210 -29998941 -5634950 5621704 -23737545
8276b3737545J1491307J7069925j1874802q690034J4057277J3922624l6413072p674268
8268c1848588L1548587j5095994j1999527K2239245J6618850j9023685j4629712K9840587
8260G649763l438233j9141857K3105870P944819j4264804q234751P511372j58916j1793341
8251a0820078J8644364O570586j1767718J4823436L695644q345282R857293K1419841
8243D4078086L964324j2200994J8802920Q237245k9409295L842859J8258344j1284607
8235D4288882j8052356J569799L271638k8169720j2029258J5233343p624786o199748
8227g712206K286528j957185J722350K72888P258801P153641J1792165P330390j6942400
8218A1204972P089522J4770759j7869108n498712J3322067l945254l0084308m651907
$$ plain form
8276 -23737545 -12246238 4823687 -7051115 -15741149 -1683872 12238752 -24174320 -31848588
8268 -31848588 -300001 -15395995 -27395522 -5156277 11462573 -7561112 -22190824 7649763
8260 7649763 4211530 -14930327 8175543 16120362 1855558 -6379193 1132179 973263 -10820078
8251 -10820078 7824286 14394872 2627154 17450590 21146234 12800952 22658245 44078086
8243 44078086 48042410 35841416 54644336 62881581 33472286 37315145 55573489 44288882
8235 44288882 26236526 27806325 31077963 2908243 -9121015 6112328 -1512458 -7712206
8227 -7712206 -5425678 -7382863 -5660513 -5387625 1871176 9024817 20816982 28147372 11204972
8218 11204972 18294494 33065253 15196145 9697433 23019500 19074246 -11010062 -15661969
8210a5661969K3700343j8512981j1631061K7381437o94136j6975876R338601K6603343
8202B3547701k854898p920051K4755616j1135476k8078045J0738655J405651j9669185
8194i210032p912082P607606k3593906l0891147K4881416J0828268j6141521K2919229
8186b1512169K3108043j7978213j3726709L5020308J7778351k3952286J9260426J7403960
8178C5401711m3619526k7451430K1996029P719493k5563193J4513630K8589633l1535034
8170a9948687j7149746L7065744K5327382L00622J9908223K8830068j8345491k4998743
8162C0989372J3299717P692708m233926K831070l503998k3359828k3523057m307733
8154d115675j941733J0014607K2719130j696286j7302679k051896N143678m426764
$$ plain form
8210 -15661969 8038374 -10474607 -22105668 5275769 4581633 -12394243 -3055642 23547701
8202 23547701 20692803 12772752 37528368 26392892 -1685153 9053502 10459153 -9210032
8194 -9210032 -17122114 -9514508 -33108414 -63999561 -39118145 -28289877 -44431398 -21512169
8186 -21512169 1595874 -16382339 -30109048 4911260 22689611 -1262675 17997751 35401711
8178 35401711 -8217815 -35669245 -13673216 -5953723 -31516916 -17003286 11586347 -19948687
8170 -19948687 -37098433 -32689 25294693 25595315 45503538 74333606 55988115 30989372
8162 30989372 44289089 51981797 47747871 50578941 47074943 23715115 192058 -4115675
8154 -4115675 -6057408 3957199 26676329 24980043 7677364 5625468 10769146 6342382
8146F342382J0259512L5909587J0616204k3244305q271943J1922812L433663J069523
8138D8037435K8558642K9529960j4112643l1250429n619821Q048468q885685p223842
8130D7082085J6399661j686276m4190770l3350156J2226721J9203314J247610J8201307
8122C5133496L4157156m759222k7481343Q139410L2650525J3875969n827155j219692
8114H4669144j5577793m8353634l6958447o335259P681309L66576j6196123q936354
8106c9640581m754774k353310J3618575L0002369M7324051J3518720j8507978j862798
8098C7344274K255185l383128j2973600J0004503K0475569l4571424k7914209J4401412
8090E638582K5186162J0697031r47521M6224712J5339758l8768795O259195K0043693
$$ plain form
8146 6342382 16601894 52511481 63127685 39883380 31611437 43534249 46967912 48037435
8138 48037435 76596077 106126037 92013394 60762965 55143144 63191612 54305927 47082085
8130 47082085 63481746 61795470 17604700 -15745456 -3518735 15684579 16932189 35133496
8122 35133496 69290652 64531430 37050087 45189497 77840022 91715991 85888836 84669144
8114 84669144 69091351 20737717 -16220730 -22555989 -14874680 -14508104 -30704227 -39640581
8106 -39640581 -44395355 -46748665 -33130090 -3127721 44196330 57715050 39207072 37344274
8098 37344274 39599459 36216331 23242731 33247234 53722803 19151379 -8762830 5638582
8090 5638582 30824744 41521775 40574254 86798966 102138724 63369929 69629124 89672817
8082H9672817m085122l8119658j6139525O892522o3828785l5483124R563979j2583689
8074f4110585j5016405j4286999M1949529K3838382L821317O2886698K5438617K9572591
8066I4093145L6509335K1483083N0615996J4571677K3664396j7765118m8157424K3721685
8058A98736775l2769033k5191926J2494114j6569847l0910745q4392956J288399J4119335
8050C6804116n1144734L3889618R580058k9266907n0359873j0643216Q7242516q651040
8042A7450538L0799543Q9618520j0151695P42718K0478565J16588908Q8999499O158056
8034C60684652R9384924j2197077p5070998k3934492k4081342K0106943n9837812k7406309
8026B57648489k8129644j09030304j184308j7533191L031540K6116537m4654629j6737571
$$ plain form
8082 89672817 85587695 47468037 31328512 38221034 -25607751 -61090875 -51526896 -64110585
8074 -64110585 -79126990 -93413989 -51464460 -27626078 -23804761 39081937 64520554 94093145
8066 94093145 130602480 152085563 202701559 217273236 240937632 223172514 175015090 198736775
8058 198736775 165967742 140775816 153269930 136700083 105789338 21396382 22684781 36804116
8050 36804116 -14340618 19549000 29129058 -137849 -50497722 -61140938 26101578 17450538
8042 17450538 48250081 137868601 127716906 128459624 148938189 265527097 354526596 360684652
8034 360684652 460069576 447872499 372801501 348867009 324785667 344892610 285054798 257648489
8026 257648489 229518845 120488541 119304233 101771042 104802582 130919119 86264490 69526919
8018F9526919q9111651k9144138J2424913p9843168L608993m1410517p9266753o6203061
8010b99418463n1801922O6282817k8485978l756834Q0801500k3775121M261193J8013333
8002b37879475Q5485260O1339319m4518987O9607862J44311n4008893J5447132J3059461
7994i1324010N9301757k5987577J5122999P3511597r658574Q0171948P6337946P1687546
7986B49163632Q7090804J1419980O9646901K7709825J4893574Q1456809o3157364J5119394
7978D93343555l8420330q9334273n0897715n6827672Q463213n7907420l5671225M4385029
7970B17133162m3853649k3629447j0915781R922382j2933386p6135895K5874094p739866
7962G7721614m7869578j927415p199547M1201491k8925258J6699954M3695711n042019
$$ plain form
8018 69526919 -19584732 -48728870 -36303957 -116147125 -112538132 -153948649 -233215402 -299418463
8010 -299418463 -351220385 -284937568 -313423546 -317180380 -236378880 -260154001 -255892808 -237879475
8002 -237879475 -152394215 -91054896 -135573883 -65966021 -65821710 -119830603 -104383471 -91324010
7994 -91324010 -32022253 -58009830 -42886831 30624766 20966192 101138140 177476086 249163632
7986 249163632 336254436 347674416 417321317 445031142 459924716 541381525 478224161 493343555
7978 493343555 454923225 365588952 314691237 257863565 266326778 208419358 172748133 217133162
7970 217133162 173279513 149650066 138734285 148656667 135723281 59587386 85461480 77721614
7962 77721614 29852036 27924621 20725074 61926565 33001307 49701261 93396972 88354953
7954H8354953J6314675k3653949K7931027K3848266m4829474J8385642q359322k1561817
7946G6430001j9267543j4846775N8856174J3024084J9611046M9324064K0967513L5289395
7938B39387959P495104L7524356L2608498k7698542k4540834o1735456l7503871l2256194
7930A33281020n7179692j2609980l2959014m6322217o6761440l1112592M5190308n38469
7922f9012076K3332425N3138741J6213517j4525118j8140597O2388419L3163350j3182782
7914G3375879K9661277j0592429l4473611l7442980J2166079M7451916r530528J9574762
7906I0190365K626706k7155433K812618m510710L3589784R880207j3455918j5246961
7898G8730658n8835862q322082j2905174j6495516K3269558j0621836n879107k5470789
$$ plain form
7954 88354953 104669628 81015679 108946706 132794972 87965498 106351140 97991818 76430001
7946 76430001 57162458 42315683 101171857 114195941 133806987 183131051 204098564 239387959
7938 239387959 246883063 284407419 317015917 289317375 264776541 203041085 165537214 133281020
7930 133281020 76101328 63491348 30532334 -15789883 -82551323 -113663915 -68473607 -69012076
7922 -69012076 -45679651 7459090 23672607 9147489 -8993108 53395311 86558661 73375879
7914 73375879 103037156 92444727 57971116 20528136 32694215 80146131 70615603 90190365
7906 90190365 92817071 65661638 68474256 63963546 97553330 107433537 93977619 78730658
7898 78730658 19894796 11572714 -1332460 -17827976 5441582 -5180254 -11059361 -36530150
7890c6530150J513986L5524439j1939832K8522494J6353571j6792497q847122k3919499
7882a6114610J4847505j5036059j7340279J8413709j8618258M314514k230961M980263
7874b6784176K6453734j0776522K1954406J6523191P159172R720680k5082554Q814598
7866B7982529j3775983k6904610J7474669P278417N701459k3442724m555369K1522334
7858A1280722j8482959K3400497M1730694Q603377j8726841l4721031l29917k1834384
7850i079842k0436178J9176811j0558927l0440181m2934182k2414978R767748J1183949
7842i5735780L6447566K2669070M597917J527481j6900443J2767987L8711759L2641565
7834C6727122L740396j6234166l90873k4224474k6693129K7695229M1949271J696748
$$ plain form
7890 -36530150 -35016164 508275 -11431557 17090937 33444508 16652011 7804889 -16114610
7882 -16114610 -1267105 -16303164 -33643443 -15229734 -33847992 -29533478 -31764439 -26784176
7874 -26784176 -330442 -11106964 10847442 27370633 34529805 44250485 19167931 27982529
7866 27982529 14206546 -12698064 4776605 12055022 17756481 -5686243 -10241612 11280722
7858 11280722 -7202237 16198260 57928954 66532331 47805490 13084459 12754542 -9079842
7850 -9079842 -29516020 -10339209 -20898136 -51338317 -94272499 -116687477 -106919729 -95735780
7842 -95735780 -59288214 -36619144 -32021227 -30493746 -47394189 -34626202 4085557 36727122
7834 36727122 40467518 24233352 23842479 -381995 -27075124 620105 42569376 44266124
7826D4266124k7089754K630880J762143l0930361J725823L8394368P205650m1363674
7818c398801k6235557p01651k6150431j9213354K0257589K4501134o023190j3029321
7810d9993582J3139179R195517O945180K1128326K1442042J8249990n99497j1671298
7802B7835857j3395929n456538N157926j0856848M248118K0606551j0885073k5043868
7794g789804m951903J9156647J181543m115886L1651250K657077m1424358k8305924
7786c1941358j831846K608970j0293880J4794001J6536349k7709245k2770379M262690
7778e6344698K5670987L3363266K3696815K2592998n555500k5751914j3272270M435081
7770H834765K9463169J0944210j7216308j3706242k9432292k6874758N134118L7786700
$$ plain form
7826 44266124 17176370 19807250 21569393 -9360968 -7635145 30759223 37964873 -3398801
7818 -3398801 -29634358 -30336009 -56486440 -75699794 -55442205 -30941071 -36964261 -49993582
7810 -49993582 -36854403 -27658886 -20713706 414620 21856662 40106652 39507155 27835857
7802 27835857 14439928 8983390 14141316 3284468 7532586 28139137 17254064 -7789804
7794 -7789804 -12741707 6414940 7596483 3480597 35131847 37788924 -3635434 -31941358
7786 -31941358 -33773204 -31164234 -41458114 -26664113 -10127764 -37837009 -60607388 -56344698
7778 -56344698 -30673711 2689555 26386370 48979368 43423868 17671954 4399684 8834765
7770 8834765 38297934 49242144 32025836 18319594 -11112698 -37987456 -32853338 4933362
7762D933362L4545835j0907286r744333n552841k6308065M831595K9872525J8831716
7754D0502508j4291699l6410680k0318330k6305020k83329L5452587J2852913J0989640
7746B188590m555027j9325427M490388K4891288M3367170L993766m519141J1955824
7738F2487431m5922697k8009073K7318220K2852184r197529k5042473K3030673j4272872
7730A3243864l8436298M9815990M0045556k880369j6646772j407600K445399m7169639
7722i89869J0205942K4409451l4186979j5132167k8249236j5284198m863787N949281
7714e8141562L5271714j6785089J1741981J2289104l6339471K1366522K2539822Q488315
7706D31336k0139174j9331713K4210393m8727208j1512546N0088967M118229M268961
$$ plain form
7762 4933362 39479197 28571911 18827578 13274737 -13033328 -8201733 21670792 40502508
7754 40502508 26210809 -10199871 -30518201 -56823221 -57106550 -21653963 -8801050 2188590
7746 2188590 -2366437 -21691864 -17201476 7689812 51056982 55050748 50531607 62487431
7738 62487431 16564734 -11444339 15873881 38726065 29528536 4486063 27516736 13243864
7730 13243864 -25192434 24623556 64669112 61788743 45141971 43734371 46179770 -989869
7722 -989869 9216073 33625524 -561455 -15693622 -43942858 -59227056 -64090843 -58141562
7714 -58141562 -22869848 -39654937 -27912956 -15623852 -51963323 -30596801 -8056979 431336
7706 431336 -19707838 -39039551 -14829158 -63556366 -75068912 -24979945 -20861716 -16592755
7698a6592755o488507L4375706J3825276j9892473N8605266J7344021n997204k917229
7690G2262101k5434488O019892l5693966m933827R099731l4089591Q006819k7676086
7682c2439415q533791J8373840m370703L5053845n697719J2300283J5480426l3530760
7674c363994J8234262m092639L548911K562146k8989288K1069430k5817267j0864868
7666b7713307K4076127p56667L0190553j1155969J0952876J6950243k9703077K2663608
7658C5504387l605148l597738L01104k8995307Q938074l1223649k397453K2064569
7650c011161k0881722K3152349K571307O164053P196462q905704L7192145j6659677
7642B6818052q406094J8100574k3590015j065356k0372742R64351O48898k6772975
$$ plain form
7698 -16592755 -23081262 11294444 25119720 5227247 63832513 81176534 75179330 72262101
7690 72262101 46827613 52847505 17153539 12219712 21319443 -12770148 -4763329 -32439415
7682 -32439415 -40973206 -22599366 -26970069 8083776 2386057 14686340 30166766 -3363994
7674 -3363994 14870268 10777629 14326540 16888686 -12100602 8968828 -16848439 -27713307
7666 -27713307 -3637180 -4393847 25796706 14640737 25593613 42543856 12840779 35504387
7658 35504387 31899239 28301501 28602605 -392702 8545372 -22678277 -25075730 -3011161
7650 -3011161 -23892883 -740534 1830773 7994826 15191288 6285584 43477729 26818052
7642 26818052 18411958 36512532 12922517 11857161 -8515581 -7551230 -6902332 -33675307
7634c3675307K5960271l744671M850202K1004955j3933056J3217613m134414R335751
7626A8881344N477495j7003073K2204344l0516172l3360817O277041m557465R739624
7618b2857679n403853K2275917P597655l4420745K1582261J9849272J6590882K1927778
7610D7141488p90681k131156l6692695j4104862L739245r014578K6211650p291067
7602G067344l3750236j6145290n032354J2398158O502964M3034182L0337334l9270721
7594E141381j7264240P221892K352524M524555K1056715K1788430l9175984m0318850
7586c4673577l05458l599776J4534982L0720021J3007569j7371081k0977222M01166
7578a8263376l133835J7420722M6113040N462455l0708971j0538523j519236j3702701
$$ plain form
7634 -33675307 -7715036 -11459707 -6609505 14395450 462394 13680007 9545593 18881344
7626 18881344 24358839 7355766 29560110 -956062 -34316879 -28039838 -32597303 -22857679
7618 -22857679 -28261532 -5985615 1612040 -32808705 -11226444 8622828 25213710 47141488
7610 47141488 46350807 44219651 7526956 -6577906 -2838661 -11853239 14358411 7067344
7602 7067344 -26682892 -42828182 -47860536 -35462378 -28959414 14074768 44412102 5141381
7594 5141381 -12122859 -4900967 -2548443 1976112 23032827 44821257 5645273 -34673577
7586 -34673577 -34979035 -38578811 -24043829 6676192 19683761 2312680 -18664542 -18263376
7578 -18263376 -21397211 -3976489 42136551 47599006 16890035 6351512 4832276 -8870425
7570h870425O245681M4357756J8971607l4087602j3852088P725007j3102597K424527
7562I811866K7654698J7106609j9301318k7995833m691730j5702749J649845K3288435
7554A1819823Q4003P98533o640863j2109207j1292331L208613L8649050J39971r590416
7545A5067176J6656456j1188589j7430493q288327L1368816K6706840j9871540J6681788
7537D9702127R307182j1588439r11806Q724067M4293897K749805j0546554O315797
7529I8046076k2716722n372781j7563505K953830K0150714k7352078j5920425k9747192
7521B477917j3394395O539687j6274671K7675078P837301r903739o766510j9624157
7513b1433489L5579358J4215526P535829K7338763m179710N816041k8148859M232072
$$ plain form
7570 -8870425 -2624744 41733012 60704619 26617017 12764929 20489936 7387339 9811866
7562 9811866 37466564 54573173 35271855 7276022 2584292 -13118457 -11468612 11819823
7554 11819823 11903826 12702359 6061496 -6047711 -17340042 -14131429 24517621 24657592 15067176
7545 15067176 31723632 20535043 3104550 -5183777 26185039 52891879 33020339 49702127
7537 49702127 59009309 47420870 46509064 55233131 99527028 102276833 91730279 98046076
7529 98046076 75329354 69956573 52393068 55346898 75497612 48145534 32225109 2477917
7521 2477917 -10916478 -4376791 -20651462 7023616 14860917 4957178 -1809332 -21433489
7513 -21433489 14145869 28361395 35897224 63235987 59056277 64872318 36723459 40955531
7505D0955531M1430593j2737703p16547j2982106q978106j8699069m0781177L1698735
7497A9190151K346452k4586084o308611j8088858P309970k2389122J1963063L4129728
7489C566689j7756586J0476995r845360l624559J2232173o336693K2019086j8347567
7481g615822k67336Q715596l4250257J6041893R410012N095355m308196r324294L7255615
7472B0752566k0884107n171433L1697674o017480O91928j6826195J8261547J794095
7464B4298595l2784707K4255537j1290918r194933O497628m319468J6202631k0456477
7456f792112J4430496N170432k6845577L1550866J150094l451191n007891k585737
7448G619380K0528054l3128849J9944035L5319842j6978701L384179p636554J9866654
$$ plain form
7505 40955531 82386124 69648421 68931874 55949768 46971662 28272593 -12508584 19190151
7497 19190151 21536603 -3049481 -9358092 -27446950 -20136980 -42526102 -30563039 3566689
7489 3566689 -14189897 -3712902 -13558262 -17182821 -4950648 -11287341 10731745 -7615822
7481 -7615822 -7883158 832438 -33417819 -17375926 -7965914 -2870559 -7178755 -16503049 20752566
7472 20752566 -131541 -5302974 26394700 20377220 21069148 4242953 22504500 24298595
7464 24298595 -8486112 15769425 4478507 -4716426 1781202 -2538266 13664365 -6792112
7456 -6792112 7638384 12808816 -14036761 17514105 18664199 15213008 10205117 7619380
7448 7619380 28147434 -4981415 14962620 50282462 33303761 36687940 29051386 48918040
7440D8918040p024453j3689231M0581072j9986245j8658657j5300501k1054624Q943168
7432B728569k3147431J3735826k826075k6415642J2055537k2296922J7192274K8006792
7424i67072J0456452J7690795k3132087J8588491j502120k1919355L3729867K835018
7416C5779989l763463l1167811j8595449J8750733l2179453J0811199K3926308m086619
7408e24566m370694k7788313K4539470Q601173n869499L5028820L862865R447737j0872905
7399C2054088k209236L3502145l42707K5909218J6056254L91713Q855340k1950052P625611
7390I9892374k054073n662400P449359l0842802j4203791k4867713k9416251r004326
7382h709623r959275K2319832n301934j2569662J3047961q691823K728555J3525968
$$ plain form
7440 48918040 41893587 28204356 68785428 48799183 30140526 14840025 -6214599 2728569
7432 2728569 -20418862 -6683036 -9509111 -35924753 -23869216 -46166138 -28973864 -967072
7424 -967072 9489380 27180175 4048088 22636579 21134459 -784896 32944971 35779989
7416 35779989 32016526 848715 -17746734 1003999 -31175454 -20364255 3562053 -524566
7408 -524566 -4895260 -32683573 -8144103 457070 -5412429 29616391 33479256 42926993 32054088
7399 32054088 29844852 63346997 63004290 88913508 104969762 105361475 114216815 92266763 99892374
7390 99892374 97838301 92175901 99625260 68782458 54578667 29710954 294703 -8709623
7382 -8709623 -18668898 3650934 -1651000 -14220662 -1172701 -9864524 -7135969 6389999
7374F389999L5123429K0507925k1239605K328483j5353170k7136261L272703J9036576
7366B2930079J3125140k3302247o571507q816721l2175018J7527175M3128937K2748095
7358D8593933r093314l314884k777280m2028186L509714M5220945J3377163j7132728
7350C6355363j9770106r924447l7724115l781208N0909095K1347443K509262j2698336
7342B7222951k1073373k2480815Q31639M2946468Q085216J085218m33143m7664845
7334a1480684l1164905J2739002M4162667Q703015p050465K6566089l5310740m5506301
7326c8342322J7550547L7843116J3123467k8838326J542395k1027887n8139860K451930
7318g3836940K1760333K4923552J428617j4538887N016497j4729170J6897594K3895964
$$ plain form
7374 6389999 41513428 62021353 40781748 43110231 27757061 620800 3893503 22930079
7366 22930079 36055219 12752972 6181465 -2635256 -34810274 -17283099 25845838 48593933
7358 48593933 39500619 36185735 33408455 -8619731 -5110017 40110928 53488091 36355363
7350 36355363 16585257 6660810 -31063305 -34844513 16064582 37412025 39921287 27222951
7342 27222951 6149578 -16331237 -15499598 27446870 35532086 36617304 36184161 -11480684
7334 -11480684 -42645589 -29906587 14256080 22959095 15908630 42474719 7163979 -38342322
7326 -38342322 -20791775 17051341 30174808 1336482 2878877 -18149010 -76288870 -73836940
7318 -73836940 -52076607 -27153055 -25724438 -40263325 -35246828 -49975998 -33078404 -9182440
7310i182440K0638451M0893042j8709390k5026018m187292L624790O712480j6365992
7302a602369K9676092L762070m3870499R28075J0799147J9413276M34729Q709438K6576015
7293E4825974k8058522j1061548n696153q921586J0461389k2349970p411135j0544565
7285b8756116j1936557j656926j7370399L7769479K1396272j0021978K3380423J6883796
7277B9687994J4841306j1412837J6563010L5210118k7703601l591804L002211j2954944
7269D3641453r380717j1628280K2895425j2120956j1118871J6889299j5844462O189126
7261B9522017K220247J388776j237472k5457026O030397k0336119j5693271J0067955
7253a3494496j3742423L593827j3579181K241287J7961619l790731K7960502O578169
$$ plain form
7310 -9182440 11456011 52349053 33639663 8613645 4426353 8051143 14763623 -1602369
7302 -1602369 28073723 31835793 -12034706 -11106631 -307484 19105792 19540521 28249959 54825974
7293 54825974 26767452 15705904 10009751 1088165 11549554 -10800416 -18211551 -28756116
7285 -28756116 -40692673 -42349599 -59719998 -21950519 -554247 -10576225 12804198 29687994
7277 29687994 44529300 33116463 49679473 84889591 57185990 53594186 56596397 43641453
7269 43641453 34260736 22632456 45527881 33406925 22288054 39177353 23332891 29522017
7261 29522017 31742264 33131040 31893568 6436542 12466939 -7869180 -23562451 -13494496
7253 -13494496 -27236919 -23643092 -37222273 -34980986 -17019367 -20810098 7150404 13728573
7245A3728573M039115O291358j6607530J6670684m335340p01998L675426k7411567q29011
7236e480290j3191164K704828J2876310j781791K7778393j8156182j7394839J9239258
7228F594523R66031j14348j6811369J2915763j3538749o5925552Q608549J8023485
7220d9281667j4405053j1449235J3371174K6132336l7316572Q348907O0939189L987311
7212C26390L155307R436684Q818624j3871175j5996574K9563124j0981616j0804018
7204c53254Q770739k8789846k971014K1043643J8540902p556267p48267L8832424k5595853
7195B1173207k4628875M7527668J4784849l4931327k3723207K3590231j0072536m3750270
7187c0030260L8077814L5932990k6578886j5669376J7501767J9667897o369763K1713227
$$ plain form
7245 13728573 17767688 24059046 7451516 24122200 19786860 19084862 22760288 -4651279 -5480290
7236 -5480290 -18671454 -15966626 -3090316 -4872107 22906286 4750104 -12644735 6594523
7228 6594523 7560554 7446206 -9365163 3550600 -9988149 -75913701 -67305152 -49281667
7220 -49281667 -63686720 -75135955 -61764781 -35632445 -72949017 -64600110 -3660921 326390
7212 326390 3481697 12918381 21737005 7865830 -8130744 21432380 10450764 -353254
7204 -353254 8417485 -20372361 -23343375 -2299732 16241170 8684903 7936636 46769060 21173207
7195 21173207 -3455668 44072000 58856849 23925522 202315 23792546 13720010 -30030260
7187 -30030260 8047554 43980544 17401658 1732282 19234049 38901946 32532183 54245410
7179E4245410L0600217k2947469k3997535j4501049j2302870N801866O577876n420494
7171A8055952k5938697j7746863o969267j1484013K5362925M0253222J364909j9277587
7163C620581j0326220j902857n800551R813937K8347452j096516l1010487k4389980
7155c2744641j0245435O470050J8160209K0291688J4344497j0196155k1644452q437005
7147b4001244J0000189J8491081K845356k459654j1637191l7618926k1451507P754636
7139e8077260R625459L836224P306082J1176897j6752913r732495L1784700J7555101
7131c278205m90046J3125250J4256392j4180397k6906249J2285735J1321486j7858308
7123a1724342M505734J8209005K473529r802350K249664J5468183o06887O079446J6133056
$$ plain form
7179 54245410 84845627 61898158 37900623 23399574 11096704 16898570 23476446 18055952
7171 18055952 -7882745 -25629608 -32598875 -44082888 -18719963 21533259 22898168 3620581
7163 3620581 -6705639 -8608496 -14409047 -4595110 23752342 22655826 -8354661 -32744641
7155 -32744641 -42990076 -36520026 -18359817 1931871 16276368 6080213 -15564239 -24001244
7147 -24001244 -14001055 4490026 7335382 4875728 -6761463 -44380389 -65831896 -58077260
7139 -58077260 -48451801 -44615577 -37309495 -26132598 -42885511 -52618006 -20833306 -3278205
7131 -3278205 -3768251 9356999 23613391 9432994 -17473255 -5187520 6133966 -11724342
7123 -11724342 -7218608 10990397 13463926 3661576 5911240 21379423 20772536 26851982 42985038
7114D2985038J728962k048925j6770698k6560270j2170534L670264N487691q633855O53539
7105a1658788L111998l1642813j9674920K9244864L3427781J165423q779644P996417
7097C190318j7426098m6512662O053371M5578871J0327123k2976035j0432997O588877
7089b5609232k1964628p911996N8773568M5530450o087746k1317011o612519j860388
7081A2940498j9361909J7185585L2001168j2083043k8037913l6806352j1576102J3992991
7073c1745077J3858742K8648538R901152P878915r746034l0418980L0658925L2355092
7065E1391273l390163j0390940o072292j748939n2721529j2954679M6718136o628388
7057D202479j3221457N511065K1731519q41210k2030670M5472818K0367193j5289723
$$ plain form
7114 42985038 44714000 42665075 25894377 -665893 -12836427 -9166163 -3678472 -12312327 -11658788
7105 -11658788 -8546790 -40189603 -59864523 -30619659 2808122 3973545 -4806099 3190318
7097 3190318 -14235780 -60748442 -54695071 -9116200 1210923 -21765112 -32198109 -25609232
7089 -25609232 -47573860 -55485856 3287712 48818162 42730416 21413405 14800886 12940498
7081 12940498 -6421411 10764174 42765342 30682299 2644386 -34161966 -45738068 -31745077
7073 -31745077 -17886335 10762203 20663355 28542270 18796236 -11622744 19036181 51391273
7065 51391273 48001110 37610170 31537878 29788939 -22932590 -35887269 10830867 4202479
7057 4202479 -9018978 -3507913 18223606 17382396 -4648274 40824544 61191737 45902014
7049D5902014O471936l727063O962775k7696353j9491175J0670761j9730095M215057
7041C577857p830786J289185J5733261l3753746J699218J3064129J0829553J1436138
7033A6044809j4199355J8949876k6531817l6389090K2943140J1062206K4929788M888551
7025B1698108O295209J1423578k4565899L0113618L3139708K6466125K7716624l0654172
7017A01632899j7269519k6719605k1197058J577716r082522J7731381m5452745n6795438
7009e5574891N145224o845712R474814J9139433M1693410M59259o1484918J5049452
7001c2943929J6658717j1913431Q283881J0138354r57211o4902672j8264968L1578728
6993f2322531l199291K7230530K1133240J9529671K805284r748081L8720674J3901772
$$ plain form
7049 45902014 52373950 48646887 55609662 27913309 8422134 19092895 -637200 3577857
7041 3577857 -4252929 -2963744 12769517 -20984229 -19285011 -6220882 4608671 16044809
7033 16044809 1845454 20795330 -5736487 -42125577 -19182437 -8120231 16809557 21698108
7025 21698108 27993317 39416895 14850996 44964614 78104322 104570447 132287071 101632899
7017 101632899 84363380 57643775 36446717 38024433 28941911 46673292 1220547 -55574891
7009 -55574891 -50429667 -57275379 -47800565 -28661132 13032278 13491537 -47993381 -32943929
7001 -32943929 -16285212 -28198643 -19914762 -9776408 -10733619 -75636291 -93901259 -62322531
6993 -62322531 -65521822 -38291292 -17158052 2371619 5176903 -4571178 34149496 48051268
6985D8051268K4827386Q366976l3021926J759710k8829323k0697007p567552k32135
6977g342603J9470288l9080011J2365052L6345969k008007K8760683K0169560M9248649
6969A17929580P592762j6081478M1897441j3316904j0889051k1448850k2729118J4949038
6961I7903420n4540113j5783879k539121k5550724o226028m0760143M1287493J4687430
6953H478335m0471903L0590629k452697P514031j4879499J2585776O9047772l8632668
6945C1779776J0942262K8691678j2042841K8023063n556268M7151302m976472m3456630
6937H0555870K0488412n8927886n906370m181229n1573158r520521o3659518j2366272
6929a05090672l4980601k6581987P4785569l2007210j425313L0195797k084351K7011460
$$ plain form
6985 48051268 72878654 81245630 48223704 49983414 21154091 457084 -7110468 -7342603
6977 -7342603 12127685 -26952326 -14587274 21758695 19750688 48511371 68680931 117929580
6969 117929580 125522342 109440864 151338305 138021401 127132350 105683500 82954382 97903420
6961 97903420 43363307 27579428 25040307 -510417 -6736445 -47496588 -6209095 8478335
6953 8478335 -31993568 -1402939 -3855636 3658395 -11221104 1364672 70412444 31779776
6945 31779776 42722038 71413716 59370875 87393938 81837670 128988972 124012500 80555870
6937 80555870 101044282 42116396 36210026 32028797 -19544361 -29064882 -92724400 -105090672
6929 -105090672 -140071273 -166653260 -91867691 -123874901 -125300214 -95104417 -97188768 -70177308
6921g0177308j5219238P5784376J0751676q1651617K3662613l2129534k5204515j4205117
6913a28388664j965309L6693284q6728710l237529M1321258j3278860O4225246L2080919
6905e9278365N6305917N855750k9871810P2856750q8673L4849720M4464523k6809792
6897I8284020O047323n3881356Q007278K6042916n355523O8071882k6319579j7889813
6889A03007148J1335675j7742770M4363375J098462L8059179m41543r0871052k25867
6881H8582607k5965727k0185503Q88932j1949839J4598603q9566081l6817500L7407332
6873d3007176j9685180K2264664J6035613K4750083k0734173n7555556N5006454J7365670
6865e559601l29180L4588766J424777L406216m2272036Q874382M2899146j1190976
$$ plain form
6921 -70177308 -85396546 -9612170 1139506 -80512111 -56849498 -88979032 -114183547 -128388664
6913 -128388664 -130353973 -93660689 -180389399 -183626928 -142305670 -155584530 -91359284 -59278365
6905 -59278365 -2972448 2883302 -26988508 45868242 45779569 80629289 125093812 98284020
6897 98284020 104331343 50449987 58457265 84500181 79144658 147216540 120896961 103007148
6889 103007148 114342823 96600053 140963428 142061890 180121069 179679526 88808474 88582607
6881 88582607 62616880 42431377 43320309 31370470 45969073 -43597008 -80414508 -43007176
6873 -43007176 -62692356 -40427692 -24392079 358004 -20376169 -77931725 -22925271 -5559601
6865 -5559601 -5888781 28699985 30124762 33530978 -8741058 133324 43032470 31841494
6857C1841494K7547203n237416k1559310q623183k9324509J0471592q124088J752160
6849a256057j988118m9497520L860514p37364j5955771J1810479J9491522K7907791
6841f364524k4460956k163960M0256606j4094274j1757825J1531900J5045130j8671517
6833a0679420m2408712J1474186m420771l6991115n173826J5389779J4506611j4001531
6825g2304799L972013L0737150L19110Q16015J9807558K7552822R515285j6781474l323093
6816C10587n326111j8186458j0927611N31762R087831p899381j7682810l409154Q982523
6807d4518822J5329433J5847328K5858887K7972755L516234j1548994L947243J9378350
6799E5782414M658307o483121L499816n122593l2726844k9264773O981218J3018486
$$ plain form
6857 31841494 59388697 54151281 32591971 23968788 -5355721 5115871 -3008217 -1256057
6849 -1256057 -3244175 -52741695 -48881181 -49618545 -65574316 -53763837 -34272315 -6364524
6841 -6364524 -30825480 -32989440 7267166 -6827108 -18584933 -7053033 7992097 -10679420
6833 -10679420 -53088132 -41613946 -46034717 -83025832 -88199658 -72809879 -58303268 -72304799
6825 -72304799 -68332786 -37595636 -37276526 -36460511 -16652953 10899869 20415154 3633680 310587
6816 310587 -5015524 -23201982 -34129593 -33597831 -24510000 -32409381 -50092191 -53501345 -44518822
6807 -44518822 -29189389 -13342061 12516826 40489581 44005815 32456821 36404064 55782414
6799 55782414 60440721 53957600 57457416 52334823 19607979 -9656794 -2675576 10342910
6791A0342910o948686l30619J2278121k621571j7007105P653581L3285656J2027236
6783D8679523n990415K045951n07847k0736238k0756893J0080690R425199j7502680
6775D737290j4640160j476754q536843j3931830J0137867K6445338M690296k206727
6767E218477J1586588N427148k704364R120349J6877550J058481p011719K62943q799410
6758C1036043j1438898L854270l60284j2166656r96778L657855j4405304r929269J5952857
6749E203836J026240k3172297O968886K0430244j6389157j3270685K5772658R445561
6741A6015286l0064735J555558L5561547q422899k2475792J9703789R695499l2742167
6733a1173914j7154987K0548668k057879k6231029Q19130K87241j9946214o753780
$$ plain form
6791 10342910 3394224 3063605 15341726 12720155 -4286950 3366631 36652287 48679523
6783 48679523 42689108 44735059 44227212 23490974 2734081 12814771 22239970 4737290
6775 4737290 -9902870 -11379624 -19916467 -33848297 -23710430 2734908 7425204 5218477
6767 5218477 16805065 22232213 19527849 28648198 45525748 46584229 39572510 39835453 31036043
6758 31036043 19597145 23451415 23091131 10924475 9927697 13585552 -819752 -10749021 5203836
6749 5203836 6230076 -16942221 -9973335 10456909 -5932248 -19202933 6569725 16015286
6741 16015286 -14049449 -12493891 23067656 14644757 -7831035 11872754 21568253 -11173914
6733 -11173914 -28328901 -7780233 -9838112 -36069141 -35250011 -34962770 -54908984 -61662764
6725f1662764J0967247J2720454J0750426J2025235j013501k995598K1791857R738600
6717A2321956n231336J9021948J3814107k6283829k8426063J3608163J0575564k3945278
6709a4544768L492973K6051180j0096118k1656154J4676529L4281521Q070656k76757
6701C9999062J7313776M766279j3706587j3031404q59737Q640893j1185469k7808913
6693D127900j2920205J243676r370254j6139614J6467542K7679486j0897274r741432
6685i550175K5351963J7554916r876083k887783J5438890r478401l0587212q767626
6677a2801511m449566j5510023j5696636j6283600p894246j316888L5243j208280P175470
6668f7950037K1596410n007613j3470561K3574366J8120221j1497014q689873J5587530
$$ plain form
6725 -61662764 -50695517 -37975063 -27224637 -15199402 -16212903 -19208501 2583356 12321956
6717 12321956 7090620 26112568 39926675 13642846 -14783217 -1175054 9400510 -14544768
6709 -14544768 -11051795 14999385 4903267 -16752887 -2076358 32205163 40275819 39999062
6701 39999062 57312838 62079117 48372530 35341126 34481389 43122282 31936813 4127900
6693 4127900 -8792305 -7548629 -16918883 -33058497 -16590955 11088531 191257 -9550175
6685 -9550175 15801788 33356704 23480621 20592838 36031728 26553327 -4033885 -12801511
6677 -12801511 -17251077 -32761100 -48457736 -64741336 -72635582 -73952470 -73917227 -75125507 -67950037
6668 -67950037 -46353627 -51361240 -64831801 -41257435 -23137214 -34634228 -43324101 -27736571
6660b7736571n60879l3356030N433636K6679030q039415r790040R096906J2546534p509957
6651c3236786K573887K9678703N135509j356434N617877m351269J676868K163507O865631
6642A4767493m119745j0244149N778489j6692836j3483728P943734m499557j4232958
6634c4783257k0831634l96275m730015k4649605N382975M214099r483646n591393N687500
6625h5181251K5163714O454092J2928673K3676639j76037P538659J0044729J2782017
6617A3231235P238135q718725k637343k7405497k3440943O136674m390785l652527m481610
6608d8121386n9894q878347j5921062L1808469L2858265P785989J0011778J713621m761333
6599F436100j8456387N838387K4943187q767161j4259017k2861497k9486917j3152975
$$ plain form
6660 -27736571 -28297450 -61653480 -56219844 -29540814 -37580229 -47370269 -38273363 -25726829 -33236786
6651 -33236786 -30662899 -984196 4151313 2794879 8412756 4061487 5738355 7901862 14767493
6642 14767493 10647748 403599 6182088 -10510748 -23994476 -16050742 -20550299 -34783257
6634 -34783257 -55614891 -56011166 -60741181 -85390786 -80007811 -75793712 -85277358 -90868751 -85181251
6625 -85181251 -60017537 -53563445 -40634772 -16958133 -17134170 -9595511 449218 13231235
6617 13231235 20469370 11750645 9113302 -18292195 -41733138 -35596464 -39987249 -43639776 -48121386
6608 -48121386 -48181280 -57059627 -72980689 -41172220 -8313955 -527966 9483812 11197433 6436100
6599 6436100 -12020287 -6181900 18761287 9994126 -4264891 -27126388 -56613305 -69766280
6591f9766280j322281J7739218O042159p29472m672255k5970822L782557K7234516
6583d7662660J7886972R280989J705946P40357k6149040j6759645K6636551J5455233
6575a8865297k397869q682604p076662j2275399k2190207J0196335J9883684J135068
6567d0272951o650332j5320972l429889r87374J327670J7035922J2233763J0330632
6559b5733531j834544m076494J6242481J1434357P836168M625467O520396R881382
6551B4895682j2282080q257301N855666r52676r476302r333282J6651992J0144262
6543A7245961j8546947k277320Q191288k199225p629541J1229672K4089421j3927110
6535A6176199k3430401m902446r978203p08433J1750975J5898569J130418j3264474
$$ plain form
6591 -69766280 -71088561 -53349343 -47307184 -48036656 -52708911 -78679733 -74897176 -47662660
6583 -47662660 -29775688 -20494699 -18788753 -18048396 -44197436 -60957081 -34320530 -18865297
6575 -18865297 -21263166 -29945770 -37022432 -49297831 -71488038 -61291703 -41408019 -40272951
6567 -40272951 -46923283 -62244255 -65674144 -66661518 -65333848 -48297926 -36064163 -25733531
6559 -25733531 -27568075 -31644569 -15402088 -3967731 3868437 8493904 15014300 24895682
6551 24895682 12613602 4356301 10211967 9259291 -217011 -9550293 7101699 17245961
6543 17245961 -1300986 -3578306 4612982 2413757 -5215784 6013888 30103309 16176199
6535 16176199 -7254202 -12156648 -22134851 -22843284 -11092309 4806260 5936678 -7327796
6527g327796k826196q437819J5072732M4868455J3056483q306930o984733j2270226
6519B6843970k9610486j5014409L7007040K409692m8883028k6150541k2440087l3970688
6511a09808537j6059327L2828068K9269303k9807567j4376808m47484j3064097K2044903
6503i9421546M3158112L2739051j955232n854603M413623j7825746K9212720N6574742
6495D1041121P810661n886767l189031m065903k5311413J770254N1923883p868318
6487E6224487l6695442j1306485k0696744k2004864r684825L1388359J0369534l2053616
6479c4459596K956330m454162l446846K4874113K2559711J6575520j5602081j644240
6471G358749N50326k6045515J6460425R900953j8880816k0633158j6729379Q555371
$$ plain form
6527 -7327796 -10153992 -18591811 -3519079 41349376 54405859 46098929 39114196 26843970
6519 26843970 -2766516 -17780925 19226115 21635807 -27247221 -53397762 -75837849 -109808537
6511 -109808537 -125867864 -93039796 -63770493 -93578060 -107954868 -108402352 -121466449 -99421546
6503 -99421546 -56263434 -23524383 -25479615 -31334218 -26920595 -44746341 -15533621 41041121
6495 41041121 48851782 42965015 39775984 35710081 10398668 12168922 64092805 56224487
6487 56224487 19529045 8222560 -12474184 -34479048 -44163873 -12775514 -2405980 -34459596
6479 -34459596 -31503266 -35957428 -39404274 -14530161 8029550 24605070 9002989 7358749
6471 7358749 7909075 -18136440 -1676015 8224938 -10655878 -31289036 -48018415 -39463044
6463c9463044j8579928p07198L2092432p861335o473363K49468J8091213J9942875
6455b708880j0518123J9983963N620895j5441256K116875k615566J7551003k948265
6447A1040646j0980747N468228j8485467P196955O429936o934883Q850464j0700634
6439h115502p625159k1606656p293430K6445540j9723735j4864285R855832j872887
6431d4800282r726582r070989M3110519K0809411k5992742J7569789J9410848p53564
6423A0556408p817184R978636K4823942k8503651k0798630N188949j4320117m389284
6415b5280931j0233377k718538q20999j0957567Q008893m507961J2829923K2831809
6407a0848748j6145036J57389J7233342J0741418o352486q128281K7535000q348707
$$ plain form
6463 -39463044 -58042972 -58750170 -26657738 -34519073 -40992436 -40742968 -22651755 -2708880
6455 -2708880 -13227003 6756960 12377855 -3063401 -946526 -3562092 13988911 11040646
6447 11040646 59899 5528127 -12957340 -5760385 669551 -6265332 2585132 -8115502
6439 -8115502 -15740661 -37347317 -44640747 -18195207 -37918942 -52783227 -42927395 -44800282
6431 -44800282 -54526864 -63597853 -20487334 322077 -25670665 -8100876 11309972 10556408
6423 10556408 2739224 12717860 37541802 9038151 -11760479 -6571530 -20891647 -25280931
6415 -25280931 -35514308 -38232846 -39053845 -50011412 -42002519 -46510480 -33680557 -10848748
6407 -10848748 -26993784 -26836395 -9603053 1138365 -5214121 -13342402 14192598 5843891
6399E843891l0640397J5442574J9920648J017779j7423408L843225J5571537k5482536
6391a1906687n380887K1555112O949540j0535401k5912898l82939j381032j3784826
6383d0780018J3584911J1665593M937710j0279885j3198449J6802252J2860523J9665198
6375A5257835J9598553q52687K572524j1886215p229888Q997762J2976053J5601924
6367E5035861k1791821k1240441J962180j4668122n950519J6180107K5861872p750897
6359B7638220l4500519Q042661O364873j2796531J4330439K2469374k165798l3129470
6351c746751j0098056O921895j6699823J1883089K2116395j2468909j8047562j123846
6343b1263568M061399j4821503J7877844M2050364j5501287k1189213J7721539O738583
$$ plain form
6399 5843891 -24796506 -9353932 10566716 11584495 -5838913 -1995688 13575849 -11906687
6391 -11906687 -17287574 4267538 11217078 681677 -25231221 -25614160 -26995192 -40780018
6383 -40780018 -27195107 -15529514 -10591804 -20871689 -34070138 -17267886 -4407363 15257835
6375 15257835 34856388 34003701 36576225 24690010 17460122 26457884 39433937 55035861
6367 55035861 33244040 12003599 13965779 -702343 -6652862 9527245 35389117 27638220
6359 27638220 -6862299 1180362 7545235 -5251296 9079143 31548517 29382719 -3746751
6351 -3746751 -13844807 -6922912 -23622735 -11739646 10376749 -2092160 -20139722 -21263568
6343 -21263568 -17202169 -32023672 -14145828 27904536 12403249 -8785964 8935575 15674158
6335A5674158k0603890P057053M7945588l958565l5130661J3504509J0426053j8636163
6327A6278082l7106L1418903Q202883k4503384J965048o74286j6884169J1042554J4793790
6318D1602315p292223q160802P300026j5610948l2357342K1201009K5779722k4130990
6310H330767j1245888K2327778n867082m2287177P525268M2612006j1019530k4142340
6302a3766198J1389499O083585k5819697j4207217K5806746J4404388j0119225p474309
6294a3702428k826083M884330R9914K9342J6613169J8937680m260255k5714539p45695
6285f684565J8109857r525204j3128498R200237J553077k8247372k5556701Q145654
6277d6133515J0411764o088750o123311L092269P842890m346131r392735J8761714
$$ plain form
6335 15674158 -4929732 2127321 50072909 46114344 10983683 24488192 34914245 16278082
6327 16278082 16240976 47659879 55862762 31359378 33324426 32650140 15765971 26808525 41602315
6318 41602315 34310092 26149290 33449316 17838368 -14518974 6682035 32461757 8330767
6310 8330767 -2915121 19412657 13545575 -28741602 -21216334 21395672 10376142 -13766198
6302 -13766198 -2376699 3706886 -22112811 -36320028 -10513282 3891106 -6228119 -13702428
6294 -13702428 -16528511 -11644181 -11544267 -11514925 5098244 24035924 19775669 -5938870 -6684565
6285 -6684565 11425292 1900088 -11228410 -2028173 -475096 -28722468 -54279169 -46133515
6277 -46133515 -35721751 -41810501 -47933812 -44841543 -36998653 -41344784 -50737519 -31975805
6269c1975805L1456873l007668k1989918J2113857K3593436j8969809j4726320L4803023
6261A1297669J1989257l6860716p796182L0212317K239816k1153428J5678088J9937910
6253B5544731k2086041j0994536J2681829L147047j708795J227846m105328j5818542
6245a2111789M686649J2672830j2579771J5093027K6830393j4078496j9380501J5657416
6237A6789758K8868649j7025492j1044711K9116108j9957027m4881994q441941J3272301
6229a3304349o036501k9513274Q479980j412320l3637301K647867J7494192K2308597
6221c2973109J0427668M619666J3917283j6825125N942903K1429977J244714J3161551
6213B0945528m797980j0560647k6530030k1438096K7004737m389927r333418J0462424
$$ plain form
6269 -31975805 -518932 -3526600 -25516518 -13402661 10190775 -8779034 -23505354 11297669
6261 11297669 23286926 -13573790 -21369972 8842345 11082161 -10071267 5606821 25544731
6253 25544731 3458690 -7535846 5145983 8293030 6584235 7812081 3706753 -12111789
6245 -12111789 -7425140 5247690 -7332081 7760946 34591339 20512843 1132342 16789758
6237 16789758 45658407 28632915 17588204 46704312 26747285 -18134709 -26576650 -13304349
6229 -13304349 -19340850 -48854124 -40374144 -41786464 -75423765 -72775898 -55281706 -32973109
6221 -32973109 -22545441 -17925775 -4008492 -20833617 -14890714 6539263 7783977 20945528
6213 20945528 16147548 5586901 -20943129 -42381225 -15376488 -19766415 -29099833 -18637409
6205a8637409q755293j6913344k6223399K7204231K9882143k0694498J3934629O382483
6197a3820457j7813422j2858464R889302M0366540p075650L125410K0572344l1095820
6189h710217m130129J6271342J1349740q171m059138J7934227m2849193l1685220L5239103
6180a0647656m504571j4177710R426222K0499671j6822340l9543410M1316015K6960909
6172A2507130j6934462K2219164J8034959m369883k4007806K771115K4749053j3537026
6164B1432244J0585113P852974k2370416J535730l443877k124249N285384J7247103
6156C6000006J7703987k8704850m819984J6159709k3704418j3186241P669938J0492821
6148A7610968j9809975l7504166N594613k108856k0284066N085389J9237235K3403726
$$ plain form
6205 -18637409 -27392702 -44306046 -70529445 -43325214 -13443071 -34137569 -20202940 -13820457
6197 -13820457 -31633879 -44492343 -34603041 5763499 -1312151 1813259 22385603 -8710217
6189 -8710217 -12840346 3430996 14780736 14772565 10713427 28647654 -14201539 -45886759 -10647656
6180 -10647656 -15152227 -29329937 -19903715 595956 -16226384 -55769794 -14453779 12507130
6172 12507130 -4427332 17791832 35826791 31456908 7449102 10220217 34969270 21432244
6164 21432244 32017357 39870331 17499915 19035645 15591768 13467519 18752903 36000006
6156 36000006 53703993 24999143 20179159 36338868 12634450 -551791 7118147 17610968
6148 17610968 -2199007 -39703173 -34108560 -36217416 -56501482 -51416093 -32178858 -8775132
6140h775132j0919920j2273644L0362824J1379999o7697J8048231K6494800R847838
6132F4097299l2467107o326701J3661864j7510591K892562O632235n743114j1327686
6124A3908761k3367394l437077n109091J6690316K5811770k2238104R268654J6880836
6116B8408671k4133144l693244K9792979M0900187k1639213j8597765L9366965k8794567
6108D1610869l3546687K5970924J9765502j1227764l5220764Q677315j5375872m7019466
6100d6365943K4298801N777958j0051844P903643j1775431r910622j7994428K6623546
6092c1494320J8278774k2131987L8141766K446725l6588363K874596J4445348J5836163
6084A808702j6849887J8872041K3556313m3827050O183328J7446297m062440J6044006
$$ plain form
6140 -8775132 -19695052 -31968696 -1605872 9774127 9706430 27754661 54249461 64097299
6132 64097299 31630192 25303491 38965355 21454764 24347326 30979561 25236447 13908761
6124 13908761 -9458633 -12895710 -18004801 -1314485 24497285 2259181 11527835 28408671
6116 28408671 4275527 582283 30375262 71275449 49636236 31038471 70405436 41610869
6108 41610869 8064182 34035106 53800608 42572844 7352080 16029395 653523 -46365943
6100 -46365943 -22067142 -16289184 -26341028 -18437385 -30212816 -40123438 -58117866 -31494320
6092 -31494320 -13215546 -35347533 2794233 5240958 -31347405 -28472809 -14027461 1808702
6084 1808702 -15041185 3830856 27387169 -16439881 -10256553 7189744 3127304 19171310
6076A9171310Q095013J1231409k3592819o641422J5960102l1132611J0773826J6293470
6068B0158278k5490513j4614875j3112173m41266j9893608m968860K7744146j7270696
6060d7889567k336322R486137j4438955R459986J3584204J1694821K643316J1499079
6052f297301K2685647k3403561R93919L7536569o614870q838333J9659568J5219242
6044E0940880j7524050j8286986K2195558M94851j7798925J4573617L056503o337028
6036C1314420P02915j2287334k961788R510931Q749060r796753j0168670K3937076
6028C8999857k2248239m6514380K1823540J2524453k6570990j5151693J6261201R81801
6020a9894450n0217742R325039L9447429p253212J6476481J3069874N277703K656330
$$ plain form
6076 19171310 27266323 38497732 14904913 8263491 24223593 -6909018 3864808 20158278
6068 20158278 -5332235 -19947110 -33059283 -33500549 -53394157 -58363017 -30618871 -47889567
6060 -47889567 -50225889 -40739752 -55178707 -45718721 -32134517 -20439696 -17796380 -6297301
6052 -6297301 16388346 -7015215 -6021296 31515273 24900403 16062070 35721638 50940880
6044 50940880 33416830 15129844 37325402 37820253 20021328 34594945 37651448 31314420
6036 31314420 32017335 19730001 16768213 26279144 35028204 25231451 15062781 38999857
6028 38999857 16751618 -29762762 -7939222 4585231 -21985759 -37137452 -20876251 -19894450
6020 -19894450 -70112192 -60787153 -21339724 -28592936 -12116455 953419 6231122 8887452
6012H887452o705601K0201183M875358K4964434N633028n1436595J2071518K370253
6004B0861030l5802108J933527K7135788K1060048n2577868o677774M9072188l0386305
5996e381474O260768M5249135K0542875n426178k4250212K7750781p192870j0258243
5988D7294582L6694519j7218293K162114m603704l6617018p194696n841541J7389304
5980C2065267k2847513j6767106L2473244m6159147k8420172K2547231M733990K367317
5972b0006889l816534L4590127l744261l0785859L3814460N089950P183104L1318609
5964E3642707M296256l078286k1373269o315456j4666286j5760327L2410379j0526627
5956A8629091l1091773j597360k6401354k7447178J1302769L8030671Q486498j3975422
$$ plain form
6012 8887452 2181851 22383034 27258392 52222826 57855854 6419259 18490777 20861030
6004 20861030 -14941078 -13007551 14128237 35188285 -17389583 -24067357 25004831 -5381474
5996 -5381474 879294 46128429 66671304 61245126 36994914 64745695 57552825 47294582
5988 47294582 83989101 66770808 68932922 64329218 27712200 20517504 14675963 32065267
5980 32065267 9217754 -7549352 24923892 -21235255 -49655427 -27108196 -22374206 -20006889
5972 -20006889 -23823423 10766704 7022443 -23763416 10051044 15140994 22324098 53642707
5964 53642707 57938963 54860677 33487408 27171952 12505666 -3254661 29155718 18629091
5956 18629091 -12462682 -14060042 -40461396 -67908574 -56605805 -18575134 -10088636 -24064058
5948b4064058J7564554j6895603m2741990L5259015M7658943j0054636j471404J2703608
5940A7958429l1295855n1986278K0795678N8556162j4399738l849042K1443025m7887280
5932c0664899l4068301J7338352L3522056J4792405n221419J0157113n7837324l3242827
5924h5224844M7354694q595869J9198757M0164680j0446137m5567629l5195074P3003292
5916e308130Q803910k4631175P9123027j1106094n4338702k4780003K8588502N0174119
5908D6525454m5449411L6717616J7696309p2034716M057503j7976960L2364549J7640014
5900A9540358l4339500J8255136n7478116K030921J139074m2168350P3242851k0617582
5892d0395208k6046833N015984j1626911N7981106l9515546L6574472O2145138n7132111
$$ plain form
5948 -24064058 -6499504 -23395107 -66137097 -30878082 16780861 6726225 5254821 17958429
5940 17958429 -13337426 -65323704 -44528026 14028136 -371602 -4220644 17222381 -30664899
5932 -30664899 -64733200 -47394848 -13872792 919613 -4301806 5855307 -51982017 -85224844
5924 -85224844 -37870150 -46466019 -27267262 12897418 2451281 -43116348 -78311422 -5308130
5916 -5308130 3495780 -21135395 57987632 46881538 -7457164 -32237167 -3648665 46525454
5908 46525454 1076043 37793659 55489968 -16544748 -12487245 -30464205 1900344 19540358
5900 19540358 -14799142 3455994 -54022122 -51991201 -50852127 -93020477 -19777626 -40395208
5892 -40395208 -66442041 -61426057 -73052968 -15071862 -54587408 -18012936 44132202 -12999909
5884a2999909K8461831j4336269K1292346K2037013o2482307M5633964l4211054k4293983
5876c0898368Q544409m9692143O4777025m1095770l5087014N1457761k6265062L6907365
5868b1351797k2380940L1247941N6795964q0828964N2481448K1311744j2099934L1968769
5860E7144231l4484914N0139173l9657489l1459398N5237329n3206225L0022230j5386990
5852A8347947l9619203K7118498n7971787K2011413j2067373j2428123N0112811o3726658
5844f8222475L2823680K2995508k5458965M8067276n624004N1657033l125875k5463069
5836B7649109O1216859m6582597m34934J1099491k5927684K2518583n4631586j088702
5828f181461m287947m3523463K9979077j6511745L7037471K4815407m1407508L9428241
$$ plain form
5884 -12999909 15461922 1125653 22417999 44455012 -18027295 27606669 -6604385 -30898368
5876 -30898368 -22353959 -72046102 -7269077 -48364847 -83451861 -31994100 -58259162 -21351797
5868 -21351797 -43732737 -12484796 44311168 -36517796 15963652 37275396 25175462 57144231
5860 57144231 22659317 72798490 33141001 1681603 56918932 3712707 33734937 18347947
5852 18347947 -21271256 5847242 -52124545 -30113132 -42180505 -54608628 -4495817 -68222475
5844 -68222475 -35398795 -12403287 -37862252 10205024 4581020 56238053 53112178 27649109
5836 27649109 88865968 42283371 41848437 52947928 27020244 49538827 -5092759 -6181461
5828 -6181461 -10469408 -53992871 -24013794 -40525539 -3488068 21327339 -20080169 19348072
5820A9348072K636609M030623J8170121J9210670N0507821o0180509k6477338L0825087
5812E8071156m0920273k679488J8581290J7998695l0741349o3591879K0549243j5397842
5804c8130447j5144995M5985246n783298k0633547k8054018k1517222k200318P824444
5796g7654155O0415512M433166l3842373L0361798n316724j9850476M7843232P2722729
5788G9112709J3166870m9380248J2514801J4140284n6921434J6005178N7894907j1768977
5780G4764090m8627820k4548569R868110k3689392l65355N7260091j228137k0902679
5772B2530339p682662j6991122O155578P620027J7661468n893796k9261680O44873
5764e216975l0100738r466140L3596127L456228K526806p907786P189277J1270855
$$ plain form
5820 19348072 21984681 26015304 44185425 63396095 113903916 53723407 27246069 58071156
5812 58071156 17150883 14471395 33052685 51051380 20310031 -43281848 -22732605 -38130447
5804 -38130447 -53275442 -7290196 -13073494 -33707041 -61761059 -83278281 -85478599 -77654155
5796 -77654155 -17238643 -12805477 -46647850 -16286052 -21602776 -41453252 6389980 79112709
5788 79112709 92279579 42899331 55414132 69554416 12632982 28638160 86533067 74764090
5780 74764090 26136270 1587701 11455811 -12233581 -12598936 44661155 43433018 22530339
5772 22530339 14847677 -2143445 4012133 11632160 29293628 23399832 -5861848 -5216975
5764 -5216975 -35317713 -44783853 -11187726 -7731498 -5204692 -13112478 -5923201 5347654
5756E347654j0809001L0066074R570977j0469863P972j8998534J2230041N7606j1687810
5747E315116R651755p292609N839881k604561J4786273L3531045j8891592J503150
5739D1838458J2935230j4495395l263936N179192R340182l8498660l4828711J5478719
5731f314921k5392802j7480645K9734370J1938055k7021800k2667955L0669863P306424
5723a9229411j5608387L6568452J5675956l3180804k2157265Q342235O697917l880049
5715b6771356K3792508J0769166k0596234N209680J7850737O496937K4957519L7076922
5707G8785879o657420l2299716L561397O344856k8484029j2118854K0595582k3378388
5699F349307n6773439n625000J8232838o140896q000664J9371925J5393093k4158747
$$ plain form
5756 5347654 -5461347 24604727 34175704 23705841 23713813 4715279 16945320 17002926 5315116
5747 5315116 14966871 7674262 13514143 10909582 25695855 59226900 40335308 41838458
5739 41838458 54773688 40278293 37014357 42193549 51533731 13035071 -21793640 -6314921
5731 -6314921 -31707723 -49188368 -19453998 -7515943 -34537743 -57205698 -26535835 -19229411
5723 -19229411 -34837798 1730654 17406610 -15774194 -37931459 -29589224 -22891307 -26771356
5715 -26771356 -2978848 7790318 -12805916 -7596236 10254501 16751438 41708957 78785879
5707 78785879 72128459 39828743 43390140 49734996 21250967 9132113 29727695 6349307
5699 6349307 -50424132 -56049132 -37816294 -43957190 -51957854 -32585929 -17192836 -41351583
5691d1351583m896300K1986451J0092716K86826j5553808m900708m127666j5010377
5683e3474449M003252O505355J6284274K295275j4417148J8867723J6985071J1933296
5675H982649O633215k511507J0508032j8298801j8989502K853186q96557m63254k6990558
5666c9173097p259543J8242399o874826L978685J5083994J9502164j55484k2898100
5658a9553808J4629050R265916j5678835j2867784j5453355k658139j6092652j3558520
5650g1968127J6610959J2947219R297825k427334J0056795L8161836J4618219K665408
5642B9962800J0528455L229064j5453980l3746540n249654J3250504j6929072k6035801
5634d0444224j1114918P063779P877310l36487L4488825M7207484K201660j8232570
$$ plain form
5691 -41351583 -46247883 -24261432 -14168716 -13881890 -29435698 -34336406 -38464072 -53474449
5683 -53474449 -49471197 -42965842 -26681568 -24386293 -38803441 -19935718 -2950647 8982649
5675 8982649 15615864 13104357 23612389 5313588 -13675914 -10822728 -11719285 -12182539 -39173097
5666 -39173097 -46432640 -28190241 -35065067 -31086382 -16002388 3499776 3344292 -19553808
5658 -19553808 -4924758 4341158 -11337677 -24205461 -39658816 -42316955 -58409607 -71968127
5650 -71968127 -55357168 -42409949 -33112124 -35539458 -25482663 12679173 27297392 29962800
5642 29962800 40491255 43720319 28266339 -5480201 -10729855 2520649 -14408423 -40444224
5634 -40444224 -51559142 -44495363 -36618053 -36954540 -2465715 44741769 46943429 28710859
5626B8710859L370536K5549955l338614l1250640N329991o966594n4299404m0333800
5618g3227711J885613K6439640m673686q562474L0031407J1745886P84861P661982
5610g914482K8294917L9590999j9970568k8864234o82535r737187k1479145l0008859
5602e0771094J6107717J4752083l1822938R520595K9830211K1975287J3305927M259466
5594B7157254L0256582Q475830j589018j711195k4398306J748966k6492734m6793764
5586c3346385J3363963K5147829k522969k3199752J7736056L3746190k8080678K3653393
5578B6497647P1544686k673496l1204469j8090478k1572475m1444840o481441M5653023
5570B2228157k6017321l5878967K8953627k5361533k0890553P8501580R2366996L504349
$$ plain form
5626 28710859 32081395 57631350 54292736 23042096 28372087 21405493 -32893911 -73227711
5618 -73227711 -71342098 -44902458 -49576144 -58138618 -28107211 -16361325 -15576464 -7914482
5610 -7914482 20380435 59971434 40000866 11136632 10454097 716910 -20762235 -50771094
5602 -50771094 -34663377 -19911294 -51734232 -42213637 -12383426 9591861 22897788 27157254
5594 27157254 57413836 65889666 64300648 62589453 38191147 39940113 13447379 -33346385
5586 -33346385 -19982422 5165407 2642438 -20557314 -2821258 30924932 2844254 26497647
5578 26497647 98042333 95368837 64164368 46073890 24501415 -16943425 -23424866 22228157
5570 22228157 -3789164 -39668131 -10714504 -36076037 -56966590 21534990 113901986 117406335
5562A17406335l9161389M3774989p827253r4133222K8810623N2434375m3693143p8879056
5554b1267741m8546369M192840m3995703K508725P1253739J3189300L6481484j8333320
5546d517045l0467437O6796631J9995929p278387l7470955J2710645J9353957j43689119
5538a04565781j2293555P3013354k8945966k2626203n955214J27707630L9508175p6679875
5530a0837435P3492616M2670412K6534112o0000922l8806089J57212316j03782361
5523H6482649k08337727l1741601M1296367o061570j64056527J49891168J63280345
5516C0753104k53928201o3709263J39290775J39157773O047589J1827745J96572077
5509B06011599j69342422j86184768N3849279j1214587J73090210N5338598j00504770
$$ plain form
5562 117406335 78244946 122019935 114192682 20059460 48870083 101304458 57611315 -21267741
5554 -21267741 -69814110 -65621270 -109616973 -107108248 -35854509 -22665209 13816275 -4517045
5546 -4517045 -34984482 31812149 51808078 44529691 7058736 19769381 39123338 -104565781
5538 -104565781 -116859336 -43845982 -72791948 -95418151 -101373365 26334265 65842440 -10837435
5530 -10837435 62655181 105325593 131859705 71858783 33052694 190265010 86482649
5523 86482649 -121855078 -153596679 -112300312 -118361882 -282418409 -132527241 30753104
5516 30753104 -223175097 -286884360 -147593585 -8435812 -2388223 9439522 206011599
5509 206011599 36669177 -149515591 -95666312 -106880899 66209311 121547909 21043139
5502B1043139j07690222p5633157J01695914j12962663K13210573M73896909k29720892
5495B83839601l03428941P9414485J65420754j34924937m6229470N79559063r5664006
5488E27986549o52683134n520932J45753788m9515337p3595672L05756404Q9490659
5481B87672325o22343754j60129462N8947301o0316994K61869688J31747998q1978720
5474a84531618k68046075l2596756J09181665o5716391O81404807N81716821k74467735
5467E46944718m1799532L20894595J97506689j28493668M73838500P78592345m84992405
5460A662491242n56736890J23807818j00822532l21087827m1734281L73813955l61474283
5453G78257202p87679682p2218731j40275752r3008188K29689212J20323242p5591399
$$ plain form
5502 21043139 -86647083 -162280240 -60584326 -173546989 39663584 513560493 283839601
5495 283839601 -19589340 59825145 225245899 90320962 44091492 623650555 527986549
5488 527986549 -124696585 -130217517 15536271 -33979066 -107574738 198181666 287672325
5481 287672325 -334671429 -494800891 -435853590 -496170584 -234300896 -102552898 -184531618
5474 -184531618 -452577693 -485174449 -375992784 -441709175 239695632 821412453 546944718
5467 546944718 505145186 826039781 1023546470 895052802 1368891302 2147483647 1662491242
5460 1662491242 1105754352 1229562170 1128739638 807651811 765917530 1139731485 778257202
5453 778257202 -9422480 -81641211 -221916963 -314925151 -85235939 35087303 -40504096
5446d0504096l01188831k4856804q9412196j555441O26190080R4124268l18449809
5439e5652829K0613603O5211082j38075021j28828328N96415130L40714678n23434933
5432A76963382o8515319J73612569j33816380j41868313K35978130L66961799l50838483
5425B58477385l15376993Q8588947j11989506K0014232J02439113J15217657Q306495
5418A65677330j81048863j7073559p8739791J22653105K41027239j45978446l9273617
5411F7243398K5163883j23681571j68987632k2563052K65934433q3114352k14534037
5404b54538930J24463137K8498526n7145531j0647017J77738012J72667516j28435194
5397E2600519N724363Q3491245p673408k1650154q4266327O4681118L963118j36086794
$$ plain form
5446 -40504096 -341692927 -366549731 -455961927 -457517368 168672712 262796980 -55652829
5439 -55652829 -35039226 30171856 -107903165 -236731493 359683637 700398315 176963382
5432 176963382 108448063 282060632 148244252 6375939 242354069 609315868 258477385
5425 258477385 -56899608 31689339 -80300167 -60285935 42153178 157370835 165677330
5418 165677330 -15371533 -32445092 -111184883 11468222 252495461 106517015 67243398
5411 67243398 92407281 -31274290 -200261922 -222824974 43109459 -40004893 -254538930
5404 -254538930 -130075793 -101577267 -158722798 -169369815 8368197 181035713 52600519
5397 52600519 58324882 141816127 134142719 112492565 28226238 92907356 96870474 -39216320
5389c9216320k2434019J1027323L2443136o6939036l5660199J40326003J0665380k2323926
5381G888342M0587710J8175648k397884o8568719J1838751L2899008l2181788q543668
5373c02600p2357813l3279774L5613201j2499496K8389813P6930370O4480491l0397214
5365E6576978m9444058Q5742594L8593653m1340824L8111971K5501400p2455635r4258557
5357a2972478m252936K8072189l3367209K0248801L8036570m2114610j1522380L6294425
5349A8422372K4352742J9632039L6693648K5038952n7677470l9533533K8296359k5271711
5341B9953398k9486678J7780961P252989k3070949k7390222L4370633L4248560r47884
5333D2710808K5974176J0659368O007960K355204k6873778n015658q457864k0661651
$$ plain form
5389 -39216320 -61650339 -50623016 -18179880 -85118916 -120779115 19546888 30212268 7888342
5381 7888342 48476052 66651700 64253816 -4314903 7523848 40422856 8241068 -302600
5373 -302600 -72660413 -105940187 -70326986 -82826482 -54436669 22493701 86974192 56576978
5365 56576978 7132920 92875514 131469167 90128343 128240314 153741714 81286079 -12972478
5357 -12972478 -17225414 10846775 -22520434 -2271633 35764937 -6349673 -17872053 18422372
5349 18422372 42775114 62407153 99100801 124139753 66462283 26928750 55225109 29953398
5341 29953398 466720 18247681 25500670 2429721 -24960501 9410132 43658692 42710808
5333 42710808 68684984 79344352 85352312 87707516 60833738 55818080 47360216 26698565
5325B6698565l1343249k3357707K6876250p957697k7143805K0346239K1939304J2813302
5317A8871202J31252K5898480L5183277k5828574l0632521j0755487j859556p227298
5309C780775l4081144j873683P164566k9253119j7485598K5170382N5207021J8749288
5301B7378488o461071L1732709J7136917k0110570o856457K0186955J1595803l7272329
5293C7330445m1877286o676645j0078542j4427395K133156K1299547K1478195j0383709
5285a202234k897605L2022854K3660164N023057n328547O87586n324896l6177453j7790225
5276g327299R94494r061658j3905615k3234187K837361J4956022p5296J2420446J2935230
5267i460502J8594136j116532j8572992K0253369R230871j6136332j6143401r151968
$$ plain form
5325 26698565 -4644684 -28002391 -1126141 -9083838 -36227643 -15881404 6057900 18871202
5317 18871202 19002454 44900934 80084211 54255637 23623116 12867629 11008073 3780775
5309 3780775 -30300369 -32174052 -25009486 -54262605 -71748203 -46577821 8629200 27378488
5301 27378488 20917417 52650126 69787043 49676473 42820016 63006971 74602774 37330445
5293 37330445 -4546841 -11223486 -21302028 -35729423 -33596267 -12296720 9181475 -1202234
5285 -1202234 -4099839 27923015 51583179 56606236 51277689 51965275 46640379 10462926 -7327299
5276 -7327299 -6332805 -15394463 -29300078 -52534265 -49696904 -34740882 -34816178 -22395732 -9460502
5267 -9460502 9133634 8017102 -10555890 9697479 18928350 2792018 -13351383 -22503351
5259b2503351O888253j8487092m002161K6574682M048729Q87729m384418J4036735
5251C059106K4903606m773134L848870p93064r378713j3703927k4047360R452772K891305
5242h540539j6951395r450339r857974J0081180N199846J369506J6648685M536200n937983
5233a2902813k3196047m747616K5522828p961630k4012146J203229O822002j9765152
5225e9037345j0288139M8704636L5918281j6185500M851223L2229231K336062o975255
5217C1553194L2866007K2999490k5645353k6542459o958137j7322774j2783847J9353573
5209A7519694k356801k6163049q70154o014799j4914007J3442431L7517528j199096
5201A6961747l9343322Q147742M87554l6878428R502198K9680898l689714l3805416
$$ plain form
5259 -22503351 -15615098 -34102190 -38104351 -11529669 -7480940 -6593211 -10977629 3059106
5251 3059106 27962712 23189578 27038448 26245384 16866671 3162744 -20884616 -11431844 -8540539
5242 -8540539 -25491934 -34942273 -44800247 -34719067 -29519221 -28149715 -11501030 -6964830 -12902813
5233 -12902813 -36098860 -40846476 -15323648 -23285278 -47297424 -46094195 -39272193 -59037345
5225 -59037345 -69325484 -20620848 15297433 -888067 3963156 36192387 38528449 31553194
5217 31553194 64419201 87418691 61773338 35230879 28272742 10949968 -1833879 17519694
5209 17519694 15162893 -11000156 -11870310 -17885109 -32799116 -19356685 18160843 16961747
5201 16961747 -22381575 -14233833 -13746279 -50624707 -41122509 -11441611 -15131325 -48936741
5193d8936741L227059K8023618j7234231K2357146M6804077k21961l929143K608830
5185C2698654J7721890n631006n951986K6167702k3645583k1223558K422962q332566
5177A4226509P142492r751928P665810N665298j6076852J6631249L559863J1177710
5169D0240151J015144l2129024O667821p072478j2352507P261828k100791K91775l4876571
5160c3054652o782022K9438802j965126K6450561J6521986j4868490p890595j0799693
5152b949229J2856945Q824594K0359496J6912741n3264674j6566195K3227891j1738998
5144b337429J3226818N0638992L1419810m5607558l4421537N4611838K120818k0559265
5136D9092487N2270857J3212611o0767262o0373408N883356J2265771l5208538K5226901
$$ plain form
5193 -48936741 -45709682 -17686064 -34920295 -12563149 34240928 34018967 30089824 32698654
5185 32698654 50420544 44789538 38837552 65005254 41359671 20136113 22559075 14226509
5177 14226509 21369001 11617073 19282883 24948181 8871329 25502578 29062441 40240151
5169 40240151 41255295 9126271 15794092 8721614 -3630893 3630935 1530144 1821919 -33054652
5160 -33054652 -39836674 -10397872 -12362998 14087563 30609549 15741059 7850464 -2949229
5152 -2949229 9907716 18732310 39091806 56004547 2739873 -13826322 9401569 -2337429
5144 -2337429 10889389 61528381 92948191 47340633 12919096 67530934 69651752 49092487
5136 49092487 101363344 114575955 53808693 -6564715 -681359 11584412 -23624126 1602775
5128A602775J2687782o0674728k2625922p341073R961190K5940698K1026262J7047504
5120b375512m4628094j469882K0829391l0722907M9773364M6653381r293122j6860428
5112A1906191q320766M4345778k2076123Q710666P7163118k9681148k1940914j4057819
5104D6048983r756145O058654m5470452L3557093o794276m8862881J3857277l6516922
5096d7878669K8265009J4015853j3121441N8941455j3820631K0738419K249760j1544356
5088C7845399N9906555m8816830J1622846K4964670n2387931P071311m7916711J2563369
5080D852678p935599n3922301O1762008l8113259p798036K1087826l6186867N4691046
5072a562504j9868888K3979433L4535054l7858218N6555686m2498205Q270485O0367866
$$ plain form
5128 1602775 14290557 -46384171 -69010093 -76351166 -66389976 -40449278 -19423016 -2375512
5120 -2375512 -47003606 -48473488 -27644097 -58367004 -8593640 38059741 28766619 11906191
5112 11906191 3585425 47931203 25855080 34565746 111728864 82047716 60106802 46048983
5104 46048983 36292838 42351492 -3118960 30438133 23643857 -25219024 -11361747 -47878669
5096 -47878669 -19613660 -5597807 -18719248 40222207 26401576 47139995 49389755 37845399
5088 37845399 97751954 48935124 60557970 85522640 33134709 40206020 -7710691 4852678
5080 4852678 -3082921 -57005222 4756786 -33356473 -41154509 -20066683 -56253550 -1562504
5072 -1562504 -21431392 2548041 37083095 -775123 55780563 13282358 21552843 81920709
5064H1920709m7211170L2324894j9227467M592718o29358p0377196P6366220k8962064
5056B8797286n0921876K7078895m1139645K2915293m8034407P192809N9599539o7606265
5048f2118371L3730124N89911Q198863N0976634m7908817N5269122J756063l0830697
5040I662832K2308301l4128894N8960018l5122644n8512198M4264900n3567513m261767
5032e0396965m565825J2072203L8834070p5784335K1437071R291830k0251088N9963795
5024i399244j2166686L0733632O32891m1253750J4471745j3095153O8270925R963821
5016D8158181m6743267M9054361l3161846m3169353J2771021N1485065L8131229p3243566
5008C281825R114792J1381677q1563220J1445181M7722185K3025236k9453627k9565906
$$ plain form
5064 81920709 34709539 67034433 47806966 52399684 51770326 -18606870 57759350 28797286
5056 28797286 -22124590 4954305 -36185340 -13270047 -61304454 -54111645 5487894 -62118371
5048 -62118371 -28388247 -27798336 -19599473 31377161 -16531656 38737466 40493529 9662832
5040 9662832 31971133 -2157761 56802257 21679613 -36832585 7432315 -46135198 -50396965
5032 -50396965 -54962790 -42890587 -4056517 -79840852 -58403781 -49111951 -69363039 -9399244
5024 -9399244 -21565930 9167702 9800593 -31453157 -16981412 -30076565 38194360 48158181
5016 48158181 1414914 50469275 17307429 -25861924 -13090903 38394162 76525391 3281825
5008 3281825 12396617 23778294 -57784926 -46339745 1382440 24407676 -5045951 -34611857
5000c4611857J1443972n1453782Q199921O3624164o21764P077078n376631l3374178
4992c5093077k8884295J7797783N4473165r888064k148871K6224686m9979996m0951871
4984f8450540L8983692M0279508m792091j38763J9345625l6505179n0787626K8970921
4976c3094453K6232576j6699403J1836493J040966l8415245k4677650J5184967K6948887
4968c1642862O26663K7216151K3273520l0932718O662747J7785594M967777K4638003
4960D2594875J0817733M777748k4750461j2314999J218447l8917769K0412109J6309777
4952B0147460l5199101k463369k833839n389691k7732134J0254898N3602714k5638123
4944a5251185M267201L0144091j5577721K141879K622949L4583853J5828946l092335
$$ plain form
5000 -34611857 -23167885 -74621667 -66421746 -2797582 -3419346 3657732 -1718899 -35093077
4992 -35093077 -63977372 -46179589 8293576 -1594488 -3743359 22481327 -27498669 -68450540
4984 -68450540 -29466848 10812660 6020569 5881806 25227431 -11277748 -62065374 -33094453
4976 -33094453 -6861877 -23561280 -11724787 -10683821 -49099066 -73776716 -58591749 -31642862
4968 -31642862 -31016199 -3800048 19473472 -11459246 -4796499 12989095 17956872 42594875
4960 42594875 53412608 58190356 33439895 21124896 22343343 -16574426 3837683 20147460
4952 20147460 -15051641 -17515010 -20348849 -25738540 -53470674 -43215776 10386938 -15251185
4944 -15251185 -10983984 19160107 3582386 5724265 8347214 42931067 58760013 55667678
4936E5667678K6505169k9650656J880267J7604711k8898247J9889101J5992415j0890110
4928F8100328m1988570k1909677L4516757m2888736j5300663N5515638p579446k9590783
4920a125152j2730590L0570929P731987k0917182M9323729J2221832k3348935j946673
4912C9779945k0706568K979459J006761m606681r020009k0736264P914821l5617004
4904c9005540k9408905M3344713Q082226k0406547O867243K7760312l410226l1503764
4896c7680488L5314851L5147139j9980143N401828J4739924m828925r615110q90181
4888A7608895J2551808J764166O619517K492522j6446699J4593961Q170425k3362493
4880B3992102J1371573K4232532o783972k0146460M743344J4981312l2796016j2418465
$$ plain form
4936 55667678 82172847 52522191 54402458 72007169 43108922 62998023 78990438 68100328
4928 68100328 26111758 4202081 38718838 -4169898 -19470561 36045077 28465631 -1125152
4920 -1125152 -13855742 16715187 24447174 3529992 52853721 65075553 41726618 39779945
4912 39779945 19073377 22052836 23059597 18452916 9432907 -11303357 -3388536 -39005540
4904 -39005540 -68414445 -25069732 -16987506 -37394053 -30526810 -2766498 -6176724 -37680488
4896 -37680488 -2365637 32781502 12801359 18203187 32943111 28114186 18499076 17608895
4888 17608895 30160703 31924869 38544386 41036908 24590209 39184170 47354595 23992102
4880 23992102 35363675 59596207 52812235 32665775 37409119 52390431 19594415 7175950
4872G175950K6938217j5137755j5251447j844245j1349773j4407790j6519287J0525355
4864b9870775p574871o091886K0515381k5810733p597722J8793167j480277R520275
4856b9597441J2067646K8675767n970384j8869168L1621125q970501q36174K9101916
4848C7222786l914881n019103j5176782K172947j2931620j7998023M4396028r208969
4840A9542383k6450940J7318489j1045512j6959894j1066740L2036709J2913119m0814378
4832b4526764J6350859q467579l5978369R703192P912158J2005142o522567N864066O78656
4823b2981206l4553129L4704475K5410052j2695755L2769891K2105037j1110211l0724479
4815B924675K1531641M2456245l2608770Q550242L4943570k9116638l4886030n264231
$$ plain form
4872 7175950 34114167 18976412 3724965 1880720 -9469053 -23876843 -40396130 -29870775
4864 -29870775 -37445646 -43537532 -23022151 -48832884 -56430606 -37637439 -39117716 -29597441
4856 -29597441 -17529795 11145972 5175588 -13693580 17927545 8957044 8120870 37222786
4848 37222786 33307905 28288802 13112020 15284967 2353347 -15644676 28751352 19542383
4840 19542383 -6908557 10409932 -635580 -17595474 -28662214 3374495 16287614 -24526764
4832 -24526764 -8175905 -16643484 -52621853 -42918661 -35006503 -23001361 -29523928 -23659862 -22981206
4823 -22981206 -57534335 -22829860 2580192 -10115563 22654328 44759365 33649154 2924675
4815 2924675 24456316 66912561 34303791 42854033 77797603 48680965 13794935 8530704
4807H530704K4109088q858428j6739603K4307475j7637397k4180356N13090k617403
4799a2572830J9566897J4230151Q565537k213827o534522J8952398q800324j473309
4791B9720171L6994255L801063k1134885j9146598j715756n528322l3595589K296262
4783h309399J6150599j9677388k3626125j4494732J3235803M242401j4046633K9744347
4775a6781127K7611778n495534r792569P145383K7827788r563922k766175L3802952
4767E1988574o897126j7764497o945023r20225M666088m605346K2284560J327579j3807275
4758B9327309J6620996j9479781j1582272K3658673J1695332j0149540k5449918J5469170
4750C0109969j4928381n3486813K5440384K5789781j7051007j4103663Q593301J1385778
$$ plain form
4807 8530704 32639792 23781364 7041761 31349236 13711839 -10468517 -9955427 -12572830
4799 -12572830 6994067 21224218 29789755 27575928 21041406 39993804 31193480 29720171
4791 29720171 66714426 70515489 49380604 30234006 28518250 22989928 -10605661 -8309399
4783 -8309399 7841200 -11836188 -35462313 -49957045 -36721242 -32478841 -46525474 -16781127
4775 -16781127 10830651 5335117 -4457452 2687931 30515719 20951797 18185622 51988574
4767 51988574 45091448 27326951 20381928 19461703 24127791 19522445 41807005 43134584 29327309
4758 29327309 45948305 26468524 14886252 38544925 50240257 40090717 14640799 30109969
4750 30109969 15181588 -38305225 -12864841 12924940 -4126067 -18229730 -9636429 1749349
4742A749349l8453421J3723204N1032690r701347K334109N530350q574458j6234389
4734A406087m853440L4074118j0798136q541575J5493202l6027636k0295500O981888
4726b2560992J7318291R66038j8320101K1203575j9968368l9229087J5970318J6704278
4718b7916048J1616199q900909M559011J1004420k9664835R582912K8633691J3874419
4710A2788860J2136152q970386J402633j7146675j3406910J8313774q891773n524803
4702i299128o293533k3104662k2538448j5127691K6667262P278090j5483117K4538446
4694c3362781J1947701j4137011j234012M0155176L4235120k2996889M763623K6015160
4686D5386087k0505572k1716804J4198942K1737587j8788044k1201431J1347674r556986
$$ plain form
4742 1749349 -36704072 -22980868 28051822 18350475 20684584 26214934 17640476 1406087
4734 1406087 -3447353 30626765 19828629 11287054 26780256 -9247380 -29542880 -22560992
4726 -22560992 -5242701 -4276663 -22596764 -1393189 -21361557 -60590644 -44620326 -27916048
4718 -27916048 -16299849 -25200758 -20641747 -9637327 -39302162 -29719250 -1085559 12788860
4710 12788860 24925012 15954626 17357259 210584 -13196326 5117448 -3774325 -9299128
4702 -9299128 -15592661 -38697323 -61235771 -76363462 -49696200 -42418110 -57901227 -33362781
4694 -33362781 -21415080 -35552091 -36786103 3369073 37604193 14607304 19370927 45386087
4686 45386087 24880515 3163711 17362653 39100240 20312196 -889235 10458439 901453
4678I01453j0966066J3236809O830138q9646K291702l10043j3712600M167307K6791103
4669B9140157j1137998k1451110J7881983O668782l0344138m115044L8081676J909842
4661B6634150l6612508M918451K4468693j6743500j8754427J8891994J2147300k6027612
4653a1077459k5766208L167642N172834q098853o524519K229128O626348r510169j5914851
4644e9696107J6302225L1069034N240385r948920R794272J4995872j4808344o309202
4636a3360785K5379402J3200167j2861546j8150881l294571o5068o187543K17440N701290
4627i422095J2933057p482298l0232183L088048K6969484M1968j5239806J9073101
4619b70724K2018485l6854337k3028690L7132222J6212307k1544916L263993K9200064
$$ plain form
4678 901453 -10064613 3172196 10002334 9912688 12204390 11894347 -1818253 2349054 29140157
4669 29140157 18002159 -3448951 14433032 21101814 -9242324 -13357368 24724308 26634150
4661 26634150 -9978358 -5059907 19408786 2665286 -16089141 2802853 14950153 -11077459
4653 -11077459 -36843667 -33676025 -28503191 -36602044 -43126563 -40897435 -34271087 -43781256 -59696107
4644 -59696107 -43393882 -12324848 -7084463 -17033383 -7239111 7756761 -7051583 -13360785
4636 -13360785 12018617 25218784 12357238 -5793643 -9088214 -9153282 -15340825 -15123385 -9422095
4627 -9422095 3510962 -3971336 -34203519 -31115471 -4145987 -4104019 -19343825 -270724
4619 -270724 21747761 -15106576 -38135266 -1003044 15209263 -6335653 -3071660 26128404
4611B6128404j6110045l1023304K3885481K1912263n183330O831677J2164485r392855
4603B9212776j5525369J3849261N113823n249544K5845876L917126l0323131p867135
4595A8973683J8887281l474930j9756742L0706024K0371896m2655536j8501624J9033359
4587B3583411o41986k1101837J4142201K6252167l3770464k8415166J0263558l855053
4579a3543169l978801J4792451J8001698j6121090j9464693J3689841o047995J518068
4571a1153690L4120707J2695852j7072705j8712421R374469k214282j5425731L0230498
4563B1842697J9049592k0564260k0153058r64198J4003839k462363J6284125K9688212
4555E6724586o782201j2146925r920473L382064J4915736J431062N657658j2569468
$$ plain form
4611 26128404 10018359 -21004945 2880536 24792799 19609469 26441146 38605631 29212776
4603 29212776 13687407 27536668 32650491 27400947 53246823 57163949 26840818 18973683
4595 18973683 37860964 34386034 14629292 45335316 65707212 23051676 4550052 23583411
4587 23583411 22941425 1839588 15981789 42233956 8463492 -19951674 -9688116 -13543169
4579 -13543169 -17521970 -2729519 15272179 -848911 -20313604 -6623763 -12671758 -11153690
4571 -11153690 22967017 35662869 18590164 -122257 9252212 7037930 -8387801 21842697
4563 21842697 40892289 20328029 174971 -789227 13214612 10752249 27036374 56724586
4555 56724586 49942385 37795460 27874987 31257051 46172787 47603849 53261507 40692039
4547D0692039k0556904j2946904k2082113N679916J2323737k808694r787898j8790527
4539b8277348P816016K726203o079928K3146885J6282898r07850k0732813l779463
4531i805400K7830437q792960r044679J7783442N096089j5673550k2738706K3853785
4523H508458J9356544k5637588K408387J0632296o689569j6893653o773643J8656872
4515C568104j6615457j9329637K657195j1206002O289819J146541j481966Q904571K129571
4506b3937261J4886248m233303J3806415L7931865j4298140j3246913Q659980N478293
4498B5047184j3277731k3474267K4216971o900504m8441238k118173P950078J851040
4490c5146640j2071288O257409K5385263k3659727l662353K1417744P992218J4039501
$$ plain form
4547 40692039 20135135 7188231 -14893882 -9213966 3109771 301077 -9486821 -28277348
4539 -28277348 -20461332 -17735129 -23815057 -668172 15614726 14706876 -6025937 -9805400
4531 -9805400 18025037 9232077 187398 17970840 23066929 7393379 -15345327 8508458
4523 8508458 27865002 2227414 4635801 15268097 8578528 -8315125 -15088768 3568104
4515 3568104 -13047353 -32376990 -29719795 -40925797 -34635978 -33489437 -34971403 -26066832 -23937261
4506 -23937261 -9051013 -13284316 522099 38453964 24155824 10908911 19568891 25047184
4498 25047184 11769453 -11704814 12512157 5611653 -42829585 -44947758 -36997680 -35146640
4490 -35146640 -47217928 -40960519 -15575256 -39234983 -42897336 -21479592 -13487374 552127
4482E52127n996548N866595j438683j2124203J7587202k284897Q600336J0487875j6368271
4473D881533Q33691k642251J4903448L591101k1387826J0494436j3097055k2810479
4465b5233402m216405K529329J2224929k9955278j1810378J7688851j0554305R288217
4457d0038442J9712286K2207303n48737k1531323K2609450O275608q01973K1254642
4449B9138814p557079j9302461k7872001n358687M512936r583555L0029881J416462
4441d575690l5932852j137599J6629452K0761700J0750758L6965024K7336583m4575852
4433B6221524j3824031K5521777R129170P016441J1477989O421951m6782605m1839882
4425a6657666J2086648k494364M045414R920975k4148813m4504423l5257408K671825
$$ plain form
4482 552127 -5444421 422174 -1016509 -13140712 4446490 2161593 10761929 21249804 4881533
4473 4881533 5715224 3072973 17976421 21567522 179696 10674132 -2422923 -25233402
4465 -25233402 -29449807 -26920478 -14695549 -44650827 -56461205 -38772354 -49326659 -40038442
4457 -40038442 -20326156 1881147 1332410 -20198913 2410537 8686145 7884172 29138814
4449 29138814 21581735 2279274 -25592727 -30951414 -26438478 -36022033 -5992152 -4575690
4441 -4575690 -40508542 -41646141 -25016689 -4254989 6495769 43460793 70797376 26221524
4433 26221524 12397493 37919270 47048440 54064881 65542870 71964821 25182216 -16657666
4425 -16657666 -4571018 -7065382 -3019968 6901007 -17247806 -61752229 -97009637 -94337812
4417i4337812l727485L920329L2954960j9743266m3769184r51092K5614285K0073717
4409g9965548K0095909N2253625J5686575l6371323M112328L0498079J7779679J1701304
4401C5790628J5292202Q22739l9982449k4144397M461506O45031J3118237M498388
4393A0501885j3590917j4386169m960606P487792K295105K0767128K3391808j7021080
4385A4484946j5236943N450412M291411p204819k304845J9947999k625790j9117089
4377b314718M971474J0359677L603419n030729N876563J6759358m584205n148305j897027
4368B2595507n873342q856675j7850390J21919M585840q424294j1121817j9543930p271853
4359e1639035j834851j789885J3114900Q750289K437972j7575505j8843299J5459830
$$ plain form
4417 -94337812 -98065297 -94144968 -61190008 -80933274 -124702458 -125653550 -100039265 -79965548
4409 -79965548 -59869639 -7616014 8070561 -28300762 -24188434 6309645 24089324 35790628
4401 35790628 51082830 51905569 11923120 -12221277 -7759771 -7114740 6003497 10501885
4393 10501885 -3089032 -17475201 -22435807 -14948015 -12652910 8114218 31506026 14484946
4385 14484946 -751997 4698415 8989826 1785007 -519838 19428161 16802371 -2314718
4377 -2314718 2656756 13016433 16619852 11589123 17465686 34225044 29640839 24492534 22595507
4368 22595507 16722165 7865490 -9984900 -9862981 -5277141 -13701435 -24823252 -44367182 -51639035
4359 -51639035 -53473886 -55263771 -42148871 -33398582 -30960610 -48536115 -67379414 -51919584
4351e1919584J3498806P502506J0675535O893168r084806l0856661N493885K8753565
4343a9043586M693454J596072m466284j4632716k9258499j5601067K1149471P577084
4335d7986071O25876k849175k0705867o773610N632815K4268737K5680109J7403686
4327d703500J7795782j8038698j1848267J8279543R559296L608518n388069l270104
4319E994501k6131304m0870249N157980Q983658k289688K883571J517619M437127r337956
4310d9654741J5228694L1664717P887947J3188883J004236r544306p488114p718523
4302e431207L660000j8841018j6797909n085150k6809956j4254811l51690O424544l627306
4293h1114503j3298620J8419909P480900m403309J7478569J6262879Q268154p779848
$$ plain form
4351 -51919584 -38420778 -30918272 -20242737 -13349569 -22434375 -53291036 -47797151 -19043586
4343 -19043586 -14350132 -12754060 -17220344 -31853060 -61111559 -76712626 -55563155 -47986071
4335 -47986071 -47360195 -50209370 -70915237 -77688847 -72056032 -47787295 -22107186 -4703500
4327 -4703500 13092282 -4946416 -16794683 1484860 11044156 14652674 9264605 5994501
4319 5994501 -20136803 -61007052 -55849072 -46865414 -49155102 -46271531 -44753912 -40316785 -49654741
4310 -49654741 -34426047 -2761330 5126617 18315500 19319736 9775430 2287316 -5431207
4302 -5431207 -1771207 -20612225 -37410134 -42495284 -69305240 -83560051 -83911741 -77487197 -81114503
4293 -81114503 -94413123 -75993214 -68512314 -72915623 -55437054 -39174175 -30906021 -38685869
4285c8685869Q384082K1013177l147817R805132R777658m322180p93447j323907O162777
4276F869606k725139K058751K401344k8001079r491161Q389525j0330596j2969033N095075
4267c8702707J2611106k3528735j7217494K9628893Q973048j6149152M344663J5768138
4259b4272240j1025794k7990364O701630J0001585k0521791j2783064k822798l653976
4251h6366812l175167J761432J1718406J3603576J5754980N887123M834391L0600492
4243e381579J9739658j0440090J319432J5133545q974643k7604924L036159J6539639
4235C367197k2466523k4997333R069716R621180l712588O821822K7065969J8276879
4227B3046319m213142q87018J2990256J8295148M092020j3804350J117468l77219l1157867
$$ plain form
4285 -38685869 -30301787 -9288610 -12436427 -2631295 7146363 2824183 2030736 706829 6869606
4276 6869606 4144467 6203218 8604562 -19396517 -28887678 -20498153 -30828749 -43797782 -38702707
4267 -38702707 -26091601 -49620336 -66837830 -37208937 -28235889 -44385041 -40040378 -24272240
4259 -24272240 -35298034 -63288398 -56586768 -46585183 -67106974 -79890038 -82712836 -86366812
4251 -86366812 -89541979 -87780547 -76062141 -62458565 -46703585 -40816462 -35982071 -5381579
4243 -5381579 14358079 3917989 5237421 20370966 11396323 -16208601 -13172442 3367197
4235 3367197 -19099326 -44096659 -35026943 -25405763 -29118351 -22296529 4769440 23046319
4227 23046319 18833177 17946159 30936415 49231563 53323583 39519233 40636701 40259482 9101615
4218I101615k4317611J4928907J6518336k2577008j3090660K3122010m271342k0050871
4210b0636624K0585524L3405021k684102j8940336M733147l572722k2874119j491328
4202a1475539L531470j0574972j1121048j4676880j6674924k030939J6929825K095108
4194d3997899o787623K3406729R998044k2355451P095985L5959136J125556k2548499
4186a8104022J7162542J8922949l1096530j3037199K9807555Q66250k8305664M813191
4178a8970928K0952914j5928295j4916972K0567358N327681j7702825L734468J5585799
4170a350800j261390j415771J1968574L761477n230662R727604J1781835J920553Q840385
4161C8741805N438611j2678600j0556312K444727k321112j2151146M53912K51046k5659247
$$ plain form
4218 9101615 -15215996 -287089 16231247 -6345761 -19436421 3685589 -585753 -20636624
4210 -20636624 -51100 33353921 30669819 11729483 16462630 12889908 -9984211 -11475539
4202 -11475539 -7944069 -18519041 -29640089 -44316969 -60991893 -63022832 -46093007 -43997899
4194 -43997899 -50785522 -27378793 -17380749 -39736200 -32640215 3318921 4444477 -18104022
4186 -18104022 -941480 17981469 -13115061 -26152260 3655295 4521545 -23784119 -18970928
4178 -18970928 1981986 -13946309 -28863281 -8295923 -2968242 -20671067 -16936599 -1350800
4170 -1350800 -2612190 -4027961 7940613 11702090 6471428 16199032 27980867 29901420 38741805
4161 38741805 44180416 31501816 20945504 23390231 21069119 8917973 9371885 9622931 -16036316
4152a6036316j9172887P448415P582879q18989J0313910K0466081l902862j4450907
4144h570676J4744893K4140198O321397M02906R772579k855543l1481638j6573403
4136d099287J3702893O351403j1434894l586874P374707j1222572j5370346K0793777
4128B508807L6448255J3348609K74471R515105K693325j6280397o831700J3185931N747926
4119F0610332k0897089k6515764j8034595j8518663j5069846m658087J3030980J0490666
4111a9562066q761472m910417O230867J7765231R391435K834698K0755322J697258
4103B5440856k2833286k1947798n237215L305984k9819182j4617953J3151010j2964016
4095f5521600k1575532o773499L0627993J1908987j8702981L5024692K9633102q277141
$$ plain form
4152 -16036316 -35209203 -27760788 -20177909 -20996898 -10682988 9783093 5880231 -8570676
4144 -8570676 6174217 30314415 36635812 37038718 46811297 43955754 12474116 -4099287
4136 -4099287 9603606 15955009 4520115 933241 8307948 -2914624 -18284970 2508807
4128 2508807 38957062 52305671 52580142 62095247 64788572 48508175 41676475 54862406 60610332
4119 60610332 39713243 13197479 -4837116 -23355779 -38425625 -43083712 -30052732 -19562066
4111 -19562066 -28323538 -33233955 -27003088 -9237857 153578 2988276 23743598 25440856
4103 25440856 2607570 -19340228 -24577443 -21271459 -51090641 -65708594 -52557584 -65521600
4095 -65521600 -87097132 -93870631 -63242638 -51333651 -70036632 -35011940 -5378838 -13655979
4087a3655979j2228321P218473K2965451l3992227j0681966L0180224k0527877k3155222
4079e3877444j8585249P306872K723678j5820355M4026690J2522442m981895J1573571
4071a5111690j4181261K4618122J3278013K1114421J9916286k5091223J4339540l3765907
4063E116301k6185508M2012480M623694N150780k8860686o736284n816830o8803356
4055g9499409L7047380L5301880k1762903j4759544l2136825J4280416m0502739M014617
4047i8017127R4194544j470178Q002680K181284J0444923L2528817q377904Q9520514
4039A29007553L4779939l2579900Q918512m1541218J1178546l848178R198511M6693200
4031A61806965n7772055l329352j7018427k5660891N5683135K781358L5128467k0497294
$$ plain form
4087 -13655979 -25884300 -18665827 4299624 -29692603 -40374569 -10194345 -30722222 -53877444
4079 -53877444 -72462693 -65155821 -62432143 -78252498 -34225808 -21703366 -26685261 -15111690
4071 -15111690 -29292951 -4674829 8603184 29717605 49633891 24542668 38882208 5116301
4063 5116301 -21069207 20943273 25566967 30717747 1857061 -4879223 -10696053 -79499409
4055 -79499409 -42452029 -7150149 -28913052 -43672596 -75809421 -61529005 -102031744 -98017127
4047 -98017127 -3822583 -5292761 2709919 4891203 15336126 47864943 39487039 129007553
4039 129007553 163787492 131207592 140126104 98584886 109763432 105915254 115113765 161806965
4031 161806965 104034910 100705558 83687131 58026240 113709375 116490733 151619200 131121906
4023A31121906m1394492J2355645p2205604J4229618J4458680n3888931k8676645p4190630
4015i8190453l026068m1092736l2806295Q4562222k4537039j4528996J1029764J2831877
4007a05757724M0430584k9077545P4006006K5574104p8134842Q524920k4353827m225037
3999i3013361k7057956j8850169M0109318p5598273n529331L3622376l305706N9326462
3991i0296640J1358073M7035418J9156888m840514O6869189r709960L9719441L1962279
3983A11254174m2584511Q479484k3570298J0298364j6772026k4472391M9073309n5031098
3975A6675007l0903406J5611722j0677824N960385l6418852K9979038J398528n5175997
3967f3551399K8212077N791872J9679157O887535K892742N9882560n520406J6761862
$$ plain form
4023 131121906 89727414 102083059 29877455 44107073 58565753 4676822 -23999823 -98190453
4015 -98190453 -101216521 -142309257 -175115552 -90553330 -115090369 -129619365 -118589601 -105757724
4007 -105757724 -65327140 -94404685 -20398679 5175425 -72959417 -64434497 -88788324 -93013361
3999 -93013361 -120071317 -138921486 -98812168 -174410441 -179939772 -146317396 -149623102 -90296640
3991 -90296640 -78938567 -31903149 -12746261 -17586775 49282414 39572454 79291895 111254174
3983 111254174 68669663 77149147 53578849 63877213 47105187 22632796 71706105 16675007
3975 16675007 -14228399 1383323 -9294501 -3334116 -39752968 -9773930 -8375402 -63551399
3967 -63551399 -35339322 -29547450 -9868293 -2980758 -88016 59794544 54274138 71036000
3959G1036000L0848742J4433831K9836241l2981377J3259513J2027515m3448355j9847919
3951G5164191l1246530q34612l2140365l0929309L6035235j4447319q680073M214734
3943b864048J2660678L3384675K58043L5045154R207730k1009425o552699l9720900
3935B0409208K183613M128100j8276903j8276436l4180077k240280l5737888o171092
3927h8161755O3326315J2373675p878708r557904R677967j0182883k9534157N5153336
3919d784114J9558692l8323808k3488762j8324734M88963j6530147M0398888N7635004
3911A6629982j0666873P127867p47664J4525790L1343056J9427090M3467839q581340
3903A12525747k1586424k5507881l9364264J9760668m136769r028952N45146k5342696
$$ plain form
3959 71036000 101884742 116318573 146154814 113173437 126432950 138460465 95012110 75164191
3951 75164191 43917661 43083049 10942684 -19986625 16048610 1601291 -7078782 -2864048
3943 -2864048 9796630 43181305 43439348 78484502 87692232 66682807 60130108 20409208
3935 20409208 22592821 26720921 8444018 -9832418 -44012495 -46252775 -81990663 -88161755
3927 -88161755 -24835440 -12461765 -20340473 -29898377 -20220410 -30403293 -59937450 -4784114
3919 -4784114 14774578 -23549230 -47037992 -65362726 -64873763 -81403910 -41005022 16629982
3911 16629982 5963109 13090976 12343312 26869102 58212158 77639248 121107087 112525747
3903 112525747 90939323 65431442 26067178 45827846 41691077 32662125 33207271 7864575
3895G864575j3246103l1266523K1245962L5726183j6960406J3096483n025007j2765015
3887a329851j3251396j2586473L3003085q416794q277667R471866q403804J8714554
3879H923520q951736J0529645L4163820j520153O606405l921868J7278069m789225
3871E8318477n0512540J2418388Q701541k1903095j0526971Q158418J4681118m6152168
3863b6816832q544466N1915381R592809O237394J4436534J1904293k1931727l9932453
3855c139067K1678101J7544836m488049m027218k7241810j8700013k0661583k049174
3847d1083977L1279727L1040551K3358091k2384437k5038026J5586788M322440M177620
3839B1258777K3972072J9787906k9846014o5281626r642901K0523269o843716M165091
$$ plain form
3895 7864575 -5381528 -36648051 -15402089 20324094 3363688 16460171 11435164 -1329851
3887 -1329851 -14581247 -27167720 5835365 -2581429 -10859096 -1387230 -9791034 8923520
3879 8923520 -28216 10501429 44665249 43145096 49751501 45829633 63107702 58318477
3871 58318477 7805937 20224325 28925866 7022771 -3504200 4654218 19335336 -26816832
3863 -26816832 -35361298 16554083 26146892 32384286 46820820 58725113 36793386 -3139067
3855 -3139067 18539034 36083870 31595821 27568603 326793 -18373220 -39034803 -41083977
3847 -41083977 -9804250 21236301 44594392 22209955 -2828071 12758717 17081157 21258777
3839 21258777 45230849 65018755 35172741 -30108885 -39751786 -19228517 -26072233 -21907142
3831b1907142K5352462J061092m4762154k4164724L8019568K5895153n168108Q915329
3823C241476O802985k7580156l8293131N178025L1763130K059245l311085Q973116l824320
3814a4990715p622446N831988K4821362K2465479P871805M702260j1465132p499798
3806B4114803L207416j3686913o379677R567515K053778j6203574j0839821J6920417
3798H753944n566645j8668284K1382585K1761059o935875j2885711J752663j1259167
3790a665431l6040856j436009J8275960q015990r721482n408121j1741655j5663910
3782g1417494R463266L6328672J8344178O397541K934855j5533218j4681872K632975
3774b5531097K0217612J7311323o920023j8421667k0777165j4155885K072905J8521725
$$ plain form
3831 -21907142 3445320 4506412 -40255742 -64420466 -26400898 -505745 -5673853 3241476
3823 3241476 10044461 -17535695 -55828826 -50650801 -18887671 -16828426 -20139511 -11166395 -14990715
3814 -14990715 -22613161 -16781173 8040189 30505668 38377473 43079733 31614601 24114803
3806 24114803 27322219 13635306 7255629 16823144 18876922 2673348 -8166473 8753944
3798 8753944 3187299 -15480985 5901600 27662659 20726784 7841073 9593736 -1665431
3790 -1665431 -37706287 -39142296 -20866336 -28882326 -38603808 -44011929 -55753584 -71417494
3782 -71417494 -61954228 -25625556 -7281378 -883837 2051018 -13482200 -28164072 -25531097
3774 -25531097 -5313485 11997838 5077815 -13343852 -34121017 -48276902 -46203997 -27682272
3766b7682272L3777341J3390214k3556864j5159031K979577M04825P527412K1380526
3758A3061728R941398l3460897l5277882K215657K691790J0927386K6663708J1022905
3750G785793l660249q257685P989354J3852187K3301059L4611657j6434436k4822540
3742C4365140P268473j4648367k2822942P572906L2695958k2055718n1119170L0873520
3734B129800K1115513k5924315J3989776M0883656K101132m9230004J0130371L7493840
3726E2689769l1804155p165470J1973992j4795646k3894294p957763K8022534m175574
3718B893393M919982J9936253k8016692P610230K0293033m065532o165893l312053N924805
3709B0017526n6198791k9366033L6510366j9419024k3085372M117985J3482369j4847390
$$ plain form
3766 -27682272 6095069 19485283 -4071581 -19230612 -16251035 -15846210 -8318798 13061728
3758 13061728 23003126 -10457771 -45735653 -43519996 -40828206 -29900820 -3237112 7785793
3750 7785793 4125544 -4132141 3857213 17709400 41010459 75622116 59187680 34365140
3742 34365140 41633613 26985246 4162304 11735210 44431168 22375450 -28743720 2129800
3734 2129800 23245313 -2679002 11310774 52194430 54295562 5065558 15195929 52689769
3726 52689769 20885614 13720144 25694136 10898490 -12995804 -20953567 7068967 2893393
3718 2893393 7813375 27749628 -267064 7343166 27636199 23570667 17404774 14092721 20017526
3709 20017526 -36181265 -65547298 -29036932 -48455956 -71541328 -67423343 -53940974 -68788364
3701f8788364k6292885N5987808K8406576j3657131J6943507M070895K907538j9018605
3693a9440661Q740655K7462559k3207185j592968j0423245j0437250J2320588k921947
3685a9499454K6317478M015548j168048J0198472j7368629J4788287Q32840m584412L37421
3676A3869503k9258049M5758j6557640j2328286J2380622o627765J1934124j0263715
3668c6805448O293012K4357173p334758K3625131Q427628j344395J826648r171948
3660I873043J7222944j3148865L982828J9570473k1965199N753950J0484888J3699204
3652D5473266K808702l35891L6321909k1301985k2971122J4029448r124625j3522355
3644C1377347k5679032O239650j2284721m7249116O185748l68665M740931J0656780
$$ plain form
3701 -68788364 -95081249 -39093441 -10686865 -24343996 -7400489 -3329594 -422056 -19440661
3693 -19440661 -10700006 16762553 -6444632 -8037600 -18460845 -28898095 -16577507 -19499454
3685 -19499454 6818024 10833572 9665524 19863996 2495367 17283654 18116494 13532082 13869503
3676 13869503 -15388546 -15342788 -31900428 -44228714 -31848092 -38475857 -26541733 -36805448
3668 -36805448 -30512436 -6155263 -13490021 10135110 18562738 17218343 19044991 9873043
3660 9873043 27095987 13947122 17929950 37500423 15535224 21289174 31774062 45473266
3652 45473266 48281968 47946077 84267986 62966001 39994879 54024327 44899702 31377347
3644 31377347 5698315 11937965 -346756 -47595872 -41410124 -41778789 -37037858 -26381078
3636b6381078K441648K4471565p007413M499319P965328O419318L5767707j5445023
3628C2731371j2448660L900593j8719456j3787573j0698384M0057966J1633346l2499031
3620A70172J2920127k350761o908028J749383K1757757L2764779k9063080k2604212
3612H436137k2477307k6877630J0050865o359779J0683839N344288k4195639k7022661
3604g2417887k0435513M6611456L1207012k911299L2368749N50184l5474254l0298087
3596e0799639L1498962M7379167j7942869M745804K538959m3458423k6857407J6504460
3588c6390986M9489397J1682047J787907K283775m2478941j4056881J7186783K1191797
3580A0694898J8753084M939366j1467718n2891903j5720601L3139866J1220082J8578075
$$ plain form
3636 -26381078 -23939430 532135 -6475278 -1975959 5989369 12408687 48176394 32731371
3628 32731371 20282711 24183304 5463848 -8323725 -19022109 21035857 32669203 170172
3620 170172 13090299 10739538 3831510 5580893 27338650 60103429 31040349 8436137
3612 8436137 -14041170 -40918800 -30867935 -37227714 -26543875 -21199587 -45395226 -72417887
3604 -72417887 -92853400 -46241944 -15034932 -17946231 14422518 14972702 -20501552 -50799639
3596 -50799639 -19300677 28078490 10135621 14881425 17420384 -26038039 -52895446 -36390986
3588 -36390986 13098411 24780458 26568365 28852140 -13626801 -27683682 -10496899 10694898
3580 10694898 29447982 34387348 22919630 -29972273 -45692874 -12553008 -1332926 17245149
3572A7245149K4444122r22547m2920047j9789293L8565731J0399610L236289J6268317
3564D6527331j2028593m1730088l2199989K2225251J1930310K136558K6499573m532347
3556A8828006k0379655j0903086K0884559K1811965j361949K5449937n953040l4909473
3548A3467264j8013651r216533P320265j4283066N194107J0585260k5922809Q37218
3540c0031945L406805K1555348K7958085J2644705L6226263K022363N847630R787958
3532H9417212q344714K4866380O82742L190426m611863k6746995L305522l0779098p665053
3523D3314559J4652293p989527J634918l4195886k873434k738144l3700837J9756878
3515b139180P762095N434842j8672764k3798113L0332989j6302891O171691L5317531
$$ plain form
3572 17245149 41689271 40766724 -2153323 -21942616 16623115 27022725 30259014 46527331
3564 46527331 34498738 -7231350 -39431339 -17206088 -5275778 -3139220 23360353 18828006
3556 18828006 -1551649 -12454735 8429824 30241789 28879840 54329777 48376737 13467264
3548 13467264 -4546387 -13762920 -6442655 -20725721 -15531614 -4946354 -30869163 -30031945
3540 -30031945 -26625140 -5069792 22888293 35532998 71759261 73781624 79629254 89417212
3532 89417212 81072498 105938878 106621620 109812046 105200183 78453188 81758710 50979612 43314559
3523 43314559 57966852 49977325 51612243 17416357 14542923 11804779 -21896058 -2139180
3515 -2139180 5622915 11057757 -7615007 -31413120 -1080131 -17383022 -11211331 24106200
3507B4106200Q877205O318280l3983081J3034381J2178587k2737549K3708025r282661
3499B2219387j0278880k4139653l0046421J7883482j4399523J7854145J1239875k0104331
3491b9771919K0561483q730567J3299814J8452730J5851094L3086396l3922052M583793
3483C3410772J6506791k0095313P078091l479733K0622655k3008776l3599322L2262100
3475B9697265j4312943l756908P073555J894327O192187l4324908J8782699M179753
3467A5425027k1368472K0840591j3123962N28259n200349K193965J7988097k6680973
3459i397817K5572517J0324512k2221025J5461668J788011J0804294k6724565o981122
3451a373527K8978600l3571239j31891Q382339n955691o103265k4709887K8683172p29311
$$ plain form
3507 24106200 32983405 39301685 5318604 18352985 30531572 7794023 31502048 22219387
3499 22219387 11940507 -12199146 -42245567 -24362085 -38761608 -20907463 -9667588 -29771919
3491 -29771919 -9210436 -17941003 -4641189 13811541 29662635 62749031 28826979 33410772
3483 33410772 49917563 29822250 36900341 33420608 54043263 31034487 -2564835 29697265
3475 29697265 15384322 11627414 18700969 20595296 26787483 -7537425 11245274 15425027
3467 15425027 -5943445 14897146 1773184 2301443 -2898906 -704941 17283156 -9397817
3459 -9397817 16174700 26499212 4278187 19739855 21527866 32332160 5607595 -1373527
3451 -1373527 27605073 -5966166 -6098057 2284282 -3671409 -9774674 -34484561 -5801389 -6530700
3442f530700p272531K3601991j9217740L241867r467292l673203J3598395j2640529
3434a8359742J9541081k6171559k5951583J9651635r708498J2319405N841396K1654731
3426a183134R451902l9218344K8849175K5939375Q800561J8717387L077744K2035506
3418G6470172l2424363j6579116L0412844p90863R801545k0027860j0977346p234009
3410B8651004m2674852Q716138P739928Q144329q2176l3488110Q881099p452769J612224
3401a9953185K8515343J4764921L3422877j0654025r676572J8553706M991757K6283479
3393H6248301J436591J1819155J2000810l9125388j5149793j356580J1354065j314987
3385F5912174k0774799K0763529j5525772l8272985o60508J4098261J6285005j4160707
$$ plain form
3442 -6530700 -13803231 9798760 -9418980 -6177113 -15644405 -19317608 -5719213 -18359742
3434 -18359742 1181339 -24990220 -50941803 -31290168 -40998666 -28679261 -22837865 -1183134
3426 -1183134 8268768 -30949576 -2100401 23838974 32639535 51356922 54434666 76470172
3418 76470172 44045809 27466693 57879537 57088674 66890219 46862359 35885013 28651004
3410 28651004 -14023848 -5307710 2432218 10576547 10494371 -22993739 -14112640 -21565409 -19953185
3401 -19953185 8562158 23327079 56749956 46095931 36419359 54973065 59964822 86248301
3393 86248301 87684892 99504047 111504857 72379469 57229676 55873096 67227161 65912174
3385 65912174 45137375 65900904 50375132 12102147 11441639 25539900 41824905 27664198
3377B7664198N470102R652792l7663230j3758612P034467R783771R106399j72058L660679
3368B0778508k2185746j1035802J2715515J626602K4459471K8321979o429763k6734918
3360B1515846j0092237J2340906o788095O090365L9903797k317123m3597886j6661330
3352C94243J0226649R49021N832579L3152942J0421461m0298169k5928898j331320n438897
3343a2020389J5878528K3108546l871443k8622501k2283624k359215p976917K9580064
3335h566951M9661430p957197k1469343o192687l425350r351408Q347663M6302994
3327D7349151j1433182m5785677j2104060j7450196m145301R046549L0902699J8702152
3319A5082135k5623127L750902l231756M714937L9612617J0810188Q062570j3298972
$$ plain form
3377 27664198 33134300 42787092 5123862 -8634750 -1600283 8183488 17289887 17117829 20778508
3368 20778508 -1407238 -12443040 272475 1899077 26358548 54680527 48250764 21515846
3360 21515846 11423609 23764515 16976420 23066785 62970582 60653459 17055573 394243
3352 394243 10620892 11569913 17402492 50555434 60976895 20678726 -5250172 -6581492 -12020389
3343 -12020389 3858139 26966685 23095242 -5527259 -27810883 -30170098 -38147015 -8566951
3335 -8566951 41094479 33137282 11667939 5475252 2049902 -7301506 1046157 47349151
3327 47349151 35915969 -9869708 -21973768 -39423964 -43569265 -34522716 -3620017 15082135
3319 15082135 -10540992 -6790090 -10021846 -5306909 34305708 45115896 53178466 39879494
3311C9879494j6457739j6501432l1583014K7908662L421298k6587517K870518j1795323
3303b8845053L07188j1118560K1591466M0704690j7641684J3957866L344764j1626014
3295A0674663P310192j4376742J3972425j4343948j2131902Q021437l1061521J8052632
3287a3882764N235089q224173K0601133L27745K5921550j0361495P96338K7879121
3279D8292544l3234582L024382j668790r548691J998297k7879031J6828714j7037808
3271a9224965j2168923L2514647r142814K5213929Q142625J037447J2195546k5274457
3263A3293035K7599379m993684j6875658J7046828k7438604k543475k3751198l720673
3255b1384050L0498958k1822167K2941949O383182p017344R568188k2277577L1166923
$$ plain form
3311 39879494 23421755 6920323 -24662691 3245971 6667269 -19920248 -17049730 -28845053
3303 -28845053 -28537865 -39656425 -18064959 22639731 4998047 18955913 22300677 10674663
3295 10674663 17984855 3608113 17580538 3236590 -8895312 -873875 -31935396 -13882764
3287 -13882764 -8647675 -16871848 3729285 4057030 29978580 19617085 20413423 48292544
3279 48292544 15057962 18082344 16413554 6864863 8863160 -19015871 -2187157 -19224965
3271 -19224965 -31393888 1120759 -8022055 17191874 25334499 26371946 38567492 13293035
3263 13293035 40892414 35898730 19023072 36069900 8631296 6087821 -17663377 -21384050
3255 -21384050 9114908 -12707259 10234690 16617872 9600528 19168716 -3108861 28058062
3247B8058062k376872j7424460J2403052l4543361k059347j8648416o422571K8892599
3239a2121314j1040056L0273978q29753n795627L9164855j799170K5148865J3399000
3231G6400778J0943576J606960n9685031J0585246j083251l9246215K139814m365853
3223b703976M51107n0612107j2408418N1414775j9146305R091758K7173701j893408
3215A367127j7097574l1589238L0364923j804696j9788841K0185653l1947358j7414503
3207f7724507j289539M731697K6075963J2565228L8751697j1854215k3005090M5491530
3199B3742764P971165K70807K0865676J4162478k5817541o0629179K2567319K4746303
3191B7879792k5249342J9194904J7866825j6274201l3651046J2085959N2258210q78929
$$ plain form
3247 28058062 25681190 8256730 20659782 -13883579 -15942926 -34591342 -41013913 -12121314
3239 -12121314 -23161370 7112608 6282855 487228 39652083 37852913 63001778 76400778
3231 76400778 87344354 88951314 29266283 39851529 38768278 -477937 1661877 -2703976
3223 -2703976 -2252869 -52864976 -65273394 -13858619 -33004924 -23913166 3260535 1367127
3215 1367127 -15730447 -47319685 -16954762 -18759458 -38548299 -18362646 -50310004 -67724507
3207 -67724507 -69014046 -64282349 -38206386 -25641158 13110539 1256324 -21748766 23742764
3199 23742764 31713929 31984736 52850412 67012890 41195349 -19433830 3133489 27879792
3191 27879792 2630450 21825354 39692179 23417978 -10233068 1852891 54111101 53232172
3183E3232172N597042Q967415l6819949l0592593j2790836J4437199R794708q626479
3175C198679r238581l8369150j5540724J8724949J5568630L6138123K5759503q608347
3167B7633082k9046052j4940449K2279640R496165Q943304K0134195k3924309m2609624
3159b2034048j8435727J6288537K9047732J6472675K2597456J226472k7982367j0552632
3151F628098Q657827K6999680J7310816j3337880j8983680l1768923l2774809j5449464
3143e2718335J2376852L0514613q920863k0492674N710250l497997n553269J9841969
3135b2739454M4804206J2998857k9239395k38272L250630k0386858l274321K2561547
3127G736940J8901290j5576456r476672J1511362m112677K506199J4051335J5684492
$$ plain form
3183 53232172 58829214 67796629 30976680 384087 -12406749 2030450 11825158 3198679
3175 3198679 -6039902 -44409052 -59949776 -41224827 -25656197 10481926 36241429 27633082
3167 27633082 -1412970 -16353419 5926221 15422386 24365690 44499885 20575576 -22034048
3159 -22034048 -40469775 -24181238 4866494 21339169 43936625 45163097 17180730 6628098
3151 6628098 15285925 42285605 59596421 46258541 27274861 -4494062 -37268871 -52718335
3143 -52718335 -40341483 -9826870 -18747733 -39240407 -33530157 -37028154 -42581423 -22739454
3135 -22739454 22064752 35063609 5824214 5585942 8836572 -11550286 -14824607 7736940
3127 7736940 26638230 11061774 1585102 13096464 8983787 11489986 25541321 41225813
3119D1225813R044776j0546181j8048795k2119541j0559048r329418j8587142O761762
3111c2157774R905410k1846370k9913239N751660K4622158o67986J7669989M7074229
3103B0438077Q680355l5501887j3065594K9252116N145299o057309K8106056J2447935
3095D9445048l4098044l7938955J4659480K8708214L627630J9442539R173445k3054603
3087B9964754l9110759k3458456J2520273J393486k922445j6605481m0919703k0782577
3079i9920908k1401333N019339L6496258L1514779J8539739j9138577J0744652K5620455
3071a2525596j706813L2720228K9906605M896107l2075311l2570040J6840007j7609088
3063a2123901o023111K5543161j384654m402100k1782102J7957549K2360400r327774
$$ plain form
3119 41225813 50270589 39724408 21675613 -443928 -11002976 -20332394 -38919536 -32157774
3111 -32157774 -22252364 -44098734 -74011973 -68260313 -43638155 -44306141 -26636152 20438077
3103 20438077 29118432 -6383455 -19449049 9803067 14948366 8891057 36997113 49445048
3095 49445048 15347004 -22591951 -7932471 20775743 24403373 43845912 53019357 29964754
3087 29964754 -9146005 -32604461 -20084188 -18690702 -21613147 -38218628 -79138331 -99920908
3079 -99920908 -121322241 -116302902 -79806644 -48291865 -29752126 -48890703 -38146051 -12525596
3071 -12525596 -14232409 18487819 48394424 53290531 21215220 -11354820 5485187 -12123901
3063 -12123901 -18147012 7396149 6011495 1609395 -20172707 -2215158 20145242 10817468
3055A0817468K7268348J083799m637811q818284k5849997J2621548j7836770o574395
3047a1926094J2447914Q23424K8334079j1335096O962288J5655867k6984186P875260
3039B1853456K110509J1786569q643793l6060242R430171l3787963j8664005K2344375
3031b9630923M761314J4962264k1452342P478899J6807131o06020N7442877K8355392
3023G8118592K2389591J4454739j5681482K6749173L0522899N9789128L8226271p516585
3015B47052326Q344767o2394687o2981624q504201O274004L674013l8037341O545881
3007I9973138j8891111p3682887N59845J6701648m201003m7609740l6124356j11741
2999f3386207n5737225j280464N3204625M1635273L8255233J8397967P1925343P1315338
$$ plain form
3055 10817468 38085816 39169615 34531804 25713520 -136477 12485071 -5351699 -11926094
3047 -11926094 521820 1345244 29679323 18344227 25306515 40962382 13978196 21853456
3039 21853456 23963965 35750534 27106741 -8953501 476670 -33311293 -51975298 -29630923
3031 -29630923 -24869609 -9907345 -31359687 -23880788 -7073657 -7679677 49763200 78118592
3023 78118592 100508183 114962922 99281440 126030613 156553512 216342640 254568911 247052326
3015 247052326 255397093 193002406 130020782 121516581 127790585 131464598 93427257 99973138
3007 99973138 81082027 7399140 7958985 24660633 20459630 -27150110 -63274466 -63386207
2999 -63386207 -119123432 -120403896 -67199271 -25563998 12691235 31089202 103014545 174329883
2991A74329883P2019989J04258659N9560920M5077828k7257171o5657746l7708352
2984C24624010n9358535l7900635n8170302l3941133j2853234p2013048j4664854O985135
2976D2707404Q965058M321549k4134021L4342088j5494295l1834687P673584j1665276
2968A4881404J3171918m3786311j3379625L5843842k1729604J1515892Q205263M3148008
2960D7870787K2322323m5800180M8501474J1256680k8009847j32229P525495N4849817
2952A18384320l2780779J1860172O9252975j9841847K7563935K9248007N8833152M8690946
2944C11210881j0366432O4783613j1731932j3927178K2295835m2627274R505698m9369367
2936B79773844n9429367n2522510q3570316J5061502n7788001l5585257L5165975n4509650
$$ plain form
2991 174329883 246349872 350608531 410169451 455247279 427990108 362332362 324624010
2984 324624010 265265475 227364840 169194538 135253405 122400171 50387123 35722269 42707404
2976 42707404 51672462 55994011 31859990 66202078 50707783 18873096 26546680 14881404
2968 14881404 28053322 -15732989 -29112614 6731228 -14998376 -3482484 4722779 47870787
2960 47870787 70193110 24392930 72894404 84151084 56141237 56009008 63534503 118384320
2952 118384320 85603541 97463713 166716688 146874841 174438776 203686783 262519935 311210881
2944 311210881 300844449 365628062 353896130 339968952 362264787 319637513 329143211 279773844
2936 279773844 220344477 167821967 84251651 99313153 41525152 5939895 41105870 -13403780
2928a3403780k4152849k5676986M0799142K6160134p4127557L9979193l3485730r8282883
2920a62191316l4633587k3571290K3749624q0211532l3705034K8473959q4192755J0007454
2912c56274477M9400578O5301930N3015497j5561217P2393016j536814L177637R1863910
2904c8219940K4731222N3284854p795016j4494639J8110036j9866667R1204465M2951759
2896A49906074J7685187O4381201k2995853J2175346J4800763N5552633N6638290n8868041
2888B89275600J2943799l4869986r7288789k3138956j0285210J7439828p2863841n3386219
2880B7826226J7451585q2950946j7576777M4507856L1387155K183515m5900171L7206907
2872A4135350j0427425l4278780O1989358K4441484J1947883j4097997j56780L2065557
$$ plain form
2928 -13403780 -37556629 -63233615 -22434473 3725661 -70401896 -30422703 -63908433 -162191316
2920 -162191316 -196824903 -220396193 -196646569 -276858101 -310563135 -282089176 -366281931 -356274477
2912 -356274477 -306873899 -241571969 -188556472 -204117689 -131724673 -133261487 -130083850 -38219940
2904 -38219940 -13488718 39796136 32001120 17506481 35616517 15749850 106954315 149906074
2896 149906074 167591261 231972462 208976609 221151955 235952718 291505351 348143641 289275600
2888 289275600 302219399 267349413 170060624 146921668 136636458 154076286 81212445 27826226
2880 27826226 45277811 -37673135 -55249912 -10742056 20645099 22828614 -23071557 14135350
2872 14135350 3707925 -30570855 31418503 55859987 67807870 53709873 53553093 85618650
2864H5618650j7076853M5257339L4195243r615991J4796298k7699533j1821677j3931758
2856I9721718j6518077r184869o1547543j3912138j8113922n3621218n97292Q711491
2848f5061850Q803057j5965383J3892977O2969640j706859P166278M1490793J3201178
2840F4789831j4928299k0128191L2373549M170523m6605889p749998l149467j9080949
2832a0308890k0316574J7798463M6709796n055681j1990511J3135217O538130P53479
2824C7263429J162920K3074441K105987m1324337l5472659k1715105n852566J72939
2816d0584951K074544J4581047J497569j1927546m041509K6408331N0419291K6482016
2808F4908792P685389J3039771k856189k9567782j6913676K4900161J6608081k6940609
$$ plain form
2864 85618650 68541797 113799136 147994379 138378388 153174686 125475153 113653476 99721718
2856 99721718 83203641 74018772 12471229 -1440909 -19554831 -73176049 -73773341 -65061850
2848 -65061850 -56258793 -72224176 -58331199 4638441 2931582 10097860 51588653 64789831
2840 64789831 49861532 29733341 62106890 66277413 19671524 11921526 8772059 -10308890
2832 -10308890 -30625464 -12827001 33882795 28827114 16836603 29971820 36509950 37263429
2824 37263429 38426349 61500790 63606777 22282440 -13190219 -34905324 -40757890 -40584951
2816 -40584951 -38510407 -23929360 -22431791 -34359337 -38400846 -11992515 38426776 64908792
2808 64908792 72594181 85633952 82777763 53209981 36296305 61196466 77804547 50863938
2800E0863938k3247546l154828j9698841k4184108J9131038M6475758J2844215j5093357
2792D3936269M012565J1659538n934095O45670L1089726K7495571j6488149k9550590
2784F6866505m767857j545316j3748491J972772K5925528J215459l3452136j7468434
2776B4998030J518922o164508l031364J5779847Q562132j9900652j5920214k698389
2768C143804k009311J7641748K6104932R563093k70126O176669k527986j5900917J9783467
2759F1705373L0117404j7476749k1343946J587928j8648117m3861827J311553L5786412
2751B9178031k0266851k4970111K1475317j272456k8088387J3520231M8779813l123525
2743C5232062k4001301K3858145n417138l9173821L968552K2362984j5251067k9503287
$$ plain form
2800 50863938 27616392 24461564 4762723 -19421385 -290347 46185411 59029626 43936269
2792 43936269 47948834 59608372 53674277 54319947 85409673 112905244 96417095 66866505
2784 66866505 62098648 60553332 46804841 48777613 74703141 75918600 42466464 24998030
2776 24998030 26516952 20352444 17321080 33100927 41663059 21762407 5842193 3143804
2768 3143804 1134493 18776241 44881173 54444266 54174140 60350809 57822823 41921906 61705373
2759 61705373 91822777 74346028 53002082 54590010 35941893 -7919934 -6608381 29178031
2751 29178031 8911180 -16058931 5416386 4143930 -23944457 -10424226 38355587 35232062
2743 35232062 11230761 35088906 29671768 -9502053 -5533501 16829483 1578416 -27924871
2735b7924871J0341716n041249l4006398J7782179K7541611n629533L019007K0013011
2727F095473M295663j3978189K3021121K2065117k1139287L814413J0275070k3274993
2719A1174388j6203315J3325695P296872k7810659J075194K2837440k1400700o079293
2711a5784378K9012179J1332705j1669687P78109K1169808q203393j1897117J7519087
2703C2257313q10820j0998857p171911r292157k365248l005532N9911l475081K121936
2694b680446R498577j5666999K154655K9469603K497383m203044J6578914J8013378
2686E5662021j2431288j0165755K9764146L457767j9688156J1427166L610713j8300234
2678D3336380j3615674O604054Q01219j6639813R249292l36398k1939920O985246K816744
$$ plain form
2735 -27924871 -17583155 -22624404 -56630802 -38848623 -11307012 -16936545 -13917538 6095473
2727 6095473 10391136 -3587053 19434068 41499185 20359898 24174311 34449381 11174388
2719 11174388 -5028927 8296768 15593640 -12217019 -11141825 11695615 -9705085 -15784378
2711 -15784378 13227801 24560506 12890819 13668928 34838736 26635343 14738226 32257313
2703 32257313 31446493 20447636 13275725 3983568 1618320 -1387212 -1327301 -4802382 -2680446
2694 -2680446 6818131 -8848868 -6694213 22775390 25272773 21069729 37648643 55662021
2686 55662021 43230733 33064978 62829124 66286891 46598735 58025901 61636614 43336380
2678 43336380 29720706 36324760 37125979 20486166 29735458 29399060 7459140 14444386 17261130
2669A7261130r196147M520478J5972891n12049k5835334J2341033J2491424l0921038
2661c877612N107767K3816899q993905k4966015L390584K0898906k8267697o007840
2653a8898913L8956543m432509j6718619N314741J5130239j0238258j8333977K8420736
2645A9199983R56197k5501899l33621r806267j3939569j9904279j687465N111901k1285764
2636f7190783L041735m533647j4059258J1015565O287522J5566220J1327806J8848918
2628a9695922K0089628j4685968J4240336K1379980j499153N465033P328042J1237809
2620D3859785k9855640k9553140J5462341r805721j6141134L074220J1875665r934024
2612b1017648l8918812J2999206K4746948m690932J4046622K0953514Q056397k5852856
$$ plain form
2669 17261130 8064983 12585461 28558352 28046303 2210969 14552002 27043426 -3877612
2661 -3877612 1230155 25047054 16053149 -8912866 -5522282 15376624 -12891073 -18898913
2653 -18898913 20057630 15625121 -1093498 4221243 19351482 9113224 -9220753 19199983
2645 19199983 20156180 -5345719 -5679340 -15485607 -29425176 -49329455 -51016920 -45905019 -67190783
2636 -67190783 -64149048 -68682695 -82741953 -71726388 -65438866 -49872646 -38544840 -19695922
2628 -19695922 393706 -14292262 -51926 21328054 19828901 25293934 32621976 43859785
2620 43859785 14004145 -15548995 -86654 -9892375 -26033509 -22959289 -11083624 -21017648
2612 -21017648 -59936460 -46937254 -22190306 -26881238 -12834616 8118898 16175295 -9677561
2604i677561j2211658K3101428m29415K748951M729662j3927525k1229303k6897029
2596e3792450m469652K702628J1736671J4825260j9730911j0486284M239716j939020
2588e6914042P703851L0220127M0892568o537997j9449346J7513963Q698681k258780
2580A9869025J6513911L7953178N956718l5271708o316690O678216n961909j19685
2572C9301056J6024484J4390947k3041459k2882068k987525r94369Q286453P622777
2564C5720296J1262880j155013j6837182j1143578j3198538Q464299J5666885k038729
2556B6741320l891659r592215r475665k5277391j0287815L2590672J2865004o454969p4321
2547G142961L442835j3441366k4341862K9318269L5546089o598287n553548p101266
$$ plain form
2604 -9677561 -21889219 1212209 782794 3531745 8261407 -5666118 -26895421 -53792450
2596 -53792450 -58262102 -55559474 -43822803 -28997543 -48728454 -59214738 -54975022 -56914042
2588 -56914042 -49210191 -18990064 21902504 15364507 -4084839 13429124 22127805 19869025
2580 19869025 36382936 74336114 80292832 45021124 38704434 45382650 39420741 39301056
2572 39301056 55325540 69716487 46675028 23792960 20805435 19811066 28097519 35720296
2564 35720296 46983176 45828163 28990981 17847403 4648865 13113164 28780049 26741320
2556 26741320 22849661 13257446 3781781 -21495610 -31783425 807247 13672251 7217282 7142961
2547 7142961 10585796 -2855570 -27197432 2120837 37666926 31068639 25515091 18413825
2539A8413825j9252493k9473882N116856L4326960N94099k99417o804184l1457608
2531b8835844j1178182J7501852L2710402J4515200J5392628P684101m8299290k3653076
2523b4162209K9111835J7815248j311343M408896K632393n6594052n0655482K7089734
2515e1664980K1352509j096839J0030318J248338l7073351l7146602K6209509L1942185
2507c6198913J2719448K9093578j980050l5170958j1444084K8344111K5353084J5914571
2499B6630787M1471176K801576m8094051o722942L1013487Q391178l648441K3205818
2491G5048588n862248o3680694k9006273J5470565m641411j3602066P678023o905272
2483b5500788m2243382j2795348K2219883J0154988J1822036K2243916J594582j9761327
$$ plain form
2539 18413825 -838668 -30312550 -25195694 9131266 9725365 9425948 2621764 -28835844
2531 -28835844 -40014026 -22512174 10198228 24713428 40106056 47790157 -509133 -24162209
2523 -24162209 4949626 22764874 21453531 25862427 28494820 -28099232 -78754714 -51664980
2515 -51664980 -30312471 -31409310 -21378992 -20130654 -57204005 -94350607 -68141098 -36198913
2507 -36198913 -23479465 5614113 3634063 -31536895 -42980979 -14636868 10716216 26630787
2499 26630787 68101963 70903539 22809488 16086546 47100033 55491211 51842770 75048588
2491 75048588 69186340 5505646 -23500627 -8030062 -12671473 -26273539 -18595516 -25500788
2483 -25500788 -67744170 -80539518 -58319635 -48164647 -36342611 -14098695 -12504113 -32265440
2475c2265440Q728908K5905260m34984P357626J7175151j0223762k5578390J370565
2467g965066K1737374r346727r489814J1971157q451823j5532864J103580J8319741
2459B345558K331287j4303891N667303m204462o331329J1675173Q989785O189831q537796
2450C821459P1521K854459q790238J7372972J0448295j0031080j5005563j4637860k11417
2441a4107452j9401845o867514J4959727j7818464k4811655j4302325Q375401Q066685
2433f5907442o764480K9709717J6191592j0566845M902762J3874350K5763882O144341
2425A3347877Q947023J4976395j8046007l471163l047051p116821J0152500l310257
2417A2432496n872525j7424525n29770J3899948k0407214Q240031K3868855p900917
$$ plain form
2475 -32265440 -23536532 2368728 1933744 9291370 26466521 16242759 -9335631 -7965066
2467 -7965066 13772308 4425581 -5064233 6906924 -1544899 -17077763 -15974183 2345558
2459 2345558 4676845 -9627046 -3959743 -8164205 -14495534 -2820361 6169424 12359255 3821459
2450 3821459 3892980 6747439 -2042799 15330173 25778468 15747388 741825 -13896035 -14107452
2441 -14107452 -33509297 -40376811 -25417084 -43235548 -68047203 -82349528 -73974127 -65907442
2433 -65907442 -72671922 -42962205 -26770613 -37337458 -32434696 -18560346 7203536 13347877
2425 13347877 22294900 37271295 19225288 15754125 12707074 5590253 15742753 12432496
2417 12432496 6559971 -10864554 -11394324 2505624 -17901590 -9661559 14207296 6306379
2409F306379j4271731p99402K3495810j2158243k1335463K4701971l84816j8256316
2401a2701811o035378Q010418P742067k2463467J756259J1159742p983603J315170
2393a9200603j0562405J596470J665690j8698721k724950K64107Q321875q996084j9435579
2384f7770200J8010320J90571j0699885J1773731J7455261J3433402j2466050O517423
2376b3555427J9852995l897070R580544P099964O972973P610651j3461242m63246N766142
2367A5506284Q594832k351129j3137933K1674373J077454k8022970M746703J6351855
2359B4439469n664984k5175464J0257624J6918099l7889220j4098596J6948716j1570956
2351b5835312j9022484N146361J7452279k0245576j4392263K0746797q897884k222795
$$ plain form
2409 6306379 -7965352 -8764754 14731056 2572813 -18762650 5939321 5554505 -12701811
2401 -12701811 -18737189 -10726771 -2984704 -25448171 -23691912 -12532170 -20515773 -19200603
2393 -19200603 -29763008 -28166538 -26500848 -45199569 -47924519 -47660412 -39338537 -48334621 -67770200
2384 -67770200 -49759880 -49569309 -60269194 -48495463 -31040202 -17606800 -30072850 -23555427
2376 -23555427 -3702432 -7599502 1981042 9081006 16053979 23664630 10203388 9740142 15506284
2367 15506284 24101116 21749987 8612054 30286427 31363881 3340911 8087614 24439469
2359 24439469 18774485 -6400979 3856645 20774744 -17114476 -31213072 -14264356 -25835312
2351 -25835312 -44857796 -39711435 -22259156 -42504732 -56896995 -36150198 -45048082 -47270877
2343d7270877K7928576J0510221r226319J208295J7383829j3333368l155584M6030193
2335C0074966M360360k5149655R965515J1016323k2569339p019198M8899940J1044791
2327F0623703l8031063R816803J1255027k9243223k498292M3097723J3081298l6778335
2319C1323641o77989P939972l3767133J913112L7274535J732518k7643432p377049m985748
2310E732427l2659109N213445L3224410j3864623k2094961k650842j9946916k8490214
2302g5536383J5974710L5784401j4051731j3179523J8541382j1241996j3835300L7065845
2294b0478595M4474933r01861m434083K1818415n056189j1717832L0090833K1655028
2286G5450649j2552227j1823977p680414k2042976j0962901J7543572l809307k1090915
$$ plain form
2343 -47270877 -19342301 -8832080 -18058399 -16850104 533725 -12799643 -15955227 30074966
2335 30074966 34435326 9285671 19251186 30267509 7698170 678972 49578912 60623703
2327 60623703 22592640 32409443 43664470 14421247 11922955 55020678 68101976 31323641
2319 31323641 30645652 38585624 4818491 6731603 44006138 45738656 18095224 10718175 5732427
2310 5732427 -26926682 -21713237 11511173 -2353450 -24448411 -27099253 -47046169 -75536383
2302 -75536383 -59561673 -23777272 -37829003 -51008526 -32467144 -43709140 -57544440 -20478595
2294 -20478595 23996338 23094477 18660394 40478809 35422620 23704788 53795621 75450649
2286 75450649 62898422 51074445 43394031 21351055 10388154 27931726 24122419 3031504
2278C031504K202923j0870261k8375116R951174K9534536r887621k3067310J2945396
2270a4534775n92769l1273439J2223895L1720627j5923091k3052363Q174172K293550
2262c0964193j4001514J8210527K8783270j4485791q353805J3001456r103049o81262
2254a7594361L1320946J3427495l0076140j0473798J9125948k1763395j0543823M4580451
2246A8003323J3482910l5145845j1714864K7665952j721937j2084070M4344802K2122973
2238F4953244l1442018j4570639R006277M369235m066255K1948382J1947093l0600033
2230C1545286q907770o01104q407482J6166875K3488956L105549l0450560p327596
2222A8612154J1568123k4834005K275805K9826521l169453l7066752k5532422J8572665
$$ plain form
2278 3031504 5234427 -5635834 -34010950 -24059776 5474760 -4412861 -27480171 -14534775
2270 -14534775 -15127544 -46400983 -34177088 -2456461 -18379552 -41431915 -33257743 -30964193
2262 -30964193 -44965707 -26755180 2028090 -12457701 -20811506 -7810050 -16913099 -17594361
2254 -17594361 13726585 27154080 -2922060 -13395858 5730090 -16033305 -26577128 18003323
2246 18003323 31486233 -3659612 -15374476 12291476 10569539 -1514531 42830271 64953244
2238 64953244 33511226 18940587 27946864 32316099 28249844 50198226 62145319 31545286
2230 31545286 22637516 22036412 13628930 29795805 53284761 56390310 25939750 18612154
2222 18612154 30180277 5346272 7622077 37448598 34279145 -2787607 -28320029 -9747364
2214i747364q740204k0598423L0135966J5853247k1554542k5119052J1137438K1852492
2206f780442j6798167J0312455K2862882j5186070j8051083r367777P375286m047879
2198b9680795m212391J3958819j8494067j0346710N569837j7098243o009012J1572320
2190e4740242J4465754j9648295j8453726K9169223j1768244l2649297K2579602L1088383
2182c9956842o777229j9601249L0344932K0882837l4958778J1314952M3152466N297935
2174I699024j0084412M561434J1424040k3248900j3964307K4020244J97249j629848
2166I74524L538797j7201022j2518043J112484J7514129N970926M060474K5723076
2158B9175345j7503437l2877505J1025202J7390419K339446q325134J3435012L262052
$$ plain form
2214 -9747364 -18487568 -39085991 -8950025 6903222 -14651320 -39770372 -28632934 -6780442
2206 -6780442 -23578609 -13266154 9596728 -5589342 -23640425 -33008202 -25632916 -29680795
2198 -29680795 -33893186 -19934367 -38428434 -48775144 -43205307 -60303550 -66312562 -54740242
2190 -54740242 -40274488 -59922783 -78376509 -49207286 -60975530 -93624827 -71045225 -39956842
2182 -39956842 -46734071 -66335320 -35990388 -15107551 -50066329 -38751377 4401089 9699024
2174 9699024 -385388 4176046 15600086 -7648814 -21613121 2407123 2604372 974524
2166 974524 4513321 -12687701 -25205744 -24093260 -6579131 -608205 3452269 29175345
2158 29175345 11671908 -21205597 -10180395 7210024 9549470 1224336 14659348 17921400
2150A7921400m7747743o979794L2412020J3946407L903295L061458K1307228j4571684
2142B3252587k5688993L6205805K6095846P084073J762289n566142m604471l3730754
2134B4810240N715122K2337168j3862452P699987j6303380l1754388j7021971m524405
2126b2904079J9993943j8158962P419011J9884747m9202341r835685K4610350J7849730
2118a0343286L728650M745048M6855130k5591308k9436100M7898327P413107O64260
2110D5933828Q736183J2828400j1451419n0209961K4606750K403486k7780347K9311096
2102C4378016p440253j8610987j6158898N150061J6893797k6125063L7271415J4439641
2094C9797729m3748229J1458834k736613p544523p822679R775808K2149596m7103989
$$ plain form
2150 17921400 -29826343 -36806137 -4394117 9552290 13455585 16517043 37824271 23252587
2142 23252587 -2436406 33769399 59865245 66949318 68711607 63145465 58540994 24810240
2134 24810240 30525362 52862530 39000078 46700065 30396685 -1357703 -18379674 -22904079
2126 -22904079 -2910136 -21069098 -13650087 6234660 -42967681 -52803366 -28193016 -10343286
2118 -10343286 -6614636 -1869588 44985542 19394234 -10041866 37856461 45269568 45933828
2110 45933828 54670011 67498411 56046992 5837031 30443781 32847267 5066920 34378016
2102 34378016 26937763 8326776 -7832122 -2682061 14211736 -11913327 25358088 39797729
2094 39797729 -3950500 7508334 4771721 -2772802 -10595481 -819673 21329923 -25774066
2086b5774066M745138J8765257l3197419J8987070J8777674P824106j2208238o320840
2078h401318K7114679l5627604J169728L2202787k7082725o869845o912596m059808
2070b8466702j1945854j0510250L4224119j2848778k78785K9948466j5323524J1899247
2062c302061K3175443J3027237J268911q24124L0827954k1010310j7217016L6899478
2054F2845512q635128k1333189M99044R443948r573105k6723294K1460096M029219
2046C2013103l0498367O73903m242338p180718j120572l754611K823473q286737l34763
2037a9907627j995252m605980L0398726J1003864j3786695J1605663M858610r463397
2029H107912o463705J3455587J5889579k6678617j6420323j472009j8858999L964345
$$ plain form
2086 -25774066 -21028928 -2263671 -35461090 -16474020 2303654 10127760 -2080478 -8401318
2078 -8401318 18713361 -16914243 -15744515 16458272 -10624453 -17494298 -24406894 -28466702
2070 -28466702 -40412556 -50922806 -16698687 -29547465 -29826250 122216 -15201308 -3302061
2062 -3302061 19873382 32900619 34169530 33345406 64173360 43163050 25946034 62845512
2054 62845512 54210384 32877195 33376239 42820187 33247082 6523788 27983884 32013103
2046 32013103 1514736 2188639 -2053699 -9234417 -10354989 -14109600 -11286127 -19572864 -19907627
2037 -19907627 -21902879 -26508859 3889867 14893731 1107036 12712699 17571309 8107912
2029 8107912 1644207 15099794 30989373 4310756 -12109567 -13581576 -32440575 -28476230
2021b8476230M878987J1210615J7093234j3401037l342658O973848K5332973K0138067
2013D0407799j0655367K9303192q57311m8473031k109031J2585124L057791k3183024
2005G6142L28398J4242467n4244732o593489L4208814k567282J1218687P648615P466813
1996A1784433k3134764j3108410L5219759j8599839M165892K4117097l4799782j6120694
1988c0476308J561264J4765098q214187J253131N1937103k7093358k0729252M3782260
1980B6785751N99619q928234P905959L2999868j3891173m2294080L8531002k289059
1972C9419653l5629749J6842955J0902265k156620j6753896J5836481J2721575k9023444
1964A2159220J4533255L369536q674553K0888468p819713j5076142o742303K471094
$$ plain form
2021 -28476230 -23597243 -12386628 4706606 -8694431 -12037089 -5063241 20269732 40407799
2013 40407799 29752432 59055624 58198313 9725282 7616251 20201375 23259166 76142
2005 76142 404540 14647007 -39597725 -46191214 -11982400 -14549682 -3330995 4317620 11784433
1996 11784433 -11350331 -24458741 10761018 -7838821 -3672929 20444168 -14355614 -30476308
1988 -30476308 -28915044 -14149946 -22364133 -21111002 30826101 3732743 -16996509 26785751
1980 26785751 27385370 18457136 26363095 59362963 45471790 3177710 41708712 39419653
1972 39419653 3789904 20632859 31535124 29378504 12624608 28461089 41182664 12159220
1964 12159220 26692475 30062011 21387458 42275926 34456213 19380071 12637768 15108862
1956A5108862j0345561j1665969M6234100R456450m3409509N964222J7028475j8530179
1948I840891o184847M1642696J7154954m7812584k4072372K178191k0854401L033101
1940b5074371K8846132j816005j4762894j2776388k8747532n637209M7818354M1431292
1932B9281379k5758007q826709K7207534n6578576m0755600P3305268M7876621m2849412
1924B902498l7651837L3232167k7973300o3591488P6955978O9433096k3456042k0506193
1916I344879j622859k615491k8295286M7396833N5379923l3772134N116736l3206423
1908A7726178o4001579J7064518M4031804K2051919m7850082J1914856J4728365j08074741
1900i2408762J8093730R8212662J0995467l8359455j4845454M6065372o8375736l6687538
$$ plain form
1956 15108862 4763301 -6902668 39331432 48787882 5378373 11342595 28371070 9840891
1948 9840891 3656044 45298740 62453694 14641110 -9431262 -7253071 -28107472 -25074371
1940 -25074371 3771761 1955756 -12807138 -25583526 -54331058 -59968267 -12149913 29281379
1932 29281379 3523372 -5303337 21904197 -34674379 -75429979 -2124711 45751910 2902498
1924 2902498 -34749339 -1517172 -29490472 -93081960 -16125982 53307114 29851072 9344879
1916 9344879 7722020 5106529 -23188757 24208076 79587999 45815865 50932601 17726178
1908 17726178 -46275401 -29210883 14820921 36872840 -10977242 937614 15665979 -92408762
1900 -92408762 -74315032 23897630 34893097 -3466358 -18311812 27753560 -40622176 -77309714
1892g7309714J14472512J5145948l1728667k5886074j0311074o597115m3055718O4368758
1884i01144K0756913m3882823Q681554o2412949k2173604K7721586L2736546K3339432
1876a6134489m6844955M1266017o127083p0765904P6321229P3141565J8774391l2600316
1868C7030455M212509N1545061p5736251J0483518Q7796939j3473342l5242833n3033182
1860A3582874J094656k6978668m3472265N6823645j9817821l1638852j3939091n7668559
1852a22014081K984875J5225192L9698936k117228l3699684N0124439l7377806m3088304
1844a30263661O9461608N2007843k425307m4375398L1434823J4950990p7877226L4386760
1836e2699568O3170602j1327916k7847520j6270717J3746419k7702705O924973N5040449
$$ plain form
1892 -77309714 37162798 52308746 20580079 -5305995 -15617069 -22214184 -65269902 -901144
1884 -901144 19855769 -24027054 -15345500 -77758449 -99932053 -72210467 -39473921 -16134489
1876 -16134489 -62979444 -21713427 -27840510 -98606414 -22285185 50856380 69630771 37030455
1868 37030455 41242964 92788025 17051774 27535292 115332231 101858889 66616056 13582874
1860 13582874 14677530 -12301138 -55773403 1050242 -18767579 -50406431 -64345522 -122014081
1852 -122014081 -119029206 -103804014 -64105078 -66222306 -99921990 -49797551 -87175357 -130263661
1844 -130263661 -60802053 -8794210 -11219517 -55594915 -24160092 -9209102 -87086328 -52699568
1836 -52699568 10471034 -856882 -28704402 -44975119 -31228700 -58931405 -52006432 3034017
1828C034017o32852J8982548M987297l2575045J5500701M2237812K5531462j5426340
1820F1639600J9372468L2543732p1627611l8704659N6184817O867533m5754155q368175
1812A2153550K4130577m3406875o5118297L2929880L0249046k4112844J715146L001904
1804b8457913j6587289j5406527K082354J7549013P577047K2218720p500958m1096860
1796e9622413K3416505J8376509k0465070J6371940L5707553L885235m9560423j092199
1788c2982363M2358304k9187459q572275K5321611n094866k3271351k9262099J8656701
1780d2033797N915970j3429578K0793712p421106P814099L928674j5397402K6791511
1772a3037917P401369N079183o12011m805957K1135969k3526658N82647J8680368j8731385
$$ plain form
1828 3034017 2401165 21383713 26371010 -6204035 9296666 51534478 77065940 61639600
1820 61639600 81012068 113555800 41928189 3223530 59408347 66275880 20521725 12153550
1812 12153550 36284127 -7122748 -72241045 -39311165 -9062119 -33174963 -31459817 -28457913
1804 -28457913 -45045202 -60451729 -58369375 -40820362 -33243315 -11024595 -18525553 -59622413
1796 -59622413 -36205908 -17829399 -38294469 -21922529 13785024 17670259 -31890164 -32982363
1788 -32982363 9375941 -19811518 -28383793 -3062182 -8157048 -31428399 -60690498 -42033797
1780 -42033797 -36117827 -49547405 -28753693 -36174799 -28360700 -24432026 -39829428 -13037917
1772 -13037917 -5636548 -557365 -1169376 -5975333 15160636 -8366022 -7783375 10896993 -7834392
1763g834392J1192895j265819L4349L664939o889413J4829979k2014275O286919K6042434
1754B4047616k7854519K860011O129664j2617014j4784101k650978L0567666j8242058
1746a2543713n825979K8594125k6988952p058905K4776126J1184878j0054324P92976
1738B876232K8864971l6848405l0824640M6229393N1544l4017539Q600131K4851690
1730I783377k9115254l8678496M2997004K1617403l4689965R462439K1087330j7900942
1722a5437104j6987903J9318100J1681662j5174939P820772R35831k4670095J1862822
1714b0650854K4170405j7546413n165128L3309231k87512l0689947J9858955M4335408
1706D7334145j9541443k8260552L3419609J1064273k9961975L265266K8443700j257941
$$ plain form
1763 -7834392 3358503 2092684 2127033 5791972 -1097441 13732538 -8281737 -1994818 24047616
1754 24047616 -3806903 -946892 5182772 -7434242 -22218343 -24869321 5698345 -12543713
1746 -12543713 -18369692 10224433 -16764519 -23823424 952702 12137580 2083256 2876232
1738 2876232 31741203 -5107202 -35931842 10297551 10349095 -23668444 -15068313 9783377
1730 9783377 -19331877 -58010373 -15013369 6604034 -28085931 -18623492 2463838 -15437104
1722 -15437104 -32425007 -13106907 -1425245 -16600184 -8779412 -7843581 -32513676 -20650854
1714 -20650854 3519551 -14026862 -19191990 14117241 13829729 -16860218 2998737 47334145
1706 47334145 27792702 -467850 32951759 44016032 14054057 17319323 45763023 44505082
1698D4505082l3334733k211308J5579729q161181K428298p6100o059062n463307k3737650
1689a6530232p969304O406223J3580753m280280l1737496P79291l981106k1076006M102316
1680f0705841J2781601J2296243k3023155k6420743J0647786J871801N029164O653228
1672f0869916J1688706J3374565k6243792p467059K3459218J4685242Q120398o772669
1664c0025307N941947m580705k4201461K316501O240569J0306164J747516k1781589R41245
1655e3095120J2450973K869809j893349J3965959L5880046p396338k3649176K6590238
$$ plain form
1698 44505082 11170349 8959041 24538770 16377589 18805887 18729787 12670725 7207418 -16530232
1689 -16530232 -24499536 -18093313 -4512560 -8792840 -40530336 -39751045 -43732151 -64808157 -60705841
1680 -60705841 -47924240 -35627997 -58651152 -85071895 -74424109 -72552308 -67523144 -60869916
1672 -60869916 -49181210 -35806645 -62050437 -69517496 -46058278 -31373036 -23252638 -30025307
1664 -30025307 -24083360 -28664065 -52865526 -50549025 -44308456 -34002292 -32254776 -54036365 -53095120
1655 -53095120 -40644147 -37774338 -39667687 -25701728 10178318 2781980 -20867196 5723042
$$ [...]
-2730C316325  $$ checkpoint
##END NTUPLES=
##END=
