##TITLE= S#492934
##JCAMP-DX= 5.00 $$ JEOL NMR v1.10
##DATA TYPE= NMR SPECTRUM
##DATA CLASS= NTUPLES
##NUM DIM= 1
##ORIGIN= DELTA_NMR
##OWNER= NMR
##SPECTROMETER/DATA SYSTEM= DELTA_NMR
##.OBSERVE FREQUENCY= 3.00529655924288E+02
##.OBSERVE NUCLEUS= ^1H
##.DELAY= (2.195E+02,2.195E+02)
##.ACQUISITION MODE= SIMULTANEOUS
##.FIELD= 7.0586013
##.FILTER WIDTH= 1.81675738660864
##.ACQUISITION TIME= 3.6339712
##.SPINNING RATE= 16
##.OBSERVE 90= 9.2
$$ ------------------------
$$ JEOL SPECIFIC PARAMETERS
##$FILENAME= C:\NMR/eb-18.jdf
##$TITLE= S#492934
##$AUTHOR= NMR
##$CREATION=  5-FEB-2018 13:34:43
##$REVISION=  5-FEB-2018 13:42:02
##$CONTENT= PROTON NMR EXPERIMENT
##$INSTRUMENT= DELTA_NMR
##$SITE= Center College ECP+ 300
##$NODENAME= nmr2
##$DIMENSIONS= 1
##$STORAGE= FLOAT
##$X_FORMAT= COMPLEX
##$X_CURR_POINTS= 16384
##$X_START= 12.50103 $$ppm
##$X_STOP= -2.50012 $$ppm
##$X_TITLE= 1H                             
##$X_ZERO_POINT= 0.33329
##$X_FREQ_FLIP= FALSE
##$X_POINTS= 16384
##$X_PRESCANS= 0
##$X_DOMAIN= 1H
##$X_OFFSET= 5 $$ppm
##$X_FREQ= 300.52966 $$MHz
##$X_SWEEP= 4.50857 $$kHz
##$X_RESOLUTION= 0.27518 $$Hz
##$SOLVENT= CHLOROFORM-D
##$TEMP_GET= 20.9 $$dC
##$ACQ_DELAY= 0.2195 $$ms
##$DIGITAL_FILTER= FALSE
##$FILTER_FACTOR= 1
##$FILTER_WIDTH= 2.254 $$kHz
##$FILTER_MODE= BUTTERWORTH
##$TRANSITION_RATIO= 0.9
##$ORDERS
##$FACTORS
##$LOCK_STRENGTH= 581
##$LOCK_LEVEL= 200
##$LOCK_GAIN= 26
##$LOCK_OSC_OFFSET= 25.6519 $$kHz
##$LOCK_PHASE= 187 $$deg
##$LOCK_OSC_STATE= 2H OSC ON
##$X_ANGLE= 45 $$deg
##$X90= 9.2 $$us
##$X90_HI= 10 $$us
##$X90_LO= 50 $$us
##$X_90_WIDTH= 9.2 $$us
##$X_PULSE= 4.6 $$us
##$RELAXATION_DELAY= 4 $$s
##$SCANS= 2
##$PROBE_ID= 1412
##$ITERATIONS= 1
##$FIELD_STRENGTH= 7.0586 $$T
##$TEMP_SET= 25 $$dC
##$SPIN_SET= 15 $$Hz
##$SPIN_GET= 16 $$Hz
##$HE_LEVEL= 73 $$%
##$N2_LEVEL= 96 $$%
##$CHANGER_SAMPLE= 0
##$ADC_CARD= 16/1MHz/20
##$EXPERIMENT= single_pulse.exp
##$OBS_NOISE= WAUGH
##$IRR_NOISE= WALTZ
##$TRI_NOISE= WALTZ
##$QUA_NOISE= WAUGH
##$OBS_PWIDTH= 1 $$us
##$IRR_PWIDTH= 50 $$us
##$TRI_PWIDTH= 1 $$us
##$QUA_PWIDTH= 1 $$us
##$RECVR_GAIN= 4
##$IRR90= 9.2 $$us
##$TRI90= 10 $$us
##$QUA90= 10 $$us
##$IRR90_HI= 10 $$us
##$QUA90_HI= 10 $$us
##$IRR90_LO= 50 $$us
##$TRI90_LO= 10 $$us
##$QUA90_LO= 10 $$us
##$MOD_RETURN= 1
##$TOTAL_SCANS= 2
##$X_ACQ_DURATION= 3.63397 $$s
##$DELAY_OF_START= 1 $$s
##$ACTUAL_START_TIME= 886685661
##$CLIPPED= FALSE
##$DC_BALANCED= FALSE
##$TRI90_HI= 10 $$us
##$SPIN_LOCK_90= 100 $$us
##$SPIN_LOCK_ATTN= 24.4 $$dB
##$DEUT_GRAD_SHIM_90= 213 $$us
##$DEUT_GRAD_SHIM_ATTN= 9 $$dB
##$IRR_CODE= 146
##$LOCK_STATE= LOCK ON
##$AUTOLOCK_LEVEL= 200
##$SAWTOOTH_RANGE= 4
##$LOCK_STATUS= IDLE
##$LOCK_SETTLE_POINT= 4096
##$LOCK_ACHIEVE_POINT= 0
##$SPIN_ACTION= SPIN ON
##$SPIN_STATE= SPIN ON
##$SPIN_STATUS= SPIN ON
##$SPIN_GAS_SOURCE= AIR
##$TEMP_ACTION= TEMP OFF
##$TEMP_STATE= TEMP OFF
##$TEMP_STATUS= TEMP OFF
##$TEMP_COMP= 0
##$TEMP_DELAY= 0 $$s
##$TEMP_LIMIT_HI= 150 $$dC
##$TEMP_LIMIT_LO= -100 $$dC
##$TEMP_MELTING= -63 $$dC
$$ [...]
##$VT_PID_STD_WB_H_CBL= 10
##$VT_PID_STD_WB_H_CBH= 0
##$VT_PID_STD_WB_H_HC= 2.4
##$VT_PID_STD_WB_H_HL= 70
##$VT_PID_STD_WB_M_PB= 1.5
##$VT_PID_STD_WB_M_TI= 30
##$VT_PID_STD_WB_M_TD= 5
##$VT_PID_STD_WB_M_CBL= 9.9
##$VT_PID_STD_WB_M_CBH= 2.3
##$VT_PID_STD_WB_M_HC= 2.5
##$VT_PID_STD_WB_M_HL= 70
##$VT_PID_STD_WB_L_PB= 1.3
##$VT_PID_STD_WB_L_TI= 29
##$VT_PID_STD_WB_L_TD= 5
##$VT_PID_STD_WB_L_CBL= 20
##$VT_PID_STD_WB_L_CBH= 20
##$VT_PID_STD_WB_L_HC= 0.6
##$VT_PID_STD_WB_L_HL= 100
##$VT_PID_LONG_0_H_PB= 1.5
##$VT_PID_LONG_0_H_TI= 30
##$VT_PID_LONG_0_H_TD= 5
##$VT_PID_LONG_0_H_CBL= 9.9
##$VT_PID_LONG_0_H_CBH= 2.3
##$VT_PID_LONG_0_H_HC= 2.5
##$VT_PID_LONG_0_H_HL= 70
##$VT_PID_LONG_0_M_PB= 1.5
##$VT_PID_LONG_0_M_TI= 30
##$VT_PID_LONG_0_M_TD= 5
##$VT_PID_LONG_0_M_CBL= 9.9
##$VT_PID_LONG_0_M_CBH= 2.3
##$VT_PID_LONG_0_M_HC= 2.5
##$VT_PID_LONG_0_M_HL= 70
##$VT_PID_LONG_40_H_PB= 1.5
##$VT_PID_LONG_40_H_TI= 30
##$VT_PID_LONG_40_H_TD= 5
##$VT_PID_LONG_40_H_CBL= 9.9
##$VT_PID_LONG_40_H_CBH= 2.3
##$VT_PID_LONG_40_H_HC= 2.5
##$VT_PID_LONG_40_H_HL= 70
##$VT_PID_LONG_40_M_PB= 1.5
##$VT_PID_LONG_40_M_TI= 30
##$VT_PID_LONG_40_M_TD= 5
##$VT_PID_LONG_40_M_CBL= 9.9
##$VT_PID_LONG_40_M_CBH= 2.3
##$VT_PID_LONG_40_M_HC= 2.5
##$VT_PID_LONG_40_M_HL= 70
##$SAMPLE_ACTION= LOADED
##$SAMPLE_STATE= LOAD
##$SAMPLE_STATUS= LOADED
##$AUTOSHIM_MODE= AUTOSHIM OFF
##$AUTOSHIM_DELAY= 3600 $$s
##$AUTOSHIM_TRACK= AUTOSHIM OFF
##$SHIM_MAX_RECALL= MAX FOUND
##$SHIM_NAMES= SHIM_Z0
##$SHIM_Z0= 9189
##$SHIM_Z1= 5127
##$SHIM_Z2= -27
##$SHIM_Z3= -2829
##$SHIM_Z4= -240
##$SHIM_Z5= 46
##$SHIM_Z6= -33
##$SHIM_X= -14
##$SHIM_XZ= 16
##$SHIM_XZ2= 0
##$SHIM_XZ3= 0
##$SHIM_X2= -7
##$SHIM_X2Z= -40
##$SHIM_X3= 0
##$SHIM_Y= 1608
##$SHIM_YZ= 13
##$SHIM_YZ2= 10
##$SHIM_YZ3= 0
##$SHIM_Y2= -11
##$SHIM_Y2Z= -20
##$SHIM_Y3= 0
##$NUM_SCANS= 1
##$END_TIME= 886685682
##$LOCAL_TIME= 886685681.0
##$PROBE_ATN= 0
##$PROBE_TUNE= 0
##$PROBE_MATCH= 2077
##$PROBE_COARSE= NONE
##$LF_TUNE_DIAL= 0
##$LF_MATCH_DIAL= 0
##$HF_TUNE_DIAL= 0
##$HF_MATCH_DIAL= 0
##$PASS_RIPPLE= 0.01 $$dB
##$STOP_RIPPLE= 60 $$dB
##$PROBE_RECOVERY= 0 $$us
##$AF_DELAY_RATIO= 0
##$VERSION= 4.3.3
##$X_ACQ_TIME= 3.63397 $$s
##$DEAD_TIME= 0 $$us
##$DELAY= 0 $$us
##$PHASE_PRESET= 3 $$us
##$UNBLANK_TIME= 2 $$us
##$INITIAL_WAIT= 1 $$s
##$NORMALIZED= TRUE
$$ END OF JEOL SPECIFIC PARAMETERS
$$ -------------------------------
##NTUPLES= NMR SPECTRUM
##VAR NAME= FREQUENCY,    SPECTRUM/REAL, SPECTRUM/IMAG, PAGE NUMBER
##SYMBOL=   X,            R,             I,             N
##VAR TYPE= INDEPENDENT,  DEPENDENT,     DEPENDENT,     PAGE
##VAR FORM= AFFN,         ASDF,          ASDF,          AFFN
##VAR DIM=  16384, 16384, 16384, 2
##UNITS= PPM,     ARBITRARY UNITS, ARBITRARY UNITS, 
##FIRST=  1.2501033903057E+01, -1.69715776317087E+03, 1.78684580540837E+02, 1
##LAST=  -2.50011824950436, -1.43256927857833E+03, -1.28398503435792E+03, 2
##FACTOR=  9.1565355261926E-04, 4.94387216150326E-03, 4.94387216150326E-03, 1
##PAGE= N=1
##DATA TABLE=(X++(R..R)), XYDATA
$$ [...]
9235D0188843j0308032J2631609J7577836m7585306Q076338J8930197j3896683k0135570
9227E479232O434433J2979474l8087830P122178J5728930k8350437k8016176O783025
9219c9927171N789920j6699903K9978296L7014104M08973p810156K4741637K868140
9211C6363840j7753954K2163045R432227j6338990k6179626M858143j0988367k2410689
9203b0854371K3428054L114698j2946555k1181497K600805o467139p502884M2148014
9195B339125K1329570J5202445L657573Q639508p969387k1988605J3574141j6922296
9187A7862074j4995246j7016609j6209389q994592j1036374K8983961J3838228J7305382
9179I737435J7654553o069944j1973252k1865802j3659246r673763P015282K3126289
$$ plain form
9235 40188843 29880811 42512420 60090256 12504950 20581288 39511485 25614802 5479232
9227 5479232 11913665 24893139 -13194691 -6072513 9656417 -18694020 -46710196 -39927171
9219 -39927171 -34137251 -50837154 -20858858 16155246 16564219 8754063 33495700 36363840
9211 36363840 18609886 40772931 50205158 33866168 7686542 12544685 1556318 -20854371
9203 -20854371 2573683 5688381 -7258174 -28439671 -25838866 -32306005 -39808889 2339125
9195 2339125 23668695 38871140 42528713 51168221 43198834 21210229 34784370 17862074
9187 17862074 2866828 -14149781 -30359170 -39353762 -50390136 -21406175 -7567947 9737435
9179 9737435 27391988 21322044 9348792 -12517010 -26176256 -35850019 -28834737 -5708448
9171e708448K6967097J5459020J5878969j2913646l1948321j3652517l2437507L05671
9163c8049682J65583J7388910J7812062j6450967K5445821k5866991j1408251K122330
9155b8841185j0730310K0885962m469763M6711827J6730249k247703J9260954k8099002
9147B9201029k9029967l2094477p798164o286886o895957J5478210O441808k0370289
9139e1354693N843359K5573396m50373K5505883l662397j0903081m9906007m3321430
9131a02675343J4655438k4088039N0781807M2710774K4148993R806681k9771200O156938
9123h273951n0438923m129666J7507907l79400K0617743J8252820L1065276m678310
9115A9543496N097048p148730k4424885l3077959M268193J9331358P977092N1673828
$$ plain form
9171 -5708448 21258649 36717669 52596638 39682992 7734671 -5917846 -38355353 -38049682
9163 -38049682 -37884099 -20495189 -2683127 -19134094 6311727 -19555264 -30963515 -28841185
9155 -28841185 -39571495 -18685533 -23155296 23556531 40286780 38039077 57300031 29201029
9147 29201029 171062 -31923415 -39721579 -46008465 -52904422 -37426212 -30984404 -51354693
9139 -51354693 -45511334 -19937938 -20388311 5117572 1455175 -9447906 -59353913 -102675343
9131 -102675343 -88019905 -112107944 -61326137 -18615363 5533630 15340311 -14430889 -8273951
9123 -8273951 -58712874 -62842540 -45334633 -45714033 -25096290 -6843470 24221806 19543496
9115 19543496 24640544 17491814 -6933071 -40011030 -35742837 -16411479 -8434387 43239441
9107D3239441M389486M058830l2439216j9404987j229244l0174893M0013606m480467
9099C972556N978324l407202j0832987N350114k2923195K1678925j3916573j3317777
9091b7417815j5057539j0149825p225777L276064L8039985M798100K5052501l701498
9083G614196N361402k0467912j6789502J4587837l3511100K2835321K641973J6981983
9075g45802K166419j2846044l094462o9183992k3200507k8675932p128017J0740105
9067a31968232L6443495M2553465m960040K3849843p552872j933415p083304L5826935
9059a4824125L4569520M566757N0691132K188277j436885k6253111m192782j9108753
9051B6200030m2577169K1637298m181674K075235l917757J4614569k5454632l7599602
$$ plain form
9107 43239441 47628927 51687757 19248541 -156446 -1385690 -31560583 8453023 3972556
9099 3972556 9950880 6543678 -4289309 1060805 -21862390 -183465 -14100038 -27417815
9091 -27417815 -42475354 -52625179 -59850956 -56574892 -18534907 -13736807 11315694 7614196
9083 7614196 12975598 -7492314 -24281816 -9693979 -43205079 -20369758 -17727785 -745802
9075 -745802 1420617 -11425427 -14519889 -83703881 -106904388 -135580320 -142708337 -131968232
9067 -131968232 -95524737 -52971272 -57931312 -34081469 -41634341 -43567756 -50651060 -14824125
9059 -14824125 19745395 24312152 75003284 77191561 75754676 49501565 45308783 26200030
9051 26200030 -16377139 5260159 1078485 3153720 -764037 13850532 -11604100 -49203702
9043d9203702P008006j3734804L861775P99095M3904671j3444865j6218245J8358499
9035a8669570l5563418r572952k4529334K2818265j2780504j2851975M8762139j1122413
9027e3509762P828861Q152776Q876321j9904221k7292468J2196424j1268922j1050934
9019h5971925L4131324L9686650L238550L9910539K0656458N290779j8141608j4947740
9011B3853027J7810491n2386032K8651430K0306411p104099K0143841k4062595J2748894
9003C9961368n9318209j9227338J6156737l5801535L2983148K1276653K2311422L909287
8995B2251533j6231509L779072m7031679l2218806J4884317j2193548J3810352L2071965
8987b0878303O984027Q982285l4574674J789643j5258081k8943255N3697769O680092
$$ plain form
9043 -49203702 -42195696 -55930500 -52068725 -51269630 -7364959 -20809824 -37028069 -18669570
9035 -18669570 -54232988 -63805940 -88335274 -65517009 -78297513 -91149488 -42387349 -53509762
9027 -53509762 -45680901 -37528125 -28651804 -48556025 -75848493 -63652069 -74920991 -85971925
9019 -85971925 -51840601 -12153951 -8915401 30995138 51651596 56942375 38800767 23853027
9011 23853027 41663518 -10722514 17928916 38235327 31131228 51275069 27212474 39961368
9003 39961368 -19356841 -38584179 -22427442 -58228977 -25245829 -3969176 18342246 22251533
8995 22251533 6020024 9799096 -37232583 -69451389 -54567072 -66760620 -52950268 -20878303
8987 -20878303 -13894276 -4911991 -39486665 -37697022 -52955103 -81898358 -28200589 -21520497
8979b1520497L8040079K4582000J819225J3731588n4551607N748543k3380473k6391600
8971d1922742K8414572o03687L5164399Q784356J4951130J7239089k7507014J1522878
8963D6042981q92405o805306J6599938l217212J271019j8323851k4490327l549578
8955F635259k7976058M649290J2144212l150707J8625626j1451351M074741j1640034
8947h089022j6896583J2508781j7262738J7147381P138454O438489K2427698o123506
8939A7288954K0597496n502985L179920J2158425q277405J9738608n756884N147821
8931E8573950M112056p490023J2479621o870104Q488768m571567k2526099j4035042
8923B8161560l7381717k8709109j8619933p952856J8725199J8344118L8199530L4768520
$$ plain form
8979 -21520497 16519582 41101582 42920807 56652395 2100788 7849331 -15531142 -41922742
8971 -41922742 -13508170 -14111857 21052542 29836898 44788028 62027117 34520103 46042981
8963 46042981 45150576 38345270 54945208 51727996 52999015 34675164 10184837 6635259
8955 6635259 -21340799 -16691509 -4547297 -7698004 10927622 -523729 3551012 -8089022
8947 -8089022 -24985605 -12476824 -29739562 -12592181 -5453727 984762 23412460 17288954
8939 17288954 37886450 32383465 35563385 47721810 39444405 59183013 53426129 58573950
8931 58573950 62686006 55195983 67675604 60805500 69294268 64722701 42196602 28161560
8923 28161560 -9220157 -37929266 -56549199 -64502055 -45776856 -27432738 10766792 45535312
8915D5535312O202739J6574778j2228595j6881055j1085168j8598642R634592j8089250
8907A064711O090926N663677k3863554J0307970j3629425J0184907M418356P555373
8899G792941L8392635k349215L0493910K0651106K719276J0246669j2190582M309833
8891A00066573j5808677m573630K1323515l447160M271948L498042j8500020j8567228
8883F8263363k7498819j3555913j6807257l2520864L920804j6733421n719845J8946664
8875b1705288J0732483K9633038m112636J4107494J509585j7947222K7370008J4362793
8867E3950255L0543934J7762174O167741Q19769l4235225r338571q653503j3187097
8859D3829477l545698r837098j1888632j5888207o635830R933048J012702l104827J670243
$$ plain form
8915 45535312 51738051 68312829 56084234 39203179 28118011 9519369 19153961 1064711
8907 1064711 7155637 12819314 -11044240 -736270 -14365695 -4180788 237568 7792941
8899 7792941 46185576 43836361 74330271 94981377 97700653 107947322 95756740 100066573
8891 100066573 84257896 79684266 101007781 97560621 101832569 105330611 86830591 68263363
8883 68263363 40764544 27208631 10401374 -22119490 -18198686 -34932107 -40651952 -21705288
8875 -21705288 -10972805 18660233 14547597 28655091 30164676 12217454 39587462 53950255
8867 53950255 84494189 102256363 108424104 109243873 75008648 65670077 57016574 43829477
8859 43829477 40283779 30446681 18558049 2669842 -3965988 5967060 6979762 3874935 5545178
8850E545178k1041784j2901021q395257L844778J5484603j752426J6937982k280830
8842d558777j808083J1008493L863300J4134403j6438524j5974160k2339679k8265431
8834f0378458L070659J6968339L6030687K5484190J2600042M255033k0739197k0879261
8826c587966p637700m906107o147091k032953K786205L085908l27735K3920684K3916255
8817B9069500L906677J2826068J466022p19337p539567J0320141K0735958j3858675
8809E6206787J733102p774110k2490729j7197927m673182J8027697q396207J1318244
8801B6753675K3542653n532920J876748Q500363Q548921j4158203r338608J2617519
8793E2810148j3326792o617026K6255681J4206443J24947L756747K635087k1300934
$$ plain form
8850 5545178 -15496606 -28397627 -36792884 -32948106 -17463503 -19215929 -2277947 -4558777
8842 -4558777 -6366860 4641633 8504933 22639336 6200812 -9773348 -32113027 -60378458
8834 -60378458 -57307799 -40339460 -4308773 21175417 33775459 38030492 17291295 -3587966
8826 -3587966 -11225666 -16131773 -22278864 -24311817 -21525612 -18439704 -18767439 5153245 29069500
8817 29069500 32976177 45802245 47268267 46548930 39009363 49329504 70065462 56206787
8809 56206787 57939889 50165779 27675050 10477123 5803941 23831638 15435431 26753675
8801 26753675 50296328 44763408 46640156 55140519 63689440 49531237 40192629 52810148
8793 52810148 39483356 32866330 59122011 73328454 73453401 77210148 79845235 58544301
8785E8544301m0362519L077916m269296j4231088K8045694J9904062J2103093j1987827
8777E0824336P589591J229982m1891859J1418425K465445q901501K165063J0994377
8769C5893859K6820283j3849177K5644616K7005619k2419781o434097j2445502j9056665
8761D1159155l2631138j6278699J0310698l1600949j8156806J2370780j8362737N70258
8753e2619438J3600933K2954252Q768901j6368258L1191379j2170690q802193L0203257
8745A6758143j044885J1014008k5739401K590198p008091l5416519L5791783J631946
8737a422818K940877J883546j5856098o94096l8982124N598480J1154941k3740073
8729e9117365J4511181n574234l881723L058913n462572L0247614j4071970j03469
$$ plain form
8785 58544301 18181782 21259698 16990402 2759314 30805008 50709070 62812163 50824336
8777 50824336 58413927 59643909 17752050 29170475 31635920 22734419 24899482 35893859
8769 35893859 62714142 48864965 74509581 101515200 79095419 72661322 60215820 41159155
8761 41159155 8528017 -7750682 2560016 -29040933 -47197739 -34826959 -53189696 -52619438
8753 -52619438 -39018505 -16064253 -7295352 -23663610 7527769 -4642921 -13445114 16758143
8745 16758143 15713258 26727266 987865 3578063 -3430028 -38846547 -3054764 -1422818
8737 -1422818 1518059 3401605 -12454493 -13148589 -52130713 -46532233 -35377292 -59117365
8729 -59117365 -44606184 -50180418 -54062141 -51003228 -56465800 -26218186 -40290156 -40393625
8721d0393625K2472691j6774591K9988802J2181758K3120633J6005257l1771383J0389227
8713B5218769l9977928j8387703J1513092j1877693K6888627j2596054P031956P112316
8705e074618k3176975K7022842p57905M496308P256527k4714864L256936k7527200r021440
8696d8240389J5590299j6257137J9216979k683359L890220J7391582o354572L7282476
8688A9836099O666758Q729047K2161934p786863J5133942o002045K879695L311741
8680F4930308k7387104l394883j5967572j1703698J1055143M166193J7715168l870918
8672C5542637j1895021m947673k6337623M508755J3079716J9304985K3553688J251168
8664E4060632R80487k7602216k1631547j1077568o350426Q864580O865627J3026463
$$ plain form
8721 -40393625 -17920934 -34695525 -4706723 7475035 30595668 46600925 14829542 25218769
8713 25218769 -14759159 -33146862 -21633770 -33511463 -6622836 -19218890 -12186934 -5074618
8705 -5074618 -28251593 -1228751 -1986656 2509652 9766179 -14948685 -11691749 -39218949 -48240389
8696 -48240389 -32650090 -48907227 -29690248 -32373607 -28483387 -11091805 -17446377 19836099
8688 19836099 26502857 35231904 57393838 49606975 64740917 58738872 61618567 64930308
8680 64930308 37543204 34148321 18180749 6477051 17532194 21698387 39413555 35542637
8672 35542637 23647616 18699943 -7637680 -3128925 9950791 29255776 52809464 54060632
8664 54060632 55041119 27438903 5807356 -5270212 -11620638 -2756058 4109569 17136032
8656A7136032n332822n44349o713647p798900l411027j1954649J965320q821826O275420
8647a9200448R072170N194548J2372547n748748p419253q446806q701289Q11027N192446
8638a6873806j401132N00976k5329783j1962758l783344j0562330L5383211R963640
8630b4065326K4372370M27607j5329151J3041035l1035142K6167315J4846196L491323
8622A1916227J8501878j6468053J0835476k0709022K76621K2673589j2787113P20081
8614A4959684k032084k1336555j4455398j1459465P762093J3201191q180706M4587958
8606B3046718M631229m987216K2951422k2315429N680112l4446651J3145044J7836371
8598B5541600k0602912M9253036l277379r127727k1323848k2865415k544107k5327837
$$ plain form
8656 17136032 11803210 11258861 4545214 -3253686 -6664713 -18619362 -16654042 -25475868 -19200448
8647 -19200448 -10128278 -4933730 7438817 1690069 -5729184 -14175990 -22877279 -22066252 -16873806
8638 -16873806 -18274938 -17773962 -43103745 -55066503 -58849847 -69412177 -34028966 -24065326
8630 -24065326 307044 734651 -14594500 -1553465 -32588607 -6421292 8424904 11916227
8622 11916227 30418105 13950052 24785528 4076506 4353127 27026716 14239603 14959684
8614 14959684 12927600 -8408955 -22864353 -34323818 -26561725 -13360534 -21541240 23046718
8606 23046718 27677947 22690731 45642153 23326724 29006836 -5439815 7705229 25541600
8598 25541600 4938688 54191724 50914345 41786618 20462770 -2402645 -4946752 -30274589
8590c0274589L2436787M1687731O763517R358493L612008m4564429m3592171l1066339
8582e5638992p00328R225641J0999146P6445787L788519m105678k829309m5914471
8574h729685k6623223m3363230L2993246J6836940R117482N6352914R376645o748607
8566C9212482j0323505K878602j1033466j3752596J1436928J8761853k1442311l221880
8558A2516107J3645277m3934522j1668831k1616464J984678k767861K002231O8204986
8550A8365601l529549K1060385K2379391j1666076j277276j7396543K1266203j0417995
8542C8784141k2330017J1321794j6585030k3461427J5865180J2279100J4694437J0775088
8534D1343266M719425J8733195m0109332P868570L804239l0656205J5881173k0513249
$$ plain form
8590 -30274589 2162198 43849929 50613446 59971939 63583947 19019518 -24572653 -55638992
8582 -55638992 -56339320 -47113679 -36114533 40331254 44119773 40014095 37184786 -8729685
8574 -8729685 -35352908 -78716138 -45722892 -28885952 -19768470 36584444 45961089 39212482
8566 39212482 28888977 31767579 20734113 6981517 18418445 37180298 15737987 12516107
8558 12516107 26161384 -17773138 -29441969 -51058433 -49073755 -51841616 -49839385 18365601
8550 18365601 14836052 35896437 58275828 46609752 45332476 27935933 49202136 38784141
8542 38784141 16454124 27775918 11190888 -12270539 3594641 15873741 30568178 41343266
8534 41343266 46062691 64795886 24686554 32555124 36359363 5703158 21584331 1071082
8526A071082J3262199j2939376l598219L5961509k4831011J5107806M172736j5487467
8518A2719259K476561j4207191J1520501m299026j5893012J7929245j8598665j4375089
8510b2727417Q302953k2120862Q025328j0306949R219986K4585096j1190323L7333089
8502B1120901m618677q800388N623735k5002990J2041855r838896Q450099J8182522
8494A7158161j8608387J1563813r371818j5295255Q191178j4137438R818741j516814
8486a2197819q67184K5332722r792139J9370652K807013j8121197P90485k2454451N680872
8477i451046j250814N162223J8913807j5159711k491115j176654o633654J6561569
8469D474605J6669883J7573691L855029k1551542k823726k6592136j0566386K0365429
$$ plain form
8526 1071082 14333281 1393905 -2204314 33757195 8926184 24033990 28206726 12719259
8518 12719259 15195820 988629 12509130 8210104 -7682908 10246337 -8352328 -22727417
8510 -22727417 -14424464 -36545326 -28519998 -38826947 -29606961 -5021865 -16212188 21120901
8502 21120901 16502224 7701836 13325571 -11677419 364436 -9474460 -1024361 17158161
8494 17158161 -1450226 10113587 741769 -14553486 -6362308 -20499746 -10681005 -12197819
8486 -12197819 -13065003 12267719 2475580 21846232 24653245 6532048 7322533 -15131918 -9451046
8477 -9451046 -10701860 -5539637 13374170 -1785541 -4276656 -5453310 -12086964 4474605
8469 4474605 21144488 38718179 42573208 21021666 18197940 -8394196 -18960582 1404847
8461A404847M496874K3621519k034149J4777676l993775j6612311J9509510j1996930
8453B9173261K139481m580740J0966698P747204j352956K6272777p232433k1768386
8445D1364906k9621229k1886919k7906249p048593K5790446K4167944Q909728n35772
8437A3234262K844970m3517056j6535643n923438P180775J1969203J1739467N2121148
8429C3113688j3270210K0609224J2146405r869851m505333l0781209K0376188l4597091
8421f778189K475252K7090068n514535N504046j3728898J837008l0997074j2729190
8413c2841512K1678552J9382816P349469L5328544J6793286k0764448M567950j4383196
8405C7111461K1833548k0200566K5940349L1847275l6795999L4696455j8933907J5284994
$$ plain form
8461 1404847 5901721 29523240 27489091 42266767 38272992 21660681 41170191 29173261
8453 29173261 31312742 26732002 37698700 45445904 44092948 70365725 63133292 41364906
8445 41364906 11743677 -10143242 -38049491 -45098084 -19307638 4860306 13770034 13234262
8437 13234262 16079232 -27437824 -43973467 -49896905 -42716130 -30746927 -19007460 33113688
8429 33113688 19843478 40452702 52599107 42729256 38223923 7442714 27818902 -6778189
8421 -6778189 -4302937 22787131 17272596 22776642 9047744 10884752 -20112322 -32841512
8413 -32841512 -11162960 8219856 15569325 50897869 67691155 46926707 51494657 37111461
8405 37111461 58945009 38744443 64684792 96532067 59736068 94432523 75498616 90783610
8397I0783610r646849o857591K7891842o0117111K062275k1127856k5571150m506086
8389g088916r48978K2674368m212967Q614141J9789052k137554k2694693J6155912
8381C0150365l6194928j9668942j1870599j7120070L3566282k5217954N7318508m184184
8373F778478k2196113J6863981n1426214K0743552k3153268L1952618L4535232n002548
8365I095718M4145152j2416900m055187j0377897j3639033j2054073p509152o737214
8357a3548586J2692354p45062N894094K9306451l0779342K4329453k6171407j3432817
8349a2454862N260034l2024614L7325551l4260694K3663826L805024k6606690K4495261
8341a0797164k2579413J9730826m855684J8745297K4441841l095684J7334493P922825
$$ plain form
8397 90783610 81136761 74279170 102171012 42053901 44116176 22988320 -2582830 -7088916
8389 -7088916 -8037894 14636474 10423507 19037648 38826700 36689146 13994453 30150365
8381 30150365 -6044563 -25713505 -37584104 -54704174 -21137892 -46355846 10962662 6778478
8373 6778478 -15417635 1446346 -49979868 -29236316 -52389584 -20436966 14098266 9095718
8365 9095718 53240870 40823970 36768783 26390886 12751853 697780 -6811372 -13548586
8357 -13548586 -856232 -1601294 4292800 33599251 2819909 27149362 977955 -12454862
8349 -12454862 -7194828 -39219442 -1893891 -36154585 -12490759 -8685735 -35292425 -10797164
8341 -10797164 -33376577 -13645751 -18501435 243862 24685703 21590019 38924512 46847337
8333D6847337j1749934j3619921R551446j8807408M334926m995754J7381807K297976
8325C1240475j0664894M7562624j7909414J3962018j242784j2740866k0517915n1675289
8317b1986045R435045l6526889l069118K5833012K6462548K5480832J9861985M6641515
8309I2132885m406224k278343J71538j749282k3101093Q34996K9923081q788896N830305
8300H8568967j657956r959216m5618157k1120652J397600k0376886M624198J3867715
8292I725613J1505925l2579948m366282j2688663l2258734n639678M540278L0243197
8284c1518292r757516L1365143J6941828k5678929n86679j3225665P755247m950580
8276b9655443K5843222L9521380m229376O410252L247471k1483487r106701O637821
$$ plain form
8333 46847337 35097403 21477482 31028928 12221520 16556446 11560692 28942499 31240475
8325 31240475 20575581 68138205 50228791 64190809 62948025 50207159 29689244 -21986045
8317 -21986045 -12551000 -49077889 -52147007 -26313995 148553 25629385 45491370 92132885
8309 92132885 87726661 85448318 85619856 83870574 60769481 61604477 91527558 82738662 88568967
8300 88568967 86911011 76951795 31333638 10212986 11610586 -8766300 -4142102 9725613
8292 9725613 21231538 -11348410 -15714692 -28403355 -60662089 -66301767 -61761489 -31518292
8284 -31518292 -41275808 -9910665 7031163 -18647766 -19234445 -32460110 -24704863 -29655443
8276 -29655443 -3812221 35709159 31479783 37890035 41137506 19654019 10547318 17185139
8268A7185139J4842145J7932168j525305K9104300j2464279j9225525N723206l8791630
8260A2780219n575399k9332315m91229J3254122n671839M5510466L14523N392554K019720
8251C8200822j9726775Q215241P02827J3510317J5001150j3965049q113934k4696714
8243I127885k9413428J4923632j1750658J6661534J1306977j6634800O783585k6871872
8235b5867145K2690514m641629j0048441J5941067m0622186j6854552j8968305Q415965
8227f9954712J4565400J1899991L8118528N905676r905492J0705115J5160745p868144
8219H627107J5083318N842767m184112k4754240m591525K4329177k5285846K0518799
8211A5585445Q192550j5085551j8191030n811782K8129918j3855763K7777908L0675690
$$ plain form
8268 17185139 32027284 49959452 48434147 77538447 65074168 45848643 51571849 12780219
8260 12780219 7204820 -22127495 -22618724 -9364602 -15036441 30474025 30788548 36181102 38200822
8251 38200822 18474047 26689288 27392115 40902432 55903582 41938533 33824599 9127885
8243 9127885 -20285543 -5361911 -17112569 -451035 10855942 -5778858 1004727 -25867145
8235 -25867145 -3176631 -7818260 -17866701 -1925634 -42547820 -59402372 -78370677 -69954712
8227 -69954712 -55389312 -43489321 -5370793 534883 -9370609 1334506 16495251 8627107
8219 8627107 23710425 29553192 25369080 614840 -3976685 20352492 -4933354 15585445
8211 15585445 23777995 8692444 -9498586 -15310368 12819550 -1036213 26741695 57417385
8203E7417385J225058p011352J7869952K3465389j4759586J6922398j896142k3659264
8195F9573838n3530036j3189123P7363k5969368M4736868L2631395K5869522n673392
8187G4527067M319294n598991o2899645j6098630j9582660k4841666k1346506J5992843
8179e5528894J3443785r160802J5862487J5220433L087734j8195607L3006107P831306
8171E566549K061258K3187163N892880Q057568m2590077M728068j9427339k8256815
8163d0780745J5477660O988257L0574561o653245K1036932J435563k6561552n537785
8155d020354n988286P098348j3172082J3984629L345256p123361n774920R262335J9851447
8146A7463012p017648K1542943P538059J002393j3007463M702550J6820028j4019652
$$ plain form
8203 57417385 58642443 51631091 69501043 92966432 78206846 95129244 93233102 69573838
8195 69573838 16043802 2854679 2932042 -23037326 21699542 54330937 80200459 74527067
8187 74527067 78846361 73247370 10347725 -5750905 -25333565 -50175231 -71521737 -55528894
8179 -55528894 -42085109 -51245911 -35383424 -20162991 -17075257 -35270864 -2264757 5566549
8171 5566549 7627807 30814970 36707850 44765418 2175341 6903409 -12523930 -40780745
8163 -40780745 -25303085 -18314828 12259733 5606488 26643420 28078983 1517431 -4020354
8155 -4020354 -10008640 -2910292 -16082374 -2097745 1247511 -5875850 -11650770 -2388435 17463012
8146 17463012 10445364 31988307 39526366 40528759 27521296 32223846 49043874 35024222
8138C5024222J4887396J3423553J0661615j4145662J0319473J2170286l1792803r595852
8130D0952228j2024166m201062l3492693J2569728L1369808k3250924J0282742M792557
8122B6998218L206967k6608656Q854067M3395360k3750117P153517K4268215o134808
8114E7382763k7331668J150936K3249361l5107851k7918953J6959461k1899761m9061821
8106f2577533J9933250K9507702J132248K3112834O6883863M3475508l1123091K9830418
8098A20175199K388349p9592824m0145653p635327K21902l7901548M8193816P9943062
8090H5646976j2500329K5792996M5141534m435418m1396174L2463917N9971955k5260630
8082A65424827K80037K7587334l7575385q4889137p183662j6004044p5535405j7230523
$$ plain form
8138 35024222 49911618 63335171 73996786 59851124 70170597 82340883 50548080 40952228
8130 40952228 28928062 24727000 -8765693 3804035 35173843 11922919 22205661 26998218
8122 26998218 30205185 3596529 12450596 55845956 32095839 39249356 63517571 57382763
8114 57382763 30051095 31202031 54451392 19343541 -8575412 8384049 -13515712 -62577533
8106 -62577533 -42644283 -13136581 -12004333 11108501 77992364 121467872 90344781 120175199
8098 120175199 122563548 42970724 2825071 -4810256 -4588354 -42489902 5703914 85646976
8090 85646976 73146647 98939643 144081177 139645759 98249585 130713502 190685457 165424827
8082 165424827 165704864 193292198 155716813 70827676 63644014 47639970 -27895435 -45125958
8074d5125958K7828863J7516764k0256650Q1925800Q7799634O716496Q3574230Q5034935
8066C25014114K2070653j7182863M0132429L6087271o0133062M89818L4213575n4984120
8058C25707815n3538478J6081139l5413614p3702672o0201630n01264l6639969q3869883
8050b078556O7172562m5659j1874924K1956901N583792K8574452q9621757O1378275
8042H1045086M1220361k1392238J23679564R6661290J28197888L9706538N0939152
8035E40057641N4165917j29395425o2407107l6668986j23262859o8014622k8950602
8028A45523957J698536J240004l2294324P0182467n6833789o8803488L1004514p6468931
8020A5248946L4068904l4500196K3753056Q336368j33567597L7560980j07560762o0835549
$$ plain form
8074 -45125958 -17297095 219669 -20036981 61888819 149688453 156404949 239979179 325014114
8066 325014114 347084767 329901904 370034333 406121604 345988542 346478360 380691935 325707815
8058 325707815 272169337 288250476 252836862 179134190 118932560 118431296 81791327 -2078556
8050 -2078556 65094006 65048347 53173423 75130324 80714116 109288568 19666811 81045086
8042 81045086 122265447 100873209 224552773 321214063 449411951 489118489 540057641
8035 540057641 594223558 464828133 402421026 365752040 242489181 174474559 145523957
8028 145523957 147222493 148462497 116168173 186350640 129516851 60713363 91717877 15248946
8020 15248946 49317850 14817654 38570710 46907078 -86660519 -49099539 -156660301 -217495850
8012b17495850k8681083p7030598K2723942q8937619M8041073N9918921N749626J03948935
8004a71762653L8727681K5780117O000712k9101376M1251452j5703488r578830P1024219
7996d3362166n5422660J8932505j527771J4699768J07549614Q374806J78779282O5829868
7988B93853246O2289259J40855446K6251310J89778439M2966719J12877890J01400808
7981I70273117j25461520J2959816j62934426r3192065j05872766p7134210o745387
7974D11892559o0628681k9236469J2421601p8293350m0183297m8972396n8000360k9694106
7966G9305501o4279930M3445390l88915j5149265P3704904l4553623L8881246n7287676
7958F3677632M7932867o304611l4645400R0248464k7986020N9871537j0083311k743230
$$ plain form
8012 -217495850 -246176933 -323207531 -300483589 -389421208 -341380135 -281461214 -275711588 -171762653
8004 -171762653 -133034972 -107254855 -101254143 -130355519 -89104067 -104807555 -114386385 -43362166
7996 -43362166 -98784826 -79852321 -81380092 -66680324 40869290 49244096 228023378 293853246
7988 293853246 356142505 496997951 523249261 713027700 755994419 868872309 970273117
7981 970273117 844811597 857771413 694836987 601644922 495772156 418637946 411892559
7974 411892559 351263878 322027409 334449010 256155660 215972363 166999967 108999607 79305501
7966 79305501 15025571 58470961 58082046 42932781 116637685 82084062 120965308 63677632
7958 63677632 111610499 105305888 70660488 160908952 132922932 192794469 182711158 179967928
7950A79967928M2607075j06686091M8724658j6877386j7710503M1917669J4806942
7943A86750292O1781516K336557M9293027O2412229j9169898m458151L139147p9612830
7935B62471889m2324604n9282780j7087742l6553509q9095763K1996877j27263551
7928h7139183o2624831l0522440m3740425N6026388l0875917J22970131J4744315l534829
7920f4696791Q9619988j6277711O5930007L215411M9157624J3654738o9575825J2622801
7912H3650242k4875842l8839155J7572855N202876Q035869j997416N678597O9784692
7904A24212718k3979441K0845611J9610045r2771109k5704959q8187302l793558l0346386
7896a00114381k9412534P0782173o7127976J0291735q671886l328368L3287054J83320
$$ plain form
7950 179967928 222575003 115888912 164613570 147736184 130025681 171943350 186750292
7943 186750292 248531808 250868365 300161392 362573621 343403723 338945572 342084719 262471889
7935 262471889 220147285 160864505 143776763 107223254 18127491 40124368 -87139183
7928 -87139183 -149764014 -180286454 -224026879 -168000491 -198876408 -75906277 -61161962 -64696791
7920 -64696791 24923197 8645486 74575493 77790904 126948528 140603266 71027441 83650242
7912 83650242 58774400 19935245 37508100 42710976 50746845 48749429 54428026 124212718
7904 124212718 100233277 121078888 140688933 47917824 22212865 -65974437 -69767995 -100114381
7896 -100114381 -129526915 -58744742 -125872718 -115580983 -124252869 -127581237 -94294183 -94110863
7888i4110863Q4861948J882222J180893K7979976k0617276k1442550j7731867j6054727
7880e4052244l0328573m2676255n658023J1995849k1760010N2855012L2186918J6085820
7872d1351506K5451927j88429K8001812l7131964K3025978K0046488q823636L1174831
7864D0205501N048570J5789171l6879930j2165679k1858507m7438738j2700604o472064
7856g6472280P288852j2043567K5775518P576460j1587043k096804j0577598j8071038
7848i0207500l5933144M581461j69936M780492K7719096L4165530R753781P34162J6065476
7839b8510582k732777R280310J1219013L3859480o666259j0899701O762470l4244074
7831b1932120k420217j0817892J3791825j0383362j8310551J8715778k0632863J4064004
$$ plain form
7888 -94110863 -9248915 -7366693 -6185800 21794176 1176900 -20265650 -37997517 -54052244
7880 -54052244 -84380817 -127057072 -132715095 -120719246 -142479256 -89624244 -57437326 -41351506
7872 -41351506 -15899579 -16088008 11913804 -25218160 -2192182 17854306 9030670 40205501
7864 40205501 45254071 61043242 24163312 11997633 -9860874 -57299612 -70000216 -76472280
7856 -76472280 -69183428 -81226995 -55451477 -47875017 -59462060 -61558864 -72136462 -90207500
7848 -90207500 -126140644 -121559183 -121729119 -116948627 -89229531 -55064001 -45310220 -44576058 -28510582
7839 -28510582 -31243359 -21963049 -10744036 23115444 16449185 5549484 12311954 -21932120
7831 -21932120 -24352337 -35170229 -21378404 -31761766 -50072317 -31356539 -51989402 -37925398
7823c7925398K5557646K6566230R336254r383890l849557l4766049k9987512j055356
7815e5507632K991778j2789700Q320286m878716j1355464p573379J3705853L5449450
7807c1637524M332925M0194806J4803901r087029r992065j5450574j333055k8264891
7799c6433506R756122N664636m613176M826764J2006258J0402040j3565519J3973160
7791B016779k330547j580313K865897K2443368K1912157n840352J4626293k3585812
7783C0527470l6855513l7460167j7937934j664668j99313K9162868J2332123o767422
7775b8862556j6614586J340823n940208J3415600L0176298J4670722K572678l7065207
7767b6306436j1612595l8769740j4917074K1135190N169711K6722246j1807140R720133
$$ plain form
7823 -37925398 -12367752 14198478 23534732 14150842 10301285 -24464764 -54452276 -55507632
7815 -55507632 -52515854 -65305554 -56985268 -61863984 -73219448 -80792827 -67086974 -31637524
7807 -31637524 -27304599 12890207 27694108 18607079 8615014 -6835560 -8168615 -36433506
7799 -36433506 -26677384 -21012748 -25625924 -20799160 -8792902 1609138 -11956381 2016779
7791 2016779 -313768 -1894081 971816 23415184 45327341 39486989 54113282 30527470
7783 30527470 -6328043 -43788210 -61726144 -63390812 -63590125 -34427257 -22095134 -28862556
7775 -28862556 -45477142 -44136319 -50076527 -36660927 -6484629 8186093 10758771 -26306436
7767 -26306436 -37919031 -76688771 -91605845 -70470655 -65300944 -38578698 -50385838 -40665705
7759d0665705j0546354j5479922J9478342l358763J1384857N70595J0501833R355481
7751a8759636M243327J0424349K376214j3454719j1402499Q981140N625496L6272150
7743B4305822K0280737J9229993q114734l8851725r879994l2293900R844122J1086685
7735d392994J1240056J4058910j7673919J1531857L063172K2001788K7675310J7625615
7727H5129795J591203k0596192k0575911j9526828j878957o354506J7788304p238383
7719B8338525j3551389j1657640l6289587j2542375m0999589o851340q02701K069119
7711i2286977N0973770L1244088M2916660Q251161j7511036k4808376m8153676j5634340
7703f5008726Q140855J1923254K3227550J2988986q000246m216513k1938230J0447342
$$ plain form
7759 -40665705 -51212059 -66691981 -47213639 -50572402 -39187545 -38616950 -28115117 -18759636
7751 -18759636 -14516309 -4091960 -1715746 -15170465 -26572964 -17591824 -11966328 24305822
7743 24305822 44586559 63816552 55701818 16850093 6970099 -25323801 -15479679 -4392994
7735 -4392994 6847062 20905972 3232053 14763910 17827082 39828870 67504180 85129795
7727 85129795 86720998 66124806 45548895 26022067 24143110 17788604 35576908 28338525
7719 28338525 14787136 3129496 -33160091 -45702466 -86702055 -93553395 -94356096 -92286977
7711 -92286977 -41313207 -10069119 32847541 41098702 23587666 -1220710 -49374386 -65008726
7703 -65008726 -56867871 -44944617 -21717067 -8728081 -16728327 -20944840 -42883070 -32435728
7695c2435728M230129o999717K8333669j7705420J4360555r73455k248229J9921730
7687F483534l3643939J8852454j1534556l533407K7402913p023170K6665379j3743842
7679I925366L68583J6270534j3168116K0052904m852474k4505150k4420409m3710873
7671f4039635o303110L200189J1816706N3443958O412976J4213758R208214j0950172
7663A7002884K7581577j6688086K1121990n586781l4186579J8187999k2538478K0835041
7655B5729567n519967j7232290n851425o0190972O819161Q037096K3210210M7922973
7647B2924353J5233885K1439814j5994033k943238K2728567q252954q30042j4382861
7639C9923491m5584401k2175413m010406M6302610M8386408J1766868J5654247o7598028
$$ plain form
7695 -32435728 -28205599 -35205316 -6871647 -24577067 -10216512 -11189967 -13438196 6483534
7687 6483534 -27160405 -8307951 -19842507 -23375914 4026999 -2996171 23669208 9925366
7679 9925366 10293949 26564483 13396367 33449271 28596797 4091647 -20328762 -64039635
7671 -64039635 -70342745 -67142556 -55325850 -1881892 4531084 18744842 27953056 17002884
7663 17002884 44584461 27896375 49018365 43431584 9245005 27433004 4894526 25729567
7655 25729567 20209600 2977310 -2874115 -63065087 -56245926 -48208830 -24998620 22924353
7647 22924353 38158238 59598052 43604019 40660781 63389348 55136394 54306352 39923491
7639 39923491 -5660910 -27836323 -31846729 14455881 62842289 74609157 90263404 22665376
7631B2665376o1263050k4906931J365306N8166449K6924889M9539288j0408670m1884352
7623B0198305O637686r614277K3424630N242563L850592j7348329m0757323J9106717
7615A0740564K1944256J7336089J3198510j4462100m7842269m3588745n81106L0297598
7607a2957203J6590501R392068p644669o7952701l2430912J1368625M7508005O0006465
7599B3880179M1019111L1622856m9555057l0366151Q301750J2314028L1433578J6145047
7591H4795341r80043o5235827n1135999q671005k734698J8558030L9375987K5251229
7583C9223015k0509812N725743J4840547L593658q481048n34795j4909093n7358974
7575c8410759P816612K2931047J8243577K3649535J8621518N25521m9157648J620190
$$ plain form
7631 22665376 -38597674 -63504605 -62139299 -3972850 22952039 72491327 62082657 20198305
7623 20198305 26835991 17221714 40646344 45888907 49739499 32391170 -8366153 10740564
7615 10740564 32684820 50020909 63219419 48757319 915050 -42673695 -43254801 -12957203
7607 -12957203 3633298 13025366 5380697 -62572004 -95002916 -83634291 -36126286 23880179
7599 23880179 64899290 96522146 46967089 16600938 24902688 37216716 68650294 84795341
7591 84795341 83815298 18579471 -32556528 -41227533 -43962231 -25404201 13971786 39223015
7583 39223015 18713203 24438946 39279493 42873151 34392103 33857308 18948215 -38410759
7575 -38410759 -30594147 -7663100 10580477 34230012 52851530 53377051 4219403 5839593
7567E839593J0625829j8924787r76217O119958j5097684k6184226K2737412L3155689
7559A7295567J324539M447881K4114137k2915878k0110948L4783116J7535494N218093
7551F1692001k720211K4236176k1585330l1704533L1527895k4824901l8970771l0355047
7543c2704721p783504j3295194r195114O1784486q24697m6015584k3865779k1113571
7535i3013678j4347008K6541222Q6832381L7619497l0333530j9695399l1216580m9249006
7527h6862101K4801255P6076164L9750175m863560n751981j4099498n8564114J4917386
7519a4596274N3094650J152283p734565k424496N523807k4315236L7602847O1857024
7511A10160040k6558233l3070468k8280477k1974374j4668931N0412888P3798656l1464766
$$ plain form
7567 5839593 16465422 -2459365 -3435582 2684376 -12413308 -38597534 -15860122 17295567
7559 17295567 18620106 23067987 47182124 24266246 4155298 38938414 56473908 61692001
7551 61692001 58971790 83207966 61622636 29918103 61445998 36621097 -2349674 -32704721
7543 -32704721 -40488225 -53783419 -62978533 -1194047 -2018744 -48034328 -71900107 -93013678
7535 -93013678 -107360686 -80819464 6012917 43632414 13298884 -6396515 -37613095 -86862101
7527 -86862101 -62060846 14015318 53765493 48901933 43149952 29050454 -29513660 -14596274
7519 -14596274 38498376 39650659 31916094 29491598 35015405 10700169 48303016 110160040
7511 110160040 83601807 50531339 22250862 276488 -14392443 36020445 109819101 78354335
7503G8354335n5120502n7848590p6330425l6934763M9965618Q9918372K1789455J831488
7495A5624988O98413n4174458l4123246L8494000M1235611J309949l904403J1511310
7487A6672164k4019840j0430172O6022703K5370991k0812646k2092334l5200152m6302344
7479e0791630l1876508N5421151K5782664j6857534K0661322j4514919k2295150o704022
7471d1174626L7814763R578277m3684164J3096016j0695103j7243091L5398666N2856560
7463C5947298J8117264k7827405L478028j7581578m0009316K1186734L4522479j3987720
7455A3845784k0328077J893230j6648997k9181801J4410668K7713521l8902738j9707965
7447f6906375J2261841j2996141K116606L1352313L5543366l7138429j3531261K2679047
$$ plain form
7503 78354335 23233833 -34614757 -110945182 -147879945 -97914327 -7995955 13793500 15624988
7495 15624988 16323401 -37851057 -71974303 -33480303 7755308 9065257 5160854 16672164
7487 16672164 -7347676 -17777848 48244855 73615846 52803200 30710866 -4489286 -50791630
7479 -50791630 -82668138 -27246987 -1464323 -18321857 2339465 -12175454 -34470604 -41174626
7471 -41174626 -3359863 6218414 -37465750 -24369734 -35064837 -52307928 -16909262 35947298
7463 35947298 54064562 26237157 29715185 12133607 -27875709 -6688975 27833504 13845784
7455 13845784 -6482293 -4589063 -21238060 -50419861 -36009193 -8295672 -47198410 -66906375
7447 -66906375 -54644534 -67640675 -65524069 -34171756 1371610 -35766819 -49298080 -26619033
7439b6619033j5175937J6112974L6908390K7199982l8876866q525336K9145062j8902147
7431A267089J5059737J5794581k2103393q4162494m6106896J0114932j1690049N5211661
7423f6614832P3036115J6132702m3976702k9371176q023181l0737389K5914940O6371355
7415B731832J3384650k1455665J8934928L027736q759939J4675850L4077538j3375747
7407D3241183n7248564K7105913o691937j692540L2612155R333547j5258936o9853803
7399c8452982K9860225J6429421J5059133Q2787437K1612004j5709185o7461327j6980071
7391B7144655j1262848j7056726O7532272L8264998j5071985k3478517j4432869l2194013
7383A9444967k8752266Q666224J9279828l5202891p745110K8131969k1843403J8242414
$$ plain form
7439 -26619033 -41794970 -25681996 11226394 38426376 -450490 -8975826 20169236 1267089
7431 1267089 16326826 32121407 10018014 -74144480 -120251376 -110136444 -121826493 -66614832
7423 -66614832 6421283 22553985 -21422717 -50793893 -58817074 -89554463 -63639523 2731832
7415 2731832 16116482 -5339183 13595745 16623481 7863542 22539392 56616930 43241183
7407 43241183 -14007381 13098532 6406595 4714055 37326210 46659757 31400821 -38452982
7399 -38452982 -8592757 7836664 22895797 105683234 127295238 111586053 44124726 27144655
7391 27144655 15881807 -1174919 66357353 104622351 89550366 66071849 51638980 19444967
7383 19444967 -9307299 -641075 18638753 -16564138 -24309248 3822721 -18020682 221732
7375B21732Q075102J0192160l1698354k5984492L7960120l5773510J8756966N442782
7367a2807494k4410863l2488845m1317757K8682652k2026227K8318183M4098236K383649
7359b9568466J1327998J1895214M0245319K902059J6334749J5866413l0802368l7990176
7351B10742m883672k033694p243355K1709387R564727l999333k9773304J7299393m181774
7342c330883j9392417K5609941j8034458j538542k5727715J9780134K197473l5339318
7334e5775785K3745565l8583225j0196049K551934M0634008M8587881M622217M7878826
7326F3465372k4232082l5682930o603342Q435700J3820677K243767K1674687k2947122
7318B0174727n1711311j9421739N327220j6444846K3226509L1838099K825816n750476
$$ plain form
7375 221732 8296834 18488994 -13209360 -39193852 -1233732 -37007242 -18250276 -12807494
7367 -12807494 -37218357 -69707202 -111024959 -82342307 -104368534 -76050351 -31952115 -29568466
7359 -29568466 -18240468 -6345254 33900065 36802124 53136873 69003286 38200918 210742
7351 210742 -4672930 -6706624 -13949979 7759408 17324135 13324802 -16448502 850891 -3330883
7342 -3330883 -22723300 2886641 -15147817 -16686359 -42414074 -22633940 -20436467 -55775785
7334 -55775785 -32030220 -70613445 -80809494 -78257560 -37623552 10964329 15586546 63465372
7326 63465372 39233290 3550360 -3052982 5382718 19203395 21447162 43121849 20174727
7318 20174727 -31536584 -50958323 -45631103 -62075949 -38849440 -7011341 -4185525 -9936001
7310i936001l958686K8527665l8407468O48597R570799l5450793K282500K270471M6470823
7301B017907j1784688N904108K5357473m2519357K096607J7894367M1596831N360542
7293D5923790Q265908J6285532n2334841l2151330K401138J2128833p983707J8318952
7285A0854275J5478958l3400930l0104461J597651M109674k2211978K7414888K3122164
7277c139759m330215L890280K6383034J6467693l5608547L609239j9473356m0561019
7269e2762650j8409211J8060842L3336994n872705N1713098K5637875k525032J2571744
7261F1750955J8157267K2771056l3492583J2267984q382429m6826066j4207130j1843499
7253A95555n364173l8510246n515650j300950l2965615Q576491L8507624L1389951
$$ plain form
7310 -9936001 -13894687 14632978 -23774490 -23125893 -13555094 -49005887 -46723387 -44452916 2017907
7301 2017907 -9766781 -3862673 21494800 -21024557 -18927950 -1033583 40563248 45923790
7293 45923790 54189698 70475230 18140389 -14010941 -11609803 519030 -7464677 10854275
7285 10854275 26333233 -7067697 -37172158 -35574507 -31464833 -53676811 -26261923 -3139759
7277 -3139759 -7469974 -3579694 22803340 39271033 3662486 7271725 -12201631 -52762650
7269 -52762650 -71171861 -53111019 -19774025 -25646730 26066368 51704243 49179211 61750955
7261 61750955 79908222 102679278 69186695 81454679 73072250 26246184 12039054 195555
7253 195555 -5168618 -43678864 -49194514 -50495464 -83461079 -74884588 -36376964 -4987013
7245d987013K0428675K8650854N213572l3015658m3050672l994864k1097537j8742481
7237g0595124K9958666K129623M499642j6387260J1062447M168797k4531479M0081911
7229a9612777M87580O78869n910861o038683N012810l1750947K4388820N863448p718926
7220c4600667M125919J561367N621214j4351806J5384557R894293k342400M042618
7212a0664905K4810634J6256250N953508J8817172j0278197k5135841m4734589j0980018
7204c5955986l102015J1775793N2150659K9314123J5161312l0556386k3251217l6602623
7196b1066340k7697895J4980600J1451052K2464441j6872477J025030k3147784k3357444
7188f2220817J1238659N2912K8988919p293405K3023334J2469619N93217L5148992
$$ plain form
7245 -4987013 15441662 44092516 49306088 16290430 -26760242 -30755106 -51852643 -70595124
7237 -70595124 -40636458 -38506835 -34007193 -50394453 -39332006 -35163209 -59694688 -19612777
7229 -19612777 -19125197 -18446328 -24357189 -30395872 -25383062 -57134009 -32745189 -26881741 -34600667
7220 -34600667 -30474748 -28913381 -23292167 -37643973 -22259416 -12365123 -14707523 -10664905
7212 -10664905 14145729 30401979 36355487 55172659 44894462 19758621 -24975968 -35955986
7204 -35955986 -39058001 -27282208 24868451 54182574 69343886 38787500 15536283 -21066340
7196 -21066340 -48764235 -33783635 -22332583 131858 -16740619 -15715589 -38863373 -62220817
7188 -62220817 -50982158 -50929246 -21940327 -29233732 -6210398 6259221 6852438 42001430
7180D2001430J0458706K2817290j3773423j0556098j4204759l1494917r602278m238041
7172h592090l821001r703890L811071k54940J4155429N34966K2074950L658041k8373461
7163f510925M785270k9021824J4154657M647424K6505862L6900181k8193713O222566
7155B9489498m5143489l1931745j7656940k883484L8335435J607317K2498967k463322
7147h147763k5973885k3193770l335194Q853081J2765854K1463151J2532364K486967
7139b549195k6490574J6380914p29126N772921K4189428l492070P336698l2929814
7131a2510818J0613840L695444k882005K6797136j042813q41342k3980987M699298J173874
7122E721627K3872N763091n443413k4627816l9243199M987887p216438K0927243J5049648
$$ plain form
7180 42001430 52460136 75277426 61504003 50947905 36743146 5248229 -4354049 -8592090
7172 -8592090 -12413091 -22116981 -18305910 -18560850 -4405421 -3870455 18204495 21862536 -6510925
7163 -6510925 -1725655 -30747479 -16592822 -11945398 14560464 51460645 23266932 29489498
7155 29489498 -15653991 -47585736 -65242676 -68126160 -29790725 -28183408 -5684441 -8147763
7147 -8147763 -34121648 -57315418 -60650612 -51797531 -39031677 -17568526 -5036162 -2549195
7139 -2549195 -29039769 -12658855 -13387981 -7615060 16574368 13082298 20418996 -12510818
7131 -12510818 -1896978 1798466 -1083539 25713597 24670784 23829442 -151545 4547753 5721627
7122 5721627 5745499 11508590 6065177 -18562639 -57805838 -52817951 -60034389 -39107146 -24057498
7113b4057498J824340j8806697n5144029k917770j5901557K0987357M0813250K6853889
7105b6348715J4801589j8341208L667698l875069O092952J9033606J4089147k0138595
7097a1018595j8867244j1812957o357357K2533781J3719353L5671640k0385658j6272961
7089a2789998n815968j8570502L3438862J9561783M7803306O644312o675437K899105
7081F6495463k6118096J939976l050987O083978j6465544j4888492j0672898j1263375
7073g939975j402925M660144J0600081k1626521k718849j2259104K859577J0205758
7065a7621814J7762190K4340260j4840425j711220k3790519j0942591j6465806R574349
7057c3695576J4372498p219078K0599721j3485839J3841554j8245839J2019981J6919873
$$ plain form
7113 -24057498 -22233158 -41039855 -96183884 -99101654 -115003211 -94015854 -53202604 -26348715
7105 -26348715 -11547126 -29888334 -26220636 -30095705 -24002753 -4969147 9120000 -11018595
7097 -11018595 -29885839 -41698796 -48056153 -25522372 -11803019 23868621 3482963 -12789998
7089 -12789998 -18605966 -37176468 -3737606 15824177 63627483 70271795 63596358 66495463
7081 66495463 40377367 42317343 39266356 45350334 28884790 13996298 3323400 -7939975
7073 -7939975 -9342900 -4682756 5917325 -15709196 -18428045 -30687149 -27827572 -17621814
7065 -17621814 140376 24480636 9640211 7928991 -15861528 -26804119 -43269925 -33695576
7057 -33695576 -19323078 -26542156 -5942435 -19428274 -5586720 -23832559 -11812578 5107295
7049E107295j8512609L5337278j1805645J7568087o357492p81736K2351064k4812700
7041A8093542K1039538M160510n983891J629798n25083M10358k492923j6818472Q716920
7032B8230297k9815270m8869198P274906n5432377J3974819m451100J9505230M5273252
7024b4309441l9017243P5006432j8725580J7226285M8593671p411133N0715450n4798046
7016D7280395R217420k9997209p5314354N476766l3615147j1547191n22734R502447
7008g9519607M0063580R171328K5531386O5064424l9357215N919756l914410m5629796
7000b2670554J5981882n0285387O1534694l8593454k8828073N2369378p0562870M3827162
6992c7227222j3160987N3618849L0675257k6156895Q4846236m0555963j475969M996786
$$ plain form
7049 5107295 -13405314 21931964 10126319 27694406 21336914 20555178 42906242 18093542
7041 18093542 39133080 43293590 37309699 38939497 38414414 38824772 36331849 19513377 28230297
7032 28230297 -1584973 -50454171 -43179265 -98611642 -84636823 -89087923 -69582693 -24309441
7024 -24309441 -63326684 11679748 -7045832 10180453 58774124 51362991 102078441 47280395
7016 47280395 56497815 26500606 -48813748 -43336982 -76952129 -88499320 -89022054 -79519607
7008 -79519607 -39456027 -30284699 -4753313 60311111 20953896 26873652 22959242 -22670554
7000 -22670554 -6688672 -56974059 4560635 -34032819 -62860892 -10491514 -81054384 -37227222
6992 -37227222 -50388209 3230640 33905897 7749002 92595238 52039275 50563306 55560092
6984E5560092j0205864q365499l9416107J8847378j2967352l8530274J9335010J8241777
6976B499161l4530955J9985210j36808J5999525j6645979R093206P4477291m5138178
6968B5602473O8357220K5463488J1565392N647342m7047166M1276857j11573386n810191
6960A3482029J33759l7915609K4107800k5545697O1075954n4973337j3334389K3745176
6952i224314n3348966m011331j474369L5232362R392686K2337670O8730532K3635477
6944I1269747k2541098L8526932j7293232k9793771P774150j1551462N0139551o9294004
6936C7236813K9734248j5711838j04690200J0819325r3280043J7106070o6444607j3862496
6928a99092728O1388905q2132592P2127345K117079K4128685K8686675j9030193O5385734
$$ plain form
6984 55560092 45354228 36988729 -2427378 16420000 3452648 -35077626 -15742616 2499161
6976 2499161 -32031794 -12046584 -12183392 3816133 -12829846 -3736640 70740651 25602473
6968 25602473 93959693 119423181 130988573 136635915 89588749 130865606 19292220 13482029
6960 13482029 13615788 -24299821 -192021 -25737718 35338236 -19635101 -32969490 -9224314
6952 -9224314 -62573280 -66584611 -68058980 -32826618 -23433932 -1096262 67634270 91269747
6944 91269747 68728649 107255581 89962349 60168578 67942728 56391266 106530817 37236813
6936 37236813 66971061 51259223 -53430977 -42611652 -135891695 -118785625 -185230232 -199092728
6928 -199092728 -137703823 -219836415 -147709070 -145591991 -121463306 -92776631 -111806824 -46421090
6920d6421090m6170183r678876L5881107l4671769l187591j796886k2441522K711448
6912a25775362o3171123K8137339K0534735m3169367J01972559P57329O5813270L6119756
6904B1219136J4358785J04987598p5248768N9904570o639089n9928993R094531p0175050
6896b427280M5453446m4901452O901073P3965747l3480876K0375296J1407203O85923
6888G7979080J61557j5944347M4054677J0699758m5946480M9566870k0438343m7669322
6880E2463450j1556005n0635369o498692r6505652J3272629L5657523l8667381Q7274525
6872a5194972M0187647M6091689j4076759n45067L3271670p6353967J0608262K8940053
6864E2928556j3206060j8613353J2317628J9987699m0806875n891205L7843471j1286073
$$ plain form
6920 -46421090 -92591273 -102270149 -66389042 -101060811 -104248402 -106045288 -128486810 -125775362
6912 -125775362 -188946485 -160809146 -140274411 -183443778 -81471219 -80713890 -14900620 21219136
6904 21219136 35577921 140565519 65316751 125221321 118582232 58653239 67747770 -2427280
6896 -2427280 43026166 -1875286 5025787 78991534 45510658 65885954 77293157 77979080
6888 77979080 78140637 62196290 106250967 116950725 71004245 120571115 100132772 52463450
6880 52463450 40907445 -9727924 -16226616 -112732268 -99459639 -63802116 -102469497 -15194972
6872 -15194972 24992675 71084364 57007605 56462538 89734208 13380241 23988503 52928556
6864 52928556 39722496 21109143 33426771 53414470 12607595 6716390 44559861 33273788
6856C3273788m1550186L3229225N760722m0283882m302856J8340481j4626122n6446133
6848f6604963L0589326J8529624k8921691K8533955N3697590Q098234k5337519M0724167
6840E9308723J3738583l8420147n638549J9232193l6002277p0164915J6988546j3516940
6832e4474783m0478916J3901931L2703694O630724l5831440M5352086J9490929m0443396
6824e3149171L0659812K6849954j451533j4978842L0520603K9644865m7203111L846865
6816D739442J3469813m9172670k6296872J7159901K1045794l211401J9242733N0407642
6808D7384382j8250387k5672596L2576004q459856j3412788M765601J0309850j0579711
6800A8660499m6768541K6752890k786119k5443842K5589435J570851K450352k6422285
$$ plain form
6856 33273788 -8276398 24952827 30713549 -9570333 -13873189 4467292 -10158830 -66604963
6848 -66604963 -36015637 -17486013 -46407704 -17873749 35823841 43922075 18584556 59308723
6840 59308723 73047306 34627159 28988610 48220803 12218526 -57946389 -40957843 -54474783
6832 -54474783 -94953699 -81051768 -48348074 -41717350 -77548790 -32196704 -12705775 -53149171
6824 -53149171 -22489359 4360595 2909062 -12069780 18450823 48095688 892577 4739442
6816 4739442 18209255 -30963415 -57260287 -40100386 -19054592 -22265993 -3023260 47384382
6808 47384382 29133995 3461399 36037403 27577547 14164759 18930360 29240210 18660499
6800 18660499 -28108042 -1355152 -4141271 -29585113 -3995678 -2424827 25525 -26396760
6792b6396760J1873269R757962l5695306J0881970Q7885r908506n803536K3670543
6784b1532479L1252850J1133019K0876571J8693458r124640l4747379n745911k6427121
6776a5621632k6326269k0162169j5238122J606036k6245253K6350454K1821412J7470285
6768c6345258K5068248J0700014J6678772k5470671l406383n08815k553849N51914
6760a5286028J7701713K2914889r740062Q933909l647875P488640j4313992J8013200
6752C2064394L5867434j0812619J9695084j1870519j5353455n1683221l9252031p029870
6744d8374803m8183362O52044J3972172J9404471N064856K3571615L0596172j2277521
6736a5574356m199672P726809J0155811j6421298L3842440K3769979j3177705j4709208
$$ plain form
6792 -26396760 -14523491 -4765529 -40460835 -29578865 -29490980 -39399486 -45203022 -21532479
6784 -21532479 9720371 20853390 41729961 60423419 51298779 16551400 10805489 -15621632
6776 -15621632 -41947901 -62110070 -77348192 -75742156 -101987409 -75636955 -53815543 -36345258
6768 -36345258 -11277010 -576996 16101776 -9368895 -12775278 -13284093 -15837942 -15286028
6760 -15286028 2415685 25330574 15590512 24524421 20876546 28365186 14051194 32064394
6752 32064394 67931828 57119209 76814293 64943774 49590319 -2092902 -41344933 -48374803
6744 -48374803 -96558165 -95906121 -81933949 -62529478 -57464622 -33893007 -3296835 -15574356
6736 -15574356 -19774028 -12047219 -1891408 -18312706 15529734 39299713 26122008 11412800
6728A1412800k6428998j6230437n4028675J9486766L3820728R335008L1075195J4422174
6720B2864561Q148685l8748442N484260R454806j6233234p71948M813368n477073l6738706
6711d7203723J4374240N152558k781470J225076J0535743P686099k8232901K8534308
6703a0710070J0882344j972460L160347j558545m001598k7120592J5296386J6899986
6695H75798J729658K092772O145605k3126194k4882547k026761l277387J0457810r265187
6686d1276433K3127078n068637n773391L2408159L416018L3739307k921560q73243
6678C6777298j0540966m2237533K801623r189186J4486990K3853782K034871P743499
6670B5730378k1470470l3483892j6405360k9758853o360282m56989l763797K9109069
$$ plain form
6728 11412800 -15016198 -31246635 -85275310 -65788544 -31967816 -22632808 8442387 22864561
6720 22864561 31013246 -7735196 -2250936 7203870 -9029364 -9801312 -4987944 -10465017 -47203723
6711 -47203723 -32829483 -27676925 -30458395 -29233319 -18697576 -11011477 -39244378 -10710070
6703 -10710070 172274 -1800186 1360161 -198384 -4199982 -31320574 -16024188 875798
6695 875798 2605456 4698228 10843833 -12282361 -37164908 -39191669 -42469056 -32011246 -41276433
6686 -41276433 -18149355 -23217992 -28991383 3416776 6832794 40572101 37650541 36777298
6678 36777298 26236332 -16001201 -13199578 -22388764 -7901774 15952008 17986879 25730378
6670 25730378 4259908 -29223984 -45629344 -75388197 -81748479 -82205468 -85969265 -56860196
6662e6860196j1322132K0351156J9285494q418548K4461299o999285K4628265n17355
6654D608698k145389L1916406k2776028j914639L50835r657475L331509j05747L1398209
6645C5006379J1640379j5594723J9253491j9173959k8899684M830246L77020K1934887
6637B9374036r457592K1404789N134917n0554294L246561j2754899j700423O475558
6629h831347K7149337L3567531k3677764L514863n209501l6263490j8707244J6100167
6621a2357448K2280480J8271394M1763812M9236885K870722k3281274l702968n2242871
6613D2838732n3692697k9473657m808370p404623j4037211L8908075j0112076j0486412
6605d8268239J716520O545982K361476j1527993N1436344P883398J5344057L0074049
$$ plain form
6662 -56860196 -68182328 -47831172 -28545678 -36964226 -12502927 -19502212 5126053 4608698
6654 4608698 2463309 34379715 11603687 9689048 10039883 382408 3713917 3608170 35006379
6645 35006379 46646758 31052035 50305526 31131567 2231883 7062129 7439149 29374036
6637 29374036 19916444 41321233 46456150 -4098144 -851583 -13606482 -15306905 -8831347
6629 -8831347 18317990 51885521 28207757 31722620 26513119 -9750371 -28457615 -12357448
6621 -12357448 9923032 28194426 69958238 119195123 122065845 98784571 95081603 42838732
6613 42838732 -10853965 -40327622 -45135992 -52540615 -66577826 -27669751 -37781827 -48268239
6605 -48268239 -46551719 -40005737 -37644261 -49172254 2264090 10147488 25491545 55565594
6597E5565594J5878428K479666l4960225K316250m0827461m5312296j1585712j1531122
6589f7976878j1004912p305955J4359321K397026r767396J743824J8387778k7472654
6581h6639846K95796J818135r136812K1066145j822443N9665396l746032N727672J8223378
6572E451389m9076081J831639m5079354O978052m902271k2044732L8152482j6659188
6564h5348064J5773989R861674L691213J6083599j2399315N907714J6536324l424225
6556c3317091L2614148L2757011M781637K3563561m0827374o601063m0941333m5916913
6548g3887417K8600219l2563424M3196828K358335J0887398K5846733m7753934L0708941
6540a2606321k9397542q584206J3264533r029720L3928427n348227K4427143K6507543
$$ plain form
6597 55565594 71444022 73923688 38963463 41279713 452252 -44860044 -56445756 -67976878
6589 -67976878 -78981790 -86287745 -71928424 -69531398 -79298794 -77554970 -59167192 -86639846
6581 -86639846 -86344050 -84525915 -93662727 -72596582 -74419025 -14753629 -18499661 -12771989 5451389
6572 5451389 -43624692 -41793053 -86872407 -79894355 -84796626 -106841358 -68688876 -85348064
6564 -85348064 -69574075 -59712401 -56021188 -39937589 -52336904 -46429190 -29892866 -33317091
6556 -33317091 -702943 32054068 36835705 60399266 19571892 12970829 -27970504 -73887417
6548 -73887417 -45287198 -77850622 -34653794 -32295459 -21408061 4438672 -43315262 -12606321
6540 -12606321 -42003863 -50588069 -37323536 -46353256 -12424829 -17773056 6654087 33161630
6532C3161630j1795928R754310R058014j4357762J0347355k098003K0082173R422948
6524F3574737k2778831L3042584m4821908j8295988j1871078l5162429P935290m8607366
6516g6984989K0442422k5953216l7560939J8808985j9325515K4563677M740509K8813381
6508f2455685J4529607k8980383P991681k598906p093463K0951720L2517904J7928744
6500g208781N491654l707151J4851361k4308026n913578K2643371k3738796L620318
6492a8269628j1593698J8301414M046215j374473M3430594k6801366j5347388j9148024
6484b6756354j1727261K186165J699271M8221998M46155j9679914j1959734k8130350
6476d5700024k6712336n656116K2156656J3693545q079260O331845J139945l1837508
$$ plain form
6532 33161630 21365702 31120012 40178026 25820264 36167619 34069616 54151789 63574737
6524 63574737 40795906 73838490 29016582 10720594 -1150484 -36312913 -28377623 -76984989
6516 -76984989 -56542567 -82495783 -120056722 -101247737 -120573252 -96009575 -91269066 -62455685
6508 -62455685 -47926078 -76906461 -68914780 -71513686 -78607149 -57655429 -25137525 -7208781
6500 -7208781 -1717127 -5424278 9427083 -14880943 -20794521 1848850 -21889946 -18269628
6492 -18269628 -29863326 -11561912 -7515697 -8890170 34540424 7739058 -7608330 -26756354
6484 -26756354 -38483615 -36297450 -34598179 13623819 14069974 -5609940 -17569674 -45700024
6476 -45700024 -72412360 -78068476 -55911820 -42218275 -50297535 -43965690 -42825745 -74663253
6468g4663253J148596m77063r728681j3006504n054097K6699727m152467L5964925
6460d3268817M0579854j770597k649405j9113823k182113j3262622J1753840M5459259
6452A5545576K680809m524484l496055k6474250j9106501j140532L0284447K8038917
6444B1807927O881680L7109152l183912k2205128k166670k2785698j6287981l6841553
6436c7672183j1056767q282820l2590769J7097256P990172o245780P902393J288477
6428f1570021R515381j952294J4066883L8304598j0340179R989345R688963k8661635
6420b0958959k226350j6860464J4468625m492631p929113L6638453k4734526M776840
6412b1318125J3770371j235314J6303203m38211K8419221p45397j5546612K3139349
$$ plain form
6468 -74663253 -73514657 -73991720 -83720401 -96726905 -101781002 -75081275 -79233742 -43268817
6460 -43268817 -2688963 -4459560 -7108965 -26222788 -28404901 -41667523 -29913683 15545576
6452 15545576 18226385 13701901 10205846 -16268404 -35374905 -36515437 -6230990 21807927
6444 21807927 28689607 65798759 62614847 40409719 38243049 15457351 -830630 -37672183
6436 -37672183 -48728950 -57011770 -89602539 -72505283 -64515111 -70760891 -62858498 -61570021
6428 -61570021 -52054640 -54006934 -39940051 -1635453 -11975632 -1986287 7702676 -20958959
6420 -20958959 -23185309 -40045773 -25577148 -30069779 -37998892 -1360439 -26094965 -21318125
6412 -21318125 -7547754 -8783068 7520135 7081924 35501145 34755748 19209136 42348485
6404D2348485j0612947j5491965J1526850j4641364q791814k4871503p674329Q097455
6396b0111132l5454912L6789830J0194436q190370K3822726j0585521J9500634k4189716
6388h224025J2372099J9534983m2021189P190007j5699069k3936817j0313069M574831
6380e6522249K6189286J815673J7568181L8753461j0245661m865675K1573278j9630396
6372A4635898l499705q492932J6600407N535899j4866584N2686929r365081k227249
6364E1007582K0402979M918231J8874802l586M4403540P58119l4933750j2945864l8708358
6355E3773695n3128177j9420295J7133640R195147J4663609J4310711J1355647m6699682
6347A184295l0533814M749266l3029696K3231874L4858027M5252620J9737790k880257
$$ plain form
6404 42348485 31735538 16243573 27770423 13129059 4337245 -20534258 -28208587 -20111132
6396 -20111132 -55566044 -18776214 -8581778 -16772148 7050578 -3534943 15965691 -8224025
6388 -8224025 4148074 23683057 -18338132 -11148125 -26847194 -50784011 -61097080 -56522249
6380 -56522249 -30332963 -28517290 -10949109 27804352 17558691 12693016 34266294 14635898
6372 14635898 11136193 2643261 19243668 24779567 9912983 62599912 53234831 51007582
6364 51007582 71410561 76328792 95203594 95200008 139603548 140361667 105427917 92482053 53773695
6355 53773695 645518 -18774777 -1641137 7554010 22217619 36528330 47883977 1184295
6347 1184295 -29349519 -24600253 -57629949 -34398075 459952 45712572 65450362 62570105
6339F2570105J7858371n7280624m0900180o200613r361985J5650968M1719434N2396017
6331G6451493J8620548j1689293n335996k8535387n6128147J3061010J1607506J5439216
6323C3490950L8078434J2225423J8412186n2252848j7542762j6020359n4601745J8598795
6315a9611926O0595J9078737Q064843J779044K4209657l3826024K50869J1819863k0341087
6306h515429R119144P010507N690558N580654r499888K3469302j2226057j7308295
6298C320496K2342452k8134703K385348m122752k631496J6374580j8799002L9335012
6290C0069935K532881l332391K3290919k4969840o512618k8781321j1257512P291459
6282a1668488q121015L9513637K1839505M550978J3211263j5277263j0588901j4533251
$$ plain form
6339 62570105 80428476 23147852 -17752328 -23952941 -33314926 -17663958 24055476 76451493
6331 76451493 95072041 83382748 78046752 49511365 -6616782 6444228 18051734 33490950
6323 33490950 71569384 83794807 102206993 49954145 32411383 16391024 -38210721 -19611926
6315 -19611926 -19551331 -472594 7592249 9371293 33580950 -245074 5795 11825658 -8515429
6306 -8515429 603715 7614222 13304780 18885434 9385546 32854848 20628791 3320496
6298 3320496 25662948 -2471755 -86407 -4209159 -6840655 9533925 -9265077 30069935
6290 30069935 32602816 29270425 52561344 27591504 21078886 -7702435 -18959947 -11668488
6282 -11668488 -19789503 19724134 41563639 46114617 59325880 44048617 33459716 18926465
6274A8926465o752753J4382725j0167258J1941116J0098944q871971J3248764n49077
6266D2256955R061542j716864p848947M667517k0648304p168450m870275j1812740l038341
6257a117907l516425R006554O480380P275515J1317588l636607j3569444j2674538q023318
6248h458202k291418J2545626K1744962J7497697R762119j455901J550631o125996k616010
6239D2153508J3621614n46752N587810m597382o877853l729038k4966424j595858j6431273
6230B618352j7684543K886302m304928J7976789L103517Q552664J0612663k5133393
6222a372577k473117n034718q356815Q701486l397805J0587654j0986509j2269751
6214b4602152K2522908j1599317J0857471J1873420r864060M556122k0766899K8714503
$$ plain form
6274 18926465 12173712 26556437 16389179 28330295 38429239 29557268 42806032 42256955
6266 42256955 51318497 49601633 41752686 46420203 25771899 18603449 13733174 1920434 -1117907
6257 -1117907 -4634332 4372222 10852602 18128117 29445705 25809098 12239654 -434884 -8458202
6248 -8458202 -10749620 1796006 23540968 41038665 50800784 49344883 50895514 44769518 42153508
6239 42153508 55775122 55228370 60816180 56218798 49340945 45611907 20645483 19049625 2618352
6230 2618352 -15066191 -12179889 -16484817 1491972 4595489 13148153 23760816 -1372577
6222 -1372577 -3845694 -8880412 -17237227 -8535741 -11933546 -1345892 -12332401 -24602152
6214 -24602152 -2079244 -13678561 -2821090 9052330 -811730 3744392 -17022507 11691996
6206A1691996J2670279M728844M5644847j2765000n503015k5306999k6752295j6564758
6198a2156101n0588287P694726r830309j6491756L1834441J8991096K8977014J0678794
6190I109618Q646595P207220m2726249p73303J2875713j4225256K2529501L962874L659901
6181A0266614j8665137j8476613L2602222k0526490J9324344L0274151j2037444J960846
6173B4722493k5271529J1237528k3818207k2018277L0745155k2518392K74991J2030684
6165a4615554J0636352Q924943r666899K6924365o418593k3702479K0827923L90016
6157A3300074o544645O450773M918408N653331k2803580J4632974J9924374k0226641
6149A5305068K3750493L767258o146748r953929r075991K1639710k3869131J7503526
$$ plain form
6206 11691996 24362275 29091119 74735966 61970966 56467951 31160952 4408657 -12156101
6198 -12156101 -62744388 -55049662 -64879971 -81371727 -49537286 -30546190 -1569176 9109618
6190 9109618 17756213 24963433 -17762816 -18536119 -5660406 -19885662 2643839 6606713 10266614
6181 10266614 -8398523 -26875136 5727086 -14799404 4524940 34799091 22761647 24722493
6173 24722493 -549036 10688492 -13129715 -35147992 -4402837 -26921229 -26646238 -14615554
6165 -14615554 -3979202 4945741 -4721158 22203207 15784614 -7917865 12910058 13300074
6157 13300074 6755429 13206202 18124610 23777941 974361 15607335 35531709 15305068
6149 15305068 39055561 42822819 36676071 26722142 17646151 39285861 15416730 32920256
6141C2920256K2259974j7639492k324068k3266693j3348550l5847671j7096546J9306274
6133c5036516p052996J5296859K2118857K384940q324007j0054414R28916n737420n799582
6124c1275363K1435959N948390n446348J3853335l410640L409766q689322k4572L333200
6115h65595k1320990J7737004L564473J0173499J3214028m487156M493966k8622626
6107f113397o199075o966807q413550Q938712o614601o3900j5415879j1919223k919586
6098e5687306q54326O041994O119212M924726N771285R126996J3465395K8524042P200344
6089B4632362L420609j4357332l1854377k4514379l0539462J0439843o75093R515000
6081e3932829J7199234j2508200k873817k3894633L75930j0794736j4707175J3087543
$$ plain form
6141 32920256 55180230 37540738 35216670 11949977 -1398573 -37246244 -54342790 -35036516
6133 -35036516 -42089512 -26792653 -4673796 -2288856 -10612863 -20667277 -19738361 -25475781 -31275363
6124 -31275363 -9839404 -3891014 -9337362 4515973 1105333 4515099 -4174223 -4198795 -865595
6115 -865595 -22186585 -4449581 -885108 9288391 22502419 18015263 22509229 -6113397
6107 -6113397 -12312472 -19279279 -27692829 -18754117 -25368718 -25432618 -40848497 -52767720 -55687306
6098 -55687306 -56541632 -50499638 -44380426 -39455700 -33684415 -24557419 -11092024 17432018 24632362
6089 24632362 28052971 13695639 -18158738 -42673117 -73212579 -62772736 -63447829 -53932829
6081 -53932829 -36733595 -49241795 -52115612 -76010245 -75634315 -86429051 -101136226 -88048683
6073h8048683r901215O631988J1802519K5505980K3149131Q786197K0136129p69825
6065b707779j3225943K111711M377731n626192K306109p6591M587767n982960J3043908
6056a192239L4505880L320501K6535968N303531p977377j4077434k3836086J1401043
6048C3983787k2179666N563872R863679j6015627K396310q796689J8576006O141475
6040B9533147J0644567K7611103q325969m516805l098773o939235m71248J081016J4190994
6031E9708797M786619r629732R346027n772374p268581O676273p105159q51822k3518649
6022B6371399j2912808j2110811k7855490M026227j0105006L105709O508194J0253263
6014a2719323L4886333J5348851L2964753J2848156j0493255j2164839l1192591n073138
$$ plain form
6073 -88048683 -97949898 -91317910 -79515391 -54009411 -30860280 -22074083 -1937954 -2707779
6065 -2707779 -15933722 -13822011 -9444280 -15070472 -12764363 -12840954 -8253187 -14236147 -1192239
6056 -1192239 33313641 36634142 63170110 68473641 60496264 46418830 22582744 33983787
6048 33983787 11804121 17367993 27231672 11216045 13612355 4815666 23391672 29533147
6040 29533147 40177714 67788817 59462848 54946043 51847270 44908035 44436787 45517803 59708797
6031 59708797 64495416 54865684 64211711 58439337 51170756 57847029 50741870 49890048 26371399
6022 26371399 13458591 1347780 -26507710 -22481483 -32586489 -29480780 -22972586 -12719323
6014 -12719323 22167010 37515861 70480614 83328770 72835515 60670676 29478085 24404947
6006B4404947n420606J1851277K1799748o537753p254187l5000112k9154493j9021611
5998d4332790j4980423K2013014J2585739K0958112J9291293P885830J6822540q473668
5990C1769647p62456j1837520l5177815j1386063j3498581L360450J6066340P475225
5982a3990773J9780747k1217217j3396842N145456k1603544K5384705R255266J7351896
5974F709694J2378495j5082486M0763507j3403089J8593745K9397180k1978051N130028
5966F2509023l9380766L547839j3320997j6654972M3919278j8813267p164261n106441
5958I535436k5425721j5309210k4966186J0647033N964792k4234896L7546334J4231910
5950a2010508j4733469L1607330j4318524L416388l5021874k053458M0231011l8695046
$$ plain form
6006 24404947 18984341 30835618 52635366 46097613 38843426 3843314 -25311179 -44332790
5998 -44332790 -59313213 -37300199 -24714460 -3756348 15534945 23420775 40243315 31769647
5990 31769647 31007191 19169671 -16008144 -27394207 -40892788 -37532338 -21465998 -13990773
5982 -13990773 5789974 -15427243 -28824085 -23678629 -45282173 -19897468 -10642202 6709694
5974 6709694 19088189 4005703 44769210 31366121 49959866 79357046 57378995 62509023
5966 62509023 23128257 26676096 13355099 -3299873 40619405 21806138 14641877 9535436
5958 9535436 -15890285 -31199495 -56165681 -45518648 -39553856 -63788752 -26242418 -12010508
5950 -12010508 -26743977 4863353 -9455171 -6038783 -41060657 -43114115 -2883104 -41578150
5942d1578150O7769943K6124795l922593R224516k9516246J4688080o2778110J3750572
5934f237193M6267817j1532698M5222686L9506449Q161108l0135290j9681865j2227951
5926E9343063m8452465m0084446L9559941j8988474l2681781L4286698l0511852j3215443
5918e0744759l8231763L1329972M667291n5068332P5184549j1143244p914727J6326095
5910c5594918K1076233O489894n5674610M0144637J491918l5153880K6819188M4793817
5902A4392279k9835548k2013496J9135229j4042625j6425644Q8717Q4767940l7628835
5894a561983q493045N8273878m8344920J1327959m607234O6266720j7826834l7535786
5886A7498755P2725767n6314187j3282781L0978040K5922958k1661070l6770561J3772064
$$ plain form
5942 -41578150 26191793 52316588 48393995 57618511 28102265 42790345 -19987765 -6237193
5934 -6237193 40030624 28497926 73720612 113227061 121388169 91252879 71571014 59343063
5926 59343063 10890598 -29193848 10366093 -8622381 -41304162 -7017464 -37529316 -50744759
5918 -50744759 -88976522 -57646550 -52979259 -108047591 -32863042 -44006286 -51921013 -35594918
5910 -35594918 -14518685 -8028791 -63703401 -23558764 -22066846 -57220726 -30401538 14392279
5902 14392279 -15443269 -37456765 -18321536 -32364161 -48789805 -48701088 36066852 -1561983
5894 -1561983 -10055028 48218850 -126070 11201889 6594655 72861375 55034541 17498755
5886 17498755 90224522 33910335 20627554 51605594 77528552 55867482 19096921 32868985
5878C2868985m8228026o6323610K8891544M0548004m1654182N6900271L2620382N655955
5870D1279323j564444R998723P6909547p8991983N4973715M8166619l6111827M0431223
5862A55090896k0587151K7667961j03352717n0320819Q393969q8669805K5382136N4460667
5854H065137L8390632m503147m621622j1815059o8013228o0962726L6103930N528593
5846f1827490j2408190R3103322J0101120L0357483j1380735J2221241J1840018q7168600
5838a5161831O9678130j5503205M032024M1809073l769064K1550823p7707063N718764
5830C0647651k8277003m8810627K4597706J3669917M986887k952394K5180552L353499
5822B2396188J3322191J0684417L8957866k7899359l1354600P949020o0038819K2853396
$$ plain form
5878 32868985 -15359041 -81682651 -52791107 -12243103 -53897285 3002986 35623368 41279323
5870 41279323 39714879 49713602 126623149 47631166 102604881 150771500 114659673 155090896
5862 155090896 134503745 162171706 58818989 8498170 16892139 -71777666 -46395530 8065137
5854 8065137 46455769 41952622 37331000 25515941 -42497287 -103460013 -67356083 -61827490
5846 -61827490 -74235680 18867642 28968762 59326245 47945510 60166751 72006769 -15161831
5838 -15161831 54516299 39013094 43045118 84854191 81085127 102635950 24928887 30647651
5830 30647651 2370648 -46439979 -21842273 -8172356 -3185469 -6137863 19042689 22396188
5822 22396188 35718379 46402796 85360662 57461303 26106703 34055723 -25983096 -3129700
5814c129700P23379M0203221K1763189j6871313L4184324o1312340p736787j4032438
5806f208465j1645102J6666786R230706M0418517J411251J3358047j0616700k6102134
5798B6512906n4197082k7444126k7409201k0426549M8001019R693953M9500178j120627
5790C110471L023849l294451m3769573M4206463p428169L2332892L0453261k302868
5782E6331875M916921l9080725M366839j5296165p073215K4313257N222111j6063302
5774A7637596m791036j2927888j8529233N068674j36577K3291757l5155490r112056
5766c4654253j5771634n9208150J7300075r015439L6533515K2473823K4675757M8815896
5758C1149590k9298619K7731125l093037k1775841j651884j9954828L856906k0420802
$$ plain form
5814 -3129700 -2406321 37796900 59560089 42688776 76873100 15560760 7823973 -6208465
5806 -6208465 -17853567 -1186781 8043925 48462442 49873693 63231740 52615040 26512906
5798 26512906 -27684176 -55128302 -82537503 -102964052 -54963033 -45269080 4231098 3110471
5790 3110471 6134320 2839869 -40929704 3276759 -4151410 28181482 58634743 56331875
5782 56331875 61248796 22168071 26534910 11238745 4165530 28478787 33700898 17637596
5774 17637596 12846560 -81328 -18610561 -13541887 -13678464 9613293 -25542197 -34654253
5766 -34654253 -50425887 -109634037 -92333962 -101349401 -64815886 -42342063 -17666306 31149590
5758 31149590 1850971 29582096 26489059 4713218 3061334 -16893494 -13036588 -33457390
5750c3457390J5635898K5078271j3598337r5816m173173l0533575r753596K0161279
5742c0736439K7421392K4352942J2207223K0997089l5202137k2638077K1028880m556894
5734A2873979K7137970J9790011J5862431k7833230l7119462J1034307l2248770L541606
5726f961158K4673364J818451j9985867k3907949R474656l2933312l183554L4166776
5718a6838593K482896j0317246M846651J9504928k2224682Q950856M2299119L71357
5710B9075286j3890757Q999074K305966l8009204L732529L7457063J36975n726239
5702B4080693K7405072k612090n0024908m879603J0052113j8800441j4933411L5987775
5694F275200P077456l5668973L1472953K2058298j0676870j1479553J2508020k5960197
$$ plain form
5750 -33457390 -17821492 7256779 -6341558 -6437374 -10610547 -41144122 -50897718 -30736439
5742 -30736439 -3315047 21037895 33245118 54242207 19040070 -3598007 17430873 12873979
5734 12873979 40011949 59801960 75664391 47831161 10711699 21746006 -10502764 -6961158
5726 -6961158 17712206 19530657 -455210 -24363159 -14888503 -47821815 -51005369 -16838593
5718 -16838593 -14355697 -24672943 -19826292 -321364 -22546046 -13595190 28703929 29075286
5710 29075286 15184529 24183603 26489569 -11519635 -7787106 29669957 29806932 24080693
5702 24080693 51485765 48873675 -1151233 -6030836 4021277 -14779164 -29712575 6275200
5694 6275200 13352656 -22316317 9156636 31214934 20538064 9058511 21566531 -4393666
5686d393666p7886269J2456076R537737r738694K7146511L4576837p889577n8841989
5678g5033034J8721755K1596405j757176N9673647N7567283j3206600n6570866j9542393
5670h550979k7314902m2464390K7012468N2569070k0916931k6776505R844778j4575695
5662e1173086l832258M5404836O7960839j4737128k9695142L548177n6901293l0378636
5654f9803691J7259182K4891919k0343562k3560946K5922111k1962321P934782O7146990
5646G484464L6260222p354760j4639961n968982l9056074j5912375M8402221K0295034
5638B9509789k3697946m320636k3941894m6250471k975574M3849985L9198314P778484
5630A9150051L6230104J3909984l0981000J8258636K8666083o59387r898437j0946647
$$ plain form
5686 -4393666 -82279935 -69823859 -60286122 -70024816 -42878305 -8301468 -16191045 -75033034
5678 -75033034 -56311279 -34714874 -36472050 23201597 80768880 67562280 10991414 -8550979
5670 -8550979 -35865881 -78330271 -51317803 1251267 -19665664 -46442169 -36597391 -51173086
5662 -51173086 -55005344 -9600508 58360331 43623203 13928061 17476238 -39425055 -69803691
5654 -69803691 -52544509 -27652590 -47996152 -71557098 -45634987 -67597308 -59662526 7484464
5646 7484464 43744686 36389926 21749965 15780983 -23275091 -39187466 9214755 29509789
5638 29509789 5811843 1491207 -22450687 -68701158 -71676732 -27826747 11371567 19150051
5630 19150051 55380155 69290139 38309139 56567775 85233858 84574471 74676034 63729387
5622F3729387l1432023p4401309l1729753l05149l4109661J6387257L9537369J6740986
5614c5582896J5333728J9294133K9793121k6404275o040224K3899900l1941978j6197023
5606b7845514J556433j5802213k0584309O029548M6804239K0673875M257227L9124982
5598E4214268k5760502m1627788J6169001R950922L4397529O63900J3282508m1418087
5590A9871751j09727904j2471537l3941998J2202972M4616948L4491950L2056241l3643172
5582d6544749L9333853L2951065J9307965M6526617L103810m0169582n5837353j8835797
5574b0164171J4631469L0248960J9347158J3033123p9891972p6841810k8538892l210178
5566a31386313R5612905O2506960P8722261p136449n9244618k0581417l6891073N0034874
$$ plain form
5622 63729387 32297364 -42103945 -73833698 -74138847 -108248508 -91861251 -52323882 -35582896
5614 -35582896 -20249168 -955035 28838086 2433811 -3606413 20293487 -11648491 -27845514
5606 -27845514 -26289081 -42091294 -62675603 -56646055 -9841816 10832059 15089286 54214268
5598 54214268 28453766 -13174022 2994979 12945901 47343430 48007330 61289838 19871751
5590 19871751 -89856153 -102327690 -136269688 -124066716 -79449768 -44957818 -12901577 -46544749
5582 -46544749 -7210896 25740169 45048134 91574751 94678561 54508979 -1328374 -20164171
5574 -20164171 -5532702 24716258 44063416 57096539 -22795433 -99637243 -128176135 -131386313
5566 -131386313 -35773408 26733552 105455813 98319364 39074746 18493329 -18397744 31637130
5558C1637130J3014050R189847m4105976q8092181o0778831j6925751P3147876N0626440
5550c2287396R0817611K0054770l988495l0893516r424918P4415461k8313297M8854576
5542A29234796k0405401o8427917n1474621m9673120N2271206m2737380J4166943L1270255
5534e775239o0886287k2783199N5995196O2981646M5613948N0530641M8811939j3353340
5526A61135305j24563567O2796660m7207550r3441288L5976525q8215532m98173j49458188
5518b43475808N7981115O7721155j18057460K02437961K4555084L0737416J2744383K41631
5510C4885477Q7425617j57943582Q7138183J10075711j09484630N0198767J6869278
5503A19164821p3857624p5005845n9547571J49791098n6927739j1358754K48344665
$$ plain form
5558 31637130 44651180 53841027 9735051 -78357130 -139135961 -156061712 -82913836 -32287396
5550 -32287396 58530215 78584985 74596490 43702974 34278056 108693517 80380220 129234796
5542 129234796 108829395 40401478 -11073143 -60746263 -8475057 -51212437 -37045494 -5775239
5534 -5775239 -66661526 -89444725 -33449529 29532117 75146065 125676706 174488645 161135305
5526 161135305 36571738 99368398 52160848 -41280440 -5303915 -93519447 -94017620 -243475808
5518 -243475808 -185494693 -117773538 -235830998 -33393037 -8837953 21899463 34643846 34885477
5510 34885477 122311094 -35632488 51505695 161581406 52096776 102295543 119164821
5503 119164821 45307197 -29698648 -89246219 60544879 3617140 -7741614 240603051
5496B40603051j62417293J2603295L1732475K6014752R6672530j43451878K56284567
5489C58041499j74750176k07698964J44423799j49402656Q2034830m2075550R9455460
5482A10028242j5942691l29884968J20041667r5908811j73417288J15208902j9334129
5475b89209076r98250p6701307R3921889L01334306n4421573L28848662L16988083
5468F19762734o2114311K75151954J45659404L92989492K08296073J71449969L96288332
5461B147483647m00324717j72096558k11206778l92683492j46191449k74480001O2300560
5454F12801212l18328805l27027881N4646529l01264219r1751467P7380483J742167
5447b91801981J9380531j14330805J75103662R5151897j19319611L30832488J3837776
$$ plain form
5496 240603051 78185758 90789053 122521528 148536280 245208810 101756932 358041499
5489 358041499 183291323 -24407641 120016158 -29386498 52648332 10572782 110028242
5482 110028242 94085551 -235799417 -115757750 -211666561 -385083849 -269874947 -289209076
5475 -289209076 -290207326 -366908633 -272986744 28347562 -26074011 302774651 619762734
5468 619762734 557648423 832800377 978459781 1371449273 1579745346 1751195315 2147483647
5461 2147483647 1747158930 1575062372 1363855594 971172102 824980653 550500652 612801212
5454 612801212 294472407 -32555474 22091055 -279173164 -370924631 -293544148 -291801981
5447 -291801981 -272421450 -386752255 -211648593 -116496696 -235816307 95016181 108853957
5440A08853957r8934002M1846269q1348054J49422944j44486247K09185167J72343464
5433C56883498k56087228J43469702r7411390k5579438l1988488j1648550J61434389
5426B39072495k49041904J2491660N6284201j49377515O0617725P5030670P3562998
5419A18640330j7648509m9896894J09402972j10924852q5959167J57999154q8372703
5412C3240331J21320j3225553l0496612k5197076k01731989J19059658o8375891n6841074
5404b43446886J49852569M99004Q8230578l6164305R3534145M6479974o2213316J24677954
5396A61449717J2454069m9196647n0879138m5618076o2981049n5732879K3158825O1057280
5388f287898l1468860j3938244M2732610n2023488N0109151N1307951O8686804J9663123
$$ plain form
5440 108853957 9919955 51766224 -29581830 119841114 -24645133 184540034 356883498
5433 356883498 100796270 244265972 146854582 121275144 89286656 77638106 239072495
5426 239072495 -9969409 2522251 58806452 -90571063 -29953338 45077332 118640330
5419 118640330 100991821 51094927 160497899 49573047 -36386120 121613034 33240331
5412 33240331 33361651 20136098 -10360514 -35557590 -237289579 -118229921 -186605812 -243446886
5404 -243446886 -93594317 -93095313 -4864735 -41029040 52505105 98985079 36771763 161449717
5396 161449717 173903786 124707139 73828001 28209925 -34771124 -90504003 -67345178 -6287898
5388 -6287898 -37756758 -51695002 -8962392 -60985880 -10876729 40431222 109118026 128781149
5380A28781149m8973056K8023009p4674263R897696L0767313L824358k0629814r0812521
5372c3796129n0304713p3031779J7620386O1532173Q7986079M3777542r536656j3293277
5364C0953626m9655466L7177038K0469373N9098570O784791p9192617o2876825r5031664
5356a32273174L772520K8894051P7266330P9409006j3269266j9309828l0684913j4194856
5348b0390130J8902358N6082093L9993786l600683m6626285j9259678l3257356l8812304
5340d6968199L3350662l2191495l4357221m4557754j1794503L4133311J3140761J09809193
5332B0564755M1026520j3387282j091810l4596513r943090j6086086M1924836K5682067
5324E4093397l9284130m338546k0964911m6845307n701132K0600424J5969297j369746
$$ plain form
5380 128781149 79808093 107831102 33156839 43054535 73821848 77646206 57016392 -33796129
5372 -33796129 -84100842 -157132621 -139512235 -77980062 10006017 53783559 44246903 30953626
5364 30953626 -18701840 18475198 38944571 98043141 104827932 25635315 -37241510 -132273174
5356 -132273174 -128500654 -99606603 -22340273 57068733 43799467 24489639 -6195274 -20390130
5348 -20390130 -1487772 54594321 94588107 90987424 44361139 25101461 -8155895 -46968199
5340 -46968199 -13617537 -45809032 -80166253 -124724007 -136518510 -102385199 -89244438 20564755
5332 20564755 61591275 48203993 47112183 12515670 2572580 -13513506 28411330 54093397
5324 54093397 14809267 10470721 -10494190 -57339497 -63040629 -42440205 -26470908 -27840654
5316b7840654J6321199L1851189k4281034O312454K6065224k9996891j9228075j4981959
5308c5778547j6962283l9553487j6082569L4542366L14786L2197073P4381181L1157485
5300F4216005J0854126R652103L44474k8993739j8165221L0986753j4132468l6125724
5292A8636309q058189l9260717m3549697L216858M6643055K4093775M236725K3629595
5284B9587714k0631073m8330805J6156661L8800387O035625J4600661O929396l6486039
5276F662527o7178489p476902K2212734k5946247K3797168K0094087k4935369j6971738
5268f9742229L0614754N6749514l644352K9520918J4275174o7869179m5289319L788548
5260e1596171J4958574r646846K6822959K0705694n2736670k6816595M2749699K7327936
$$ plain form
5316 -27840654 -11519455 20331734 -3949300 2363154 28428378 -1568513 -20796588 -35778547
5308 -35778547 -52740830 -92294317 -108376886 -73834520 -73519734 -41322661 33058520 64216005
5300 64216005 75070131 84722234 85066708 56072969 37907748 68894501 54762033 18636309
5292 18636309 10578120 -28682597 -72232294 -69015436 -22372381 1721394 5958119 29587714
5284 29587714 8956641 -39374164 -23217503 15582884 21618509 36219170 43148566 6662527
5276 6662527 -60515962 -67992864 -45780130 -71726377 -47929209 -27835122 -52770491 -69742229
5268 -69742229 -39127475 17622039 13977687 43498605 57773779 -10095400 -55384719 -51596171
5260 -51596171 -36637597 -46284443 -19461484 1244210 -51492460 -78309055 -35559356 -8231420
5252h231420J9652384N6583429J2526244n7701184n9457837J835055k1597380j8629410
5244g5020119N8846042P787233l4734269k6930697J0058665r615715j2325355P8059646
5236c874569K5814005j2504164J1475213J0429091k2307139l1334105L5860126p412206
5228F146252l5622308J4962879J8612747j0099343N321298M9864278K371661k7502008
5220B4055456N798619l41139l7482714l476069L8165762k545083r142631J3865399m99191
5211B8398409m2406009q516442K2006146j9346091n008056J0505221k486300l3961646
5203e0814768L332928L2915781r546009K3981376K0008967k018973k4599846l373789
5195a0114333L2291592j1005572L7229725K7577672j6021558k0096452k6960936M468502
$$ plain form
5252 -8231420 11420964 68004393 80530637 22829453 -36628384 -34793329 -56390709 -75020119
5244 -75020119 -16174077 -8386844 -43121113 -70051810 -59993145 -69608860 -81934215 -3874569
5236 -3874569 21939436 9435272 20910485 31339576 9032437 -22301668 13558458 6146252
5228 6146252 -29476056 -14513177 4099570 -5999773 -678475 49185803 51557464 24055456
5220 24055456 29854075 29512936 -7969778 -11445847 26719915 24174832 15032201 28897600 28398409
5211 28398409 -14007600 -22524042 -517896 -19863987 -24872043 -14366822 -16853122 -50814768
5203 -50814768 -47481840 -14566059 -24112068 -130692 19878275 17859302 -6740544 -10114333
5195 -10114333 22177259 11171687 48401412 75979084 59957526 39861074 12900138 17368640
5187A7368640k1165876K2984296L4994228k1216073j2389948k4258134k7302034k0015527
5179e1000428J0012191L0661327L977172J99628J3467372k5120541j5664674K0581260
5171a2886693l838265J9980010J716164K2031266K463548k7504449K8895719m9220964
5163a8363664k4183629k2540734l6228508R013244j6844455N9364143J5560609R395998
5155b4826996L4726950k3062035N2724m921390J8559740J2914349M842704J5970141
5147C4256187n453156k4375322P263529J5105605m142825L8972738n225258K166553
5139E8568051l0526040l2046858P073056m4061806M4055710L150832l133154J003057
5131D082848m9216687j0007439m7630973K0845890K7394423K7870990N4013346K5950958
$$ plain form
5187 17368640 -3797236 19187060 54181288 32965215 20575267 -3682867 -30984901 -51000428
5179 -51000428 -40988237 -10326910 -6349738 -6150110 7317262 -17803279 -33467953 -12886693
5171 -12886693 -16724958 3255052 4971216 27002482 29466030 1961581 30857300 -18363664
5163 -18363664 -42547293 -65088027 -101316535 -92303291 -109147746 -49783603 -34222994 -24826996
5155 -24826996 9899954 -13162081 -13109357 -18030747 528993 13443342 18286046 34256187
5147 34256187 28803031 4427709 11691238 26796843 22654018 61626756 56401498 58568051
5139 58568051 28042011 -4004847 3068209 -40993597 3062113 6212945 3079791 4082848
5131 4082848 -45133839 -55141278 -102772251 -81926361 -54531938 -26660948 27352398 53303356
5123E3303356J0352492j3410742j753272m0269594r148076j6561272J2027007J3799825
5115H339724Q010536O1217070l4567867J6857144k2111932l9986992o68579k2717440
5107b5628336O0174713p926931L1479920K7304865l9024165j0587492j3171854l280741
5099A9339979k5294076K868579m781813j3551383k4335380M8901696K8020903n513813
5091B5654692P7703906k1986998L605690m1987565l597433J5073620o9362295Q7329956
5083G2433573j2313615j2035821J0958398l0183739j0373006r2986919J2859509n858585
5075f7500205l5428131O1526056O7588908J1703200M626243M317125l8837607n4338987
5067d6343398k4672316Q8898302q431381N0773847J02776648k8140810K0424134m0436684
$$ plain form
5123 53303356 63655848 50245106 48491834 8222240 -925836 -17487108 -5460101 8339724
5115 8339724 16350260 77567330 42999463 59856607 37744675 -2242317 -2910896 -25628336
5107 -25628336 34546377 26619446 58099366 85404231 46380066 35792574 22620720 19339979
5099 19339979 -5954097 -3085518 -7867331 -21418714 -45754094 3147602 31168505 25654692
5091 25654692 103358598 81371600 84977290 42989725 39392292 54465912 -14896383 72433573
5083 72433573 60119958 48084137 59042535 28858796 18485790 -74501129 -61641620 -67500205
5075 -67500205 -102928336 -41402280 26186628 37889828 42516071 46833196 7995589 -46343398
5067 -46343398 -71015714 17882588 9451207 60225054 163001702 134860892 155285026 114848342
5059A14848342L6124806m8736942n4534317P8764821p7121884r743059J380553n731744
5051C5250576l2789694n6423571M1619107m0433667k8687094O6672169M8018031j3748377
5043A9477480L6842209K1284242k5997548l1141774J3907569N5933362p3090236L8028134
5035E5243438J7152651o6182577M728534j1087310M8324638n8693065R347032L7066796
5027C5900137q5085959J45462J6823478J3837526j8989258K2165162K9451134m4895941
5019c0648259k6279868L5242376j850587l9925545N5580254o808710k0673328j6506389
5011e1870056Q181633J0900325p4997979N5210841n126362l0898813L8672445J3159714
5003c6768252L0312732l4172980L2950061J8669577l9324923M0362395M8494996J1897789
$$ plain form
5059 114848342 150973148 102236206 47701889 126466710 49344826 39601767 40982320 35250576
5051 35250576 2460882 -53962689 -12343582 -52777249 -81464343 -14792174 33225857 19477480
5043 19477480 56319689 77603931 51606383 20464609 34372178 90305540 17215304 55243438
5035 55243438 72396089 6213512 10942046 -145264 48179374 -10513691 -1166659 35900137
5027 35900137 -49185822 -49040360 -32216882 -18379356 -37368614 -15203452 14247682 -30648259
5019 -30648259 -56928127 -21685751 -23536338 -63461883 -7881629 -14690339 -35363667 -51870056
5011 -51870056 -43688423 -32788098 -107786077 -52575236 -57701598 -88600411 -49927966 -36768252
5003 -36768252 -6455520 -40628500 -7678439 10991138 -28333785 12028610 60523606 72421395
4995G2421395J9462458K9879236q483135l9598608m5111637J1437041m6326871j3328487
4987a9648608O2728979j4788697K9561600r560341L897080k6431846o7408899L8799141
4979b851591m0190167K286234L4735910l306848J4157247l1518269J4869590j4445834
4971b6263728l7318273K4519521o107595j0218172K5246006J5218026K5239235M721995
4963A5037015P164008J8707057m3918771J6753526J3156184l219910L9549853n406372
4955E7822590K1799697k9339315j8607292J3182338m0764727J5140962j2685301j7062953
4947a0514001r448357k5173987K1736189n134697J3535336K1045678j9826386p401584
4939b1181809j6077535l124976J3659375J1442832L5170636J1730300N93331Q427302
$$ plain form
4995 72421395 91883853 121763089 113279954 73681346 28569709 40006750 -6320121 -19648608
4987 -19648608 43080371 28291674 57853274 48292933 52190013 25758167 -41650732 -2851591
4979 -2851591 -43041758 -40755524 -6019614 -9326462 4830785 -26687484 -11817894 -26263728
4971 -26263728 -63582001 -39062480 -45170075 -55388247 -30142241 -14924215 10315020 15037015
4963 15037015 22201023 40908080 -3010691 13742835 26899019 23679109 63228962 57822590
4955 57822590 79622287 50282972 31675680 44858018 4093291 19234253 6548952 -10514001
4947 -10514001 -19962358 -45136345 -23400156 -28534853 -14999517 6046161 -13780225 -21181809
4939 -21181809 -37259344 -40384320 -26724945 -15282113 19888523 31618823 32212154 40639456
4931D0639456j6768827p929333j9610859k0761681j2819266k1872458J5379364J9235973
4923b4507631K9238301L4949303P187116O072368k1943177j1591348N490699N169136
4915C0064767L1038719J2149751J0132179j3020374l3044550j5136923l4836691j0023749
4907b2676871o328521l153620J0205189m015500K7785982J2081472J3031729K3581706
4899E0511566N28420P312690o632746P052744N639847r049450R305963m906806j4093390
4890D5668838j291634O53577P144242L274877M265469Q288998k7917153j0682611o061341
4881B3343262j8494823Q896388k315168J6116544j0035659n164312K1943581j1452628
4873B2837185K3977484J3960192P700588n380787k6549864l358845l4572064j2941400
$$ plain form
4931 40639456 23870629 15941296 -3669563 -24431244 -37250510 -59122968 -43743604 -24507631
4923 -24507631 4730670 39679973 46867089 52939457 30996280 19404932 24895631 30064767
4915 30064767 61103486 73253237 83385416 70365042 37320492 22183569 -12653122 -22676871
4907 -22676871 -29005392 -32159012 -21953823 -25969323 1816659 13898131 26929860 50511566
4899 50511566 51039986 58352676 51719930 58772674 64412521 55363071 64669034 59762228 45668838
4890 45668838 44377204 45030781 52175023 55449900 59715369 68004367 40087214 29404603 23343262
4881 23343262 4848439 13744827 11429659 27546203 17510544 12346232 34289813 22837185
4873 22837185 46814669 60774861 68475449 63094662 36544798 33185953 -1386111 -14327511
4865a4327511N985230m866944L38366k156213N709053m529765j879720J3287727L99270
4856b040507k0159709q802242k3291830k5380968j1543853o654466J0009889j2923144
4848a00786830J4846992J0639222l25359K4047957K791510J2382421j7243289r462593
4840f3109969Q29530j0049128L0401454K4648106L1960377J4140575l730416p355382
4832A7735147k8443867j3451898r128578n831742m833663o041823o060216Q99338L020074
4823e2137228J2027342J5235493J87474O714138r067614Q404645P013133O527997K8340543
4814B3245923m641806M331906j3248564j0143786l654597j7515520K1976867l962575L6750
4805c575402Q652865l489359L307771j3719237N576121o334897k1243902N805700N735256
$$ plain form
4865 -14327511 -8342281 -13209225 -12870859 -15027072 -9318019 -13847784 -15727504 -2439777 -2040507
4856 -2040507 -22200216 -31002458 -54294288 -79675256 -91219109 -97873575 -87863686 -100786830
4848 -100786830 -85939838 -75300616 -75625975 -51578018 -48786508 -36404087 -53647376 -63109969
4840 -63109969 -62280439 -72329567 -41928113 -17280007 14680370 28820945 25090529 17735147
4832 17735147 -10708720 -24160618 -33289196 -39120938 -43954601 -49996424 -56056640 -55157302 -52137228
4823 -52137228 -40109886 -24874393 -24686919 -17972781 -27040395 -18635750 -11622617 -5094620 23245923
4814 23245923 18604117 22936023 9687459 -456327 -4110924 -21626444 350423 -3612152 -3575402
4805 -3575402 5077463 1588104 4895875 -8823362 -3247241 -9582138 -30826040 -25020340 -19285084
4796a9285084p31281R954075Q384215k675396k2160264j5102568P399330j9313276
4788e3530249J7268688L5899179J3360822K2893624K379010J7865186k2519669j7538818
4780A6077773K3860066k1573815R217814R901763N835094l953000k3594447K0062563
4772C5833811j9958664j4329995K2761190n729722m616656o535535O440845o84733
4764A3180541k0618152K3830185O207686k6873269R940134r138357j0565723j1952010
4756b5988965j70452K2347226l0998095K2306530K3641395j0999026K5418703k247614
4748B3309702J1905458l0512903j9135798K0668762l2557629J8600393J8647683l807454
4740G118214m173178k2153303J4287421j2946633Q70670M2541718p528348q627064
$$ plain form
4796 -19285084 -20016365 -10062290 -1678075 -4353471 -26513735 -41616303 -34216973 -53530249
4788 -53530249 -36261561 -362382 12998440 35892064 38271074 56136260 33616591 16077773
4780 16077773 39937839 18364024 27581838 37483601 43318695 39365695 15771248 35833811
4772 35833811 15875147 1545152 24306342 18576620 13959964 7424429 13865274 13180541
4764 13180541 -7437611 16392574 22600260 -4273009 5667125 -3471232 -14036955 -25988965
4756 -25988965 -26159417 -3812191 -34810286 -12503756 11137639 138613 25557316 23309702
4748 23309702 35215160 4702257 -14433541 6235221 -26322408 -7722015 10925668 7118214
4740 7118214 2945036 -19208267 -4920846 -17867479 -16996809 25544909 18016561 9389497
4732I389497j0823342k8849325j8900232l1529738J6563083R777557p394826N0419048
4724a1348278J6446549K6935646K5091925N549024J2708093m5868725m408219j2988161
4716A2117854k8515626K0656128m687243J0263740j1935733j1093449J1593386k2468419
4708b4069362J2634876J0848913j0464145L314808q651004Q249903N080294K532824
4700e22893K5176691j0533088q798696l291997j8089378M466317k761442J7894029
4692C539543J6414306J528488K4954265L873678O793385M642384n790720L84888j3552287
4683D2787930K558925O215066j604933J299915r690869j7668812k1686310j2374629
4675a0163717K357564Q142804J2569244J3504675L570689j1155816p531546o615546
$$ plain form
4732 9389497 -1433845 -30283170 -49183402 -80713140 -64150057 -54372500 -61767326 -11348278
4724 -11348278 5098271 32033917 57125842 62674866 75382959 29514234 25106015 12117854
4716 12117854 -16397772 4258356 -428887 9834853 -2100880 -13194329 -1600943 -24069362
4708 -24069362 -11434486 -585573 -11049718 -7734910 -16385914 -8136011 -3055717 -522893
4700 -522893 24653798 14120710 5322014 2030017 -16059361 -11593044 -14354486 3539543
4692 3539543 19953849 21482337 46436602 50310280 57103665 61746049 55955329 56340217 42787930
4683 42787930 45346855 51561921 49956988 51256903 41566034 23897222 2210912 -10163717
4675 -10163717 -7806153 336651 12905895 26410570 29981259 18825443 11293897 4678351
4667D678351q912056L710928L030672J2001685M932965P152883K0666849m851271Q004604
4658E0415610J591437r103794M39507j3184609Q929016j0214803j1822687J0066401
4650B7116078j4541686P042413J4611161J0481998J5141610j3525957m389060k2193812
4642A9742745l9315053Q390056p409286J1505266K8994532O495941K4958669k3528805
4634B9834065L373899k878724l9128484J8703372j6395773K804103M087693k134301
4626a734150K7985358k2342417J7216902J2340797k3536071R694690n840174n721335
4618H063600o759257r089233K0174643j1957968m4396L3651588k4136684j618635q332901
4609d9243j9007590k16098j8384780N5169130J5797208J7506474N2308496j8784427
$$ plain form
4667 4678351 -4233705 -522777 2507895 14509580 19442545 26595428 47262277 42411006 50415610
4658 50415610 52007047 42903253 43342760 30158151 39087167 28872364 17049677 27116078
4650 27116078 12574392 19616805 34227966 44709964 59851574 46325617 41936557 19742745
4642 19742745 -19572308 -11182252 -18591538 -7086272 21908260 28404201 53362870 29834065
4634 29834065 33207964 30329240 -8799244 9904128 -6491645 -3687542 400151 -1734150
4626 -1734150 26251208 3908791 21125693 33466490 9930419 19625109 13784935 8063600
4618 8063600 1304343 -7784890 12389753 431785 387389 34038977 9902293 8283658 -49243
4609 -49243 -19056833 -19272931 -37657711 17511419 33308627 50815101 103123597 84339170
4601H4339170j2312088l7946898j5310756j1825472j2775917N6347487K8193327N160301
4593H3869154J1291920j8756844n2438914m1386269j5338507R544573O072851M1311028
4585B4168992N7082932j8018611K796757k0075943m5335878l4736091k2961444L3323597
4577b3755689m857873L0832034M6706294j1568813j4600887j4406170r484651j6923911
4569a8059666J9710378N3264603L8375621J2747033L4896195j267574m4277988J66751
4561I5555353j8965301n044528k0461978K458411Q976418n2671348J5253727n634415
4553A9466339j6494735Q625038L421636J9412154k1598604M891909J0055022l8788347
4545a1009588j7225814j945659k6136325m349759J0598995K4040030J5433291o898171
$$ plain form
4601 84339170 72027082 34080184 18769428 6943956 -5831961 50515526 78708853 83869154
4593 83869154 95161074 76404230 23965316 -17420953 -32759460 -23214887 -17142036 24168992
4585 24168992 81251924 63233313 66030070 45954127 618249 -34117842 -57079286 -23755689
4577 -23755689 -28613562 2218472 48924766 37355953 22755066 8348896 -1135755 -18059666
4569 -18059666 1650712 54915315 93290936 106037969 140934164 139666590 95388602 95555353
4561 95555353 76590052 71545524 51083546 53541957 62518375 9847027 25100754 19466339
4553 19466339 2971604 11596642 15018278 34430432 12831828 17723737 27778759 -11009588
4545 -11009588 -28235402 -30181061 -56317386 -60667145 -50068150 -26028120 -10594829 -17493000
4537a7493000M1639333j9532420j2111650K3978855j9528490J0655345k3994892Q332224
4529h054695j0444730l6706571L5731321q236253P771709K5104477Q839535J4384527
4521B8389320j1603787J5383918J0598114k3317531J5639616N31856k8170164L20773
4513G772115j6331488J338904j3784884m426076K4412394l6578063Q020495M214432
4505b5362171j3953116J6484428K213075K8940815j0086936r964291J0288782l8297550
4497c9736964j3835475K064552r503519j258851q014631O299594q140136j6858851
4489h8984281L3011168Q061088J1241065L6924216J6304882K2585352K120652K2171984
4481F3436126K831818l7347280o862986k8028862l0181900J425089J9149483K6569491
$$ plain form
4537 -17493000 24146333 4613913 -7497737 16481118 -3047372 7607973 -16386919 -8054695
4529 -8054695 -18499425 -55205996 -19474675 -27710928 -19939219 5165258 14004793 28389320
4521 28389320 16785533 32169451 42767565 19450034 35089650 35621506 7451342 7772115
4513 7772115 -8559373 -7220469 -21005353 -25431429 -1019035 -37597098 -29576603 -25362171
4505 -25362171 -39315287 -22830859 -20617784 8323031 -1763905 -11728196 -1439414 -39736964
4497 -39736964 -53572439 -51507887 -61011406 -62270257 -70284888 -63985294 -72125430 -88984281
4489 -88984281 -55973113 -47912025 -36670960 253256 16558138 39143490 41264142 63436126
4481 63436126 66267944 28920664 22057678 -5971184 -36153084 -34727995 -15578512 10990979
4473A0990979L210747M302503k715034m5492665j1596596J3396846K122964J8964060
4465f816196K819501J540752m0933021l5583189M277906k6649996N240465J2920952
4457h3182826J0016371M53031q75803L1723374j263326o343392P923594j3788507k1910225
4448g7247709O017593K6681834K8152362J1877578J9496680r09039m8075286j371270
4440c5377257k344457J1953028J8830665J5561104K6423814m3294684J272534m165925
4432a1141178j8140920J1540242l400481K3871349k2960236O018740K4258133j4905250
4424d859601L749213n700104j7933823l2425379k0913098P261520K434991p849004
4416g6235285K8931753j4724819k8522741m659554k4527212J9473447j8543345L7891219
$$ plain form
4473 10990979 14201726 18504229 15789195 -29703470 -41300066 -27903220 -25780256 -6816196
4465 -6816196 -3996695 -2455943 -43388964 -78972153 -74694247 -101344243 -96103778 -83182826
4457 -83182826 -73166455 -72713424 -73589227 -41865853 -43129179 -49472571 -41548977 -55337484 -77247709
4448 -77247709 -71230116 -44548282 -16395920 -4518342 14978338 14069299 -34005987 -35377257
4440 -35377257 -37721714 -25768686 -6938021 8623083 35046897 -8247787 -6975253 -11141178
4432 -11141178 -29282098 -17741856 -21142337 2729012 -20231224 -14212484 10045649 -4859601
4424 -4859601 -1110388 -6810492 -24744315 -57169694 -78082792 -70821272 -68386281 -76235285
4416 -76235285 -47303532 -62028351 -90551092 -95210646 -119737858 -100264411 -118807756 -80916537
4408h0916537K5667624j9953751M8269142q177130L5314797J1574836J8674355M4506991
4400G4960327l3095916K2967700r850933k0020239J929441j0565442J4341919q967485
4392C1699372r870303J1698054k6617705k4244477N280820l3965010R086606j3090750
4384e0023393Q870578K9463068l0636205M7916297k6620754j0383296k690123m3093861
4376g7197689L2813314k8449292M6176883M0811631N886492M1100129k3739193m824491
4368C2577784l3030011l2369231L677336j6745670n812090J2431346j5972247l781536
4360e9024319r875136j5508857J6258590l8057287K2390110M909262o783500M5052887
4352d0638250j881289M9230185j8823009n507332L439240n9563316J782777k0718419
$$ plain form
4408 -80916537 -55248913 -75202664 -26933522 -35110652 204145 11778981 30453336 74960327
4400 74960327 41864411 64832111 54981178 34960939 36890380 26324938 40666857 31699372
4392 31699372 21829069 33527123 6909418 -17335059 -12054239 -46019249 -36932643 -50023393
4384 -50023393 -41152815 -11689747 -42325952 5590345 -21030409 -31413705 -34103828 -77197689
4376 -77197689 -44384375 -72833667 -26656784 14154847 20041339 61141468 37402275 32577784
4368 32577784 -452227 -32821458 -29144122 -45889792 -51701882 -39270536 -55242783 -59024319
4360 -59024319 -68899455 -84408312 -68149722 -106207009 -83816899 -78907637 -85691137 -40638250
4352 -40638250 -42519539 6710646 -12112363 -17619695 -14180455 -73743771 -71960994 -92679413
4344i2679413R396172k143661n3497K7195416j8192920j800800R796567k115492j4521065
4335h5118693P682287J1005051J1521650J1652791M5606236M0624833k536808L4852830
4327G5290177k785320j6008472l0230266j5190675p859982n1604601J1732763k472285
4319c9128661o389809j663109J0437097J0149119l8749304J4227861P537832M926984
4311c8651990K9416878N3814468N2038297L459106K3106444l118467m9549964m1915293
4303B8599479j8192075k1855929j6145935J9186219L6159782M900837l403562K3580557
4295E2829373l3838511k6918168o376263J807900J2743597l107467N0730926n523416
4287D2347971k1439447R412847k2014781m02367m772739K9042848J9087553j9353866
$$ plain form
4344 -92679413 -83283241 -85426902 -85480399 -58284983 -76477903 -78278703 -68482136 -70597628 -85118693
4335 -85118693 -77436406 -66431355 -54909705 -43256914 2349322 42974155 40437347 75290177
4327 75290177 72504857 56496385 26266119 11075444 3215462 -48389139 -36656376 -39128661
4319 -39128661 -45518470 -47181579 -36744482 -26595363 -65344667 -51116806 -43578974 -38651990
4311 -38651990 -9235112 44579356 96617653 100076759 123183203 120064736 70514772 28599479
4303 28599479 10407404 -11448525 -27594460 -8408241 27751541 32652378 29248816 52829373
4295 52829373 18990862 -7927306 -14303569 -12495669 247928 -2859539 47871387 42347971
4287 42347971 20908524 30321371 8306590 7904223 3131484 32174332 51261885 31908019
4279C1908019J5711812j1723830l1382863J22375l509988R747813k05198J830495K2922521
4270C5421156l2305416K504685L69941k5000606P095914k4168691Q179075j9294764
4262d7198706k0355241J1355634k9317295M254974N39030O683527K9915705J6302403
4254b7819969L3543817K1273826p930158k142025k4086026j4201994R366094k752421
4246a4748856M2190632J0331098Q32651K549211l3464170l501833l2430137N983688
4238b2257716N144824k3081383R192845j0405842L290027K321316K5117246K2718201
4230A2039518o114300j981521j890361j6899015j5434682K7016741L781614J858881
4222B376875l238146K060554j1236074k8213724K8278822p752568j0441452j236694
$$ plain form
4279 31908019 47619831 35896001 4513138 4635513 1125525 10873338 10668140 12498635 35421156
4270 35421156 3115740 5620425 5990366 -19010240 -11914326 -36083017 -27903942 -47198706
4262 -47198706 -67553947 -56198313 -85515608 -81260634 -80721604 -74038077 -44122372 -27819969
4254 -27819969 5723848 26997674 19067516 16925491 -7160535 -21362529 -11996435 -14748856
4246 -14748856 27441776 37772874 38605525 41154736 7690566 4188733 -28241404 -22257716
4238 -22257716 -17112892 -40194275 -31001430 -41407272 -38117245 -35795929 -10678683 12039518
4230 12039518 5925218 3943697 2053336 -14845679 -30280361 -3263620 517994 2376875
4222 2376875 -861271 1199283 -10036791 -38250515 -9971693 -17724261 -28165713 -29402407
4214b9402407L028462n429813j4258462L6844486N306018m657758Q25600J6200987r670157
4205a213044n170663L8574844q480586j4397763l1227412r094939l3831923j9172508
4197h4013994N4251585J6223362K6432909J4581657J2998799k4167621l3452659J6582062
4189e63900j0333351p827057M173550J2238510l0832023k3390982n137855j9096858
4181h0769966j3843454j71587M8242270O992506L9520266N1493471J5204737J1722661
4173G8390904k0058137J0754273l6042652j7780913J4332029p741362L565235q777348
4165A6642029R899719k3264498j7573661m48949K488404M16121L824846K5405402j7041598
4156C47815j0829875k5029697j7272739k1933990k5958184K6316560j618511J5417917
$$ plain form
4214 -29402407 -26373945 -31803758 -46062220 -9217734 -3911716 -8569474 -7743874 8457113 -1213044
4205 -1213044 -6383707 32191137 23710551 9312788 -21914624 -31009563 -64841486 -84013994
4197 -84013994 -29762409 -13539047 12893862 27475519 40474318 16306697 -17145962 -563900
4189 -563900 -10897251 -18724308 -14550758 -2312248 -33144271 -56535253 -61673108 -80769966
4181 -80769966 -94613420 -94785007 -46542737 -39550231 -29965 51463506 66668243 78390904
4173 78390904 58332767 69087040 33044388 15263475 29595504 21854142 25419377 16642029
4165 16642029 26541748 3277250 -14296411 -14745360 -12256956 -11840835 -8015989 17389413 347815
4156 347815 -10482060 -35511757 -52784496 -74718486 -100676670 -74360110 -75978621 -60560704
4148f0560704K0293130K6451214K6253987N714485L4841282Q779244j8825109k0859333
4140B2088196j1411777l1266108k3520246O065322J0120469l55277j0692942L5854719
4132c117644r923285j1578418K7360624k024373j638932k5156771K4642879J944851
4124E08931k6863623M6871496J0289442j0108734m892540J3152832Q324526l2450723
4116D831607K5765161J7696941n0301739j9071840L069095k0950692j7054870K6506771
4108b9509566M9148328j3782153l516050M6885618l0064395l0134693J4894204J239844
4100E161137k6898311l0384438M0574860j9826799m4973218L5769093o610508l2575006
4092g9763190j3621193M0563071J3503784j6674055P0365430L5604022j9163342N552702
$$ plain form
4148 -60560704 -40267574 -13816360 12437627 18152112 52993394 61772638 42947529 22088196
4140 22088196 10676419 -20589689 -44109935 -38044613 -27924144 -28279421 -38972363 -3117644
4132 -3117644 -13040929 -24619347 2741277 716904 -922028 -26078799 -1435920 508931
4124 508931 -26354692 20516804 30806246 20697512 15804972 28957804 37282330 4831607
4116 4831607 30596768 48293709 -2008030 -21079870 -18010775 -38961467 -56016337 -29509566
4108 -29509566 19638762 5856609 2340559 49226177 19161782 -10972911 3921293 5161137
4100 5161137 -21737174 -52121612 -11546752 -31373551 -76346769 -40577676 -47188184 -79763190
4092 -79763190 -93384383 -52821312 -39317528 -55991583 14373847 49977869 30814527 36367229
4084C6367229L8318144j4083993m0862552K5475357q359437n3630935k8528830K9184083
4076a6120934j9044945k9945947N6774806J4366678j8344016M331430M0494851n915634
4068B6596289l3077461M1474545J0913178l7859826N979000M0719559j9803407j2210649
4060B2731228J8797902J3005913k9537955j0051456P5947949l3301938O41833J3617029
4052G1850505m6178143m0256922q6831061L9059727l5921231j2662017R6590355O573310
4044g775477N0604403J1378195M7881064K0098321m9569183M5671727j0959303m4035939
4036F3293808J5910845k74476o88042j1443721k0194064L3459683p4353033o506099
4028g95099M4800089m5262805P0443555r690715O0272336N779203n9537051P4761146
$$ plain form
4084 36367229 74685373 60601380 19738828 45214185 36854748 -16776187 -45305017 -16120934
4076 -16120934 -35165879 -65111826 -8337020 6029658 -12314358 -7982928 32511923 26596289
4068 26596289 -6481172 34993373 45906551 8046725 14025725 54745284 34941877 22731228
4060 22731228 41529130 54535043 24997088 14945632 90893581 57591643 58233476 71850505
4052 71850505 25672362 -14584560 -101415621 -62355894 -98277125 -110939142 -14348787 -7775477
4044 -7775477 42828926 54207121 102088185 122186506 72617323 118289050 107329747 63293808
4036 63293808 79204653 78930177 78242135 66798414 46604350 80064033 5711000 -795099
4028 -795099 44004990 -1257815 69185740 59495025 119767361 125546564 66009513 140770659
4020A40770659j05490456j3773265l6328556o5674778p11766j01910237M3734018k0790700
4012a60175081k7496215O3364248k664498K2403901J606673L388771L4278698l5774723
4004a01068226J0011788M5858061o5577594J9121316k9062400k3715452k362098p1382422
3996b18177027Q2319891o1318415J4507714O6421279j7018912R3396107j0886498
3989e0755861J04941533J5100238k9629218O9126210n0595126J1721623p794460K9713600
3981I1828539J7086798l8629347K2626672k4303258o8829271k1951500r448032l5186936
3973f6806335J950539M134342N3342722k3765885J3727746N4488708o1244556K5756578
3965A583859k3953458L8187934l75621O178037J11450946m1601919M7027236o207054
$$ plain form
4020 140770659 35280203 21506938 -14821618 -80496396 -81208162 -183118399 -139384381 -160175081
4012 -160175081 -187671296 -124307048 -126971546 -104567645 -102960972 -99572201 -65293503 -101068226
4004 -101068226 -91056438 -45198377 -110775971 -91654655 -120717055 -144432507 -146794605 -218177027
3996 -218177027 -135857136 -197175551 -182667837 -116246558 -133265470 -39869363 -50755861
3989 -50755861 54185672 69285910 39656692 108782902 58187776 69909399 62114939 91828539
3981 91828539 108915337 70285990 92912662 68609404 -219867 -22171367 -31619399 -66806335
3973 -66806335 -64855796 -60721454 -7378732 -31144617 -17416871 37071837 -24172719 1583859
3965 1583859 -22369599 15818335 15442714 21620751 133071697 91469778 138497014 132289960
3957A32289960j1481759k5903549o8088471M4975703p4660937q634876J6515364j5970711
3949a0959276J45500j9835461L4382205j8348053j8877372L8679399J2868346j8861150
3941h05862L9452556Q235751J0091610n168491J823425M0369612q5119107K6383018
3933C5262512l1270772n3371385J3294437m3609457P0677110n2499866K9424725L7907832
3925E815136o1479706N0559618j5967586M6098967L149931n804728L9058857o5345319
3917c914830k5161736r366522l9723086r351108N49541J1927746L3837143n247644
3909d6450496P5367094K9587336r371188N4730288n1200849P335326m8833407j6655039
3901e490935J8326670p4805416L9287712m5423398j9308472M478686j3654698N5473476
$$ plain form
3957 132289960 120808201 94904652 26816181 71791884 -2869053 -11503929 5011435 -10959276
3949 -10959276 -10813776 -30649237 3732968 -14615085 -33492457 5186942 18055288 -805862
3941 -805862 38646694 46882445 56974055 51805564 53628989 93998601 8879494 35262512
3933 35262512 3991740 -49379645 -36085208 -79694665 -9017555 -61517421 -32092696 5815136
3925 5815136 -55664570 -5104952 -21072538 25026429 28176360 22371632 61430489 -3914830
3917 -3914830 -29076566 -38443088 -78166174 -87517282 -86967741 -75039995 -41202852 -46450496
3909 -46450496 28916598 58503934 49132746 103863034 52662185 59997511 11164104 -5490935
3901 -5490935 12835735 -61969681 -22681969 -68105367 -87413839 -82935153 -96589851 -41116375
3893d1116375p117834M9062327K9525855q705224J6920972K072912m20763O25655j684043
3884C9163482O065406m398388k1197026K4840064k2164501Q33639N968130j7536088
3876A1574718J1914446l5256835J8402084j7010160j1667780J7968198j3777822J3588060
3868d265091k0650270P437769j4629204r206953J6277823J1151744K3569859J577115
3860A1262792J5019488k4361577j7833742r984182k801272J2180244K530765K1732970
3852G745486j0566689m713284J629763J1131823J0715887J4967965J6290371o283528
3844D0917794L392348j928749K6019659l343334O780952p035100m7660824j9833220
3836b690474l3159427J8795277N821582J6469098K0248679l5562642j3910415k2348987
$$ plain form
3893 -41116375 -48234209 828118 30353973 21648749 38569721 40642633 40221870 40847525 39163482
3884 39163482 45228888 40830500 19633474 44473538 22309037 23142676 29110806 11574718
3876 11574718 23489164 -11767671 6634413 -10375747 -22043527 -4075329 -17853151 -4265091
3868 -4265091 -24915361 -17477592 -32106796 -41313749 -25035926 -13884182 9685677 11262792
3860 11262792 26282280 1920703 -15913039 -25897221 -28698493 -16518249 -13987484 7745486
3852 7745486 -2821203 -7534487 -5904724 5227099 15942986 30910951 47201322 40917794
3844 40917794 44310142 42381393 68401052 65057718 71838670 64803570 17142746 -2690474
3836 -2690474 -35849901 -17054624 -11233042 5236056 25484735 -10077907 -23988322 -46337309
3828d6337309O514343J1895592J8704060K0099822j4289517j9068700o079345L808052
3820b4753002l532625J8265722j4776210k7016367m0841477k0590671J5977477L193631
3812i4073522N5225736J8588905j814389j5187369k0893065P458184m785250L9592608
3804a5888162K4262770N512077o091927K64843j275092m654312K3768274P27025J148626
3795B7774122k6811998K966830l868622j0606590L2957490p382952L315305k4068154
3787e724569n726679O44162j6323255K6634023k918898j2598186k1224929j2628860
3779d9867191q870413L367241K3465065K5811342K329963k2530360j573225l8352312
3771f6219890L153998J8099899L1869808M5010617o320038K7816174l7032640k6537034
$$ plain form
3828 -46337309 -39822966 -27927374 -9223314 10876508 -3413009 -22481709 -28561054 -24753002
3820 -24753002 -28285627 -10019905 -24796115 -51812482 -92653959 -113244630 -97267153 -94073522
3812 -94073522 -38847786 -20258881 -22073270 -37260639 -58153704 -50695520 -55480770 -15888162
3804 -15888162 8374608 13886685 7794758 8059601 6784509 2130197 25898471 26625496 27774122
3795 27774122 962124 3928954 60332 -10546258 22411232 15028280 18343585 -5724569
3787 -5724569 -11451248 -10807086 -27130341 -496318 -3415216 -16013402 -37238331 -49867191
3779 -49867191 -58737604 -55370363 -31905298 -6093956 -3763993 -26294353 -27867578 -66219890
3771 -66219890 -63065892 -44965993 -13096185 31914432 25594394 53410568 16377928 -10159106
3763a0159106m185215j4026590K8893730m848873K8278008l692476k2005038o58356
3755b403916j4122745L98070l805382R788461M050192M007261R836266L1634093J3794933
3746E3177233J0848390J3547904k3098528j0451156l5194506p71506j2643770k2713959
3738b7299898P403463k9047978L4763j0947096K3290896K3087742r93867J6889811
3730B417836k2698952j1249289j4956845K8150102L6598904K3041082L0249188j5496427
3722E6055599k9381042n2072812j1643175L208407J1302839M4749133K5080564J0167343
3714E7466856j9177175o112511j6234206k4585195l972053K134874j0010584j5229460
3706c5719454J4430521n577554j455511m286722Q092911o158196k4153027L1810275
$$ plain form
3763 -10159106 -14344321 -28370911 522819 -4326054 23951954 20259478 -1745560 -2403916
3755 -2403916 -16526661 -16128591 -19933973 -10145512 -6095320 -2088059 7748207 39382300 53177233
3746 53177233 64025623 77573527 54474999 44023843 8829337 8057831 -4585939 -27299898
3738 -27299898 -19896435 -48944413 -48909650 -59856746 -36565850 -13478108 -14471975 2417836
3730 2417836 -20281116 -31530405 -46487250 -18337148 18261756 41302838 71552026 56055599
3722 56055599 26674557 -25398255 -37041430 -33833023 -22530184 22218949 47299513 57466856
3714 57466856 38289681 32177170 15942964 -8642231 -12614284 -10479410 -20489994 -35719454
3706 -35719454 -21288933 -26866487 -28321998 -32608720 -24515809 -30674005 -54827032 -23016757
3698b3016757n153421O173802N854041p89136n32901m0142353K4953331m240053j1150066
3689d8043513J6353224m416153j963211k9847098J8780387K1119837M367141M2798822
3681A9149436L2797431n614565k8707612k0555395l1513287l8389792p879912L3167938
3673d7545758J146251N842257L8634984N063285J1969440J4345620M6773655Q210291
3665H4440025j2490395L3149828k3107243j8084752j2640354K491481k5920010n1257032
3657b3418452N730143l3438389j7637108J8712522M0580582J9224390l362019L5533153
3649D1924822j6687715k6340316l731445M125101k3090771k7293381K2279513l925768
3641c2739960j622335L0206849L3321003j5791419j8129593P859220j2229924k138973
$$ plain form
3698 -23016757 -28170178 -21996376 -16142335 -16931471 -17464372 -57606725 -32653394 -36893447 -48043513
3689 -48043513 -31690289 -36106442 -38069653 -67916751 -49136364 -28016527 -23649386 19149436
3681 19149436 51946867 46332302 17624690 -2930705 -34443992 -72833784 -80713696 -47545758
3673 -47545758 -46399507 -40557250 -1922266 3141019 15110459 29456079 76229734 84440025
3665 84440025 71949630 105099458 81992215 63907463 51267109 53758590 27838580 -23418452
3657 -23418452 -17688309 -51126698 -68763806 -50051284 -9470702 9753688 6391669 41924822
3649 41924822 25237107 -1103209 -4834654 -709553 -23800324 -51093705 -28814192 -32739960
3641 -32739960 -34362295 -4155446 29165557 13374138 -4755455 3103765 -9126159 -11265132
3633a1265132L2276897N2187851j6537582q373489n639330m1609919j7695986j763359
3625a8420049M2544643k5498737n870347J1559964m6263533k490189j861592L5581632
3617a0718208r858998k39313L8185716k8593185L981720N676404k925693l1779543
3609c6271100k2999147J6478983n292943J9605351N1804165K2925509k2072879k449076
3601B1728863j3775522q405401O729715L5784437K3804946m7643816n007372m8505676
3593c5289826m0317038k507624J0351075L8676417k3717144L5474084k204725j9597908
3585c9132689K5370379J734515J7966020k5905544J9750729M054632j7411708K9794512
3577A6220846L906458r661122k1688082P403921K099152N141013L8071405L0425531
$$ plain form
3633 -11265132 21011765 73199616 56662034 48288545 42649215 1039296 -16656690 -18420049
3625 -18420049 24124594 -1374143 -7244490 4315474 -41948059 -44438248 -46299840 -10718208
3617 -10718208 -20577206 -20816519 17369197 -11223988 -7242268 -1565864 -4491557 -36271100
3609 -36271100 -59270247 -42791264 -48084207 -28478856 23325309 46250818 24177939 21728863
3601 21728863 7953341 -452060 6277655 42062092 65867038 18223222 13215850 -35289826
3593 -35289826 -75606864 -78114488 -67763413 -29086996 -52804140 -17330056 -19534781 -39132689
3585 -39132689 -13762310 -12027795 5938225 -19967319 -216590 3838042 -13573666 16220846
3577 16220846 20127304 10466182 -11221900 -3817979 -1718827 3422186 41493591 71919122
3569G1919122j6113815j6193410l156412m0239664j2008806j1359025k205275m4375307
3561g3732592k7760633K2138972k8564453M1658264L2716709K4239215n715669j8722830
3553c3743017L5748538l8061004K6260726L1461878j0175261q093978j8054231K1639966
3545F983617k8106297P927112L5266361j9564011q401969K8984964L1955019J4356144
3537F9400940K3608023J4796252l8692962o7211821J7406498J0954020J7292687O7374888
3529A14928525J5380094k2058849q2792611j4917568j6192789k9550180O9828379J4960200
3521D9585201r492576l2482339K050869O348001k6945631N7292871J2953001l4012668
3513B5296729j4497165Q607217l150216j8835006K1417420j3665538o6378435k5310677
$$ plain form
3569 71919122 55805307 39611897 36455485 -3784179 -15792985 -27152010 -29357285 -73732592
3561 -73732592 -101493225 -79354253 -107918706 -66260442 -33543733 -9304518 -15020187 -33743017
3553 -33743017 2005521 -36055483 -9794757 21667121 11491860 3397882 -14656349 6983617
3545 6983617 -21122680 -13195568 22070793 2506782 -5895187 23089777 55044796 69400940
3537 69400940 93008963 107805215 69112253 1900432 19306930 30260950 47553637 114928525
3529 114928525 130308619 108249770 25457159 10539591 -5653198 -35203378 34625001 49585201
3521 49585201 40092625 7610286 9661155 16009156 -10936475 46356396 59309397 25296729
3513 25296729 10799564 19406781 16256565 -2578441 18838979 5173441 -61204994 -86515671
3505h6515671L0767296Q082525K9608420M3956423j6755431p3275288n4724141J1965083
3497a06890784r820900M6471447Q4141784K1841415j6028140j5046245J8968290k9300827
3489e663960R002108L8404263k7642465l6815281j5845168J5326627k2947691J3992328
3481c2189239L6770635l5826499l1091521k044617J3099897j2018600K0064095L8657117
3473d578732k7697800j4525516K9372196J6601042j850545K0363437J3865229l4919030
3465c369719k1034331M0342656J7386930l418385K7692224j8373672n2844506l5135999
3457d8754802J7381255J0523831j2811665M3656624r815991l7962532O943448K2395787
3449h444045J4427409k0714786J6831359k5834073n5213909L2348622M6293691L5094155
$$ plain form
3505 -86515671 -55748375 -47665850 -18057430 25898993 9143562 -64131726 -118855867 -106890784
3497 -106890784 -116711684 -70240237 13901547 35742962 19714822 4668577 23636867 -5663960
3489 -5663960 3338148 41742411 14099946 -22715335 -38560503 -23233876 -46181567 -32189239
3481 -32189239 4581396 -31245103 -62336624 -64381241 -51281344 -63299944 -43235849 -4578732
3473 -4578732 -32276532 -46802048 -17429852 -828810 -2679355 17684082 31549311 -3369719
3465 -3369719 -24404050 15938606 33325536 29907151 57599375 39225703 -13618803 -48754802
3457 -48754802 -31373547 -20849716 -33661381 9995243 179252 -37783280 -30839832 -8444045
3449 -8444045 5983364 -14731422 2099937 -23734136 -78948045 -46599423 -305732 34788423
3441C4788423K1918070K0739267k5937317o5799539J0780564K3884435j1546742L878166
3433A2705327j390210m1407614l8002869L4392399N3988502j113061j905310k2041143
3425d773979q9724876m9334809L7562858P6419255N7707726N4988168L0877529p4310285
3417C9411587n0138215J5001352K2103261K8550402L3077915K6257842o2437207l7378475
3409A4448462K4516621n433766K287365P535239j126476n3308330j4281377N8527941
3401C3165679J3908496N671536M495662l9976279p5938892k4235164M9621009L1299452
3393a988501J9699490K9954395l8259347q6647861k6132769J4198281K1697901K3932040
3385d3546371M6071479M57407o1769390R580129J3274679Q169623L0419258L9024287
$$ plain form
3441 34788423 56706493 77445760 51508443 -14291096 -3510532 20373903 8827161 12705327
3433 12705327 11315117 -30092497 -68095366 -33702967 20285535 19172474 17267164 -4773979
3425 -4773979 -94498855 -143833664 -106270806 -29851551 27856175 82844343 113721872 39411587
3417 39411587 -10726628 4274724 26377985 54928387 88006302 114264144 51826937 14448462
3409 14448462 38965083 33531317 35818682 43353921 42227445 -11080885 -25362262 33165679
3401 33165679 47074175 52745711 57241373 17265094 -58673798 -82908962 -33287953 -1988501
3393 -1988501 17710989 47665384 9406037 -77241824 -103374593 -89176312 -67478411 -43546371
3385 -43546371 2525108 2982515 -58786875 -49206746 -35932067 -27762444 2656814 41681101
3377D1681101K4218532l1373235L1904573K1208007k4325799K814866n230167j7669618
3369D3228260l4697991K0457150K2842347k4402738m280506j690087l3065143k2880853
3361c4489561K6713434J4790638n715309R86977J8908903j0367553j370779M9312205
3353E8768955r58721j9006938k3992992j7878643k2843146p443974N7381877J4711673
3345C8738091N27902Q439706l722874j4788636n827734K0455212k5240404l9518193
3337b0936930j8007657K828329Q794389N1506900O4898619O12180j6473088l1221156
3329D2001586j2449355p958846L0565577M8992484l1787623m1238749o0064190m7518310
3321g9457426j0806360L2992732O7906642P267228r288586j6818414l0053465J094002
$$ plain form
3377 41681101 65899633 34526398 66430971 87638978 63313179 66128045 60897878 43228260
3369 43228260 8530269 28987419 51829766 27427028 23146522 21456435 -11608708 -34489561
3361 -34489561 -7776127 7014511 1299202 2286179 21195082 10827529 9456750 58768955
3353 58768955 57810234 38803296 14810304 -3068339 -25911485 -33355459 24026418 38738091
3345 38738091 39265993 47705699 43982825 29194189 23366455 43821667 18581263 -20936930
3337 -20936930 -38944587 -36116258 -27321869 24185031 89083650 89695830 73222742 42001586
3329 42001586 29552231 21593385 52158962 101151446 69363823 28125074 -31939116 -79457426
3321 -79457426 -90263786 -57271054 10635588 17902816 8614230 -8204184 -38257649 -37163647
3313c7163647M3779399M7844151J4341338j3568725j7342125k2004758j8926781M0970138
3305C7928990J6830398l760615n175341k3589865R793887o657798M1889576J0146273
3297G7405505m9754750k6813619n8042102r15541K5153235O1428271O7106290j5576351
3289G9990938j2160252m8581264m5895692M436487K2290305M5449861J4339275P78645
3281F0648303P976981k2917873L113839J5821086k1567734j5083875m8054182k3045040
3273d3108495p782146o212641O0196009N752897J7159512N233681k1008011K2830674
3265C3061480j8270519L4390497N409621k1384928J6393392k7541701J1020925r366241
3257B3712526j4186004o764201n3332468j1621249l262450O540306M3920367K4524007
$$ plain form
3313 -37163647 6615752 54459903 68801241 55232516 37890391 15885633 -3041148 37928990
3305 37928990 54759388 50998773 45823432 22233567 32027454 25369656 67259232 77405505
3297 77405505 27650755 837136 -57204966 -58120507 -32967272 28460999 95567289 79990938
3289 79990938 67830686 19249422 -26646270 -22209783 80522 45530383 59869658 60648303
3281 60648303 68625284 45707411 48821250 64642336 43074602 27990727 -20063455 -43108495
3273 -43108495 -50890641 -57103282 3092727 8845624 26005136 31238817 10230806 33061480
3265 33061480 14790961 49181458 54591079 33206151 49599543 22057842 33078767 23712526
3257 23712526 9526522 2762321 -50570147 -62191396 -65453846 -58913540 -14993173 9530834
3249I530834K4479652M900559j9654181J3592326j6058516l69635J4031536k6775063
3241C677512O580172k7468465L697693J1211325j8794620L3401838j9874826K631808
3233d937563O14267j4238831J7340475k8475860O912739m553152j0403221K1890881
3225a5850265M581949P865743j2895538k2999445j1564438p182534J6251759M8578254
3217F785485K4866201J7497858q574603m3311717l1473096n1197527j676654R49208
3209h6134845P073490M1312697J2534822L6424696J1282550J3528414O945423j7749404
3201B5217843O187367J902977J9785085K0301438K0445168j627881j7724023k7791080
3193D6696894k1833187k783030j1318617J7657264j4150112j0978961j1252495r863510
$$ plain form
3249 9530834 34010486 38911045 19256864 32849190 16790674 16421039 30452575 3677512
3241 3677512 10257684 -17210781 -13513088 -2301763 -21096383 12305455 -7569371 -4937563
3233 -4937563 -4323296 -18562127 -1221652 -29697512 -22784773 -27337925 -37741146 -15850265
3225 -15850265 -11268316 -3402573 -16298111 -39297556 -50861994 -58044528 -41792769 6785485
3217 6785485 31651686 49149544 40574941 -2736776 -34209872 -85407399 -87084053 -86134845
3209 -86134845 -79061355 -37748658 -25213836 11210860 22493410 36021824 42967247 25217843
3201 25217843 31405210 33308187 53093272 73394710 93839878 92211997 74487974 46696894
3193 46696894 24863707 22080677 10762060 28419324 14269212 3290251 -7962244 -17825754
3185a7825754L2639474R976764L8451089P932083j9379415k0269719l6233332n404354
3177a0113164r095113J1636332J3842384k668227j0539496m176999r518499j0353258
3169c0986040n98709j1193658L128934j9461893J5783000J0320989r925766J1685473
3161c1247670k6377155m921334k1035377J5210733L8951772J1548381L6920865k430889
3153A6619326j4966161l0008527j3230153O139023j293935J6907162P134750j2530205
3145b5228720k9048103M86200J796938J8062541L7520797L6813376K3176183j4806641
3137D8772571N912579k2042831k2107916k656928J503651K159764j3851506J3750122
3129A1439506j0408087j1462384m464475M808597n457830r339248K8516697J197858
$$ plain form
3185 -17825754 14813720 24790484 63241573 71173656 51794241 31524522 -4708810 -10113164
3177 -10113164 -19208277 -7571945 6270439 3602212 -6937284 -11114283 -20632782 -30986040
3169 -30986040 -31584749 -42778407 -39649473 -59111366 -43328366 -33007377 -42933143 -31247670
3161 -31247670 -57624825 -62546159 -83581536 -68370803 -29419031 -17870650 19050215 16619326
3153 16619326 1653165 -28355362 -41585515 -35446492 -36740427 -19833265 -12698515 -25228720
3145 -25228720 -54276823 -53790623 -51993685 -33931144 3589653 40403029 63579212 48772571
3137 48772571 54685150 32642319 10534403 7877475 9381126 11540890 -2310616 11439506
3129 11439506 1031419 -10430965 -14895440 -10086843 -15544673 -24883921 3632776 4830634
3121D830634J5456960R796569Q938500j4946863m0157937m602937l5563274j3743150
3113f9991498P772817J1439462N033857q135745J3124786k656380J840516L0322366
3105a1249819L4877325L906261R305159r283061k6357817k5157710j3547187K1085595
3097a6421254j8305305J8822403J0322486j3866354J0965898K338517L3956507p241586
3089B0571312J0358243O301181l4315622j1428128r487200K992747j5912404k00900
3081c1120771r038221l3262813k6726815m026016N93955l792036L6070513J8196448
3073e3105756J0886023K650617J2195512o910599k5191666J2676224p214000O386075
3065d7627570J2796068M7224908K0950060J2210099L6446319j6128251n317285l1185730
$$ plain form
3121 4830634 20287594 30084163 39022663 24075800 -16082137 -20685074 -56248348 -69991498
3113 -69991498 -62218681 -50779219 -45745362 -53881107 -40756321 -43412701 -41572185 -11249819
3105 -11249819 23627506 27533767 36838926 27555865 1198048 -23959662 -37506849 -16421254
3097 -16421254 -34726559 -15904156 -5581670 -19448024 -8482126 -6143609 27812898 20571312
3089 20571312 30929555 37230736 2915114 -8513014 -18000214 -15007467 -30919871 -31120771
3081 -31120771 -40158992 -73421805 -100148620 -104174636 -103580681 -107372717 -71302204 -53105756
3073 -53105756 -42219733 -39569116 -27373604 -34284203 -59475869 -46799645 -54013645 -47627570
3065 -47627570 -34831502 12393406 33343466 45553565 81999884 65871633 60554348 29368618
3057B9368618R079462j9825421k1632713L7419941k7221019J198294k2844306j0144906
3049b4602050k1974406l7257079M0733505M948006J7326899M5303529K3861027L873498
3041E2212929K968525Q934003J1235436l4280470n254579n456467q7766374k412511
3033e9819508l5048300K330624Q254413r560160O7443062p0489265K9286243K9321715
3025c8281176K974870Q9325874L3735201J14065820J4842835K9355573P6774010k9037127
3017B93755880J5226726p148433l7839735m8123553o4347651k31064m490405l4976508
3009A11825257O2386083k2526295m6848361r401823p0801607Q228720q9782126P725811
3001d9194341j2471452j15247720L2044772n7908511M1939245K9581274O8681099
$$ plain form
3057 29368618 38448080 18622659 -3010054 34409887 7188868 8387162 -14457144 -24602050
3049 -24602050 -46576456 -83833535 -43100030 -38152024 -20825125 24478404 48339431 52212929
3041 52212929 55181454 64115457 75350893 41070423 35815844 30359377 -57406997 -59819508
3033 -59819508 -94867808 -92537184 -84282771 -93842931 -26399869 -96889134 -67602891 -38281176
3025 -38281176 -35306306 54019568 87754769 201820589 216663424 246018997 322793007 293755880
3017 293755880 308982606 301834173 263994438 215870885 151523234 151292170 146801765 111825257
3009 111825257 174211340 151685045 104836684 95434861 24633254 32861974 -56920152 -49194341
3001 -49194341 -61665793 -176913513 -144868741 -202777252 -160838007 -131256733 -62575634
2994f2575634J45917334J3261491J42862928Q8725164N6967635P0115066J6215308
2987D71489292K4076916p3331543o1367979k7116120q5698648n1532251J004625m7476281
2979A50048011j8076369m1915539L189535l707638n7113322P6297027m2501943n666076
2971F0553686j4810313m9355749J0428325j01013344O5320112p503284Q57199P5768600
2963D0245232j1304967N2892831o4873758R564935q176623o3988149M5134612R771770
2955I265883L9885992L4848113M3234570O7312748J2014188K7351000P0147913o443359
2947B97617048M7734538O1496895M5142775R3729723j0739953Q1857290m7222474q5664007
2939D83951835j2239252j43687803j5175702j18915881m2037322l9771228j53269128
$$ plain form
2994 -62575634 83341700 96603191 239466119 328191283 385158918 455273984 471489292
2987 471489292 495566208 422234665 360866686 333750566 248051918 196519667 197524292 150048011
2979 150048011 131971642 90056103 93245638 89538000 32424678 108721705 66219762 60553686
2971 60553686 45743373 -3612376 6815949 -94197395 -28877283 -36380567 -35523368 40245232
2963 40245232 28940265 81833096 16959338 26524273 18347650 -45640499 -505887 9265883
2955 9265883 49151875 83999988 127234558 194547306 206561494 233912494 304060407 297617048
2947 297617048 345351586 406848481 451991256 545720979 534981026 616838316 569615842 483951835
2939 483951835 471712583 328024780 312849078 193933197 151895875 112124647 -41144481
2932d1144481J6923763r0625408m010640P939129j6288998N6830866o9857309J0716245
2924a29516833J7275151l9963929L0510561n083044k4782510l8304980j02982782m116365
2916b96964731n9462897m6045168Q9395923k2420341P7506989K8567410O0355071
2909a69067744J06536402l9032813J32192268j1622117k6045134L2803196l5733478
2902i969420P5109120l3056384O6908795N2009792p7870481J8853143j9471540j3407102
2894E9105923J4472862M0498716R4080880J6233083K4807531R5382101l5099912j6801115
2886B92680069L049118o7531352o0643116j20787526P117182m8855080o0688660R2438898
2878C6779533j3165802M504780k0516376J1937701l50290o8788944P8805428K7002794
$$ plain form
2932 -41144481 -24220718 -114846126 -118856766 -110917637 -127206635 -70375769 -140233078 -129516833
2924 -129516833 -112241682 -152205611 -121695050 -126778094 -151560604 -189865584 -292848366 -296964731
2916 -296964731 -356427628 -402472796 -313076873 -335497214 -257990225 -229422815 -169067744
2909 -169067744 -62531342 -101564155 30628113 19005996 -7039138 25764058 -9969420
2902 -9969420 65139700 32083316 98992111 151001903 73131422 91984565 72513025 59105923
2894 59105923 73578785 114077501 208158381 224391464 249198995 344581096 309481184 292680069
2886 292680069 295729187 228197835 167554719 46767193 53884375 5029295 -55659365 36779533
2878 36779533 23613731 28118511 7602135 19539836 19189546 -49599398 29206030 56208824
2870E6208824j6331921L6687969M0137721J106004l0365593M0622187L0251050l7075417
2862A21240824J0114632O2328513k6180629j4270339L9921270r28875m8950598m9378634
2854I3896164J0233078q2877247p9323934K1311224j6947048k5539559J8582111P4836737
2846A4171526J3911654M487128P8776402K7033981l6059967m021249K2698036n8720441
2838F2277070m0571188K3359028m581024m4337752k1709200K3269059o8384031m0402399
2830a11080437M5989415J4415223K1696807M7271810Q1886191j376452k9266685L0949751
2822A00485623m3074247o6591431k3341902j257822k9566286j9710146M9249491K1903684
2814a1903036j6796039K7998690L5048077k3068382q51607K7839951O388468k3948945
$$ plain form
2870 56208824 39876903 76564872 116702593 117808597 87443004 128065191 158316241 121240824
2862 121240824 131355456 193683969 167503340 153233001 193154271 192225396 143274798 93896164
2854 93896164 104129242 21251995 -58071939 -36760715 -53707763 -79247322 -60665211 14171526
2846 14171526 28083180 32570308 111346710 138380691 102320724 98299475 120997511 62277070
2838 62277070 21705882 45064910 40483886 -3853866 -25563066 -2294007 -70678038 -111080437
2830 -111080437 -65091022 -50675799 -28978992 18292818 100179009 98802557 69535872 100485623
2822 100485623 57411376 -9180055 -32521957 -33779779 -63346065 -83056211 -33806720 -11903036
2814 -11903036 -28699075 -700385 34347692 11279310 10427703 38267654 44656122 20707177
2806B0707177o607782K4449891m3330416q447862K6922952l254593m391611r444742
2798c396986K3567788l0853578j1879946L3722654M762737J2130004R652618L1496577
2790F9201868j2533277j0289621J3994396j0783290j3739126j5070807J4454402j7395199
2782A7839346m168452J3058175j175487p325127k1222494P295009j9390149q890255
2774b3979434N705145P059067k960533j3679892J3674936o729756O342016N671029
2766h897422K6612850j648726k1146829O688324l0359774o680108j5095975K8773535
2758b1754125J9222889m699263M2288884q578765o214166k3323637j940004p726498
2750a2724685l2971831J8377872l021408j4836417j5506777R299072j3636981j5736963
$$ plain form
2806 20707177 14099395 38549286 -4781130 -13228992 13693960 10439367 6047756 -3396986
2798 -3396986 20170802 -10682776 -22562722 11159932 15922669 28052673 37705291 69201868
2790 69201868 56668591 46378970 60373366 49590076 35850950 20780143 35234545 17839346
2782 17839346 13670894 26729069 25553582 18228455 -2994039 4300970 -15089179 -23979434
2774 -23979434 -18274289 -11215222 -14175755 -27855647 -14180711 -20910467 -14568451 -8897422
2766 -8897422 17715428 16066702 -5080127 1608197 -28751577 -35431685 -50527660 -21754125
2758 -21754125 -2531236 -7230499 35058385 26479620 20265454 -3058183 -4998187 -12724685
2750 -12724685 -45696516 -27318644 -30340052 -45176469 -60683246 -51384174 -65021155 -80758118
2742h0758118K1569010K5024279J9542876J6308264O3024852N131833m380459N438373
2734G0900910k5715323l2349951m4628749K6493568k75598J3304682N3486393K3562006
2726H4777938J679947j6894273J4663565k3715792j7733526O999413j342921l0683211
2718A7751140k7659422J3937976k7972349O235259J8196032J4924945q188244k0198321
2710a2972984K5344841k4281002M775125K4490573M166849n891083j4796320P695347
2702H531346j5078920j0672838R790876o405776l7973888j1891484j4327011q221298
2694h6248993J8901633J6576285M0552193j5785858R825095M575924k2678404K7187465
2686g094660o985147J6863448j1194868j6357925J2244076j4606049K9385155K4570509
$$ plain form
2742 -80758118 -59189108 -34164829 -14621953 1686311 64711163 69842996 65462537 70900910
2734 70900910 45185587 12835636 -31793113 -5299545 -5575143 7729539 61215932 84777938
2726 84777938 86457885 69563612 84227177 60511385 42777859 49777272 48434351 17751140
2718 17751140 -9908282 4029694 -23942655 -17707396 488636 15413581 7225337 -12972984
2710 -12972984 12371857 -11909145 -7134020 17356553 21523402 15632319 835999 8531346
2702 8531346 -6547574 -17220412 -7429536 -13835312 -51809200 -63700684 -78027695 -86248993
2694 -86248993 -67347360 -50771075 -10218882 -26004740 -16179645 -11603721 -34282125 -7094660
2686 -7094660 -14079807 2783641 -8411227 -24769152 -12525076 -27131125 2254030 26824539
2678B6824539P973698J4170954j5211106j3117658n85503q275668J9600756j978273
2670B9401739n424199o20146m5298782N792449j3273755R60310K9241771N319791L8407102
2661D4506280n715143J9257358J2241007k9063668J613515j7901113j4608024o475647
2653C854565R448703K1025804l577898o175530M258885l9632691k5346278N359867p786883
2644c8571456J3287665P50751K5858893j7451359l1009126R649198l0090361m272467
2636g1848262N902928L2454324J2484076M412796L2545505j1666812j3816599m567836
2628a4099880K0636117j332709K1347628M5477030R718221J376615n914608Q947521
2620H6155935l0012602n85324K3037851J500089k41864K317922M207214m6997795k0150263
$$ plain form
2678 26824539 34798237 48969191 33758085 20640427 20054924 11779256 31380012 29401739
2670 29401739 23977540 23357394 -21941388 -16148939 -29422694 -28462384 779387 6099178 44506280
2661 44506280 38791137 58048495 70289502 41225834 42839349 24938236 10330212 3854565
2653 3854565 13303268 34329072 30751174 24575644 28834529 -10798162 -36144440 -30784573 -38571456
2644 -38571456 -25283791 -24533040 1325853 -16125506 -47134632 -37485434 -67575795 -71848262
2636 -71848262 -65945334 -33491010 -21006934 -16594138 15951367 4284555 -9532044 -14099880
2628 -14099880 6536237 5203528 26551156 72028186 81746407 83123022 77208414 86155935
2620 86155935 56143333 55558009 78595860 80095949 79854085 82172007 86379221 39381426 19231163
2611A9231163k5306369k6251728k5924335L399243L6425669r242480N1881362K0623257
2603D4835782J3123636J054791j3952176J7648444m7568636J0899346k698979j7212118
2595F130090N145856m318989J8958995r624941J3886946J1450858q059391j7542519
2587A6026905L144554k4797789j8907098M730269j9457765K2496971k4563007K6756399
2579a4570561l880340k3314612L4466316l7315795L2236090n176917J3480517K6164672
2571B2089370k4191533L0858421k9404503n575966P17205j2333836O893758P430700
2563c516384J1928705J3732525J0034641M039486J2100864m4224019M932895l4804984
2555b5776271l1610973K3090138k0431773N1466115j7005388K2462586L803495n7170824
$$ plain form
2611 19231163 -6075206 -32326934 -58251269 -54852026 -18426357 -27668837 24212525 44835782
2603 44835782 57959418 59014209 45062033 62710477 15141841 26041187 23342208 6130090
2595 6130090 11275946 6956957 25915952 16291011 30177957 41628815 33569424 16026905
2587 16026905 19171459 -5626330 -24533428 -19803159 -39260924 -16763953 -41326960 -14570561
2579 -14570561 -18450901 -41765513 -7299197 -44614992 -12378902 -17555819 -4075302 22089370
2571 22089370 -2102163 28756258 -648245 -6224211 -5507006 -17840842 -10947084 -3516384
2563 -3516384 8412321 22144846 32179487 36218973 48319837 4095818 9028713 -25776271
2555 -25776271 -57387244 -34297106 -54728879 -3262764 -20268152 2194434 5997929 -51172895
2547e1172895K5405096l3422280J7500224J1893327K0004662L6157213j6497245K2782047
2539C2650149K094078j9731958q769116M228611k2601494J301569M548752K5522944
2531A9243535K1075822j971128O0224935k8318692P029566R387399j5313573J9020291
2523I0378155l4797583L6756858l2161859k5536174K0159073k1858360J4532187m649107
2515D2823190K0854136j7037773l5481861p412301j9114639k1656299J3198514L1061904
2507G234871j989671J3705665n539708N492081k7335886k091634L4464128k0274297
2499C665549L0684191M692680R656595j2286235k0725222J3403283n2055682j1759976
2491c4724817j1927824o925970O009331J6644762M3701702l123432M79657r032045
$$ plain form
2547 -51172895 -25767799 -59190079 -41689855 -29796528 -9791866 26365347 9868102 32650149
2539 32650149 34744227 15012269 6243153 10471764 -12129730 -10828161 -6279409 19243535
2531 19243535 40319357 38348229 98573164 70254472 77284038 86671437 71357864 90378155
2523 90378155 55580572 92337430 60175571 34639397 54798470 32940110 47472297 42823190
2515 42823190 63677326 46639553 11157692 3745391 -15369248 -37025547 -23827033 7234871
2507 7234871 5245200 18950865 13411157 18903238 -8432648 -10524282 23939846 3665549
2499 3665549 34349740 39042420 48699015 36412780 15687558 29090841 -22964841 -34724817
2491 -34724817 -46652641 -53578611 -47569280 -30924518 12777184 9653752 10133409 1101364
2483A101364k4052682k5635310P356726K7928019K1753447K9647021K1835056O989341
2475F6922982k6442655J302714p928624j0600159M526230k071375J2010381j9735977
2467A7983517J6649034M057270j4797389K026891k3709654m402511k0068177J0598198
2459a1662821K6714594K768229K1699163m008008j7833838j6775774j6338462O589533
2451h847384J226223K858665J5007875j9178135n093820J278209n509711K2416314q15238
2442C342998J8147629k872577j9451143R741829k5261246Q39049J617599r710081J4246652
2433i359291q252205J5215218R477404j1474689J8508693j8335825q328950R733638
2425b816007j1977468K4978720n884512R011480M592030l7355621J1322272k4602342
$$ plain form
2483 1101364 -22951318 -48586628 -41229902 -13301883 8451564 38098585 59933641 66922982
2475 66922982 40480327 41783041 33854417 23254258 27780488 25709113 37719494 17983517
2467 17983517 34632551 38689821 23892432 25919323 2209669 -2192842 -22261019 -11662821
2459 -11662821 15051773 17820002 39519165 35511157 17677319 901545 -15436917 -8847384
2451 -8847384 -7621161 -4762496 10245379 -8932756 -14026576 -12748367 -18258078 4158236 3342998
2442 3342998 21490627 18618050 -833093 8908736 -16352510 -15513461 -13895862 -23605943 -9359291
2433 -9359291 -17611496 -2396278 7081126 -4393563 14115130 -4220695 -12549645 -2816007
2425 -2816007 -14793475 10185245 4300733 13312213 17904243 -19451378 -8129106 -32731448
2417c2731448q969999J0375434p988383K2144996q182760J4307586J8386649j7741332
2409a0399257J5786387M303608j1198239J4020176k576911J5549119m275327j5152240
2401F057316K4964417l6124454L892045J3035253j3288002K0403068j6006097L0796210
2393C3729756l896068p560232M0089102j9015257m975494j0674653j4739371j2254068
2385G03715j5620108K3869171J6136277j1339956K2373636J0205931k1375359J7552033
2377D2505340J368744J1595757k2443855k1036912L352242o8035122j705094K536080
2369e1862820j699076K1625186J1916498M3756765j3993918L486988K1217444j8657066
2361A5790001j1132075J3710146J0786394k885962J0147655O797047r506875n6365609
$$ plain form
2417 -32731448 -41701447 -31326013 -39314396 -17169400 -25352160 -11044574 7342075 -10399257
2409 -10399257 5387130 9690738 -1507501 12512675 9935764 25484883 21209556 6057316
2401 6057316 31021733 -5102721 -1210676 11824577 -1463425 18939643 2933546 33729756
2393 33729756 29833688 22273456 62362558 43347301 38371807 27697154 12957783 703715
2385 703715 -14916393 8952778 25089055 13749099 36122735 46328666 24953307 42505340
2377 42505340 43874084 55469841 33025986 11989074 15341316 -52693806 -54398900 -51862820
2369 -51862820 -53561896 -31936710 -20020212 23736553 9742635 13229623 34447067 15790001
2361 15790001 4657926 18368072 29154466 26268504 36416159 43213206 33706331 -22659278
2353b2659278q971614j6750074l2781219M3377279K7170486M5747405K420421L865022
2345D1418428l914889p6596157j0489546r218203R52818L1286957M3473258M4485930
2337F1398596l878573r290188o996929m1878523l2003376K5516075K480265K2928428
2329A8275775K1347557R008956K941650m9301948K0714155j8047906j2747326L4442282
2321B6633195n627532K2072885k2998837N094762m811595m4643276Q405763j3230416
2313b9105051p661538J1509160J4614005K1404516J899637o45084J2766596k2722030
2305B060211k00401K0572725j0848229J6541875j8714953l719494j4943245k5824452
2297c5075963L1194767j2976410J5349122p52501k4502474r923841l5337126J0880179
$$ plain form
2353 -22659278 -31630892 -48380966 -81162185 -37784906 -10614420 35132985 37553406 41418428
2345 41418428 37503539 -39092618 -49582164 -58800367 -57847549 -26560592 16912666 61398596
2337 61398596 57520023 48229835 41232906 -645617 -32648993 -7132918 -4652653 18275775
2329 18275775 39623332 48632288 51573938 2271990 22986145 4938239 -7809087 26633195
2321 26633195 21005663 43078548 20079711 25174473 20362878 -24280398 -15874635 -29105051
2313 -29105051 -36766589 -25257429 -10643424 10761092 12660729 12015645 24782241 2060211
2305 2060211 1859810 22432535 11584306 28126181 9411228 5691734 -9251511 -35075963
2297 -35075963 -3881196 -16857606 -1508484 -2260985 -26763459 -36687300 -72024426 -61144247
2289f1144247L891502J2009285K5425208n23804J236111n143737p35689Q750675Q574006
2280g660690P692929N500964j2547976n307385q982503o234859R068033j871681J1922589
2271h420579L222718P863232O732508M99410N225567j2987597o798379q954932O461130
2262g156922J1307209K1573416K7589518j296315j056856k3851178j9184969j3219304
2254e295401m072531K6415966M888815J1851235L834425j7875929m177785j0991735
2246D577060J1896874J5929326L377587K7414840l545147l013525N869490j5130987
2238D7375518P951485k2435892q889336o797822l7144835O480894j7212062l704362
2230c4376412K431944j9125996J6526517j5493969R295993K7417270l286695K4585033
$$ plain form
2289 -61144247 -57252745 -45243460 -19818252 -20342056 -19105945 -24249682 -24985371 -16234696 -7660690
2280 -7660690 32239 5533203 -7014773 -12322158 -21304661 -27539520 -18471487 -20343168 -8420579
2271 -8420579 -5197861 2665371 9397879 9897289 15122856 2135259 -4663120 -13618052 -7156922
2262 -7156922 4150287 25723703 53313221 52016906 50960050 27108872 7923903 -5295401
2254 -5295401 -9367932 17048034 21936849 33788084 37622509 19746580 15568795 4577060
2246 4577060 16473934 32403260 35780847 63195687 59650540 56637015 62506505 47375518
2238 47375518 55327003 32891111 24001775 17203953 -19940882 -13459988 -30672050 -34376412
2230 -34376412 -31944468 -51070464 -34543947 -50037916 -40741923 -13324653 -16611348 7973685
2222G973685p370053m379857N35074k6950201K3354223p270071o884607J2498936k6966102
2213c5458973J2112648j1501006J8775965L9763321j0566643L1718962j6240170k3208644
2205E395460j2248273k9807446J6881374k2629671L87350J3903881l0065044N611395
2197e2570974k816878L853317N386070j4498282K3872928j1233042n700880L9231813
2189a4475928O18121J6062334k040348k876525j721416l5674804L5345167O883943k601511
2180d80967K5685519j0950350Q85330l0385557R004224J2063242l0994031J6513413
2172h659177r085724k2846069j3488195k23201J8190626j2245237J8250026L1766042
2164A659091j0372600J6358420L2537277J9072773J2403349O601505K2260732k7387000
$$ plain form
2222 7973685 603632 -3776225 -3241151 -30191352 -6837129 -14107200 -20991807 -8492871 -35458973
2213 -35458973 -23346325 -34847331 -16071366 23691955 13125312 44844274 28604104 5395460
2205 5395460 -6852813 -36660259 -19778885 -42408556 -42021206 -28117325 -58182369 -52570974
2197 -52570974 -55387852 -51534535 -46148465 -60646747 -36773819 -48006861 -53707741 -14475928
2189 -14475928 -13857807 2204527 164179 -2712346 -4433762 -40108566 -4763399 2120544 -480967
2180 -480967 25204552 14254202 15139532 -15246025 -6241801 5821441 -25172590 -8659177
2172 -8659177 -17744901 -40590970 -54079165 -54302366 -36111740 -48356977 -30106951 1659091
2164 1659091 -8713509 7644911 40182188 59254961 71658310 78259815 100520547 73133547
2156G3133547k5540733J3886518k6857052j1089525k183048R086454k427324j1407907
2148A6600930M1875143j401183p526283J1795685j2139012k0053539k7995545J4499488
2140A5655684M172522k977228M0479218K1263444k640390l656564o48802j4112062
2132E7535822k6110090P117807J3659622j2709394R617618J3824593q695971q588784
2124D5651223k233905N676096k3583521j1172449Q093420j7981489M824172J7151269
2116B6424816K2664766P798511j912486J3824472k0846443j0472278P256843R17204
2108D5655405j425283j2688364l696128k3723236k3996969Q71737l533025k800471J909599
2099b3426735O172115M987413P861731K0809706K0687626m325515j3004460k5362660
$$ plain form
2156 73133547 47592814 61479332 34622280 23532755 21349707 30436161 28008837 16600930
2148 16600930 58476073 57074890 49548607 61344292 49205280 29151741 1156196 15655684
2140 15655684 19828206 16850978 57330196 78593640 75953250 72296686 71647884 57535822
2132 57535822 31425732 38543539 52203161 39493767 49111385 62935978 54240007 45651223
2124 45651223 43417318 49093414 25509893 14337444 22430864 4449375 9273547 26424816
2116 26424816 49089582 56888093 54975607 68800079 47953636 37481358 44738201 45655405
2108 45655405 44230122 31541758 27845630 4122394 -19874575 -19002838 -22535863 -25336334 -23426735
2099 -23426735 -17254620 -12267207 -4405476 16404230 37091856 32766341 19761881 -5600779
2091e600779l6004313j7031866k973320K8469048K2545062J5982516J6298902j4314526
2083G370724l917834j1150793J910226K330037j7046578J779554j5320123l704599Q112801
2074b9636585J3320573K1094900j720219L173380r72763r824007O724003J5852212
2066A8011494J1818503R876137L567091J3180238Q487399R145331L4336320r80577o386690
2057A01055246j7868300l0771411j4401855k7168455J8083878j376982j3977818L871409
2049A7445712k9644196j0538097j8956493O197231J6501714l875918L2790814J6762438
2041B6683205J3788623K7340365J8514624J8301216l476671m173586L069695k1280022
2033G8767449M548111J5720959m348184J2106574j0362779k843379k0778955l0603093
$$ plain form
2091 -5600779 -41605092 -58636958 -61610278 -33141230 -10596168 5386348 21685250 7370724
2083 7370724 3452890 -7697903 -5787677 -3457640 -20504218 -18724664 -34044787 -37749386 -29636585
2074 -29636585 -16316012 4778888 3058669 6232049 5259286 -4564721 2159282 18011494
2066 18011494 29829997 39706134 43273225 56453463 64940862 74086193 108422513 107441936 101055246
2057 101055246 83186946 52415535 38013680 10845225 28929103 27552121 13574303 17445712
2049 17445712 -12198484 -22736581 -41693074 -35495843 -18994129 -22870047 9920767 26683205
2041 26683205 40471828 67812193 86326817 104628033 101151362 96977776 100047471 78767449
2033 78767449 83315560 99036519 94688335 106794909 96432130 93588751 72809796 42206703
2025D2206703K567692l8231693p646133m494958r876536J3694033j0072035K3770593
2017A1917666n465295o105517J7869800r471899J8704338J0926889J6885383J2228692
2009F7490057j6843803o255627l4957982l8025020j8128836j8470143Q181392J8801487
2001c8208475K8632919L7591585J3812513K2555288M186613q739056O927389j2368562
1993E4390214P314136m176626n104554N593295j9740885Q316719j1932718k981158N284952
1984C6963375k0630017O217276k2612299o280852p364556j6702817J7226730j2445744
1976b5628904J7089775J1262875l881742J1451139j8727663L465669j2346526m476997
1968b1792374K7786887L576692K4834346J8226593j452452L196947j6514816O445717
$$ plain form
2025 42206703 44774395 6542702 -1103431 -5598389 -15474925 -1780892 -11852927 11917666
2017 11917666 6452371 346854 18216654 8744755 27449093 38375982 55261365 67490057
2009 67490057 50646254 44390627 9432645 -28592375 -46721211 -65191354 -57009962 -38208475
2001 -38208475 -9575556 28016029 41828542 64383830 68570443 59831387 66758776 54390214
1993 54390214 61704350 57527724 52423170 58016465 38275580 46592299 34659581 31678423 36963375
1984 36963375 16333358 22550634 -61665 -6342517 -13707073 -30409890 -13183160 -25628904
1976 -25628904 -8539129 2723746 -1157996 10293143 -8434520 -4968851 -17315377 -21792374
1968 -21792374 5994513 9571205 34405551 52632144 51179692 54376639 37861823 44307540
1960D4307540P16102j1231642K7234089j7211772j4953734r154130l4824811N18699
1952a4599659k8111558K6660651K3259341n479127N4615675j4205942j683204k4762255
1944A5693922l7998986p083708n3066150K9117031J5010697j362452L4529168r292077
1936a4452555o969702l2263247j3516589J2297159j4789865L2305043M6745550l958210
1928E397584J6475716l945560k2515984k1402476l2545413L5904973j6320672J9678443
1920a9273389N9421185j3176927K3969642k0191960P108265k0739632k8132966N2481307
1912D1465525j7988561J4910445J8123444n592544k0826165l9877066l323065l9895321
1904e3003308l3586073J1256897J1118223j2180086K7667507J9674271q940629q094893
$$ plain form
1960 44307540 45023642 33792000 61026089 43814317 28860583 19706453 -15118358 -14599659
1952 -14599659 -42711217 -16050566 7208775 1729648 56345323 42139381 40456177 15693922
1944 15693922 -22305064 -29388772 -82454922 -53337891 -38327194 -39689646 -5160478 -14452555
1936 -14452555 -21422257 -53685504 -67202093 -54904934 -69694799 -37389756 9355794 5397584
1928 5397584 21873300 17927740 -4588244 -25990720 -58536133 -22631160 -38951832 -19273389
1920 -19273389 40147796 26970869 50940511 30748551 37856816 17117184 -11015782 41465525
1912 41465525 23476964 38387409 56510853 50918309 30092144 -9784922 -13107987 -53003308
1904 -53003308 -86589381 -75332484 -64214261 -76394347 -48726840 -29052569 -37993198 -46088091
1896d6088091p744907J1010694m8706402J3141423J2943874k2854478K4600889R440623
1888e4256375L5718514j8777614J6364222J3422034m4132208m99568l623883J3705573
1880d2079305o885202L7820267K5185467j4764953M198749k409597M147544k1439189
1872a6226219M2742310J8958808M148148K6032548J126269k278528n0930295m384149
1864A9188892l4839298l5386558P167716K014574P358508k3735539M853285m2603944
1856i5982364l6196796j0721016P396269K8930992K3669617O9140639K708087J2663202
1848A608630k127119j7034846k848082k2650601L3656138j4787840J6904962K0588739
1840A3309981n380486L364480k5164042m731256l7927889l215516P127916J0501862
$$ plain form
1896 -46088091 -53832998 -42822304 -91528706 -78387283 -65443409 -88297887 -63696998 -54256375
1888 -54256375 -18537861 -37315475 -20951253 -7529219 -51661427 -52160995 -55784878 -42079305
1880 -42079305 -48964507 -11144240 14041227 -723726 3475023 1065426 5212970 -16226219
1872 -16226219 26516091 45474899 49623047 75655595 76781864 74503336 23573041 19188892
1864 19188892 -15650406 -51036964 -43869248 -41854674 -34496166 -58231705 -53378420 -95982364
1856 -95982364 -132179160 -142900176 -135503907 -106572915 -82903298 -13762659 -11054572 1608630
1848 1608630 -518489 -17553335 -20401417 -43052018 -9395880 -24183720 -7278758 13309981
1840 13309981 7929495 11293975 -13870067 -18601323 -56529212 -59744728 -52616812 -42114950
1832d2114950J5328661J3167698J4088567k1795185K2864237n659216J1065528L309456
1824A0254796n960468M450285l9661293L0145354J221596J9344118L2302120m015558
1816D8080950m743023n1820488p829063j9283153l893585L3134624K4319908P270413
1808B5236583n188194M441527l0998271j8288418k0584580L12305j7329942M426232
1800e7972758N0351793o371043K9674993r955974k4005436m2953649n0537558K4337279
1792h7432353j4365257M3781452M9858063J0510853L261008k5469728M43090k5199269
1784d4612141n973736K0435528o476808j5435624P048460O265598Q224103L1997113
1776A472493K9054707K7998100j9750324K175245j7035422m6461324M429004k0675150
$$ plain form
1832 -42114950 -26786289 -13618591 469976 -21325209 1539028 -4120188 6945340 10254796
1824 10254796 4294328 8744613 -30916680 -771326 450270 19794388 52096508 48080950
1816 48080950 43337927 -8482561 -16311624 -35594777 -39488362 -6353738 17966170 25236583
1808 25236583 20048389 24489916 -6508355 -24796773 -45381353 -45069048 -62398990 -57972758
1800 -57972758 -7620965 -13992008 15682985 5727011 -18278425 -61232074 -111769632 -87432353
1792 -87432353 -101797610 -58016158 -8158095 2352758 5613766 -19855962 -19412872 -44612141
1784 -44612141 -50585877 -30150349 -36627157 -52062781 -45014321 -38748723 -30524620 1472493
1776 1472493 30527200 58525300 38774976 40950221 23914799 -22546525 -18117521 -38792671
1768c8792671J0936252k510615J1717292K5573789k5304519J6524706j8105632j6804768
1760c6766166p7853J20777L2187398J3429127L2129234J2613804j5940124j5830208
1752B1865989k6910389k2746960o836010R679446J3825741K1889788J1829854N971417
1744B8568876j7763254j7560333j3737131k8747341J1099995R070403J6083294J7334111
1736D348620J4665348J6971316j3604013K2144846Q020309q692795l862108j5386639
1728B4604884k1293891m1949023P858520O642803j437536K1556913J3057588l167437
1720E872821k4070424K1805654J0763001m837492K6343191J5766005r516180k2072710
1712B0053866J7802290k842326k4621662P478022o53457l6747429k9775372J6689274
$$ plain form
1768 -38792671 -27856419 -30367034 -18649742 6924047 -18380472 -1855766 -19961398 -36766166
1760 -36766166 -36844019 -36723242 -4535844 8893283 41022517 53636321 37696197 21865989
1752 21865989 -5044400 -27791360 -34627370 -24947924 -11122183 10767605 22597459 28568876
1744 28568876 10805622 -6754711 -20491842 -49239183 -38139188 -29068785 -12985491 4348620
1736 4348620 19013968 35985284 22381271 44526117 52546426 43853631 39991523 24604884
1728 24604884 3310993 -38638030 -30779510 -24136707 -25574243 -4017330 9040258 5872821
1720 5872821 -18197603 3608051 14371052 9533560 35876751 51642756 42126576 20053866
1712 20053866 37856156 35013830 10392168 17870190 17216733 -19530696 -49306068 -32616794
1704c2616794n858877o675953K8430131K8287574j5591515o768251L8072057j2237531
1696A5040841m585320K0214189J4465762j9550229r563501M6515473j8495074j2391660
1688C1650481J0088080k5199787n2474548l8561965K2316844j6699497R965035O1349581
$$ plain form
1704 -32616794 -38475671 -45151624 -16721493 11566081 -4025434 -10793685 27278372 15040841
1696 15040841 10455521 30669710 45135472 25585243 16021742 62537215 44042141 31650481
1688 31650481 41738561 16538774 -35935774 -74497739 -52180895 -68880392 -58915357 2434224
$$ [...]
-2730e2532189  $$ checkpoint
##END NTUPLES=
##END=
