##TITLE= S#480159
##JCAMP-DX= 5.00 $$ JEOL NMR v1.10
##DATA TYPE= NMR SPECTRUM
##DATA CLASS= NTUPLES
##NUM DIM= 1
##ORIGIN= DELTA_NMR
##OWNER= NMR
##SPECTROMETER/DATA SYSTEM= DELTA_NMR
##.OBSERVE FREQUENCY= 3.00529655924288E+02
##.OBSERVE NUCLEUS= ^1H
##.DELAY= (2.195E+02,2.195E+02)
##.ACQUISITION MODE= SIMULTANEOUS
##.FIELD= 7.0586013
##.FILTER WIDTH= 1.81675738660864
##.ACQUISITION TIME= 3.6339712
##.SPINNING RATE= 17
##.OBSERVE 90= 9.2
$$ ------------------------
$$ JEOL SPECIFIC PARAMETERS
##$FILENAME= C:\NMR/eb-3.jdf
##$TITLE= S#480159
##$AUTHOR= NMR
##$CREATION=  1-FEB-2018 13:14:19
##$REVISION=  1-FEB-2018 13:21:32
##$CONTENT= PROTON NMR EXPERIMENT
##$INSTRUMENT= DELTA_NMR
##$SITE= Center College ECP+ 300
##$NODENAME= nmr2
##$DIMENSIONS= 1
##$STORAGE= FLOAT
##$X_FORMAT= COMPLEX
##$X_CURR_POINTS= 16384
##$X_START= 12.50103 $$ppm
##$X_STOP= -2.50012 $$ppm
##$X_TITLE= 1H                             
##$X_ZERO_POINT= 0.33329
##$X_FREQ_FLIP= FALSE
##$X_POINTS= 16384
##$X_PRESCANS= 0
##$X_DOMAIN= 1H
##$X_OFFSET= 5 $$ppm
##$X_FREQ= 300.52966 $$MHz
##$X_SWEEP= 4.50857 $$kHz
##$X_RESOLUTION= 0.27518 $$Hz
##$SOLVENT= CHLOROFORM-D
##$TEMP_GET= 20.3 $$dC
##$ACQ_DELAY= 0.2195 $$ms
##$DIGITAL_FILTER= FALSE
##$FILTER_FACTOR= 1
##$FILTER_WIDTH= 2.254 $$kHz
##$FILTER_MODE= BUTTERWORTH
##$TRANSITION_RATIO= 0.9
##$ORDERS
##$FACTORS
##$LOCK_STRENGTH= 915
##$LOCK_LEVEL= 200
##$LOCK_GAIN= 27
##$LOCK_OSC_OFFSET= 25.6519 $$kHz
##$LOCK_PHASE= 187 $$deg
##$LOCK_OSC_STATE= 2H OSC ON
##$X_ANGLE= 45 $$deg
##$X90= 9.2 $$us
##$X90_HI= 10 $$us
##$X90_LO= 50 $$us
##$X_90_WIDTH= 9.2 $$us
##$X_PULSE= 4.6 $$us
##$RELAXATION_DELAY= 4 $$s
##$SCANS= 8
##$PROBE_ID= 1412
##$ITERATIONS= 1
##$FIELD_STRENGTH= 7.0586 $$T
##$TEMP_SET= 25 $$dC
##$SPIN_SET= 15 $$Hz
##$SPIN_GET= 17 $$Hz
##$HE_LEVEL= 75 $$%
##$N2_LEVEL= 82 $$%
##$CHANGER_SAMPLE= 0
##$ADC_CARD= 16/1MHz/20
##$EXPERIMENT= single_pulse.exp
##$OBS_NOISE= WAUGH
##$IRR_NOISE= WALTZ
##$TRI_NOISE= WALTZ
##$QUA_NOISE= WAUGH
##$OBS_PWIDTH= 1 $$us
##$IRR_PWIDTH= 50 $$us
##$TRI_PWIDTH= 1 $$us
##$QUA_PWIDTH= 1 $$us
##$RECVR_GAIN= 4
##$IRR90= 9.2 $$us
##$TRI90= 10 $$us
##$QUA90= 10 $$us
##$IRR90_HI= 10 $$us
##$QUA90_HI= 10 $$us
##$IRR90_LO= 50 $$us
##$TRI90_LO= 10 $$us
##$QUA90_LO= 10 $$us
##$MOD_RETURN= 1
##$TOTAL_SCANS= 8
##$X_ACQ_DURATION= 3.63397 $$s
##$DELAY_OF_START= 1 $$s
##$ACTUAL_START_TIME= 886338792.0
##$CLIPPED= FALSE
##$DC_BALANCED= FALSE
##$TRI90_HI= 10 $$us
##$SPIN_LOCK_90= 100 $$us
##$SPIN_LOCK_ATTN= 24.4 $$dB
##$DEUT_GRAD_SHIM_90= 213 $$us
##$DEUT_GRAD_SHIM_ATTN= 9 $$dB
##$IRR_CODE= 146
##$LOCK_STATE= LOCK ON
##$AUTOLOCK_LEVEL= 200
##$SAWTOOTH_RANGE= 4
##$LOCK_STATUS= IDLE
##$LOCK_SETTLE_POINT= 4096
##$LOCK_ACHIEVE_POINT= 0
##$SPIN_ACTION= SPIN ON
##$SPIN_STATE= SPIN ON
##$SPIN_STATUS= SPIN ON
##$SPIN_GAS_SOURCE= AIR
##$TEMP_ACTION= TEMP OFF
##$TEMP_STATE= TEMP OFF
##$TEMP_STATUS= TEMP OFF
##$TEMP_COMP= 0
##$TEMP_DELAY= 0 $$s
##$TEMP_LIMIT_HI= 150 $$dC
##$TEMP_LIMIT_LO= -100 $$dC
##$TEMP_MELTING= -63 $$dC
$$ [...]
##$VT_PID_STD_WB_H_CBL= 10
##$VT_PID_STD_WB_H_CBH= 0
##$VT_PID_STD_WB_H_HC= 2.4
##$VT_PID_STD_WB_H_HL= 70
##$VT_PID_STD_WB_M_PB= 1.5
##$VT_PID_STD_WB_M_TI= 30
##$VT_PID_STD_WB_M_TD= 5
##$VT_PID_STD_WB_M_CBL= 9.9
##$VT_PID_STD_WB_M_CBH= 2.3
##$VT_PID_STD_WB_M_HC= 2.5
##$VT_PID_STD_WB_M_HL= 70
##$VT_PID_STD_WB_L_PB= 1.3
##$VT_PID_STD_WB_L_TI= 29
##$VT_PID_STD_WB_L_TD= 5
##$VT_PID_STD_WB_L_CBL= 20
##$VT_PID_STD_WB_L_CBH= 20
##$VT_PID_STD_WB_L_HC= 0.6
##$VT_PID_STD_WB_L_HL= 100
##$VT_PID_LONG_0_H_PB= 1.5
##$VT_PID_LONG_0_H_TI= 30
##$VT_PID_LONG_0_H_TD= 5
##$VT_PID_LONG_0_H_CBL= 9.9
##$VT_PID_LONG_0_H_CBH= 2.3
##$VT_PID_LONG_0_H_HC= 2.5
##$VT_PID_LONG_0_H_HL= 70
##$VT_PID_LONG_0_M_PB= 1.5
##$VT_PID_LONG_0_M_TI= 30
##$VT_PID_LONG_0_M_TD= 5
##$VT_PID_LONG_0_M_CBL= 9.9
##$VT_PID_LONG_0_M_CBH= 2.3
##$VT_PID_LONG_0_M_HC= 2.5
##$VT_PID_LONG_0_M_HL= 70
##$VT_PID_LONG_40_H_PB= 1.5
##$VT_PID_LONG_40_H_TI= 30
##$VT_PID_LONG_40_H_TD= 5
##$VT_PID_LONG_40_H_CBL= 9.9
##$VT_PID_LONG_40_H_CBH= 2.3
##$VT_PID_LONG_40_H_HC= 2.5
##$VT_PID_LONG_40_H_HL= 70
##$VT_PID_LONG_40_M_PB= 1.5
##$VT_PID_LONG_40_M_TI= 30
##$VT_PID_LONG_40_M_TD= 5
##$VT_PID_LONG_40_M_CBL= 9.9
##$VT_PID_LONG_40_M_CBH= 2.3
##$VT_PID_LONG_40_M_HC= 2.5
##$VT_PID_LONG_40_M_HL= 70
##$SAMPLE_ACTION= LOADED
##$SAMPLE_STATE= LOAD
##$SAMPLE_STATUS= LOADED
##$AUTOSHIM_MODE= AUTOSHIM OFF
##$AUTOSHIM_DELAY= 3600 $$s
##$AUTOSHIM_TRACK= AUTOSHIM OFF
##$SHIM_MAX_RECALL= MAX FOUND
##$SHIM_NAMES= SHIM_Z0
##$SHIM_Z0= 9196
##$SHIM_Z1= 5115
##$SHIM_Z2= -58
##$SHIM_Z3= -2829
##$SHIM_Z4= -240
##$SHIM_Z5= 46
##$SHIM_Z6= -33
##$SHIM_X= -14
##$SHIM_XZ= 16
##$SHIM_XZ2= 0
##$SHIM_XZ3= 0
##$SHIM_X2= -7
##$SHIM_X2Z= -40
##$SHIM_X3= 0
##$SHIM_Y= 1608
##$SHIM_YZ= 13
##$SHIM_YZ2= 10
##$SHIM_YZ3= 0
##$SHIM_Y2= -11
##$SHIM_Y2Z= -20
##$SHIM_Y3= 0
##$NUM_SCANS= 1
##$END_TIME= 886338859
##$LOCAL_TIME= 886338858
##$PROBE_ATN= 0
##$PROBE_TUNE= 0
##$PROBE_MATCH= 2077
##$PROBE_COARSE= NONE
##$LF_TUNE_DIAL= 0
##$LF_MATCH_DIAL= 0
##$HF_TUNE_DIAL= 0
##$HF_MATCH_DIAL= 0
##$PASS_RIPPLE= 0.01 $$dB
##$STOP_RIPPLE= 60 $$dB
##$PROBE_RECOVERY= 0 $$us
##$AF_DELAY_RATIO= 0
##$VERSION= 4.3.3
##$X_ACQ_TIME= 3.63397 $$s
##$DEAD_TIME= 0 $$us
##$DELAY= 0 $$us
##$PHASE_PRESET= 3 $$us
##$UNBLANK_TIME= 2 $$us
##$INITIAL_WAIT= 1 $$s
##$NORMALIZED= TRUE
$$ END OF JEOL SPECIFIC PARAMETERS
$$ -------------------------------
##NTUPLES= NMR SPECTRUM
##VAR NAME= FREQUENCY,    SPECTRUM/REAL, SPECTRUM/IMAG, PAGE NUMBER
##SYMBOL=   X,            R,             I,             N
##VAR TYPE= INDEPENDENT,  DEPENDENT,     DEPENDENT,     PAGE
##VAR FORM= AFFN,         ASDF,          ASDF,          AFFN
##VAR DIM=  16384, 16384, 16384, 2
##UNITS= PPM,     ARBITRARY UNITS, ARBITRARY UNITS, 
##FIRST=  1.2501033903057E+01, 3.47967443256707E+02, 1.38965399338026E+02, 1
##LAST=  -2.50011824950436, -2.12085881352175E+02, 1.51720453653795E+02, 2
##FACTOR=  9.1565355261926E-04, 7.05254591307049E-03, 7.05254591307049E-03, 1
##PAGE= N=1
##DATA TABLE=(X++(R..R)), XYDATA
$$ [...]
##PAGE= N=2
##DATA TABLE=(X++(I..I)), XYDATA
11807 10126656 6099309 -4490541 -6200961 -986644 1142225 4279782 7348138 8235060 -3716733
11798 -3716733 -12350372 -8581155 -1087000 -1581660 -7402653 -2199852 -3605152 -8744865 -8576472
11789 -8576472 -1562479 393601 -9499006 -4484397 4337127 4151931 -2425713 -8818615 -9169812
11780 -9169812 -11379117 -6600505 4047074 5844197 -1296714 -10402579 -13023449 -1653332 8280182
11771 8280182 11991399 11775443 5157284 3035587 -2620829 4345895 14233343 9072397 8808097
11762 8808097 5952067 8103057 5293085 712661 7877496 5951914 9294731 10863214 3111980
11753 3111980 -1920653 -9543744 -10308092 -7960932 -7074983 -5095566 -17235461 -24847195 -16871995
11744 -16871995 -15205285 -9519261 -5226324 -580174 2018589 -4224214 8185001 10985761 6515847
11735 6515847 10142019 7943483 12529490 4740964 -2287732 -4589096 -14018674 -8908507 -8486997
11726 -8486997 -10338935 -9300723 -19734250 -22875231 -20500593 -12407397 -1422839 -7642121 -7041152
11717 -7041152 -6959268 -14873060 -8148742 -2339655 10165929 9651187 -2043409 4877549 2348531
11708 2348531 5154818 10518588 16518107 26657438 12814587 12831591 22183284 17226303 15438514
11699 15438514 15839552 28404050 27360851 13878981 19858834 11938907 258266 6749466
11691 6749466 14614249 18082482 86280 -8233703 -7862286 -18541289 -5610712 -1877267 -9148246
11682 -9148246 -10600745 -13226542 -5834183 -11992324 -7410780 -2352316 -15938945 -1703468
11674 -1703468 9952975 -1209763 -17261363 -20565519 -8252318 -13873455 -6374988 10403881
11666 10403881 -10902798 -24788078 -8046037 11524694 10298388 1521098 17101202 15018759
11658 15018759 7920836 27198318 25027626 4445643 -9689883 2893100 17307304 6535507
11650 6535507 4130150 -10409342 -27090556 -15606184 3027276 16208560 12254803 8991003
11642 8991003 7979250 6012544 22665255 29448836 21009895 24299578 31001010 25755443 10454895
11633 10454895 5792965 6044209 -2753309 8040465 23865911 11582056 -10403406 -14969438
11625 -14969438 275846 6702547 10186810 17580766 7821255 -5573982 -8012683 2300338
11617 2300338 6071220 -2455728 -6232690 -6704177 -5059256 -9532915 -13124664 -9342555 -6325222
11608 -6325222 -5385666 -2170855 8431828 9484391 2207214 6426164 18988828 23747930 20484294
11599 20484294 24852863 29442605 22447267 16534615 22102104 26009165 20726611 11765751 7315800
11590 7315800 4480236 -2444561 -302298 4379238 5106502 -4951117 -16578820 -7814051 1702346
11581 1702346 7361209 8351680 8749760 5274264 -9023184 -5029439 6520296 6584497 -2474945
11572 -2474945 -10031770 -13074972 -25684224 -32782364 -25546028 -19720416 -21109151 -22253310 -23070131
11563 -23070131 -23806466 -23265012 -15092576 -2009978 2660243 6143942 1403046 13825 5045854
11554 5045854 3698740 4032893 1676757 4574912 -565036 -7710613 -3281450 -7379794 -15676949
11545 -15676949 -18063514 -8987377 -6262397 -10400101 -6126123 -4564020 -13408477 -16129362 -1457033
11536 -1457033 7275291 9669142 12105845 12748638 2977523 -3274859 14333243 24818230 24607144
11527 24607144 18043891 9295902 -825151 -6935794 7544673 13510309 4348800 -8303417
11519 -8303417 -15616842 -18370104 -15703619 -5194971 -3309495 -10641220 -18837756 -15559199 -13142834
11510 -13142834 -5976259 3312046 50642 -3126574 -6708262 1865101 5265161 11000018 23410095
11501 23410095 17022151 9900266 8502962 18714302 21083301 17071700 20931429 11269396
11493 11269396 -7691056 -12524622 -1341296 -2154576 -12409702 -17229507 -15229546 -24989625 -24797951
11484 -24797951 834564 10303032 11217664 9305227 20600188 25646780 23229083 47690368
11476 47690368 55198249 48120285 34319656 28126153 30683255 23669448 31621471 32264063 17107309
11467 17107309 5496937 3858044 10239741 17863847 19179277 18790319 13101568 12706994 26210751
11458 26210751 21467404 23447930 19363636 9711296 11431185 10456515 27669515 15519170
11450 15519170 4346057 11041993 5190339 10343413 12365480 30834808 32869435 13310322
11442 13310322 14793430 11907518 4501135 6344090 18547690 26333392 3114851 -20869533
11434 -20869533 -15207321 -18526458 -11941849 1781664 6990302 3432162 -23789076 -8017706
11426 -8017706 5187869 2329610 10791219 7212374 20791742 7225379 6271899 14892794
11418 14892794 -4641203 -4074051 -1523507 14270073 18075825 1731895 -3515415 -17796665
11410 -17796665 -19581576 -2870382 2175219 7760506 523423 -15588779 -18663711 -25808276
11402 -25808276 -5890355 -2718817 -5798204 12862172 -1151621 -5872598 -18179983 -6629687
11394 -6629687 6602540 -10057876 11725911 4779890 -14887679 -29895596 -28616255 -7794013
11386 -7794013 -25336392 -18814028 -4501104 -16759528 -20811990 -14124344 4022028 891724
11378 891724 -10234902 15195087 20101207 10347254 12559978 -930841 -5850422 -28174727
11370 -28174727 -14969205 8010863 -12006220 -11332657 -37934025 -42249865 -36476894 -23393732
11362 -23393732 19991859 6779399 5350559 -7312819 -18683986 7786385 19020240 43888812
11354 43888812 32132990 8780968 8456720 -10466481 701177 16975208 10286832 4736266
11346 4736266 -22938494 -20087201 -21786622 -41710875 -17701718 -32917393 -40383002 -48961903
11338 -48961903 -58784645 -37614518 -67280138 -46631342 -34083997 -47249592 -28831901 -33374800
11330 -33374800 -875644 -1957224 1119626 34525983 15738550 23072112 36428033 47807829
11322 47807829 56832775 28347532 31691042 20320808 -4133241 27425444 31584957 27562486
11314 27562486 2869099 -23158513 -363736 -16442377 16861555 44290099 21856610 15356172
11306 15356172 -17232231 6549922 15313163 19805955 52060760 22284602 8897868 -8709888
11298 -8709888 -15753136 4878883 3174701 19855590 11030133 -13780354 -8972656 -26941591
11290 -26941591 -24405911 -2867216 920516 11388493 -11950247 -9710088 -12424834 -38132224
11282 -38132224 -3792563 12453079 23889542 11974383 -4740080 9154697 -10901348 9397865
11274 9397865 39372671 40498461 28813514 4108780 12168608 14915889 6729601 14980765
11266 14980765 12144630 -3119987 -15848347 -24196803 -17367067 -29512857 -40443478 -24352242
11258 -24352242 -25461421 -25271013 -34870395 -31037726 -17746030 -16968417 6355005 7467882 -3862953
11249 -3862953 -8486953 -106402 15858895 14922352 12743537 -1553874 -18872238 -18229166 157340
11240 157340 -1479147 -14594250 -17082358 -20541790 -18333647 -16999836 -3840291 -9988153 -18722787
11231 -18722787 -970155 4946134 764699 -9603973 -11066635 -10349978 -3112690 16369079 15447304
11222 15447304 -4354938 -6836191 5790345 4817973 13755554 25493036 25824924 10183343
11214 10183343 8341420 26536512 5064343 -8378809 5004508 18331968 11867077 -10357186
11206 -10357186 -7323356 -17570958 -30169491 -10903713 12574154 10325233 -16568725 -28268165
11198 -28268165 -15434975 -10934925 -12534388 -1648301 -2822791 -11678017 -24140694 -18361777
11190 -18361777 1503745 -7645240 -6455311 735028 8261427 10195530 -454845 12563992
11182 12563992 12907829 2211123 13332 626999 10677882 5417223 -7216832 -7220677 -10305841
11173 -10305841 -10281470 -2860125 9214293 25690242 8480829 -5564172 9416062 14151280
11165 14151280 14008363 1670523 7226072 3688860 -26837520 -21845407 -19491366 -31254915
11157 -31254915 -41117001 -33391655 -7809243 -19198057 -27393685 -11607929 -9268414 126289
11149 126289 14919604 27110594 23783818 4242864 15823741 22487034 12033496 16118575
11141 16118575 8200924 7432339 5996236 9570799 16274542 -9045624 -11139009 -2839508 -2604372
11132 -2604372 4791617 -5150823 -13570018 -34516064 -45941444 -26618865 -23036282 -18425182
11124 -18425182 -17088870 -25697571 -23346202 -20177724 1334985 21098123 25120936 33976765
11116 33976765 21103736 10793385 16970146 17089112 16982428 1537394 -6830728 -15042364
11108 -15042364 -35263093 -27268632 -21899071 -28191561 -31138638 -23919410 -643210 -2769172
11100 -2769172 -6297380 4959404 5605459 8407545 12849311 21132023 14089006 -9520275 -8097699
11091 -8097699 5250773 5347167 -1841683 -7922688 -4504185 -4385474 -1704040 14645552 11089484
11082 11089484 -3433901 -7987467 -1858257 5146401 -4632095 -6366228 -9280054 -16842918 -11301689
11073 -11301689 -3291723 2629465 1948714 13003461 27234101 31612953 35832119 39127451 38585529
11064 38585529 35246711 42376226 42590564 29827377 16501620 6852827 -454729 -9041924 -7357244
11055 -7357244 -6809040 -12402843 -15329498 -15623010 -18233509 -14183385 -2987452 2756131 2892509
11046 2892509 -2557349 1779130 -2592673 -550858 12447023 7092321 3539401 -3536047 11885432
11037 11885432 22262776 11139283 16022762 10559249 11097598 12919750 23140054 35809201
11029 35809201 8967514 -9933221 -4529123 417258 2048737 -3088529 -2070259 -13308597
11021 -13308597 -38957008 -22694042 -9038839 -16017349 -16960530 -23345821 -12909514 -27604723
11013 -27604723 -21269478 -1463578 -19218329 -9543285 -7758613 716663 1053724 -6566923
11005 -6566923 10714518 -6585202 -4410115 10263966 322834 -6086258 -19682041 -20732220
10997 -20732220 -26472260 -39144905 -24417410 -33214524 -48450158 -38668142 -40628313 -27458624
10989 -27458624 -31045612 -26675009 -13180904 -22741712 7009160 5241892 -3524243 -5859821
10981 -5859821 -19461074 -1808720 -10274925 1417798 -4281020 -41198857 -43909431 -43124460
10973 -43124460 -24294254 -23767208 -30652022 -19550297 -34975036 -41219828 -23908766 -10271129
10965 -10271129 -3521441 -17667383 -5645127 9467478 -19666363 -20482440 -16140296 -6251420
10957 -6251420 -11198905 -19129226 10636406 -18351636 -34577278 -25246234 -13085473 4549080
10949 4549080 -6884795 21219472 14401706 -9163904 -1015914 -941255 17707192 18475763 17796309
10940 17796309 6988044 -28155564 -31365957 -36588349 -44640940 -29931989 -43179046 -58738501
10932 -58738501 -68584203 -63005812 -42395788 -65258561 -40541923 -17646454 -21988618 2096066
10924 2096066 7051939 29477441 4355836 7329629 53581892 42849479 54605746 51889066
10916 51889066 50412935 37855758 17752139 52196181 49004830 39125715 54908882 44957640
10908 44957640 29988861 4050824 1429157 19610410 870177 16036238 13400677 -25631774
10900 -25631774 -38747383 -57495614 -21701124 -12865351 -11973666 10226538 -25792689 -26247532
10892 -26247532 -32287983 -10063576 26515515 12902602 19195544 -10487864 -30538249 -24546885
10884 -24546885 -23192395 7194551 5473000 -19227473 -30747956 -41761686 -15141202 2515244
10876 2515244 2125673 21780799 -406422 -4637777 -537625 5768835 28057895 -2371006
10868 -2371006 8787116 12134090 -5568502 -8905873 -26610568 897803 -24202 -4013699
10860 -4013699 8043423 -13878267 -30119794 -40144586 -19028094 2401070 -24140544 -46141785
10852 -46141785 -50910266 -62641360 -57831982 -50507229 -32254065 -34168406 -54808765 -22058628
10844 -22058628 -9805160 -7279652 -1283178 14329914 45088034 30048072 38897106 38810172
10836 38810172 17766700 18071927 27070103 40955472 15152393 -8145714 -7219318 -8885764
10828 -8885764 -5950476 1973393 -4469009 -17301844 -19333545 -10123266 1278267 -9466450
10820 -9466450 -8423875 -13873576 -10021930 10182970 1332364 -5532756 -11188434 8724460
10812 8724460 19165452 16485988 29732995 13131198 -5088026 2148575 33269120 30644029
10804 30644029 -2111303 -4910589 2218865 -8313818 -14855593 7850284 7756404 -9790215
10796 -9790215 -226970 33733112 32517323 -519798 7558321 27446732 38377162 36404234
10788 36404234 38088481 19411754 -25658289 -28548039 -4866179 14767067 1678103 -17929472
10780 -17929472 -28551114 -36943406 -22868134 -3681274 14317313 14899580 11268966 8453748
10772 8453748 12894449 21812482 15729774 10657030 12848703 25192479 15346856 3877986 3856863
10763 3856863 -3770165 -10675860 -6700489 20302175 18516502 2533398 4166907 8500295 3713811
10754 3713811 -5115705 11899280 17776814 6730463 4904600 11060260 472451 -18650806
10746 -18650806 -9665910 8840453 15348393 8495438 11466672 689442 -17601112 -9703171
10738 -9703171 8420165 19846963 2486338 -2816002 -3250922 -14178241 -9698541 -269522
10730 -269522 9360517 -1498257 -5657662 7307752 9041884 5664956 6383253 7392465 3115715
10721 3115715 -303945 4575756 12606508 2836381 -5120214 -15368061 -23013372 -12907749 -9810079
10712 -9810079 2665452 713597 -8909627 -18598289 -27580376 -592946 14086819 12672922
10704 12672922 8722505 189304 -4052434 -11250062 7138182 26329998 8455994 -6402091
10696 -6402091 -1754879 1135574 -926106 -1131346 14422864 6258247 -14992861 -239100 6118820
10687 6118820 4065217 -15014 6979444 14015564 -9629872 -4809124 6912729 4435093 7238472
10678 7238472 7353482 11496387 -3644470 -9571864 9519411 13080579 13267624 12724098 6862207
10669 6862207 8337610 6704279 16578532 22031009 11781134 12576715 5132317 11914931 21893486
10660 21893486 11655158 6687408 -2563268 782129 888191 2245466 20839028 9561884
10652 9561884 -10882197 -12928298 -3710154 4061577 1414657 13562717 16104350 -11337431
10644 -11337431 -18419699 -4255368 7296320 7669166 3659113 12137135 6769 -12382782
10636 -12382782 386689 13044805 18842065 6459107 4443373 13868947 10840844 11987132
10628 11987132 16434261 20246296 11244489 -1587337 12932720 28894750 22942436 15163969
10620 15163969 12287116 10737352 2980476 9196842 31833665 29757226 15571240 5876549
10612 5876549 3215039 5091903 6284861 18631167 23212975 16588327 6472574 -1776751 3770805
10603 3770805 12145455 14898416 17554345 20899855 15068987 3779790 5442908 17393839 11833901
10594 11833901 972725 6237628 9505823 3060008 -793122 3684046 -8746415 -24513446
10586 -24513446 -14201639 1521235 3060927 -5722526 -8323227 -18389822 -24651506 -8565431
10578 -8565431 8543343 13783152 7384749 6498656 4482778 3446096 12768060 20926223 28108145
10569 28108145 30974725 26497180 17989007 12519549 12310120 16484919 21860908 26612237 14944039
10560 14944039 -2777087 515624 5656162 10289810 6771978 2458256 -1533394 -10899714
10552 -10899714 2240725 7609427 869250 -10592120 -20939296 -11437853 -4456638 453791
10544 453791 -4456147 -15903139 -17580631 -18288211 -9052475 6620414 3151358 -7959890 -10032569
10535 -10032569 -4841339 1169487 -2142406 8064827 5079946 -11834610 -7212744 -5509354
10527 -5509354 -657086 -2527523 202549 -1771631 -20843462 -11143676 -2908282 -2961671 1663815
10518 1663815 2337336 -3819856 -16893986 -7275098 7311524 883036 3091608 13667449 7069085
10509 7069085 429993 1514737 9901987 12362892 16886150 34213492 20993749 8308314
10501 8308314 6637928 7548896 21764426 28803708 30889745 5326825 -8749938 6830658
10493 6830658 9628582 9975491 9561199 2261352 -15737686 -17415442 5751987 8047075 -16433457
10484 -16433457 -22647903 -13770415 -12342884 -8817509 -4514479 -2231242 -18591694 -19016700 599429
10475 599429 4300594 5027699 -2154551 3169241 8552073 9102800 12252303 2920232 5057906
10466 5057906 9154006 10563252 11910979 10646095 4105012 -8317060 -5275295 11144224 13158550
10457 13158550 -868871 -55587 677979 -6872548 -9917671 4373723 16339666 -2292971
10449 -2292971 -6791744 -2892033 -3128060 -2103794 5437889 17011333 2449624 -4116766 1364400
10440 1364400 5842742 13179583 15007573 10653437 1166732 6497605 12879188 5895744 3094838
10431 3094838 10539192 5374202 -351112 10630406 10093662 -7043547 -15478998 7442832 15243828
10422 15243828 4540874 5375849 -902674 -6697230 -4805728 15706632 19459606 6027590
10414 6027590 8756564 6824110 7686248 11686195 13057504 3836841 2016133 19491098 17414955
10405 17414955 -211166 -6080278 -6831060 -13761158 -4064333 15046594 10277316 -15052897
10397 -15052897 -21082075 -9769861 -9676271 2213465 13332817 11587058 1156998 -2077835
10389 -2077835 4308143 -625263 12393483 21869944 15920651 11516862 7995923 4753925 -6019848
10380 -6019848 4665466 14653041 1519501 -5967230 -2447883 -1287484 -9642292 -9823847 -3362622
10371 -3362622 -5952827 -6368496 4035619 6841885 5476773 2679804 850867 8647612 14612917
10362 14612917 22074511 17089787 17861369 22627838 8096766 5363217 12428142 25032238 22652673
10353 22652673 14560244 18401503 5195414 -1972670 8234043 24660714 26364542 5366790
10345 5366790 -4846056 -2706346 832794 3984765 1196159 -1765888 -10068679 -21844975 -12689922
10336 -12689922 -714470 -2029411 -12297701 -13493986 5830431 4801936 -316557 6782045
10328 6782045 13239927 16089933 8936809 17437489 17709455 3559177 5323941 15299545 21617480
10319 21617480 5651410 -9575832 -3282303 4153126 8494269 8114299 2756558 -3503125 -9051099
10310 -9051099 1615056 19014863 17075641 4534445 -8013254 -2361018 12051732 13024824
10302 13024824 11495600 3607292 -3033648 -7648649 -5798553 8148897 5394082 -7886216
10294 -7886216 -11197357 -6236948 -5129374 -10674622 -7468396 -3085888 -9713091 -8564394 637526
10285 637526 -822770 -3744806 -1828382 2286738 1772567 4664632 17076929 13039326 8228029
10276 8228029 13563288 9770881 5456790 10123306 22854428 19800039 5313672 7939407 3273297
10267 3273297 -8066880 -3142309 5137104 7102034 -2408866 -6791606 -9014494 -20126841 -11812859
10258 -11812859 -1123421 3083210 10389832 2912025 -7139866 -12308491 655503 16393948
10250 16393948 9895803 16055579 14581054 -5130988 -6821727 6254914 19148574 4930140
10242 4930140 -3114150 9003944 -1300702 -2980004 6299764 7490947 -495817 -11795338
10234 -11795338 2317418 8597052 4109681 6679123 -3387705 -3970859 230671 4815120
10226 4815120 15059371 14536476 15447040 7373603 5870831 23911577 20851357 17362486 22933163
10217 22933163 23803664 19574298 9412345 20271894 18549068 4254033 13117191 16652363
10209 16652363 12079894 3947738 7588838 15085234 6066126 9482943 12319611 4312066 5021166
10200 5021166 10635420 14643785 7950042 -1327233 -3480957 -7070972 716892 11225676 5728859
10191 5728859 47994 -7328402 -11266472 -8183648 1068328 10297295 980861 -3713873 -4164132
10182 -4164132 -13933632 -17034279 -5981567 5493067 -43744 -4223283 -2166177 -8387034 -13066299
10173 -13066299 3450734 20041466 12760984 3023267 1549044 4109048 1538681 4418858
10165 4418858 9002700 -2434181 -10916695 -11214800 -5309332 -3752690 -10962020 -14177214 -10946308
10156 -10946308 -3396513 -779038 -2681303 -86435 2541450 -1318022 4441291 11537820 6259287
10147 6259287 -2672711 -2100709 12629189 9719153 1815739 1983648 648435 3468186 3291433
10138 3291433 11698892 10740527 409449 -87841 3585171 9979394 2918980 -6038417 -4288697
10129 -4288697 124178 1216477 131773 222879 -3993990 -10708246 -4858477 11711028 14022054
10120 14022054 9292378 6691138 7108487 7453146 8693218 19839327 21597118 20205176 16962101
10111 16962101 11448293 9452554 8002509 13463107 13083948 14321569 9556787 -3574069 -9094454
10102 -9094454 -8438866 -4393052 -9299106 -8708343 -8713724 -16019122 -15981660 -10040337 -4625331 -6348079
10092 -6348079 -2334995 5259149 7239178 10457152 16004597 13408242 8450208 9774483 11079457
10083 11079457 12966940 11846679 13786306 3744563 -7546735 -3907934 -3919174 2133413 4684770
10074 4684770 8008654 3827303 -5842529 1175965 2795406 7042927 12414557 15148476 15085362
10065 15085362 6662679 3592696 709123 964842 9855112 16145369 12468460 3646304 -7358025
10056 -7358025 -9170439 -1545590 9171176 16869366 6290524 -1457471 -4435177 -431101
10048 -431101 10760860 13809417 16831505 10373675 9303668 15531717 17541322 17145350 14654097
10039 14654097 20648809 25447631 26970036 25291984 21016358 14638707 18329066 34032218 37004516
10030 37004516 28327083 13929228 9735728 10105496 13580172 22937182 11016922 -8739606
10022 -8739606 -19763752 -18793466 -14235826 -14334596 -13257930 -19596806 -27711412 -20883057 -12479356
10013 -12479356 -11494577 -2065187 5174999 9825202 11364983 14648531 18671639 8310950 21030435
10004 21030435 32415724 24378637 19515220 11872287 12378938 4507226 11465453 23456869
9996 23456869 6676328 1188830 2817682 765455 -536255 -386338 5302334 -2459960 -5052356
9987 -5052356 6314436 -2357740 -5269298 5104729 6844521 10207547 9808644 17814711 12333276
9978 12333276 6027894 25216804 18914537 8795440 6109075 3834862 4074862 -4445283 -76583
9969 -76583 -12995762 -30680431 -21528765 -15591930 -13798520 -13839948 -18449889 -22753316 -20053963
9960 -20053963 -238919 10666530 88807 3906921 9033971 7988318 17885395 23691862
9952 23691862 21474312 7411202 11647823 27768980 19912029 12072096 4268470 -2538999 -1441717
9943 -1441717 3200698 6780745 -5008785 -20115519 -20983413 -14306535 -4205981 2479211 -8113865
9934 -8113865 -10254335 -2918594 4531734 15658985 13881914 15651704 8512216 6441649 21930415
9925 21930415 17596301 12052643 2694169 -1638886 6189182 2222459 5267522 2687975 -4509203
9916 -4509203 241236 -1541336 4675079 5334003 -9122697 -5264637 -5787623 -5794969 -9176785
9907 -9176785 -23206873 -18701584 -30128232 -26143148 -11018266 -18187561 -12768471 -19131547 -12098051
9898 -12098051 -2090308 -1039531 18991859 12504774 10053868 13621358 3852002 9407734 6020752
9889 6020752 6930237 6062106 -7154446 -2021278 -9956892 -13493819 -2765237 -11592091 -6397357
9880 -6397357 -6649840 -7650216 -4298035 -16464147 -7430195 -18442419 -25287870 -9891608 -15434728
9871 -15434728 -14069006 -22195413 -23327738 -21684233 -25995023 -3225838 2118326 -3701408 -2159330
9862 -2159330 -9404521 -8534298 -4416497 2025739 4822867 -5377826 -2140652 -6705887 -19062194
9853 -19062194 -7502713 -4805942 -4787995 417676 9255953 9506595 -12325200 -6893221 1328515
9844 1328515 -3504541 3344434 6096758 -5861431 -28437784 -27586474 -16630899 -16219744 -9782593
9835 -9782593 -3960175 -13301689 -18513529 -4625145 -220060 -2245427 3618285 9787258 882547
9826 882547 -6311685 1704075 -10217775 -24814116 -15704537 -3787899 -8956171 -14063113 -8255132
9817 -8255132 -10839101 -12367674 3090781 19937844 14239787 13257010 15035642 7389387 10051536
9808 10051536 11434954 11708566 394742 1452764 7275477 -8887515 -5153917 3136970 2109808
9799 2109808 234157 7135108 18860824 7880807 2613606 13759104 10021565 1449035 3103356
9790 3103356 3420355 2709170 -6347365 -7136072 -4470255 -8870477 3388990 2416514 6880294
9781 6880294 11760068 123722 3415510 4564255 13034961 5565031 -8887519 -2288431 -11157245
9772 -11157245 -19082067 -15888659 -12063478 -10487318 -15520419 -8485490 3877224 -2019844 1867783
9763 1867783 11038472 15704812 24021934 13017269 11984214 6045262 -2367762 4312568 -2216238
9754 -2216238 2955959 -8409494 -21554892 -14051098 -12392764 -2435565 -1587821 1055242 7438904
9745 7438904 1026679 4489360 11802572 10783254 13082235 10274043 10625271 12199480 953523
9736 953523 5237819 3268640 4427898 12268612 7377300 15552648 8034935 5886057 9247082
9727 9247082 4295426 13084492 10625285 9255068 4653710 -4316881 -2398432 -2236975 555637
9718 555637 8805583 8820592 7553821 9747617 9421650 18595358 18321259 23140620 30046730 25103589
9708 25103589 29663732 19818295 17968865 20991439 19828638 27410390 23459717 22116297 14198938
9699 14198938 6340528 15703809 22885003 19364293 15320819 9836816 4896953 1409443 -325481
9690 -325481 10295155 1968020 -3183456 337123 -4948037 805109 -3619068 5615376 12636161
9681 12636161 9979587 16220684 5103200 4122414 8757606 10184372 16174937 11702745 3330190
9672 3330190 -7280273 -15362057 -2217003 5444063 645359 5235709 -3121135 -4193958 -4274016
9663 -4274016 1917872 18470351 9409040 15830636 12878492 1659102 2651933 -2462863 8137560
9654 8137560 6110743 5321854 6394382 -10965656 -13445384 -7206215 -2539446 2378608 1030126
9645 1030126 1321059 -4128698 -13342349 -67086 3752210 2068224 4858088 -529279 4776141
9636 4776141 -2715099 918389 7878956 2395980 7352841 152690 1035305 2878055 -1048250
9627 -1048250 -1390791 -5085668 -3225549 -7315951 -14965588 -12573507 -6678022 -11350117 -10226657
9618 -10226657 -5047881 -2376786 -5300433 -8922973 9530268 19194197 22492336 26953291 27380498
9609 27380498 30387821 25537984 35611152 52634398 53684411 42873320 33220190 29195355
9601 29195355 25019353 16448630 15408619 18700412 837723 -10760521 -19617522 -25258110 -26572904
9592 -26572904 -32996445 -16089667 -12430927 -11905093 -7931760 -11966267 4927789 15830770
9584 15830770 27095997 36879644 36664506 42429356 35267496 33989585 45480812 34648743
9576 34648743 24425129 25267317 27438053 29314212 12092095 15261574 13786539 -736084
9568 -736084 15164369 20694732 27400866 19912526 10159049 16509417 1318345 10597852 17923167
9559 17923167 11397230 15334436 5047287 -800122 -9731149 -8710693 10415863 6243191 6056332
9550 6056332 11160679 -2126729 -3398751 -1834967 10091325 13122227 -4992998 2717513 -1493040
9541 -1493040 -2611888 3740547 -2985964 4027972 -3214045 4116278 16753343 17298961 29268459
9532 29268459 22786704 20248802 27030881 28780558 33158820 29818717 34448319 37278180 16800236
9523 16800236 5837419 4348269 1885870 4002249 3174180 10429750 -5753220 -32163831 -28712779
9514 -28712779 -18069410 -5688150 -7639241 -7594309 -4687903 -15441755 -11739494 430164
9506 430164 11510487 13623391 13859085 24777323 34185781 32252857 21878311 18737321 24985087
9497 24985087 33190283 33160576 33984910 31535011 12454676 -1320510 4294222 17938033 17629269
9488 17629269 12377054 18087705 17595860 2006111 -6691610 -1841997 5190901 12093462 10661587
9479 10661587 8276654 -7940602 -30090085 -33911406 -24871227 225823 609119 -13219498
9471 -13219498 -11727295 -16387946 -14928795 -8258540 15538028 33345613 21991022 27566763
9463 27566763 30345626 16290641 10642929 13882450 29227381 30805057 21958962 13995609
9455 13995609 -12784190 -14639869 -3375416 -4875566 8840108 10502682 3481716 -13556193
9447 -13556193 -14101471 9255971 -6793911 -4790354 18877673 13671632 -3025148 -18988858
9439 -18988858 -9318318 -14369198 -20224031 8869274 4285211 -17741167 -23488985 -23331644 -11344513
9430 -11344513 -4046440 9260947 5353991 -12904008 6594690 9030489 -1072900 11536832
9422 11536832 14600838 10914559 972046 17309802 20855542 -15529995 -9659147 6633133
9414 6633133 2142874 -4098693 -7602653 -6915469 -26571234 -25705018 -5588948 -13681289 -18247006
9405 -18247006 -16845709 -19823180 -14216128 -12089276 -10319121 -14360011 -8415350 14277034 8154032
9396 8154032 3644568 9932062 2508993 6560675 19462928 35349889 24755483 -213513
9388 -213513 2202550 1976752 1905710 8266279 2368181 -7176927 -18362880 -22413097 -18138990
9379 -18138990 -19296096 -12787621 -10516351 -12934620 -303593 -4751773 -8985664 -624843 9124926
9370 9124926 24683034 20623610 22013265 19274004 7583162 19585717 23818434 25494274 22506501
9361 22506501 9158487 7843561 5274404 9706744 9481611 -5730934 -820630 997498 -4480477
9352 -4480477 1292446 -1864565 -104706 -7164204 -4398574 15329707 8969809 12047457 12057426
9343 12057426 11035561 17866001 8416946 15996023 16818503 14050012 14784476 787726 34671
9334 34671 -7993583 -16547339 -6198673 -2404645 -3516014 -15340787 -24725904 -13858639 -10667019
9325 -10667019 481818 12864353 9753357 11789674 4187849 13196512 28587420 31045989
9317 31045989 37492852 31909782 36819378 34400816 24636926 33926115 36682294 33844549 24682726
9308 24682726 18028664 12706272 -1476419 -4932719 -1216801 -10337561 -23529488 -33520941 -39591672
9299 -39591672 -34432917 -30221003 -26405506 -29969231 -31093179 -21020991 -16644794 116769
9291 116769 15227154 14686252 9608394 13553193 25953231 24316943 22771902 27092376 23726977
9282 23726977 12787513 11291482 10973739 4381315 4386381 7984474 15099947 12683812 10651436
9273 10651436 5527607 1901739 18582963 24890657 22553234 18080058 13393070 5113579 -983470
9264 -983470 13473629 16708006 1167328 -4264417 2823822 1343448 -1427568 5413113 10573378
9255 10573378 6854732 10099117 26334783 23813445 18299529 18411128 19727758 26338410 29618699
9246 29618699 31582319 15542140 7031049 11923441 12949910 18827362 20864055 12652075 -4127853
9237 -4127853 1140491 20411682 25845805 23441693 22664324 17591604 5758576 16799872 34178692
9228 34178692 31278712 16203420 8091122 5295247 -6406498 -6565005 -368 -3079272 -12854172
9219 -12854172 -14671832 -13508382 -17986961 -18242373 -9665508 7014579 14667871 20378818 17316916
9210 17316916 12825440 19701387 24581783 39998957 43225534 36705597 22755735 8833453
9202 8833453 17008242 16017659 10958121 5882141 897983 -639203 -6179722 -472064 4168846
9193 4168846 -6242575 -9326098 2914957 16488915 21411909 12180116 11122901 6853233 158334
9184 158334 14083304 22534908 26462990 11431485 -1893780 2368612 -2018210 5658521 10122076
9175 10122076 13583786 12248439 -511357 2239923 5815410 7903851 9393958 8789570 10579902
9166 10579902 6008858 -628226 2612138 1204505 -4516330 -6425546 -10114098 -4172895 -4066666
9157 -4066666 -2207495 -945033 -9101683 -5391916 -5847010 1417318 13207396 16163144 14259118
9148 14259118 4684708 4231964 5055384 3985000 11724462 18612795 11097104 1866850 -4112607
9139 -4112607 -7094806 -4331819 117374 12620254 7664141 593860 433062 -7183876 694778
9130 694778 8422590 13388143 6906582 -2583637 4817286 410833 -1250132 6995122 2764491
9121 2764491 -7299668 -9473967 3507346 13667635 4236190 4343362 4597012 -3959796 6371967
9112 6371967 16900272 27649138 22125535 10232055 15038345 8704212 17163558 21720432 17821659
9103 17821659 22994069 14949218 14142250 8604206 4995706 8571039 313542 6817371 13224370
9094 13224370 3773083 -3213809 -10468166 -9327205 -8107544 -9671757 2858616 -697976 -6042788
9085 -6042788 -4463484 -11940888 -8177906 -10824589 -2667014 7981747 4476875 6760738 -8116032
9076 -8116032 -15197753 -11383371 -8341376 4560242 5115453 -319366 -10324015 -20112221 -14693063
9067 -14693063 -10778134 -4526577 7466274 3459893 -2445759 -3250213 -3731969 -285821 697056
9058 697056 17049356 20697626 6441678 8944640 8563965 6609649 4134590 10238256 18169158
9049 18169158 6237831 7763294 15795188 10363936 6328457 6500018 12494875 18803743 21888996
9040 21888996 25618424 16842060 11208769 15980790 8777779 14340228 21543811 12803190 997807
9031 997807 -4208456 7396282 -5422213 -15160712 3812772 4581273 -3020507 -3512847 9337181
9022 9337181 8847439 -4189726 12993187 24231936 15083951 13844438 16645946 17940455 10822387
9013 10822387 6499054 7013966 -2509490 1797653 3076066 -8348658 -5715091 -10324056 -16471664
9004 -16471664 -17070951 -2816381 8303305 -11056724 -6831778 6057915 1201182 -1791218
8996 -1791218 5988560 20032946 9006730 6340747 19607462 14327822 6314839 7178573 16285102
8987 16285102 20555787 17834957 16303787 8651130 7041791 15010443 14921476 18864461 23028817
8978 23028817 14622169 3739126 4577803 20511123 16374060 8697069 14960441 10226611 1435383
8969 1435383 -3468643 10635589 13439728 2381006 4376355 2921427 4841781 2059084 4853974
8960 4853974 11768666 8938207 11044271 9171417 13263724 15123491 5305481 5677196 13027398
8951 13027398 17918526 13187326 3342168 3161594 -999737 -2864717 7974289 7314034 2674064
8942 2674064 -6487161 -4882639 9094715 7441596 8961788 1810886 6317232 22109023 25619119
8933 25619119 33933953 22634549 12885183 14902449 28412146 49992636 40207743 22493828
8925 22493828 6825799 -1882346 10100698 19350831 16712466 99655 -15795978 -13955795
8917 -13955795 -13388954 -8539882 403407 -6804300 -4339520 5395538 16092819 16040149 6695820
8908 6695820 20384222 26973448 35766979 42607145 32380046 24991408 16012985 23317191 25640454
8899 25640454 21918614 18754901 1904218 -912233 5935460 4642455 -5521963 -6326367 4519392
8890 4519392 3785959 46905 8806297 7410146 -3648513 4297849 20445398 24425912 12061595
8881 12061595 10412157 12937135 8209646 15235538 18220231 19117580 12943579 6913570 4111578
8872 4111578 1948013 13532463 13377276 12433286 13328869 5757292 -4712224 -3361709 19144562
8863 19144562 24768981 14206440 6118709 -563857 -5127156 3705976 22745710 25308437
8855 25308437 11280184 38354 1309459 6896339 20506935 27169032 23714478 21874092
8847 21874092 16875112 17416413 17140131 26020523 26805239 17367793 19311784 13044589 5357632
8838 5357632 1353861 7434607 9649873 1291539 2246715 777412 -902542 6323575 14323863
8829 14323863 10514316 7976472 13338453 16945724 16886416 21754601 26368383 10959530 8138743
8820 8138743 16062353 15080567 11074167 10070623 16292125 4124033 -1754316 6092568 6043028
8811 6043028 9524262 15420137 17602792 8477448 2613663 9435760 15985177 21800817 28818910
8802 28818910 17721498 3038511 8112574 15490159 19821564 14707536 15627453 8101681 -6411971
8793 -6411971 6589361 11383516 5342249 -2591599 -766495 6589004 -3296601 -750027 1405785
8784 1405785 -6944648 -5882522 295755 5257878 -1063570 -8602301 -4864209 -7155071 -5988833
8775 -5988833 3849357 1873332 2891209 643397 1529183 3424593 -893466 14222751 18415921
8766 18415921 18597715 17681372 7715178 8864008 7938313 19175980 25093141 16087042 12677686
8757 12677686 5302901 5946462 12951474 14678007 14868754 11453653 15045594 19316169 10044117
8748 10044117 9907731 10965534 8962115 14947686 18211855 18962586 395849 -8247483 4583565
8739 4583565 8277568 10237978 5442334 2049596 -3080708 -5498022 6658384 8646601 1263606
8730 1263606 -4449077 -3307655 5010303 7883650 1438132 -4154044 -4145075 1645500 6152375
8721 6152375 9524002 13958589 3884300 -831465 12066919 23142147 19618103 10578384 15241868
8712 15241868 16630114 14848110 23503358 27556701 15807223 5764693 12140267 19807768 20751595
8703 20751595 20572327 19007670 7747946 2933845 9543573 12633847 16016145 16260517 13984748
8694 13984748 7701167 6689456 12503393 12334289 18182607 25438260 23732173 20271151 20457353
8685 20457353 18091837 11107427 12777879 21847868 17857934 10336796 11671845 2736375 -8924256
8676 -8924256 -6574703 9429400 14584432 8638032 16111192 15051466 6483418 8185753 22864411
8667 22864411 33633815 26995765 26485275 26142094 17595049 8559389 6582234 14282890 16720622
8658 16720622 12663916 11522025 10743623 4479394 -4102863 706568 21488721 27599737 21333643
8649 21333643 18239415 15162633 8842212 2568798 20078106 30673072 17608439 4410789
8641 4410789 427068 6708620 -559814 -403478 9197503 7104828 541200 -2952647 9162101
8632 9162101 11084417 -1596885 -459388 11569629 16906774 11507817 11008072 18813212 11454711
8623 11454711 2236216 13415916 20080961 17400592 8599544 12712098 17253474 2374942 2862394
8614 2862394 5907855 11663934 11325063 6432831 13840436 6959135 5227101 7556942 13162642
8605 13162642 19849206 11330395 11288366 14844827 10812883 3157283 -1569709 3074557 4110025
8596 4110025 -2905610 1227789 -2727618 -14727646 -12498248 -3570427 8689491 -1883364 -4300515
8587 -4300515 4018523 644608 9421289 11896477 13823914 1938322 -3563102 15688632 18178862
8578 18178862 11987957 1379751 -1030479 2320997 4114944 13265656 13401820 -622229 -6944394
8569 -6944394 3135144 15667799 16393769 -304853 -2785896 1850602 10008304 21043547 17653437
8560 17653437 15600792 -1709693 -952022 19503067 30995251 31150651 13898525 17791604 21874739
8551 21874739 17577443 19247821 23441295 26644115 17720304 19333546 26270163 14661031 -8103294
8542 -8103294 -5140837 14469743 21834207 12667759 3620728 1951501 -14494344 -8363350 14978065
8533 14978065 29295578 23583442 9406208 19946710 19015108 18840378 25016622 31311215 35962510
8524 35962510 29609294 30473547 22283214 12037266 3891216 1366017 8194353 18271814 15262130
8515 15262130 -3407485 -9568427 -11142428 -9850837 -7691166 14113917 25035788 4118436
8507 4118436 -1483129 -15232 1663234 -4620851 11938197 31659103 15212167 3647843
8499 3647843 1079929 -774381 -6980420 5960242 21429597 12902960 2978044 514980 -3852723
8490 -3852723 -9697153 7110621 12301791 5782398 6918022 12291289 9831133 -482737 19426701
8481 19426701 22034846 12097384 20073798 28879314 23232811 6126038 16930790 16424890 -223827
8472 -223827 1363942 9887951 2440019 -6939916 2360456 -527175 -10503178 -7353514 10841548
8463 10841548 9216991 8962288 22219820 11415292 6295061 10271533 23443364 15369299 6552316
8454 6552316 20451267 10935080 7349215 11486200 11740394 518117 -833143 21257575 26944112
8445 26944112 21562502 19410528 11787742 -1211904 12608815 32216406 34531236 21752790
8437 21752790 10992298 9285897 -4677877 11859460 28211304 25741354 19830399 10672473
8429 10672473 14681690 -30517 2971971 19814215 23458231 20394023 5294385 -3655252
8421 -3655252 -12747154 -9947961 9647311 26081523 18787701 298779 -12018849 -4792190
8413 -4792190 17162619 29571907 40534118 24686760 7140717 2159463 8764220 32158229
8405 32158229 32851595 28675696 13200684 6858434 15686778 15703336 24170119 29818928 28392604
8396 28392604 15850009 16825860 28348051 21676907 6490709 11191135 21670722 5667419
8388 5667419 3143063 12667787 9747068 -9674917 -7714204 18450466 13144432 10152898 22837170
8379 22837170 29000927 16887041 12310868 28840427 29346998 24666746 30876596 36534810 21981418
8370 21981418 10177231 4616147 3960769 14219975 18906599 21217793 4435618 -2530697 -6734634
8361 -6734634 -9242188 16091355 25116753 17460995 3513072 7975490 19173312 11139899 20961789
8352 20961789 33730785 23303934 15487129 29754368 43618682 31524131 11346237 23350090
8344 23350090 31343070 26633862 41006766 44827043 37194969 11519286 13486041 40958201
8336 40958201 37413084 38585805 33437365 27638353 16222948 2337632 19286231 20459260
8328 20459260 10186653 7258999 6171944 11956890 6556643 4418745 16216357 15714389 19875409
8319 19875409 27397730 32030978 40008607 23417891 19129931 23050098 19136127 22651847 13924872
8310 13924872 19371734 10344739 -10200441 -5824058 -3479896 3397024 4241604 8928440 19414320
8301 19414320 7068204 1118652 9582779 14931134 20881473 21024908 25779820 25464156 6812765
8292 6812765 8393947 18493557 26186472 32160168 29734226 38325856 29773741 23520485 41041866
8283 41041866 48550227 47406518 38697428 39618082 42281891 31335396 37919196 43218807 26718639
8274 26718639 18524256 24242439 34771962 30407670 19221311 21216091 7344618 2340276
8266 2340276 19584295 23625557 14799304 -4089392 -5975627 2359023 6013554 24426498 25465436
8257 25465436 13766957 13507158 18523651 36400431 45270321 46328254 42545084 27548785 32608492
8248 32608492 34914799 28954195 32727497 27845426 23016088 15797301 18974223 27436374 16503197
8239 16503197 21447720 35194148 32794257 29103246 28547416 34888260 26680838 15516763 27598990
8230 27598990 26161248 17202211 18358245 22182267 21745391 7770999 16510690 33818591 33390962
8221 33390962 35910788 40141078 41770138 29853878 23055932 33840851 34827728 25748862 24712156
8212 24712156 28201946 19825671 6404824 7897152 26344069 34002928 36737901 46140792 47147806
8203 47147806 40953157 36756065 52667679 64599054 53663105 44037170 46533384 47607105
8195 47607105 34773436 24830583 23459315 21207857 13577126 25607889 41382160 29118356
8187 29118356 7881623 -4407802 14037744 27143806 32839717 43532461 32311935 16794392
8179 16794392 1151366 15162613 44156991 48233911 43750991 36475996 32799577 25491327
8171 25491327 21063363 42245456 58109971 38185282 23635087 27298993 34752673 28878879
8163 28878879 24537742 48095130 35242089 17752535 32416781 49488108 50826218 25294317
8155 25294317 35744776 41759654 26260463 35802049 46207287 44885812 25664466 26952398
8147 26952398 44483151 40931736 40320253 52243054 51082933 44325146 43470954 47419814 52333201
8138 52333201 42944352 49489532 44549573 32506747 36474360 39419494 62393253 65883025 64971961
8129 64971961 61239064 52149571 65329274 74650956 91942139 90457735 67813080 42028711
8121 42028711 24072957 24484398 26169180 30927373 35280989 34565962 15147782 5694951 22613508
8112 22613508 54160229 76096710 83516297 99662721 87985339 64403891 63165235 88732828
8104 88732828 82831985 39429842 42162586 68032449 75021312 61966472 82971370 89817183
8096 89817183 54112214 87337961 181263673 231409275 167839273 104373730 95106714 77850336
8088 77850336 95806235 140683476 136609488 54057269 -12677709 -12424543 -10103595 -8113423
8080 -8113423 33307077 73596227 96011547 124403450 132159369 132236211 133634707 191799899
8072 191799899 258635590 283371441 306765789 229084276 129006775 99124189 113332492
8065 113332492 97288787 18399355 32748003 26263442 -71893111 -115850937 -110970489 -102259823
8057 -102259823 -111306582 -50068746 56286363 34920678 -21405361 -14987763 -15789012 16779876
8049 16779876 101689120 222306609 225703100 102925011 88986649 80570709 93509482 176805700
8041 176805700 245568172 239816055 66363114 -31915246 -77720099 -164698964 -136232146 -95125753
8033 -95125753 -78573740 -118283369 -163987403 -143235406 -159482731 -130896673 -76341899 -91696765
8025 -91696765 -85066132 -105839316 -142695844 -182168813 -240052788 -214635097 -242089874 -242681537
8017 -242681537 -180776227 -201916965 -195107601 -195534526 -129155598 -68508041 -63090411 57255414
8009 57255414 108442678 110076654 117932516 119163384 142613110 92941715 128365653 216051961
8001 216051961 197265987 182780921 175860824 201108346 233965865 263519487 396577811 450023375
7993 450023375 428485984 437121511 406620391 408998192 350857545 320132161 329710447 186911586
7985 186911586 128078517 -5780991 -119416147 -185959418 -261462174 -232811623 -227335319
7978 -227335319 -189123722 -148444703 -164363900 -132815735 -112786078 -114458231 -77201213 -54814946
7970 -54814946 -14591526 -51224463 -77416591 -42697149 -71671841 -61942297 -53721718 -25150595
7962 -25150595 -43934143 -97317043 -54325272 -74575388 -86143746 -91974990 -95067598 -63949327
7954 -63949327 -113760952 -95154286 -82004536 -139538838 -133172489 -125461605 -86935483 -75052211
7946 -75052211 -85265388 -66407696 -109370658 -147964658 -155729926 -172867582 -166945163 -185504256
7938 -185504256 -183597845 -181690231 -217547507 -203386729 -202701815 -179145697 -147632324 -138936432
7930 -138936432 -98086638 -105364133 -80020249 -44975530 -32272424 -2932958 -28356083 -41741258
7922 -41741258 -62698293 -84715140 -78158416 -113819106 -125885090 -145449802 -162757898 -150265244
7914 -150265244 -134110369 -103074455 -99863371 -101883326 -67635724 -59855019 -54213359 -33201884
7906 -33201884 -28801436 -34895530 -80533761 -82091455 -80953581 -112122113 -102151175 -102506051 -95805406
7897 -95805406 -113395931 -108968400 -65215147 -66266067 -51426919 -39142035 -34418234 -35934607
7889 -35934607 -46832039 -31769667 -41061819 -66287432 -77741699 -91236191 -92882976 -85714994
7881 -85714994 -78270427 -65457850 -73418485 -69467850 -54192678 -43868476 -12943489 -5448179
7873 -5448179 -1722408 -12358774 -26815766 -19740981 -32670597 -29576153 -32437514 -37929942 -39374910
7864 -39374910 -46670463 -36703660 -42195473 -44838793 -34425707 -22146823 -13770690 -16419844 -22766412
7855 -22766412 -36725457 -49521295 -48198317 -40124397 -43588839 -43245372 -45241660 -50626562 -52273955
7846 -52273955 -46125008 -31597662 -30756746 -15108550 371112 -3021804 -16709447 -26910752
7838 -26910752 -20892142 -28180873 -23791997 -15556395 -22822870 -39166512 -51302065 -39252393
7830 -39252393 -36544631 -33837318 -23015041 -13382683 -7818037 -12854597 -11831641 -11798198 -16574031
7821 -16574031 -14882122 -4428672 2823065 -2896168 -20838230 -28896614 -29890873 -32431210 -19535309
7812 -19535309 -11878460 -10657052 -26463652 -41893647 -38857383 -42340324 -28300726 -18131560
7804 -18131560 -20243137 -29193500 -44476819 -37517689 -29790000 -15228105 -1297180 -9688045
7796 -9688045 -17419340 -20581140 -16386017 -8627254 -8247973 -8652130 -20578825 -35055353 -30021731
7787 -30021731 -30426274 -30277265 -27155572 -28979544 -27190777 -33910638 -22590687 -13453738 -17423302
7778 -17423302 -7985615 -8261353 -12183670 -20863276 -19450676 -9548910 -23451476 -30487890 -28297657
7769 -28297657 -31754567 -33581020 -27993195 -14675800 -19555442 -33406438 -20906216 -3530004
7761 -3530004 -312838 1514694 2922516 -948688 -18562431 -20515636 -3197167 -5300921 -12751546
7752 -12751546 -16636282 -19577446 -26575660 -31855490 -16082473 -4291685 -1221067 4021730 2044566
7743 2044566 -2631809 -704216 7528473 11871431 8342765 5249918 -683151 -14552851 -12010175
7734 -12010175 -7266605 -23474315 -35592660 -32425462 -18656850 -19949297 -20299912 -8563759
7726 -8563759 -26559151 -41991930 -26560992 -1130149 5396854 -8022041 -6846773 -20886821
7718 -20886821 -49009443 -41517347 -21476248 -18616233 -29030541 -35741832 -42135958 -68264042
7710 -68264042 -67325155 -38876558 -33774709 -27861885 -22653304 -25004323 -39038968 -44145159 -13177989
7701 -13177989 -9355498 -8548836 9628867 4757831 -9327888 -21758545 -6394096 -4145334
7693 -4145334 -16363215 5138140 7475179 -12295354 -22205963 -21700780 -24367547 -37613577
7685 -37613577 -20656268 -2977158 -23257174 -28412903 -28201540 -41715632 -44929345 -25986498
7677 -25986498 2238793 -13850457 -23749732 -11561834 -28509986 -29805744 -9595838 11310404
7669 11310404 -4131956 -22712236 -1233886 -8731445 -20982073 -7404484 3761923 -6248792
7661 -6248792 -19889883 -600026 2992851 -15244518 -8951430 -1563865 -12111142 -19244228
7653 -19244228 -12818039 -8691810 -18615129 -12661157 -6945271 -26369451 -25018865 -13139978 -5743578
7644 -5743578 -1799590 7996478 13830709 -13689058 -9951985 13517241 15122770 10143562 11762886
7635 11762886 16442449 -11509245 -17003355 7982599 6795078 -6213117 -4543881 7703293
7627 7703293 -5000544 -15759291 2548860 6837642 -7869088 -7623997 -1570605 -9153050
7619 -9153050 -21853530 -20663127 -15999302 -28943177 -26118277 -22298544 -26736278 -23972709 -23846726
7610 -23846726 -14978692 -14458890 -1219601 5121569 -10228549 -5925782 -2729486 -1425480 -3139503
7601 -3139503 4716906 4366326 -25458278 -31390718 -14550003 -8789667 -12727758 -3138749 5309621
7592 5309621 -11777210 -23272352 -855668 15313223 8098869 14943234 23050426 11991072
7584 11991072 -13965780 -13552807 3113299 -1061743 1193851 293755 -10523337 -32801770 -40783101
7575 -40783101 -25571017 -18444135 -12212420 -17940570 -29436249 -38111125 -36576485 -30945392 -27938045
7566 -27938045 -15543103 -15828533 -27072641 -30366117 -13939078 -10244187 -22699533 -13837240
7558 -13837240 -4574512 -13281174 -21940830 -2891701 3609741 -23048804 -32585388 -17125627
7550 -17125627 -12380928 -19399413 -4060132 4677641 -14444423 -29990158 -11953978 6967631
7542 6967631 3108526 10952810 11238270 1369595 -10930727 -8151271 1925832 -5332861 1234487
7533 1234487 -913815 -9680508 -13125208 -17135616 -15474151 -15188595 -579451 3986336 -9306705
7524 -9306705 -11685115 -8202275 -11921736 -11286872 -2867988 -2362982 -16831109 -24994149 -11331795
7515 -11331795 -15467244 -21716074 -18657165 -21389373 -24073911 -29867928 -11186715 -7159757 -19525119
7506 -19525119 -17628047 -18380379 -12990591 -12330382 2256757 12712768 -2737860 -8377298 -2537775
7497 -2537775 4948861 5995552 7921010 11714756 50571 -14569891 -5554290 1166419 -7636295
7488 -7636295 -16171157 -19678133 -14984532 -22780076 -18422531 -12812546 -23671614 -24287594 -24096711
7479 -24096711 -13923124 -13886515 -18523997 -17336173 -20782171 -11286671 -10498834 -17978783 -18601984
7470 -18601984 -12826229 -8327359 -6291501 1762983 1983034 -14320811 -19089754 2273298 7722731
7461 7722731 -1804338 -7002684 -7731516 -15968388 -29989917 -17188091 -11913154 -22088915 -25392606
7452 -25392606 -20381968 -13899382 -23961394 -23534022 -12015064 -3438763 1900829 4909469 9543348
7443 9543348 7831291 2204522 3612271 16749733 20858883 18086204 14787929 13916829 9209379
7434 9209379 -4418341 1406797 7165665 5628046 -311208 -9857981 -13576682 -24461301 -24107557
7425 -24107557 -17364555 -15613119 -16147459 -21993283 -21311417 -15191554 -12713378 -12702664 -7051966
7416 -7051966 24141 3564628 -1890103 -316749 557359 -12647248 -10033411 -3471054 -1390110
7407 -1390110 -11943931 -19559706 -10651880 -17335294 -15938822 -6362045 -2996424 -3864905 -8125169
7398 -8125169 -226701 1323478 -3687839 566201 2969204 1327139 -1455330 -8170950 -5963265
7389 -5963265 -4567579 -5908827 -2447616 -7471435 -4835059 -10310705 -12272652 -1187637 -7175731
7380 -7175731 -9180794 -14393086 -13554291 -12090584 -23131612 -17565200 -16257740 -17533457 -15342230
7371 -15342230 -18281512 -14646937 -16656441 -17713965 -7500591 -4802332 -5972319 -12978808 -18727639
7362 -18727639 -7530298 -11037785 -13531217 -10188186 -14960601 -13369660 -18946748 -7319079 -2394903
7353 -2394903 -15609927 -11360709 -10475518 -5087282 -6543370 -12761754 -8631544 -17007202 -20057526
7344 -20057526 -18517502 -19305348 -12784371 -18129167 -21471173 -12858853 -14476916 -14093104 -14185783
7335 -14185783 -7901261 -3247199 -19777602 -15085210 -11234267 -19625725 -21832971 -27988939 -23502945
7326 -23502945 -29445404 -26130292 -10594511 -15254415 -13492859 -12414925 -10701913 2943283 11377586
7317 11377586 15011188 7551527 2981523 8068423 -6667081 -10793397 579457 -7040658 -12268801
7308 -12268801 -11803929 -5818915 -17763780 -32501958 -5359713 7075801 5389315 10853339
7300 10853339 7094289 -921883 -11878991 4538891 16853573 1699233 2132623 -1502810
7292 -1502810 -15264682 -17617677 -15434568 -12675886 -17721911 -7347475 6844214 -15387381
7284 -15387381 -23325731 -14092748 -14004622 -7868821 1883541 14058504 -7043929 -24062145 -1677455
7275 -1677455 1876005 -1935455 2554669 10474323 8998235 -4383170 4334889 2330850 -15002397
7266 -15002397 -7135711 5127637 5275148 -6344521 -16877846 -17052183 -19306640 -1644112
7258 -1644112 16597201 4380752 -2495592 1585445 10080814 13269627 13355932 17804414 15569
7249 15569 -7795626 7573066 6882788 -12824030 -30278829 -25042510 -19553995 -21371366 -12406591
7240 -12406591 -14435970 -33705931 -37531837 -17804440 -3521550 -9919782 -17746782 -16346410
7232 -16346410 -21001540 -21588922 -11069950 -13466764 -23804809 -22731597 -11100603 -7731413 -15908000
7223 -15908000 -15531321 -14810244 -15680499 554547 13532821 2174816 -15625032 -17602833 -6574863
7214 -6574863 -5437748 -816111 8797340 -7909370 -23230949 -16776005 -4376622 -2263518 -7949770
7205 -7949770 4364015 2113457 -13431641 -8484804 -7261874 -9583651 -10625593 -750906 5195540
7196 5195540 -13541575 -15426613 -12579763 -17935054 -7207060 5162094 8372233 -5274510
7188 -5274510 -11465835 -2753869 -11982054 -8372572 8820046 5013428 -6369170 -13591179 -6451697
7179 -6451697 -10128553 -16886039 3581278 4219767 -8216550 -9408233 -5212087 -3016155 -14080137
7170 -14080137 -7000680 -3558195 -16653141 -12850933 -7698661 -11246878 -20935408 -22225092 -15212799
7161 -15212799 -15900176 -8047037 1251234 -9864899 -19763608 -16200613 -11718224 -10408941 -8582348
7152 -8582348 -3120160 -14040093 -26884889 -19954490 -17631666 -19980609 -15658187 -5164482 -6363619
7143 -6363619 -17235066 -17051954 -15322563 -16019018 -8735371 2443975 -5921941 -21529750 -27672837
7134 -27672837 -26364066 -18003406 -10797737 -1523283 -12010496 -23219182 -14674190 -7549796
7126 -7549796 2694805 6659360 9918603 6206716 -3801322 3143034 5145679 -735813 -1794487
7117 -1794487 -1612418 700853 -3724029 -10452211 -7685482 -12004030 -9166579 -2734378 -4071307
7108 -4071307 19315 -12653242 -15625870 -13997302 -17600772 -12531553 -20936562 -13380275 -12009475
7099 -12009475 -20556311 -17388129 -19029710 -8554879 -3731315 3194679 16417783 9252522 -609024
7090 -609024 -2451696 3871544 13555670 8443439 5411969 3980979 -13609524 -17458438 -12700570
7081 -12700570 -1587287 -159119 -13143442 -4681170 -8342850 -11430474 -7739576 -4899377 509621
7072 509621 -14350521 -15075193 -11445749 -13344729 -14694761 -20266055 -17103273 -16287950 -15624046
7063 -15624046 -9658229 -557822 1475250 -2830386 -4711006 4512612 9016202 1232929 4766798
7054 4766798 5680917 1222579 -8612772 -6410692 270434 -8906691 -6114523 1684175 6785937
7045 6785937 122029 -41953 8226145 7286262 10177513 8955216 9021510 -498081 -4563085 -2836634
7035 -2836634 -6317671 -6928106 -18822107 -22675841 -20784031 -14141357 -9524313 -11219256 -9344128
7026 -9344128 -15624061 -17319447 -6161811 6618429 3888737 1401021 812473 -2842806 -6404366
7017 -6404366 -3063102 11143294 3624890 5573213 11320775 7932537 5785557 -1353549 10123861
7008 10123861 7796352 9163854 16496424 6668705 -538791 -13184484 -14779502 -10564886 -6918222
6999 -6918222 -3374330 -9136302 -15616055 -17633746 -25396576 -21768376 -4801971 -4319106 -2412623
6990 -2412623 -5979127 -3271574 -10588968 -22985101 -1355363 1571461 4292400 5523309 4303718
6981 4303718 4483232 -13084695 -474626 11456556 14140083 18536513 13494136 12264559 2574334
6972 2574334 -4403708 2176155 6415424 7308074 5180123 -5307245 -5128496 -15673075 -19950578
6963 -19950578 -6524519 -6527221 254979 -9924758 -8656132 -8430237 -20631814 -8290372 -12283809
6954 -12283809 -7496154 -9393944 -16018343 -13391134 -24303509 -20102900 -22672330 -21560151 -12294280
6945 -12294280 -17378502 -20800716 -18765302 -16775770 -16130725 -18657049 -14102038 -14450339 -26760497
6936 -26760497 -15688210 -14145472 -20079191 -22883902 -28114447 -20598883 -27900044 -9238841 -26329
6927 -26329 -10888201 -3813871 -5643605 4189405 3486162 16347878 27202659 9928894 13882047
6918 13882047 14005447 9194734 4435690 4779336 11749966 3159876 1480336 9517032 1195448
6909 1195448 -838116 4079618 6482016 16834893 13692670 20024894 13154069 3807323 10932188
6900 10932188 -2960200 6558266 5087007 -970314 -2075495 -14843327 -5693613 -17567249
6892 -17567249 -13216838 814910 -3491446 2756808 -1704089 -1425155 -4487154 -8879338 1870369
6883 1870369 -869685 -7258626 -7687485 -20383620 -20320468 -18549074 -20678461 -14422028 -21121431
6874 -21121431 -10543531 -10590470 -6835649 10516607 -920321 3940696 6245326 12636664 15785860
6865 15785860 9484994 19678780 1737306 -11094228 -5880345 -7337085 -13270765 -17564105
6857 -17564105 -11457258 -19526360 -37086782 -33879376 -25454299 -31185787 -23569491 -13685107 -15537467
6848 -15537467 -25557513 -27857087 -10685109 -8699466 -1573846 4953751 707161 117056 -1676783
6839 -1676783 3603585 1703423 744782 -2166811 -7066920 -4770437 -2516796 -12054031 -25887864
6830 -25887864 -18480044 -14562688 -11165722 -5633136 1504261 62405 -17751051 -6063534
6822 -6063534 6988141 8287834 8691281 7594421 10570349 -6443640 -15525248 -6352034 -3945704
6813 -3945704 -3742043 -4517712 -3995409 -3862703 -15947418 -10947804 8374414 14162135 19620336
6804 19620336 13028336 17790365 17679327 6987546 22198256 22636811 21662704 12978584 4298065
6795 4298065 11396569 -1839577 -83703 2783143 -1975721 -193921 -8863048 -4847066 -148612
6786 -148612 -2118735 996472 -5152940 -1578037 5961554 2759582 13358833 14452111 7025700
6777 7025700 1575684 -312018 18037341 14969066 10073447 12918948 551298 -3307875 -5357892
6768 -5357892 5891259 8877684 -2254250 2474373 526630 -3703245 -2407567 27621 4266200
6759 4266200 5170453 8551322 8341269 -4021570 -7695270 -3032866 -2897888 4407179 7272605
6750 7272605 299511 -11786945 -14820942 1007444 5197513 4883202 8233704 1754589 -5351355
6741 -5351355 -5803549 3303755 7498410 -2045786 -5245537 -3718513 -7946466 -8097994 -9435117
6732 -9435117 -6448437 -1797805 -5750597 -1927942 -4452393 -7920810 -8765035 -10988122 2661909
6723 2661909 -740258 -13050419 -16468476 -18601221 -9406504 -9205607 -3467231 1861286 -9755879
6714 -9755879 -6727372 1600984 11553517 15062635 3394715 3596260 2400867 -1639861 -2458734
6705 -2458734 -10500173 -9620015 -19038913 -30379397 -20517602 -19346311 -21232920 -23797545 -14496372
6696 -14496372 -1986708 -16735068 -13487663 -417634 1118200 1550945 48059 4264032
6688 4264032 -12166910 -23182926 -6927298 410948 -828432 -6524093 -9902603 -9966717 -9985301
6679 -9985301 77850 6513117 3429436 3298944 -3829086 -10097448 -9373056 -16191739 -21539872
6670 -21539872 -21393817 -11274165 -12298527 -27163184 -22910919 -17097546 -14812542 -6288351 9060887
6661 9060887 12727976 -1658034 -2208141 4787177 1215340 -6116357 -3703379 -4788219 -12221321
6652 -12221321 -13926584 -15063693 -18747207 -23915945 -15320378 -8127827 -4159651 3417697 -835930
6643 -835930 -7068030 -10422787 -4992983 -4124735 -7125336 -2814291 -6997973 -16696782 -20520090
6634 -20520090 -15210498 -12439816 -8204667 -910455 4577901 5980131 6778112 9318287 3764620
6625 3764620 6570839 8838346 8529416 10721418 8743082 871313 -16280235 -11788227 241874
6616 241874 3362581 4171750 4740195 3996599 -6052325 653759 9914683 6334908 -4174883
6607 -4174883 -8868971 -3147946 -6202999 -10610335 -20351282 -26891702 -24394147 -18961614 -11729252
6598 -11729252 -7799547 -9919038 -19884472 -19398525 -7445455 -1504284 -14763630 -17090453 -7434594
6589 -7434594 -10170936 -13939092 -21424196 -21097115 -31070472 -26990319 -788773 2888524 -2965998
6580 -2965998 -21488049 -23253383 -13700254 -9347497 2455828 -2047438 -9015107 -20383443
6572 -20383443 -32085873 -25778286 -20567316 -21667552 -17287806 -11585899 -7089349 -16791702 -25199429
6563 -25199429 -10311367 -9998748 -4551952 -1293268 -8357968 -12443081 -32497430 -28089862 -30537923
6554 -30537923 -37455079 -34459556 -45195276 -36301403 -38333742 -44164236 -42179839 -41921054 -30125858
6545 -30125858 -27339020 -18161979 484375 -2400267 -4681404 4075817 6546569 15726009 23500879
6536 23500879 44566961 51481450 30600495 30189292 16990562 17661897 28757499 27912165 23474136
6527 23474136 -10655637 -23938540 -32660367 -38377413 -22278103 -26515417 -33694603 -37184129
6519 -37184129 -33310670 -22849552 -19038576 -4058784 8636735 3005648 15523107 24401963
6511 24401963 18341487 19884503 17079691 24445189 10346071 4632070 13545521 -2269087 2062641
6502 2062641 -297935 -5901715 -15420193 -26068588 -11532230 -13765685 -12452591 -10869453 -25614852
6493 -25614852 -30804091 -29066674 -19668062 -7384861 -3867408 1994113 -1889016 -6799126 9089194
6484 9089194 12336624 22747714 28783589 20181698 14368907 -4657500 -171394 -4382732 -13488491
6475 -13488491 -14702729 -33885175 -36322566 -40262946 -36212528 -29073380 -32183919 -26036357 -24988720
6466 -24988720 -13887589 3023774 4249478 5360726 9697860 10493132 14719546 15098777 20797037
6457 20797037 17349677 8427075 18297320 11398048 8285268 6615812 4469424 8612753 661513
6448 661513 5603166 -8563971 -20478943 -13497296 -17019376 -18299552 -23117152 -19350186 -21791073
6439 -21791073 -24723257 -6792802 717978 -3311581 4561687 18966708 26815779 25983547 27361672
6430 27361672 33018728 24320819 27149082 31782953 24018354 20805422 11442427 15734544 15739573
6421 15739573 16650882 19856942 11249988 22061665 26577939 25386534 24935021 24167327 28277070
6412 28277070 21801093 23592287 27937414 19170912 12360435 16480439 23905166 26068094 18814449
6403 18814449 21307735 29958095 29313116 33327154 33396603 37155086 30683488 21798903 33001786
6394 33001786 31027286 21464990 13086351 18093266 25142138 16950150 21563518 27238053 21853409
6385 21853409 19784335 27557343 35073143 32152269 23946533 20030081 10377858 736285 2241994
6376 2241994 -4566333 -6397242 -12065888 -24979674 -29945896 -27924255 -10789529 -9038487 -7871463
6367 -7871463 4349056 1178352 1401681 13487326 27805078 24678314 12028213 20489414 25131367
6358 25131367 12177067 11177948 10505040 1899046 -3459905 2549633 15447055 974426 -6647153
6349 -6647153 1167500 336089 8525074 11400318 15680048 10140897 2697562 13801422 10188687
6340 10188687 7930730 9399069 5697223 9904322 7903306 4522769 -3122870 -9792962 3952251
6331 3952251 8172540 7243445 8896585 -4626022 -8811478 -1833127 17899831 25699301 7718526
6322 7718526 6170181 599982 -2629724 9828488 18145224 17227121 -5747986 -14732766 -9679873
6313 -9679873 -13364194 -5889837 -1906552 -5801791 -11829112 -18689157 -12759255 -7125446 2903238
6304 2903238 12839513 6655423 8913292 7405044 -206778 5718316 16656159 21551069 4586505
6295 4586505 -1972228 3740037 -8698095 -9860525 3124943 5414330 -9654544 -15556643
6287 -15556643 -2151328 -6277112 -13250368 -1816722 -43131 -10000166 -11913886 -7382454 -13754026
6278 -13754026 -22137857 -12629104 -12412090 -22046448 -18542283 -19383575 -27737035 -24018146 -5513837
6269 -5513837 -5447962 -18870732 -10210125 -4650021 -13696615 -8175469 8213430 498984 -19165553
6260 -19165553 -11425742 -2832948 -18506374 -24213877 -14188643 -18832915 -27512884 -17006389
6252 -17006389 -10655706 -26947887 -28595639 -7967626 -33506 2294353 9337389 6099598
6244 6099598 -7595156 -269207 22467070 19353299 6139610 1630611 -7890555 -19818764
6236 -19818764 -15160315 -6908083 -23809039 -42272806 -37970994 -33122025 -37300391 -33127516 -28056967
6227 -28056967 -33243415 -32475060 -15530601 -2108687 -4351085 -1728784 2987941 3129819 7595478
6218 7595478 13996566 16011189 10433783 8250592 5586982 -1441620 -2413120 -310263 -1622243
6209 -1622243 -3258928 -3915834 -9429703 -14073343 -11133456 -2381275 -97895 -2186343 -1252540
6200 -1252540 -6169788 -7659725 -4406907 1794749 5672456 254922 -3355576 -7868125 -9778321
6191 -9778321 -5907165 -444927 6785168 4010797 -8500843 -12160279 -5510203 4142808 10045433
6182 10045433 8615787 4196933 -11464268 -15587121 483457 7102706 1895877 -12934666
6174 -12934666 -17694600 -17172024 -18255111 -5476852 -3647328 -12507578 -18844904 -16108774 -2284184
6165 -2284184 -251168 -2572457 -1956430 -6247437 -5470811 -7294123 -8294963 -5087966 -13152546
6156 -13152546 -15635856 -17397365 -20983598 -22507733 -29658549 -17415204 -9115280 -13315745 -13683272
6147 -13683272 -16751733 -9517752 -7594596 -1758542 9832077 2215255 -5167239 -8614482 -6449045
6138 -6449045 -1847220 -8618680 -8069462 -7486053 -14313275 -15043488 -16227222 -10150626 -11023492 -18991961
6128 -18991961 -11148493 -8821514 -8847248 -10241243 -11207087 -9114695 -20113095 -15762726 -2524364
6119 -2524364 -1912539 -6045289 -12659400 -11645093 -10755815 -6547297 6142186 5174120 -4329937
6110 -4329937 -7962574 -7528574 -1765454 -791193 -4236919 -7292120 -10250458 -5611792 -6038840
6101 -6038840 -7939597 -5784575 -10107056 -9833734 -2210481 2055620 -5299470 -11890734 -4704152
6092 -4704152 -1084142 -7891738 -7535296 -5104133 -10308079 -7296072 3567245 7529694 -2588496
6083 -2588496 -6305950 5375322 10575369 15731612 18279344 11003001 4924947 3094978 6816705
6074 6816705 6227972 2292139 1033376 -5467774 -3951362 2039030 -5261370 -8243812 -1362591
6065 -1362591 7917237 9668247 8176910 14233999 2969646 -6234436 2646008 4973828 -1163331
6056 -1163331 -10662816 -10891274 -18836131 -32640301 -27897500 -24627080 -24908463 -20302144 -16469905
6047 -16469905 -17981422 -24066847 -17612569 -6400505 -2450866 4864307 3726141 -3415219 -4661819
6038 -4661819 -1883468 3002981 -481089 372821 -1225114 -8534492 -6197519 -7123113 -9020511
6029 -9020511 -13620417 -12560607 -11082718 -19389657 -19043624 -20545739 -22375834 -22929950 -22543335
6020 -22543335 -19360321 -23455738 -19813157 -11209804 -8224224 -6119041 -8270139 -4868410 904499
6011 904499 1119407 7869627 6110504 69252 -5112229 -9194971 1420585 -3328759 -5926783
6002 -5926783 -4229717 -11962581 -9971952 -13025225 -2065726 1520756 -6027116 -54634 -6750240
5993 -6750240 -5952172 -2977693 -3123888 658545 -8822884 -10204008 -11211432 -15919874 -6552601
5984 -6552601 -10440100 -14801771 -11547290 -15353548 -9004908 -12830820 -8543293 -4202976 -14450578
5975 -14450578 -2755467 -5122176 -6876797 -3035055 -3356869 7656309 1581239 4699197 5752003
5966 5752003 -2197919 10282536 16599624 15206237 9104989 -101522 1272278 1418741 6806358
5957 6806358 14268686 -1027420 -8799812 -10396770 -10960655 869524 -1421249 -2043393 -9441210
5948 -9441210 -12106861 -5168816 -14264866 -7262449 -1701365 -9661107 -11471812 -6378643 -2821498
5939 -2821498 -11473972 -9991350 9647896 10679887 -1182170 9734284 13088876 10415514 11667874
5930 11667874 18428537 24666721 3261632 3825111 8702889 4073060 10555562 1133414 -781366
5921 -781366 -4644333 -6408042 3176680 4920136 18122085 16949767 -4968024 4157352 19344623
5912 19344623 21804386 22533294 18231892 24022025 -999733 -4468874 30735271 24169539 13601735
5903 13601735 -2555758 3981809 11942987 -3769770 19494136 15874821 -551872 -2746975
5895 -2746975 -5698818 11246082 3045133 -442012 12923444 9788458 18535833 7923465
5887 7923465 -3544794 22254767 33460340 48007384 42297823 23043373 15776977 -11765415
5879 -11765415 23042098 56761676 34465876 1804395 -36415898 -22984264 -21272452 -14021635
5871 -14021635 16403114 -8184204 -31660543 -35859867 -17584096 2519565 -9489252 1786838
5863 1786838 15313343 12070995 20921893 3983599 -4010609 7707240 13969197 35648380
5855 35648380 25110937 14067215 -7962639 -31949176 8014439 20803514 6634229 -15082919
5847 -15082919 -26106941 -16660282 -31959359 -16196724 -4091684 -30546378 -37654597 -22535076
5839 -22535076 -3187743 -4685401 -16104757 -6273160 -4795347 -710146 19698680 12762984
5831 12762984 10525378 5063673 -2693808 1854181 -5148003 956133 -17706874 -26220214 -11172367
5822 -11172367 -24080267 -30732939 -30851384 -21457067 -23353027 -28893975 -9394257 -5214186 -14884692
5813 -14884692 -9491728 -1454177 -303906 2571905 8049720 16556161 7365450 5157372 11208156
5804 11208156 8572313 19394365 12638419 6440334 4330405 5652896 14482721 4650084 2865415
5795 2865415 -8428622 -18400287 -8282501 2649336 4662803 -10673686 -19885443 -19120021 -11428727
5786 -11428727 741082 7893792 778361 -5524450 -4792313 -2600307 3724180 744621 -231937
5777 -231937 -4096323 141745 1736825 -12406972 -16156328 -18037060 -9575346 -4808552 -2622936
5768 -2622936 -7647859 -23423656 -18489808 -8288697 2121178 2585552 -891002 -4521118 -9110324
5759 -9110324 -633356 4764349 3600027 961825 2789900 -4650 -4322465 -5362354 -5332346
5750 -5332346 -4663620 -3529819 2757928 -5914241 -11934254 -10525176 -5019905 2840070 757512
5741 757512 3576615 -2413022 -3276050 1238662 678982 1923305 -1172263 2309576 4259622
5732 4259622 2733481 -3667710 -9186075 -6316251 3979653 11467293 8399753 3611007 -7180821
5723 -7180821 -4600338 4128183 10178671 9486670 -4475587 -6216783 -7802900 -4414609 -1221439
5714 -1221439 -8895596 -10108466 -9176834 -3186055 2601679 1294354 -526575 -3925434 -4054395
5705 -4054395 7897749 7380875 1533558 1796093 -3265959 -2319146 -13084215 -11314323 -6431161
5696 -6431161 -12899525 106732 -1233609 -5079575 -12647274 -17002040 1686882 3915991 9033701
5687 9033701 7048854 -9667429 -11321861 -15953146 -10509087 -3422871 -10115937 -7340285 -19300095
5678 -19300095 -23210694 -14137203 -19837024 -5762909 -2120220 -1632985 -3282224 -18738437 -2425978
5669 -2425978 -1262928 115287 6865079 -7039914 -5380123 -12916524 -2439945 12279991
5661 12279991 -510783 465215 -7245349 -5578724 6563196 2658980 9263089 -788435 -8963732
5652 -8963732 -4642187 -13208378 -2077723 -3976090 -9324336 -1140465 -6215638 996427 -5502534
5643 -5502534 -2455291 13973544 7604735 13135328 10008778 3780425 1060625 -6965451 1954000
5634 1954000 -4376648 -13308435 -10613759 -16562122 -14347990 -15225724 -14754261 -7706756 -5620576
5625 -5620576 5858841 6672790 3739937 9430298 6771919 9452379 12266834 12336729 6019358
5616 6019358 -2147873 3780493 3113775 -3750289 -3603753 369636 1317673 2810882 9162994
5607 9162994 7241797 1092805 4122407 13808564 14748802 7797303 5508411 1501898 1024908
5598 1024908 9310717 11166657 5456976 -3414452 -1368062 9997928 13114841 17747252 10263262
5589 10263262 1692089 6873083 10471302 19205138 12852690 4158626 1008101 -3633433 9329397
5580 9329397 8682329 130592 -4447290 -8541220 500688 342388 -442123 -1250146 -14336935 -13461624
5570 -13461624 -8020007 -3183179 -1460751 -13497391 -8253203 -3409524 -3913020 3393280 2637394
5561 2637394 11441520 8163879 7829814 18856808 10135994 6259529 3583540 9574930 12168981
5552 12168981 -1464730 -3178735 -6679081 -9601659 -5316538 -1496381 2397769 -3124236 -9658847
5543 -9658847 -3459325 2073208 6508071 6733975 1765120 4500097 -362999 -62764 5970089
5534 5970089 8413955 10386413 4380104 8674503 12972104 13724972 16689381 19224690 20539346
5525 20539346 15779283 13887275 13556437 14904151 7017615 -204485 -3063721 -5523183 -2359760
5516 -2359760 -4953595 -209711 -3975306 -10715929 -5187019 785078 11246886 13748097 14586250
5507 14586250 11357706 1998674 2672529 7191029 6703784 9902092 9027500 -2055203 -12454633
5498 -12454633 -17716615 -6963690 -6815299 -3810074 6169123 -5491108 -11199653 -15158961 -3025217
5489 -3025217 4025800 -1473344 8107172 3742993 1551196 -327542 -1270004 4474943 2006914
5480 2006914 4886753 7671835 6415885 3323626 -7797113 -12309178 -2329053 -3370841 -7011757
5471 -7011757 -9123367 -9098886 -7999277 -17406670 -6534622 -3525332 -9200918 -4795963 2384819
5462 2384819 15536953 4032854 -3617646 -2228372 -661330 4210724 2190774 4639108 -2685460
5453 -2685460 -12854943 -14020286 -4657615 -2448680 -12155693 -13537161 -4059499 4563866 -622861
5444 -622861 -1801235 -6423108 -13100946 -10402722 2543586 12906373 2121044 -8209533 -15284243
5435 -15284243 -11267125 -4706065 2175430 8101326 5610459 8790149 1914487 3519081 4992658
5426 4992658 4682117 10450877 12673499 21760440 10325959 -646838 -1980484 -3554265 2812766
5417 2812766 7600287 13446232 9672935 2684498 2889208 2137399 -1881919 5767540 10425619
5408 10425619 11391042 11627018 2944045 255239 -14101446 -10860772 -1458865 -2498872 5317372
5399 5317372 -4041573 -4012941 -11768081 -19761496 -9074721 -2778035 11997942 12004853 5942924
5390 5942924 3632574 -8210895 -7921265 8528813 20193445 21282987 8658560 3044810 5935883
5381 5935883 -4598083 4921791 8905454 7413331 8889125 219618 10183150 -835906 -8551969
5372 -8551969 -5873199 -5147333 11005615 2281308 -4697357 -5744111 -13822949 -14360026 -14131491
5363 -14131491 -5591760 -5310140 -18190741 -9544448 -562580 -12666525 -15904086 -16165650 -3485814
5354 -3485814 1402434 2554159 13519288 -7123391 -13029040 -10198574 -3570335 10821443 3173904
5345 3173904 3410584 -5462045 -6446383 1697857 -2628081 6937581 13204203 8958184 9185147
5336 9185147 10442909 8575669 1158949 -918462 13140557 5851899 -4875047 -442234 -6912078
5327 -6912078 -4771238 -4170874 5672691 5827984 -4399661 10143699 13945212 18412101 21559955
5318 21559955 17714872 14008749 7564208 12188659 12199024 6843418 3329307 -4768000 -14789957
5309 -14789957 -10956819 -7788997 -7990435 -3288599 -1108117 2322569 -1219871 9895868 17743441
5300 17743441 10683754 14215863 15393471 15117510 11118630 12140140 9812539 -4393875 -10474685
5291 -10474685 -7751321 -8649823 -11507163 -9149476 -14845751 -17406961 -18847293 -16929796 -14110339
5282 -14110339 -15062941 -1560473 -627180 763613 2329124 -4900984 -837716 6499661 23441800
5273 23441800 28031671 17938445 13640212 8046825 9147107 18455518 18940264 12613969 1887221
5264 1887221 -2977346 5185129 938858 -239594 -6711464 -14560037 -2459478 3161244 12485098
5255 12485098 2008243 -13856825 -13307693 -17361959 -5943014 -1417746 -5989939 -15374252
5247 -15374252 -31203446 -26982800 -23417070 -25295766 -14273780 -4345612 1695543 -1271001 -8520047
5238 -8520047 -2914140 -6107716 4436457 24427019 20663467 8797937 -15738248 -19422539
5230 -19422539 -11841258 -7481279 6164628 -2998331 -11964045 -15921932 -13820408 3840525 12188605
5221 12188605 15580181 12686336 9273869 17515508 15943791 10192956 12260466 4337347 -564760
5212 -564760 -3874424 -2468751 167066 -13073052 -8797583 -4500167 -4841159 -45303 -839352
5203 -839352 7985481 6094380 3851084 7298143 1791567 -539825 -4743361 -4773305 -714412
5194 -714412 -8601051 -14972921 -13762216 -14438561 -9046308 -6314270 -184561 315100 -8307297
5185 -8307297 3785115 10067079 11443733 12293426 8458601 9192913 1920049 10216817 18485402
5176 18485402 9041195 4699041 2583467 2226044 2521224 3814124 9493297 4750540 -2442196
5167 -2442196 1084635 -3963398 -4321800 -2612132 -3088435 3412060 -1177412 -646622 -6060680
5158 -6060680 -7881291 4238152 2279634 4384583 4583523 2111418 -181138 -5026989 2643189
5149 2643189 2922607 -6504209 -3042201 4342625 5915797 -118323 -5512902 6311781 7662090
5140 7662090 6695787 17923724 17759700 11963731 -1572181 6870969 17406781 517491 -2972232
5131 -2972232 -230212 435394 -7853252 -12985414 -5160035 -13017443 -13814637 4232143 10499659
5122 10499659 5608820 -1133697 -3591426 4331575 11488522 22668321 13401291 -5729584 -1026552
5113 -1026552 -8814272 -11844001 -4776330 -2148200 -13539944 -33648713 -14273310 -7002880
5105 -7002880 -25371047 -18216852 -1158434 1646826 -10443608 -1614415 13472468 -3793823
5097 -3793823 -5153829 19878609 21812882 10321553 1553668 5623363 5377046 -269096 17791666
5088 17791666 11491810 -2124611 -4146304 -11008874 -2561136 -36106 6326882 -6185979
5080 -6185979 -25171291 -10478806 -7927722 -10271164 -4520846 -4539007 -15419270 -29730852 -10242790
5071 -10242790 11923635 -5058531 -14501473 -10924250 -12668495 -14293728 -13620134 2631417
5063 2631417 -11330369 -29728612 -17121789 -15058647 -15482347 -28358354 -23975427 -7536550 -8437753
5054 -8437753 -1483501 -12060404 -21917069 -17493007 -6420444 15893328 15489327 -6581422
5046 -6581422 -29490463 -37494235 -13390255 4969965 -4175908 -17504478 -35048455 -33265095
5038 -33265095 -20363508 -5269673 11576263 -2471455 -6064223 5188180 20371687 27631677
5030 27631677 10203118 16803837 29248775 30759919 25819755 14959027 9319015 -3800809
5022 -3800809 2935798 29596600 24704919 -8072066 -22644450 -10067783 5789836 7075463
5014 7075463 9470241 465806 -28689547 -26248462 -7693194 973204 -5920361 -15056646 -12088541
5005 -12088541 -18622604 -7508963 2839303 -2662953 4890868 19263328 24612450 13177918
4997 13177918 15049275 21096292 10412049 14593498 35177369 26744151 -3052959 -5438092
4989 -5438092 7359639 1698473 -7880840 10198328 14100819 -6628632 -5425732 7452299 7602321
4980 7602321 -5617275 4295470 15427647 3786886 75638 1255337 19334 -9693547 -8634613
4971 -8634613 -1609745 289544 9153546 10576067 2083522 -7477516 -3028210 6766109 15035492
4962 15035492 25488310 21607644 -1304086 -16907779 -5231092 7920670 8273927 5551134
4954 5551134 9521725 1640885 -10145056 1581061 12629279 13380753 9058714 23963518 31530577
4945 31530577 8625486 79141 2808532 10089647 8779112 11006181 13619389 -11277203
4937 -11277203 -21401353 -10388967 73030 64874 -6016685 -2855060 -4602321 -5499048 4328319
4928 4328319 1449419 -5569798 -1698286 2962491 11533919 8343285 6886082 3663520 -4848910
4919 -4848910 10762338 13903964 15503176 16500924 10796512 12146757 -3058588 -327831 2604339
4910 2604339 -2556039 3111704 -4705379 -10456963 -21671306 -24633181 -7690731 -3277196 -921449
4901 -921449 675944 -502069 6023312 4634494 13579725 21184064 9033129 14943511 19505166
4892 19505166 17701978 2343922 -12792761 1434362 -5782368 -5197628 4511930 -5522399
4884 -5522399 -17500977 -25602743 -1992927 3867950 -9122143 1438530 2329307 -3047751 -4885263
4875 -4885263 -957272 -1699532 -13706830 -1564056 12429176 -744866 -7137153 -11842195 -13188653
4866 -13188653 -1176282 13518041 22962423 1245690 -5616551 3725693 -2218070 8066510
4858 8066510 15890695 12768596 -5445826 -11221092 3320409 -9430706 -14346615 381731
4850 381731 4388677 -5881578 -12883478 -5263037 -9019631 -15460654 422621 6507610 -11156800
4841 -11156800 -20197671 -17228286 -13266131 -20308291 -21940118 -18057561 -31644112 -30593463 -21882829
4832 -21882829 -20859030 -26895804 -32273830 -19813054 -16690037 -13657893 -6713828 -10423728 -13437567
4823 -13437567 -9642013 1754224 6116904 3162491 7632268 12294988 10799307 16876711 18850812
4814 18850812 16457553 20022435 25423169 30610066 18012800 13316071 12610578 3876848 11647760
4805 11647760 14845080 9703482 -6066463 -10009100 2389332 -1548262 3861585 14431209
4797 14431209 11421906 4972276 5643102 17763866 16416695 8426113 15779362 12281708 975457
4788 975457 -3440731 -7417319 -5924262 -14887085 -14836583 -10053899 -15074995 -8230075 -12618218
4779 -12618218 -6924629 424220 -2167977 9524240 12595908 19061353 10054952 -352719
4771 -352719 11350129 7957317 9653385 11993329 6650845 -205046 -12336383 -1271193 6770442
4762 6770442 -413543 3153564 -2978852 -5022917 -5827786 -10351546 -3840000 -14781721 -15641907
4753 -15641907 -16310155 -23900185 -15484869 -27148982 -25639829 -19759100 -18992589 -10343312 -17602599
4744 -17602599 -4883054 -3317156 -10082463 2664859 18131 -612891 -6306506 -3677031 7238643
4735 7238643 -6553678 -6990235 -5772529 -12776970 -7476923 -5233140 9436633 8584896 -4745245
4726 -4745245 3035799 -420369 5845458 10527068 12627988 20969290 -130143 -3745602 -1294078
4717 -1294078 -2812538 4191726 -1945053 5046031 -5157424 -18443672 -10025237 -11892788 -7128165
4708 -7128165 -9724907 -14183440 -11942293 -19332369 -13753763 -12005592 -13081112 -4528880 -9984895
4699 -9984895 -2905713 11887771 14698429 13516090 7497161 19878047 20506406 13946019 30968699
4690 30968699 26960198 8165630 -3421110 3948438 8700569 -8498975 -2180638 3462051
4682 3462051 -10821298 -13354790 -3331931 1770459 -8134252 -6070410 7600242 4032579 -1546393
4673 -1546393 -2473646 -11843277 -15842644 -11108447 -9314723 -14908849 -22243242 -23956125 -30698296
4664 -30698296 -24109542 -6124209 -11505967 -21424580 -13644990 -814987 -665512 1432180 13938335
4655 13938335 6323629 -10953898 -645875 16974283 11501001 1973268 284732 -3569359
4647 -3569359 -15027878 -13398193 2145258 -2149548 -10349883 -15804540 -20338106 -17970617 -19518428
4638 -19518428 -12571681 -9797891 -9847449 -8315315 -14833424 -7378993 -1517089 -4324487 1511318
4629 1511318 10607361 18810361 12624800 3564466 7030432 3721299 7369430 19116564 17698950
4620 17698950 8279842 -13213425 -16836596 -3338051 3035026 8376148 -7062016 -16495839
4612 -16495839 -18515896 -21115604 -3217724 1795108 -5474180 -20812241 -26165513 -9654593
4604 -9654593 -12079358 -16258825 -14128752 -20140251 -21878754 -21314220 -14180029 -13649819 -24126289
4595 -24126289 -13122366 -3323249 -963555 5851279 -618663 2800665 8208717 20622986 29942094
4586 29942094 14011917 15531315 9743112 -623904 3497716 2744627 -1848393 -27024880 -33039106
4577 -33039106 -20848649 -30974460 -33497338 -27817854 -27770408 -30834656 -26998394 -138108 9335104
4568 9335104 -1375937 5250710 3619040 8602008 21292501 28481820 31103943 6297495 643277
4559 643277 -1558250 -3426114 17652159 11634469 -1914680 -14125479 -9458441 864652
4551 864652 -12608455 -3977915 -1261000 -18835621 -17961688 -7327611 -6211874 -29181271 -39195920
4542 -39195920 -14304321 -9737352 -7400904 5326863 656061 -629200 -512554 25766790
4534 25766790 42000233 31461131 39012000 30396132 29912885 25668303 11972336 8717510
4526 8717510 -5160070 2345192 -1836199 -17864960 -23533707 -37787459 -35576382 -22114747
4518 -22114747 -4623755 4929150 -8994321 -11409621 -1265989 3447794 16424403 21158281
4510 21158281 24693615 19209479 4375427 12472610 7204441 4677838 2522882 -2398320 632068
4501 632068 -17313672 -14895140 -14522350 -19768315 -17687354 -23868831 -18874839 -21409878 -10925369
4492 -10925369 387764 -7201433 -7321086 -2802997 4190421 11453361 21865079 27585255 13481983
4483 13481983 1277651 12056827 14789987 11859003 11395495 9595790 5339442 -7800562
4475 -7800562 3738664 9228721 8189221 13014432 9877128 16005999 7530665 10563130 12115847
4466 12115847 7993727 9697876 -8465202 -14775788 -18988999 -19199063 -21051470 -28051698 -23659322
4457 -23659322 -29756976 -33308673 -23991897 -13241808 -8763173 -8607740 -5567035 1672258 -5229263
4448 -5229263 -9986915 -5359093 -4482834 -637176 -15105229 -16550813 -18902589 -26540945 -14733872
4439 -14733872 -8860648 2765419 -11617261 -13900781 8146690 15520543 25070359 19906178
4431 19906178 17725430 9300193 8480981 30905368 34274578 21677284 7847009 -129270 342066
4422 342066 7754543 15852660 18301339 5293930 3033484 2079795 -7885347 -4178785 -8562033
4413 -8562033 -2705445 -3602923 -5707775 -11211039 -37888498 -38177235 -35116695 -22687944 -10390176
4404 -10390176 -10617737 -16429470 -35767054 -31177596 -16912319 -5616161 4783714 12912540
4396 12912540 9102640 -2763736 -2499719 4924998 7312450 778995 12270069 16077924 7675028
4387 7675028 1346109 -3468458 -6095600 -22708057 -12716027 7016111 11267996 2977885 -9168350
4378 -9168350 -13305627 -25110771 -18545050 1639926 15450256 7474219 -5604848 -14794906
4370 -14794906 -28703898 -29908953 -27999485 -11494454 -3320290 -3470219 -13766022 -36776483
4362 -36776483 -35482968 -31817436 -12060249 14281227 26821647 13380115 -18510541 -20069515
4354 -20069515 -10890572 -8410741 850107 14272172 1255586 -24692699 -33089385 -25632240
4346 -25632240 -28800095 -33142725 -4650015 1704420 -5477165 -11196446 -11856197 -8110717 -20511792
4337 -20511792 -2241947 4856608 -439310 -466052 -11119067 -13173180 -26579293 -25887273 -12021399
4328 -12021399 4157138 26655179 29655044 21546233 24235853 29060508 39615928 60838179
4320 60838179 73722074 76224263 52254610 44684942 43163275 18116846 13675944 12092692
4312 12092692 23609861 14508400 -2393141 -784414 -24202793 -29679558 -15597248 11231646
4304 11231646 23279068 4581347 736878 -2596786 -12834832 -12351212 -2545033 4200801 -1253091
4295 -1253091 -12432914 -8953749 -22292018 -39799950 -33396447 -24633505 -3302391 -4275899 -8646208
4286 -8646208 -16125424 -31931565 -19639184 -15547707 145567 9641576 -324470 -7824273 -15709499
4277 -15709499 -7277631 -10061956 -13438907 949989 4494221 -6366986 -7389739 -3115421 -6290715
4268 -6290715 -16111362 -11752473 6437956 1952168 8619425 13921123 5521882 -224693 -3657358
4259 -3657358 16318591 19941108 23635096 23800181 3556829 -3416948 -6786641 -2015707 -6485943
4250 -6485943 -11353558 -7830872 -15288642 -21822850 -21408051 -20821176 -21011452 -14127494 -271708
4241 -271708 12256720 1651209 -7502285 -4654152 2023149 8833577 884365 4071147 -4361873
4232 -4361873 -14285597 -8289170 -3271468 -1186570 -16642054 -9693762 8359941 17747689 23658315
4223 23658315 17497327 16709093 18309310 27942697 35016318 32756171 27191674 11700303 -2276870
4214 -2276870 4344240 9303371 -8794405 -19497221 -10633968 -3625047 -21368465 -19570304
4206 -19570304 -383758 -8604789 -10801776 3124741 18226009 1304892 -7616265 15815075
4198 15815075 14856469 6433511 2807994 5939998 4574825 3486312 15742587 10159848 2359861
4189 2359861 6360059 8298919 13904177 23956366 20502108 6453352 1461382 14691114 12108991
4180 12108991 -4336307 3649577 -389893 -14598515 -19571724 -11486438 -8358978 -25548438
4172 -25548438 -14411725 -5094363 -13121930 -14669212 -10338557 551310 -322324 4838463 8339491
4163 8339491 -1767993 -1984925 3847591 6132775 8931793 9500788 7047784 2916203 4586678
4154 4586678 16514152 14505264 15592183 22201478 20721221 20660325 15944820 21211315 18998427
4145 18998427 12738303 12848115 5794677 4529319 913324 -135355 -1628014 -5650778 -5618078
4136 -5618078 -4309432 3685320 11755603 11884528 6532610 5277737 7963163 11443430 11544064
4127 11544064 9969131 5277400 -5317886 -8695597 -11136545 -13174347 -18032084 -17859900 -10804041
4118 -10804041 -8466520 -7763039 -11987601 -8383656 -575099 11515594 21594323 19820929 15777393
4109 15777393 7169435 8556529 14613964 18159184 15886443 4874450 -65790 -1842959 -757325
4100 -757325 2849565 3963643 3261988 3995861 3704720 5889352 6744076 9531327 13955728 7412586
4090 7412586 8557718 5698800 361518 319933 2309489 10759764 -1105740 -8325776 -4660770
4081 -4660770 -7257236 -6001215 -4395942 3800784 606409 -11463364 -9309174 -6491848 -6499349
4072 -6499349 -1599063 2907921 10354758 6827061 -1053603 5662445 10887197 22517077 21138288
4063 21138288 17894656 25039181 13619721 11170705 12176920 14988355 7885343 -9626360
4055 -9626360 2332526 8577395 224703 -4550311 -5504364 -1879838 -4848529 4164312 24267385
4046 24267385 19634859 8140804 4470202 4933726 12343223 6936050 12639252 15861681 4031579
4037 4031579 386540 -8164422 978289 2804865 404490 14133670 14458982 12214000 1189540
4028 1189540 -625392 6471274 -663928 364182 2179413 -5684612 -15988887 -26321922 -24703566
4019 -24703566 -22516341 -27485620 -18936353 -15030191 -12500025 -11839803 -14909174 -3947222 -7481517
4010 -7481517 -3979421 5937312 9745040 10907540 -2838250 -562235 -1124057 -4657225 6398041
4001 6398041 16490776 20583439 12472554 13859705 23501206 23825129 27726692 39172805 41208941
3992 41208941 35240496 28585584 28899975 27105979 16265376 18173408 16209788 13802723 8995666
3983 8995666 3521852 9720578 4872035 3798430 572427 4050094 11877036 7056784 9493586
3974 9493586 7114526 812830 -7952443 -6263100 8702248 8659785 -468201 -2598130 -730362
3965 -730362 -2655361 -2603952 4858750 12064532 1386970 -1846729 6151898 3823566 -2928060
3956 -2928060 -11937308 -1367941 775765 -3499002 3285744 -1251736 -2255749 -4874168 6992325
3947 6992325 18550720 12839865 13774962 10622995 10808011 15485794 15548710 12987677 6546834
3938 6546834 3411042 5811634 1851384 6711532 10026009 79839 4544209 6007435 9820326
3929 9820326 6779900 5754444 18360551 7429413 7988884 7660494 -2462552 -5934118 -8957915
3920 -8957915 3427696 307063 -6381836 -4246222 -16959663 -21393938 -10814166 -212349
3912 -212349 5652726 -2153431 -5565144 -10467329 -21936607 -5645248 2284906 1888466 -1334738
3903 -1334738 -12043051 -5195882 -12533248 -5300246 2746061 -4628590 1874855 -1956079 3192403
3894 3192403 1903382 -6713144 -2955306 -6524831 -1549142 3791153 -1983786 -2482529 -7248553
3885 -7248553 -7217088 -1981293 -8603340 -2580584 -2479957 -2737176 4090458 -4426471 -4450636 -15787367
3875 -15787367 -12935744 3766814 4087590 9636911 783746 -3593905 -2717174 2280405 18854369
3866 18854369 18106365 15921496 16900171 11244341 8033072 8596121 8509977 5995720 2761396 10335908
3856 10335908 7056684 -8445280 -5146571 -1458948 1213608 1420459 7708728 11993054 -405828
3847 -405828 3220773 8915602 6369386 -89486 260217 6585883 3947205 1203135 -4535272
3838 -4535272 -7959850 -9095794 -3991513 -1685113 -1903348 -527192 -9664131 -11772271 -7321143
3829 -7321143 -1871010 -7848250 -14808532 -6601948 -5924569 -11907284 -10416900 -1526635 -505102
3820 -505102 -4566597 -960602 9175807 8244068 6093107 16278533 18402427 14025148 742803
3811 742803 3610672 13629442 10621577 12356508 5776513 3151452 -5007063 -7772750 5459667
3802 5459667 8186710 9456865 4163517 1843062 3759327 -744441 -2182657 2645795 12157189
3793 12157189 15554231 4924486 -46022 4690118 261134 4743994 17683372 25469572
3785 25469572 12866610 -2269749 8907720 8863550 4890654 6401173 9832398 6370789 -5466132
3776 -5466132 877803 502984 -907552 3176525 6161159 10304463 10564694 12963276 5936381
3767 5936381 6537329 15422411 9051984 -1495839 893524 4349945 -7131154 -14889484 -6537935
3758 -6537935 -8607600 -22716444 -13045714 -1592292 -3854992 -9326343 -5205789 4031460 -5929898
3749 -5929898 849384 5844082 2146277 5039597 -2970255 -2277783 -8405022 -3878732 1711504
3740 1711504 -5527196 4801556 -284424 -11264650 -6735548 3942856 11482619 -51849
3732 -51849 -3152110 1474936 -12568497 -8211394 4320826 3214755 -1209593 -13683706 -4062059
3723 -4062059 -4783800 -6605295 9488203 4073527 7574847 -2083670 -8312825 -1823194 -6642046
3714 -6642046 6218518 2890908 -2095158 -3982925 -16809276 -7144903 3319517 10413835 15307736
3705 15307736 6051335 7667881 6410222 3757855 16017259 11267832 10275133 2856156 -9576363
3696 -9576363 -7173964 -21164557 -15895772 -10490160 -11206984 -7833529 -21670728 -15614993 -13316599
3687 -13316599 -8537472 7863569 7913294 4955547 -3476471 -3659339 3957316 458886 1736283
3678 1736283 3690937 -3812014 -2142776 -3330616 -3872050 -3424219 -6740969 5253396 6427493
3669 6427493 9847283 8320474 -4896028 -1761852 -987162 5112089 7157534 8001488 7923786
3660 7923786 -5380575 -6227747 438515 4074972 8849885 18747530 20317983 10299084 1418773
3651 1418773 3909043 9438886 12840797 22821679 17947007 8310540 1495679 -1224307 2216853
3642 2216853 6475741 17346293 15029526 11508169 9945992 2062616 -5786914 -1466656 13352869
3633 13352869 11431363 6735089 1464227 -7121617 -14672063 -7616647 10933764 9573595 6731612
3624 6731612 8179246 7824095 6494734 9513373 15934072 12981893 11161879 14778189 12124013
3615 12124013 1508160 68877 -2343947 -1739202 3759205 5683585 7786306 -82343 9299603
3606 9299603 15365243 15030640 23739364 20474483 24008766 23425662 28976986 33408798 20431475
3597 20431475 18373514 13935296 9169366 12534981 13898908 16083021 7910041 -4341514 -2108398
3588 -2108398 -5480834 -509879 10579599 12047635 15629630 -1640499 -1528761 8420734 9924763
3579 9924763 23938365 22228243 27046308 17465350 6680817 19806252 16564086 17602260 16537818
3570 16537818 14674515 14180846 -675812 -1520600 315293 -3730149 3216475 579002 -879259
3561 -879259 739238 -4859306 2969196 2133608 6924165 6283371 -5304473 10096077 11456459
3552 11456459 7417559 1484833 -2231269 3510304 -7350773 4429951 15916039 5554416
3544 5554416 -3566572 -6111902 2323812 205350 -44975 10685365 7345881 -3151896 -5618441
3535 -5618441 -4319402 359163 1746991 6735046 10358490 3047655 4093903 5060117 12595369
3526 12595369 18929818 16489768 14136107 7308184 11106919 10974657 9463417 6585954 -1270243
3517 -1270243 -6257817 -13057585 -7592453 -6042095 -7754854 -10122511 -13695218 -11365730 -14225267
3508 -14225267 -7288960 2693706 8265631 11260448 7104856 5373972 6311828 13242454 27005881
3499 27005881 29244926 24209783 19669948 9566529 9337896 12396767 19006442 17412899 2371129
3490 2371129 5413620 -348005 -6838740 -5593659 -355280 11306864 2049553 5798048 11102447
3481 11102447 3672322 5874444 11250805 24654732 20747763 9782966 13681250 10713364 6524590
3472 6524590 3269929 1536398 6175847 1676199 2719617 6878801 805778 601195 -1459260
3463 -1459260 12244412 26651665 22049886 18402629 10306384 15023189 15113691 13365258 22929142
3454 22929142 16164302 5158240 -5173980 -3637776 -3084713 -14086659 -8849355 314845 -1224476
3445 -1224476 -11474959 -15582601 -8863223 -4861954 5176357 20350294 21628141 12077805 5951880
3436 5951880 14141012 26543487 30490210 32785946 25576196 18144150 11372286 5655478 9280220
3427 9280220 6385371 5998584 -87895 -4811943 -5922965 -16521071 -9681098 733406 10522961
3418 10522961 14095498 9564504 15199879 12694143 20321849 36863828 40151912 40080110 32613026
3409 32613026 32412838 34121624 30364001 40059314 39824207 34449184 32438876 24489066 27922380
3400 27922380 23933401 25952829 32506438 24024858 24230743 15520464 15922193 22787914 18442480
3391 18442480 25794856 23583186 24840216 25721324 21081423 31720484 29932064 29955549 34951315
3382 34951315 31444024 30869684 19019571 16949252 22593013 16659364 17585641 11981275 8373828
3373 8373828 7226295 1045311 11319302 11932118 7890489 8948598 8103614 14074386 5062844
3364 5062844 674900 4460616 -770298 605108 -312115 -790750 -5647011 -11998714 -2322638
3355 -2322638 3226522 5459496 10186246 10955202 15137876 17661546 21003313 23688517 21569354
3346 21569354 26081957 26923669 24901650 25226569 19682544 15713686 16737971 22395644 23585450
3337 23585450 17899463 17602723 15779783 9945641 9453679 12150237 10181206 6003386 5846059
3328 5846059 3947953 -3790614 -7400314 -1412633 3837714 6452612 9313894 6992502 3910140
3319 3910140 5888320 12662569 18347092 17424261 15129817 10434166 7367834 10125502 8815592
3310 8815592 7813676 9502844 10782546 11895942 11343518 14833533 15147704 13318519 19606237
3301 19606237 22280693 19202040 15004568 11183209 9735918 5250202 4199082 3890064 -594827
3292 -594827 1574007 2265759 1699006 4333823 6344984 11225045 14769470 23366479 29138654
3283 29138654 22688129 21860970 25050211 25683450 26221836 28960350 32137146 23021621 12501564
3274 12501564 14494707 14893330 14434314 16871136 17134174 12433964 -246205 -1644830 3785755
3265 3785755 5402208 12124294 12491352 9831982 5990365 6170194 15040851 19378776 28509141
3256 28509141 34091267 25595530 20178790 19754405 20547159 18718072 19185308 25377195 13297208
3247 13297208 -1488791 3702456 6956707 6986880 9416096 20438479 22845441 10444648 18594734
3238 18594734 24369347 19480040 22281146 26927046 25780961 9949747 5413381 6305791 -2530115
3229 -2530115 5165118 13106964 3137743 -6002609 -865713 10613024 9739966 16014197 28661637
3220 28661637 12993185 4023940 17930935 26266825 19895773 10855501 18886262 11142683 1396083
3211 1396083 15047096 18269107 14908229 13252192 17623517 15051722 4845781 10788693 12026787
3202 12026787 10573492 18082360 11670402 -6951514 -15220832 -6413975 3325489 2225116 10145259
3193 10145259 9257852 -13048594 -15307251 2904 14613391 13188217 9959388 14092109
3185 14092109 -1746263 -10761539 -2655408 11320451 20028900 15327963 14943086 11575864 6075290
3176 6075290 10790438 23465913 34711386 32338303 19679063 15536104 14514088 10330097 10046553
3167 10046553 7682893 10705196 8461056 5368089 7558268 4262532 8118239 9672666 18994357
3158 18994357 31708985 27565049 18832455 15001255 22046803 22212489 14844399 16701697 16943074
3149 16943074 9445339 12962003 22612242 19991203 11422803 13364895 30988960 35841384 37523488
3140 37523488 37549992 22052681 13905887 13858999 22553263 20163625 11351578 8064928 -5956527
3131 -5956527 -10940264 -4680050 2283287 5635777 8701778 13799002 10894212 4596718 7666943
3122 7666943 13581220 15631860 20234997 15683373 11030945 7998891 7000182 12910634 17119128
3113 17119128 30153483 31933568 30322425 36698286 37985125 40556495 43700454 54173564 53622689
3104 53622689 39131374 28887440 27053175 29291291 30206060 28547835 19814072 11389897 3044962
3095 3044962 8817041 21798029 24151066 14882086 1464061 7945292 11076453 7370752 10747214
3086 10747214 13615032 11616790 6605127 16542033 26321238 23056179 24813430 41100297 53246944
3077 53246944 56987146 57176183 55335055 60224481 62460128 70982374 70210133 66347313 66925787
3068 66925787 55617221 61788539 67772362 65809528 58406831 54952646 68818447 62414525 53382723
3059 53382723 55945521 51479936 44183739 41682555 49954403 55434535 48115164 55054025 67523249
3050 67523249 69536248 76280966 69609338 65337095 54673553 37091497 34807291 24532729
3042 24532729 32003196 29592722 18438383 22553986 15744355 20987192 25550795 38936289
3034 38936289 57249530 58850315 79873690 111062887 141815755 172544637 190211099 208718801
3026 208718801 219766765 225116381 248495239 257417733 250071095 210877364 136334310 65371274
3018 65371274 -18809514 -71669982 -91777802 -100172190 -94203698 -111239875 -114263527 -113227543
3010 -113227543 -104183043 -69097310 -41383602 -13654973 -1751430 6436297 27720371 50327887
3002 50327887 86569227 121062157 140998584 157362482 158340037 159585833 168574635 168557162 162168561
2993 162168561 114465540 44162448 -37710513 -123671454 -166306581 -187773380 -187705415 -186290242
2985 -186290242 -189035926 -179026597 -177367050 -158071965 -134005923 -117341959 -104375315 -96090178
2977 -96090178 -81503914 -76866259 -76918336 -69856838 -65485865 -67141829 -68999100 -70904571 -69193894
2968 -69193894 -70458216 -65141299 -54212273 -61303878 -74670990 -93686921 -100914439 -99613730
2960 -99613730 -98088450 -85183124 -80306541 -75927192 -79369160 -83273180 -81552308 -83098134 -77645961
2951 -77645961 -73148557 -62645825 -58185746 -64686321 -67725226 -62288771 -51929536 -48879404 -44437075
2942 -44437075 -40205280 -47863524 -63718892 -68259529 -65461201 -65191617 -61356938 -50292832 -42146627
2933 -42146627 -53250991 -59184826 -55314333 -45534436 -31622405 -22468121 -15557262 -26796567
2925 -26796567 -37297796 -43660691 -46418392 -38000412 -34091834 -29519190 -30784287 -33089205 -39121505
2916 -39121505 -48339691 -40408536 -24630400 -15006709 -14514693 -19929514 -32089975 -45793454 -49412229
2907 -49412229 -40607208 -38164460 -42883641 -44154780 -49672797 -52197597 -54411388 -48440919 -38171930
2898 -38171930 -28712976 -13871229 -13390413 -17796858 -21251962 -18912328 -10981548 -7139416 -2899269
2889 -2899269 -9083703 -16271535 -14376349 -6466795 -2359529 -6562727 -7739411 -3040494 6681081
2880 6681081 13431607 14359057 6281763 -4807455 -9921925 -8374933 -2735320 -5063482 -14155795
2871 -14155795 -23723455 -27168452 -27817163 -30274915 -29457084 -22300947 -12944688 -12196408 -14046069
2862 -14046069 -20263753 -27017424 -29794858 -23634069 -7701796 -11682561 -27525053 -41512585
2854 -41512585 -44921444 -38865171 -37934229 -26100100 -23000738 -33641305 -38257417 -35677033 -24022345
2845 -24022345 -23624232 -23495949 -14738017 -17132161 -18859152 -18719835 -17628880 -12402444 -14370130
2836 -14370130 -8803871 -5787251 -9377485 -5243756 -11738479 -7755056 -1572644 -6712919 -8352214
2827 -8352214 -18025049 -12229940 -13499182 -19986130 -7442032 -13088432 -18496554 -21261565 -13685444
2818 -13685444 -333944 -9578811 -2345213 1329743 -8494869 -6327224 -5940826 -716407 -8329263
2809 -8329263 -14720501 -5034243 -15197749 -17263392 -13354438 -18314914 -13950077 -15623398 -4734063
2800 -4734063 -4437985 -11856876 3497834 -1519318 -1745354 504072 -1442247 5352383 -1403911
2791 -1403911 11173386 9794895 -6095062 -1490796 -3639000 4007889 8353832 9709652 10490924
2782 10490924 -6389652 -2489498 3122904 -4565690 13222 -357282 -408443 -5896821 -10132194
2773 -10132194 -2027527 -16032844 -14269819 2605861 4493726 5492380 -4824008 -973008 -5613653
2764 -5613653 -12898056 3043254 633929 -3409895 -9866310 -13306109 -13394893 -25522836 -20205829
2755 -20205829 -12857818 -8898740 -2467144 -6807248 -11665659 -13422686 -8996301 4473667 8505799
2746 8505799 8087467 2833808 -8417320 -2433162 1813752 3550380 1680172 -3170464 1915553
2737 1915553 -3956521 -405188 3826643 -323127 -825517 -2311243 2173030 -6731437 -13328640
2728 -13328640 -7255062 -4184907 -8169977 -16362264 -20346705 -26053951 -23948679 -9580073 3315201
2719 3315201 -6701004 -22633963 -23974711 -16813862 -5933532 -1587850 2365625 -9220625
2711 -9220625 -25121504 -26862230 -19570653 -10106958 -15322365 -17116486 -15251978 -13644649 -15933614
2702 -15933614 -15279303 -1597044 3001269 1351472 2047389 12110447 9356667 -1959632 3183765
2693 3183765 10363038 5195034 -9390462 -3454368 2543978 -5662636 -10970835 -6840195 -2586879
2684 -2586879 -13027917 -11804608 -2652160 4208029 -148383 -6878516 -2896280 -4361344 -7183253
2675 -7183253 -11626029 208578 7880994 -4665417 -13415201 -9455456 -1395753 -11267819 -8620752
2666 -8620752 6478683 5350767 -8724932 -9139456 3150411 -4761711 -14214621 -7293543 7470260
2657 7470260 3227239 -3819745 -1994026 -6616535 -8163492 -8425182 8863865 16685167 11293200
2648 11293200 2260143 -9798594 -3308680 -4034605 1338173 9184679 9274364 -132314 -19148299
2639 -19148299 -14724109 -3952349 912619 3786555 6105571 2244547 -6524570 -7083592 3876745
2630 3876745 8237726 -507523 -383095 -2131275 3375388 1675750 -1943119 2715624 -3383862
2621 -3383862 7914762 12460122 19051522 21055644 11885060 19751504 17490425 22530394 19672870
2612 19672870 9058131 5954421 -530856 622031 -9365706 -23915857 -29029053 -31492037 -31087296
2603 -31087296 -25623879 -26244308 -29440951 -36473224 -33289904 -16714080 -16715938 -10049549 -11651823
2594 -11651823 -10270384 -4428400 -10515724 -3415088 -11752064 -8881640 -7233480 -12646944 -5658569
2585 -5658569 -16182323 -22094969 -30459629 -28318905 -21392531 -28858024 -27328512 -27685151 -34932394
2576 -34932394 -40585490 -36745132 -25315817 -16502952 -16208413 -11075379 -13601141 -13287777 -107986
2567 -107986 5588664 17112920 10972156 5642189 4165803 4909846 19081146 7642532 621413
2558 621413 -4606977 -4807482 2628435 3379493 12460812 3803238 -3932021 704816 11178517
2549 11178517 19893970 17678753 15556085 14169538 12714803 7810897 7431057 6919967 11330641
2540 11330641 8820644 4180264 5481083 -3693557 -6183890 -5926386 8855637 15514176 5360183
2531 5360183 2302469 -745636 4085612 2506960 9038680 17438006 14393552 7774609 3304744
2522 3304744 10826191 8863513 7279316 8393133 13300032 8293008 -4655279 -2521054 -4908567
2513 -4908567 -8818469 -18698800 -17178984 -10517190 -13727009 -13003254 -18113152 -19205867 -19346135
2504 -19346135 -11332747 5486908 17238991 14472951 1247053 -2347031 7197905 20308314
2496 20308314 21188104 26280023 20524701 6952752 2977912 4510098 16661684 10345014 13168611
2487 13168611 16388075 8475288 7499891 -2908205 178674 2823584 8104364 11592522 176159
2478 176159 -1382950 -8275150 -16321545 -10884570 171265 4560579 705316 -2999228 -3718421
2469 -3718421 -15785119 -16832572 1039101 5333850 8749576 -1922901 -12785935 -17033973
2461 -17033973 -15645369 3308107 168270 4211608 7888547 -2553167 -969432 3936080 12559576
2452 12559576 3561853 6527318 26599808 18335873 -3350775 -10354300 -7241171 -6210813 -727538
2443 -727538 8310022 62657 -26683761 -26615619 -9846810 422428 7444242 -2113663 -5605543
2434 -5605543 -5007677 6971723 14759727 4425621 7799026 4432534 2889908 12070890 17867311
2425 17867311 5393660 -16563282 -9168834 6803391 2431725 -7235439 -6143723 -13346729
2417 -13346729 -22729265 -16993351 -4205965 -3864453 -17781704 -11840090 -5716551 -5709602 -4268437
2408 -4268437 -2483230 8852888 7466056 6193306 5039714 3329220 6981027 4646414 6592859
2399 6592859 5967869 -2172279 -8538426 -4218658 3473169 4393570 -2591571 -2232167 4814528 4758367
2389 4758367 9818306 9614966 11399912 10463031 6337568 11705654 4847970 -806668 -6063515
2380 -6063515 -2828100 4352329 -8035084 -18344721 -21383346 -14943471 -8635737 -4826787 -1320695
2371 -1320695 -10994170 -21211115 -10813110 10514274 14710780 7248358 1788527 3988227 5116821
2362 5116821 11400557 24033239 17315878 6352643 3432706 10621966 12468188 4146970 610699
2353 610699 -5151983 -4483685 -804015 -1527103 -9644373 -15640426 -14119544 -11532069 -672850
2344 -672850 4595119 -2574951 -16933676 -12061379 3426638 -175105 -2808236 -3819040 -8141507
2335 -8141507 -18726987 -15992047 -1252646 -12202009 -26112221 -20417746 -7552100 -4241443
2327 -4241443 -7696095 -6497850 -7901842 -9061785 4891602 17669018 15530476 10614791 1439396
2318 1439396 4468449 12045968 14303675 10955441 316572 11078536 12133124 1947641 -1080271
2309 -1080271 -5528049 774116 5204743 20266173 22317363 -2752091 -13482134 -5853944
2301 -5853944 17044004 30530391 21785331 8034295 -3490877 -1455203 8280181 13245962
2293 13245962 18083095 8709473 -4488850 1684788 4650847 -1849228 -13616498 -3309919
2285 -3309919 18693890 14018062 5425004 -8056799 -10662039 3796869 22112730 36303121
2277 36303121 19431768 -927196 -11386581 240815 30981933 33754111 8804938 -11950931
2269 -11950931 -3046491 9380584 7635873 14235669 15060794 -2979589 -8807503 11715424
2261 11715424 22456277 3141632 -9714299 6350340 14919639 8735448 -765016 -6538235
2253 -6538235 -3600743 -2515192 6822558 9393195 5103812 -5600887 -15893104 5152221
2245 5152221 18078209 7707213 -6023764 1351311 16222911 1670971 -764916 10470245
2237 10470245 9011953 2263699 5712728 21235991 15557354 312127 3572092 11308423 14200253
2228 14200253 9410714 6533590 16752437 13321701 -2863913 -9298405 2072546 19867512
2220 19867512 13018106 12747049 15069590 -2643019 -7471740 9359354 35159301 24766331
2212 24766331 -312695 -898973 -229223 5288195 6686647 2877076 -3744409 -9591755 -1828802
2203 -1828802 2548213 2622916 -578610 -9064587 -2239303 17759275 20454835 4709343 -5068676
2194 -5068676 4264239 12117253 9260741 10692934 3101099 -4981852 213058 12606073 18878799
2185 18878799 8339685 886717 1372307 15081609 30472352 26376269 14264749 9834361
2177 9834361 14517069 12273215 14950196 22616400 18375971 7884984 4488660 12657932 10620999
2168 10620999 8287943 15102884 19172610 18717786 10183757 8289072 15436490 21266154 18469000
2159 18469000 7297407 7465136 14892743 13179958 14896698 18816898 11003829 -44947 2653835
2150 2653835 24382523 27483989 12086367 9320068 8862591 12322191 9318418 10957734 18085225
2141 18085225 12344070 15019966 13080031 9779659 6153315 -1551514 10710677 20990155 20405272
2132 20405272 5144334 -15942109 -13088965 -4455758 873195 1605101 -5364982 -7351881 -13472230
2123 -13472230 -11125312 8591624 14586323 10794141 8155968 19125579 30310841 17715141
2115 17715141 20061460 26791922 19606791 10087988 4455805 15744370 12224593 5099230 3549060
2106 3549060 -9034641 -10557803 -5861622 7291180 20450309 17665783 5141074 -10477032
2098 -10477032 -695364 23600623 22747306 13720373 14004664 9478694 -1554891 -5120807 10086443
2089 10086443 8717809 -7257030 2586276 11176407 3058250 -15265397 -17322636 113786
2081 113786 4871148 8834660 2967078 -7255543 -8091842 -5805347 7104710 14864077 11142524
2072 11142524 532287 -3684082 10421575 19346361 7609495 -2207786 -1376207 2180071 3485836
2063 3485836 246761 6876722 2443066 -9216094 -8298125 197282 14523885 8533237 6920353
2054 6920353 15456254 7569635 -2654576 -3902499 14520891 20011053 2681536 -5765844 -6339629
2045 -6339629 -3835306 607657 2552549 6254429 5915447 161577 7374196 17782483 24365026
2036 24365026 8552099 -7491558 16698118 26010788 11195646 -5454041 -3831956 3045083
2028 3045083 -13101115 -1597311 11159904 -3791982 -14012242 -3635248 21399420 17483918
2020 17483918 -2557477 -1872095 9941979 23396372 22054413 5102136 4538441 -1906650 -10549138
2011 -10549138 5143353 18281115 14812377 -17628935 -13646660 17419559 4933708 -1015266
2003 -1015266 5690794 17688338 11062670 -2063476 12238387 3614033 -1818272 11180715
1995 11180715 13382905 11970850 1619993 -5009954 4073901 13866239 21556324 4141447
1987 4141447 -8797692 16557187 15267709 7272522 4680143 -3804052 -3067532 -6884274 19285461
1978 19285461 13684319 -18514032 -14114260 -10669738 6709367 14893209 5997212 -8204160
1970 -8204160 -20564595 6619487 19328709 151570 974502 -459297 -5383026 3930238 11457848
1961 11457848 15856729 -10912698 -14601305 14054260 13079197 12914366 -9474969 -9608418 16468056
1952 16468056 12605555 12553883 2321757 8495930 5073757 -4279450 38164302 45048750 2618348
1943 2618348 -13641056 10408891 32453248 15802866 15234264 35819209 3463176 -20118483
1935 -20118483 -5718703 10716454 29932041 16434881 11299460 1542631 -9338828 1225434
1927 1225434 -3540693 38147096 54457385 -127109 -25929431 355197 27977558 -2524771
1919 -2524771 -3534565 42564601 11167000 -36679809 -3125943 26999148 -1102972 -22195275
1911 -22195275 21755496 43788862 -9076093 -15835761 -1907801 1406371 22839159 26037455
1903 26037455 19828924 -7730380 -7105899 6762134 11529683 54762122 40330910 -22816758
1895 -22816758 -16682562 40453159 46663824 1287483 11314394 37897561 -10802296 -15684936
1887 -15684936 53387207 49052275 -5111781 -7115382 46678441 44353298 7585037 36469383
1879 36469383 33852267 12967996 22551799 28473245 18417951 -5162913 1668429 -5993870
1871 -5993870 -13552332 17233580 2434303 -34477019 -12834996 16483892 -2513755 -16112093
1863 -16112093 23769185 33034060 -27173279 -17339267 28035835 4099047 -16729040 1928574
1855 1928574 14438081 -32030201 -38493065 12926308 5116064 -9546758 2232175 6473842
1847 6473842 -4493837 -1442703 19087071 7577696 1710554 25959924 19688457 -4181079
1839 -4181079 -1785002 -7093867 -9818241 19574948 53442271 33454828 -17342354 -6840503
1831 -6840503 13124678 23601171 58311544 65501218 22085261 -23654478 -2255158 30796139
1823 30796139 23449720 26244341 31892438 9387814 -4981363 13281929 26393637 17365758
1815 17365758 11750333 33557220 40509552 23818067 9554984 -7371372 969390 8127408
1807 8127408 9035213 17976626 10085654 -7178888 -25318499 -7919592 19200613 8161998 7694006
1798 7694006 25451866 20430693 -734068 -7209229 9886343 14374626 2528916 13915793
1790 13915793 17514825 10879028 4031939 -5251106 15543468 27891032 28964847 32651655 36049173
1781 36049173 33785810 -6356915 -9761869 29218766 29624199 5468553 -8706527 -7154101
1773 -7154101 -20989919 -25567892 16115354 29485084 2208594 -4555632 8865330 28269200
1765 28269200 33266198 29725839 23147832 7806036 13205113 11362287 4570030 14022590 2521861
1756 2521861 -11592196 -6691642 12335298 13944508 -265355 19343533 33775560 21109495
1748 21109495 17635392 22653814 22709693 15762080 14515617 11435863 1124044 3229429 3347329
1739 3347329 -5504800 422513 7609292 2439260 8868740 28326328 25661706 2358033 5764003
1730 5764003 28396287 26288406 13419844 9345975 3674353 1725023 14024868 22676698
1722 22676698 12593939 1081278 -106676 9671441 31176816 42988851 14118381 -17710747
1714 -17710747 -5053659 11897625 6174132 -2730222 -2646620 -12156090 -26114531 -4756482
1706 -4756482 14403650 5830062 -2193810 6846578 30491729 35455662 22330732 9755853
1698 9755853 11157536 21359385 15823122 8943521 15310799 8739400 -7124643 1526955 22791721
1689 22791721 26720028 15990446 27145791 44912415 35290511 24779998 19514103 28176731
1681 28176731 35706430 22534910 8574831 8490833 23280522 17492246 11752194 30503894 35079054
1672 35079054 25552870 48015013 87589187 70138261 25029429 22058611 52939467 60741866
1664 60741866 45970779 29862839 -2281532 -16903573 -3725859 20408898 31380745 15419126
1656 15419126 -6542319 -6815559 35947035 62665349 37789882 16431680 32028524 36966165
1648 36966165 24402918 29797959 28337465 7631827 -8392441 15849952 30106119 16564194
1640 16564194 14242308 10581178 29779513 43033082 34156886 23622149 33567998 55695273
1632 55695273 28562704 7701174 28644900 33936882 21256987 34854924 49950235 21895686
1624 21895686 -4459850 22940366 58444280 44927058 30124408 8793296 -4404761 13064239
1616 13064239 11107945 -3324161 -14160057 11925322 12745484 -11909666 16829465 24911054
1608 24911054 -2279504 8092894 71779156 78569083 2452292 -26031371 11172230 24513162
1600 24513162 4415301 -209116 -8893732 -23353003 -27279004 11916872 60547440 46495001
1592 46495001 12223124 14220206 84226135 117034524 74430979 51742594 42314405 10878253
1584 10878253 -22586286 4918571 35562981 5656707 -41770012 -55373817 -45484014 -27486515
1576 -27486515 18585774 53804584 86082897 64682384 -5995238 -8900791 62699009 119069756
1568 119069756 59229089 10221947 22539439 -12817594 -20088313 48101290 79127114 15477183
1560 15477183 -10691685 76220630 130118916 94594969 85688435 56316521 27473510 78577433
1552 78577433 98960514 64346723 -8945746 -6009794 9449263 -29118921 46338729 78358811
1544 78358811 48307055 69660844 131009115 179846412 89375351 58763254 145434483 176159768
1536 176159768 163648731 71123776 1259184 -3340500 -58166323 -16161667 74162608 76257010
1528 76257010 -6376481 -91247774 63380818 143066480 72569111 158790940 226378023 220191450
1520 220191450 91919805 62498643 177434407 147927382 171837073 139484671 58494126
1513 58494126 79089622 29893761 99920354 246231989 256427208 83122237 -48654758
1506 -48654758 311197232 546720691 261678702 160909808 240773967 225336588 234014936
1499 234014936 615268089 897878894 121735611 -411073227 -96174777 193052651 245096357
1492 245096357 175005728 159425514 -125787984 -348175239 -45031043 89572002 81936749
1485 81936749 116444874 58704848 114763807 175170324 166226070 39051814 291400114
1478 291400114 1064148566 1124862217 644555786 510611682 447143668 413891037 802787286
1471 802787286 1621690723 1310724514 -386951894 -886945223 -574411216 -366461082 -237294659
1464 -237294659 -105302440 -269093781 -944556546 -1022355431 -469952252 -265760006 -202777209
1457 -202777209 -166955732 -146408881 -105724589 -138098614 -169557645 -290754348 -50164865
1450 -50164865 333299504 152622079 -13018621 -77493514 -304171502 -364493488 54589842
1443 54589842 608547762 136461682 -573480223 -439242100 -304517133 -301307214 -211058394
1436 -211058394 -41288176 -187461484 -530702471 -327917978 -69069800 -154314605 -255554598
1429 -255554598 -291911574 -185970183 -129134777 -120096608 -80873012 -158790051 -148395748 -182309884
1421 -182309884 -226948839 -78894221 -95424787 -190123567 -228280320 -184217377 -148308402
1414 -148308402 -264900657 -144531584 21762313 -25281620 -84388701 -113293171 -32058069
1407 -32058069 -6558567 -23219371 21849444 -41869621 -124193194 -170113743 -160918316 -85746015
1399 -85746015 -146891911 -217971204 -166342454 -111503703 -79738813 -113553109 -77497950 -22913300
1391 -22913300 -36201159 32451632 33357737 -33026373 -70748639 -65064830 -19111044 -43597571
1383 -43597571 -64958865 -109852608 -168230771 -96826025 -9785189 -25182367 -72100604 -60522104
1375 -60522104 -13409932 -3072121 12131321 38341984 -28252073 -85957827 -59432951 -25700658
1367 -25700658 -23233316 -76459023 -103356319 -99995677 -76391990 -40720454 -38224019 -7026768
1359 -7026768 15175668 -12643251 -34495556 -13348610 6455289 -8498008 -9886697 -2459994
1351 -2459994 -42150075 -102112437 -84908944 -32340217 -7771590 -19699311 -44210947 -23048564
1343 -23048564 5366083 20467262 13473367 6351320 4156114 -24405087 -16712679 12009621
1335 12009621 -23750578 -102397538 -112598202 -57647748 -33473399 -46689687 -47778122 -47139413
1327 -47139413 -61303539 -33021344 1302391 5237248 -2988161 -12866838 -9695542 -14787545
1319 -14787545 -15835272 -41473103 -66199913 -31990073 -4741761 -23460643 -49591649 -42384629
1311 -42384629 -32199170 -32281217 -12630081 3498564 -17752967 -41231943 -37349482 -32688594 -32176156
1302 -32176156 -46857504 -56330546 -43710284 -28688207 -32379816 -52631559 -31410162 -5073639
1294 -5073639 -13790908 -15951937 -2034954 -646527 -19392079 -10773340 4927359 -16693282
1286 -16693282 -44418258 -39267960 -15575694 -7653155 -20630192 -44919239 -46432966 -24897707
1278 -24897707 -13223178 -17093522 -19776577 -26428174 -51332963 -48318279 -14683445 -13512935
1270 -13512935 -46646799 -53062632 -27633785 -18842471 -23914781 -22105651 -14506094 -14249176 -12769651
1261 -12769651 -10862068 -13331084 -11265812 -23573086 -30577459 -18577478 -19997269 -41657591
1253 -41657591 -47953753 -15359678 -7292739 -34701828 -32692741 -14287689 -8845325 -5968538
1245 -5968538 734144 -10997131 -37824192 -35305619 -17085716 -15171974 -15940100 -31925914
1237 -31925914 -56319547 -45306388 -17357983 -15927750 -33174105 -20853496 -975226 -20212800
1229 -20212800 -26449828 -15938001 -31306734 -48158069 -34467367 -13263938 -35382796 -64005705
1221 -64005705 -60358867 -50380948 -33856497 -16615180 -14517063 -20238790 -15823950 -7525959 -6183813
1212 -6183813 -2204875 3770529 -5068350 -15736671 -5322600 -8088480 -26867777 -35994492 -30710890
1203 -30710890 -15892996 -16693416 -17327631 -11169264 -7845038 -14234875 -33229130 -26808645 -4438946
1194 -4438946 -5557848 -12562344 -8415456 -23602915 -52541269 -49257406 -3395447 17678853
1186 17678853 -8774775 -18374715 -25308879 -24535938 -7843235 1079913 2320677 -21705550
1178 -21705550 -31896194 -35303638 -31086066 -9569917 -29740655 -50821005 -30751005 -7753468
1170 -7753468 -13262215 -21551100 559085 4631735 -25178923 -14907304 6984805 -14140149
1162 -14140149 -26257179 -20829010 -11002005 -31399459 -53512037 -37331568 -31130192 -9346776
1154 -9346776 -1754798 -10031476 -1804673 -15586001 -21506468 -3557409 22139282 15588860
1146 15588860 -21367998 -23970705 -24658027 -60347481 -47832350 -5317004 -15500161 -39570425
1138 -39570425 -46000743 -31155532 -42986574 -29386653 26635280 -2279863 -35735548 -35008361
1130 -35008361 -31891289 -22048811 -22240741 -8533481 -40208676 -66279681 -26787350 -15836474
1122 -15836474 -8901894 7649614 -18348049 -26974140 -1750364 38475946 33997452 -13994417
1114 -13994417 10343077 -12734252 -41557690 17526817 28165664 -1576210 -60957052 -35191915
1106 -35191915 11731084 -27411199 11745461 28095757 -5507249 -24099725 -33133533 14661626
1098 14661626 -136402 -29025914 -3284572 -17839702 -17916288 -56498773 -84663883 -20622011
1090 -20622011 -21333665 -1025564 14316247 -21640802 -49815683 -104300590 156067 83308015
1082 83308015 42273118 25822937 -54426944 -67012322 -38975218 22975263 103624072 32798445
1074 32798445 -13419158 -52896028 -79411818 10461547 26283543 9457971 -4049977 -31911973
1066 -31911973 -37440651 -108783615 -60939327 16632451 -26047205 30245295 45618843 -532478
1058 -532478 -50021125 -20750355 136802228 127283432 117730587 122873576 9835240 -5835703
1050 -5835703 43138189 118470082 90828053 853450 12236951 -54468616 -82062813 -4934594
1042 -4934594 -7744181 -17401479 -23881953 1220664 -4893249 -86481463 -33118955 3210221
1034 3210221 14430868 66980139 10077541 -37480489 -83093249 -45218406 44469994 41150891
1026 41150891 54584837 -24630217 -88635226 -22208852 23731749 44027834 10009822 -11581456
1018 -11581456 -14481950 -58650777 -22643970 7737460 -35276564 -37259240 -29336099 7472849
1010 7472849 -3922514 -62053011 -33245611 -5235319 36230996 28340047 -11856450 1851052
1002 1851052 -46858658 -46428274 22600676 47621304 -7410717 -84624170 -38120673 10652300
994 10652300 -15581857 5817000 29806672 -4434043 -26819321 4143731 51156145 22382033
986 22382033 -14368089 254482 -15762250 -3289277 -681543 -25029893 -21878875 -26175207
978 -26175207 -24666176 -37332594 -3342338 30601944 -19323453 -28703312 7381681 -1498226
970 -1498226 -30269637 -3898283 30058800 -13901239 -63453394 -27901913 -9717681 -33005024
962 -33005024 -12257519 952943 -9452408 -29515918 -12956898 10203018 -9736047 -2646225
954 -2646225 -7841722 -18347312 -15061743 -29682998 -43850062 -49795808 -36142446 -30579771 -37434714
945 -37434714 -29142389 -26298942 -36886276 -14039179 6823004 -868434 -2013790 -4452917 3095227
936 3095227 -4650143 110637 1445 -34868414 -28633678 -14503830 -8408152 -8101115 -13452944
927 -13452944 -17159172 -34701757 -22380794 6259577 11195474 3851360 -13477598 -40011532 -40052517
918 -40052517 -24075461 -12699432 -10870743 -23785669 -34498765 -59424624 -39785981 5179812
910 5179812 2019092 -10885370 -20565761 -14481967 -19834286 -17142094 7767348 -9257772 -38762242
901 -38762242 -41712078 -26373000 -17692587 -25267784 -30277399 -24455949 -21125677 -12392817 -3378112
892 -3378112 -303799 8405609 -2179214 1494241 11285906 445593 -9536279 -15623535 3737454
883 3737454 3627732 -13722406 -17802885 -23972198 -14248868 -1248063 6918734 6003644 -6334928
874 -6334928 -15045037 -12752946 2230160 16238675 1789217 -16773547 -8464883 -8940375 -11123015
865 -11123015 -3129577 9441720 5145872 -15128342 -2618959 3751132 -1684231 3790855 4100962
856 4100962 -5091489 -23628391 -22378847 -15082267 -14937031 -7667566 -14468894 -31880874 -27632652
847 -27632652 -7801135 1716848 1844038 2634127 1252893 -12445262 -4813659 11883264 172858
838 172858 -12984026 -17237555 -11761149 -14823660 -18664421 -14639229 -23979928 -19368115 -5426370
829 -5426370 817610 555085 -3381043 -1190698 -1443102 4101887 12129914 4779769 -4614076
820 -4614076 -5867235 -6255808 -7958922 -13727543 -14347757 -9971745 -8342934 -6586524 -11819597
811 -11819597 -9901426 -7476518 -11231775 -2970101 2816305 311320 -10737226 -10643369 129405
802 129405 -7020435 -11102816 -6369328 -1582432 -1739642 -7692801 -4766433 -4288965 -6047473 -3650503
792 -3650503 -1972828 5618530 3209199 -7167192 -2556974 5696172 3220937 -8249429 -1749516
783 -1749516 16377781 6175687 -6893295 -5055887 -7633853 -16213253 -16182634 2688316 -1172935
774 -1172935 -28794926 -35039156 -26204858 -13176029 -8770984 -7084094 -1584995 -9191953 -10248281
765 -10248281 -609744 13319235 21793018 8506133 2982494 9016865 6910653 -566014 -5020531
756 -5020531 1566142 -2270326 -15725050 -10300083 -4973180 -10624458 -12785074 -7092276 4051072
747 4051072 -361075 -4471359 1595110 373079 2936828 670662 274017 2088215 -6788733
738 -6788733 -8252692 -6840233 -3343932 -6251913 -16562195 -9696661 -2869572 -6416125 -4870044
729 -4870044 -2912203 -5584937 -9375942 -34542 17400139 7617902 -4371424 -1190439 -2857950
720 -2857950 1937708 8879789 16160107 1521345 -19520860 -9595554 -5491028 -4741572 -931863
711 -931863 -3708514 -10726434 -19809772 -11395284 -7476643 -11748313 -70450 2941861 -6035610
702 -6035610 -5305246 -4656118 -10341421 -12462555 7464130 18622468 -8116704 -11502827 962731
693 962731 -3612260 -4508365 12141060 29300348 3227984 -8954572 12712564 12336458 3433751
684 3433751 5443040 14669753 2956348 -12890861 -7241620 -8726552 -13034075 -9401352 -13339702
675 -13339702 -16343819 -7098704 -4161755 -14603211 -17431692 -596232 -4046558 -14910630
667 -14910630 11021728 20715105 -11190574 -35819167 -9092578 16362176 1361688 3958552
659 3958552 11943626 -6726443 -28000690 -5222085 31728101 22001648 -695194 -2914188
651 -2914188 8727603 7223063 -4341837 -5946863 1446156 10269995 6438592 734948 -3507926
642 -3507926 -18216521 -30948943 -4781392 38409127 30591612 -22665297 -44511600 -13613196
634 -13613196 5242854 7295866 12718955 6893686 -23518027 -38994913 5029368 33791030
626 33791030 11267743 -16537424 -4200092 27736400 19876682 4834365 2018370 2765462
618 2765462 841393 949038 17080961 10915213 -22217074 -34215877 -4607239 23052567
610 23052567 4481967 -24763907 -9692679 13763349 8448243 2439407 5283215 2377443
602 2377443 -19058878 -8185307 25875621 12047225 -26345536 -45316778 -20410103 1098367
594 1098367 -4049771 -6635388 -14435109 -18057795 -23343171 -17509702 7371069 16650515 12257
585 12257 -13709460 -1244199 4892828 -16187803 -16588266 19613531 20749093 -12431393 -21660183
576 -21660183 -7029864 -6737072 -19699684 385492 6946981 -21024796 -35162095 -28434796
568 -28434796 -16152276 -21552714 -22531108 -19434712 -18315983 -9984482 -15910061 -21325136 -4325712
559 -4325712 14066815 7274999 1285003 12722075 10172216 -9588835 275256 24355648
551 24355648 4440050 -18170667 -8382404 9460976 2166013 -9515327 465998 -3740445
543 -3740445 -1971600 11937637 18267373 13052185 -551195 -1749080 179831 10549886 13130143
534 13130143 -7098453 -17070599 -8454663 -5454863 -13833433 -14822173 -11496600 -14699978 -15762390
525 -15762390 -2568043 -1362319 -10799127 -11309717 -11202182 -2096514 271228 -1504365 -6705337
516 -6705337 -4979501 6711892 -7380932 -11898997 -432674 5460574 3417110 2832416 10667499
507 10667499 -5658131 -17600978 -3299302 6626052 4136796 -2530086 -8126722 -14880255 -16147449
498 -16147449 -10915371 -13035957 -15078284 -3824831 -12392189 -27358822 -21237226 -16409652 -21216403
489 -21216403 -25683877 -3548689 -2546373 -25272107 -15280600 634303 4453364 -4439852 4235125
480 4235125 17188704 8634128 11944636 13618794 7525047 954271 -2594977 1753932 4173362
471 4173362 -76732 -12150176 -21877113 -12131851 -1760166 -9772800 -6608429 -577553 -2114581
462 -2114581 -7006615 -6538570 5804095 -2979441 -7153130 -3926288 -7313178 -11119051 -23144757
453 -23144757 -15991910 -4118269 -1753706 -8876272 -17069477 -7213905 849968 5799841 17852249
444 17852249 22369640 7029763 -2702292 5068259 16386678 14053426 8255285 11965752 1700156
435 1700156 -2733989 -5023226 -8540417 -1752160 1817826 6603783 -4142281 -10187430 -12183349
426 -12183349 -23481884 -15798148 -2024345 -2958447 -16808281 -19612144 -11874445 -15486196 -20496180
417 -20496180 -9876883 -4832617 -6386667 643701 -1563753 -7519834 -20096447 -19392622 -10237027
408 -10237027 -7827150 2957127 -8728336 -16769841 -15468720 -16006518 -9364579 -5999800 11888064
399 11888064 16348200 10218214 10579061 949803 -3863970 1951355 14368108 22830038 16290160
390 16290160 4616773 -7229782 -14735305 -717770 7129683 9313871 17744041 13099895 7830329
381 7830329 -5801993 -1413968 6056673 2513100 16860194 13801185 6199354 -7101102 -13595440
372 -13595440 -2954937 108007 13060150 10954453 5797897 10904409 3803743 -3483808 -4554438
363 -4554438 3113352 3467741 -6775584 -2443385 -4545932 -26483690 -28557425 -16225157 -4680920
354 -4680920 -7230048 -8539509 8912034 3522464 2416364 3483552 4479848 13739990 7089097
345 7089097 15075544 10333417 -2776605 -16103099 -28882366 -8310616 -1801038 -9838447 -15427055
336 -15427055 -16114220 -10707299 -16625800 -8176063 5497349 -4597910 -12324302 -8159186 -3827559
327 -3827559 -7143181 -22269966 -16980381 -12655979 -18963301 -17381345 -21981336 -8966727 -8057146
318 -8057146 -10598837 -2689859 -9665427 -8186443 -12751825 304383 12510632 -3169540 -10611391
309 -10611391 -15316978 -10128617 -5978275 -2755739 8022857 7417914 5099867 8492950 7693487
300 7693487 9242245 12207882 14987876 23986840 19994185 11573767 -2016898 -9974273 130043
291 130043 -2065289 -224522 -1145134 -4086984 -4553774 -10637565 -8021122 -14064016 -14395370 -3146182
281 -3146182 4384094 1510778 -12404119 -26948813 -33994896 -22605303 -4562256 4387778
273 4387778 -7253624 -15286738 -14955070 -17095144 -6235427 2832883 9270157 4061626 362213
264 362213 4614054 -10153927 -19666641 -15420990 -4628323 1710849 -2807770 -7982032 -16008731
255 -16008731 -18391334 -2180664 9358517 6354379 6686334 3802055 7335294 8867231 10036936
246 10036936 6634341 -13678028 -4089300 8385557 6675025 1259543 -8562515 -5786802 -15025145
237 -15025145 -6753501 10035696 1239130 -2105919 -668350 1218442 -6980318 -17783797 -12515057
228 -12515057 -11916926 -5144638 10428231 -2802253 -22639541 -26196962 -16369340 -1587952 4691748
219 4691748 20018064 6012644 -22515296 -13918627 -2432737 1990893 -3934655 4023083 8666564
210 8666564 -14264162 -14836185 -9388339 -11621343 -10677361 -582765 12595121 1447501 -14302058
201 -14302058 -19700899 -20248354 -8823531 2535112 -769558 -9369674 -20310038 -27759624 -26429775
192 -26429775 -13320420 2586979 -8011501 -18062494 -11848349 -8687504 -11025837 -10426982
184 -10426982 2481370 675531 -8002535 -1269601 7178466 1668393 -9042796 -1507715 9548791
175 9548791 12059732 8519534 10050596 10550277 2493370 5877806 13574580 19032983 12395205
166 12395205 6381777 13295113 10953444 7195348 5994713 8990012 12635573 9881466 9837349
157 9837349 3749434 -7674403 -8602340 -5311083 -3398009 -4097780 -13519126 -18872614 -22305184
148 -22305184 -17097215 -7214452 -9814849 -1441512 1844582 2806950 7280207 5118972 10806943
139 10806943 7715170 14400562 18000711 474792 -7993235 -14150312 -14514096 -14875863 -16503605
130 -16503605 -17563496 -32977319 -35216591 -17021809 -11443958 -16679983 -19703529 -14627837 -5529574
121 -5529574 -4714170 4610450 908148 -17068349 -16104518 -9623165 1800714 -5941882 -20936011
112 -20936011 -21366600 -21802718 -10197013 -9880828 -14134027 -12560008 -15911471 -9256058 -162574
103 -162574 2834492 -6044090 -16388595 -5698231 8598838 1741716 -5061516 -7385490 -8581146
94 -8581146 -6757910 -9402008 -4505710 -14835912 -22795438 -15480797 -14949780 -12172780 -25838550
85 -25838550 -33089218 -24026953 -12452210 -1052121 -8089267 -8180772 -1685504 -1993928 8378521
76 8378521 24672897 28108417 20476988 15489829 23445570 19047100 1779831 8152232 10012776
67 10012776 7708886 1058848 -11916477 -17179037 -28762021 -12932458 -47331 -2446467 460115
58 460115 -11636124 -13052317 -5626665 11591458 19210195 6069050 10761497 13869095 1708184
49 1708184 -364494 6645075 7998733 1490073 518357 9991236 -4941528 -16051158 -4904300
40 -4904300 -1185805 8075309 6204963 7330884 2018485 -4361343 10991681 8128159 14041789
31 14041789 18358230 8626975 80895 -5485510 3676497 -5406789 -13812189 -7771618 -15487811
22 -15487811 -30172607 -32106655 -24205280 -24567601 -32236415 -29009587 -20764885 -24221318 -16840035
13 -16840035 -11430032 -8905395 -3708742 -2575231 8708113 9123973 14277013 11098136 5261543
4 5261543 17504673 18008487 14865617 3734891 2960899 2674626 -4738598 -507422 -4329877 -13856399
-6 -13856399 -25192433 -23625335 -16305248 -14799070 -16562492 -19191030 -16668295 -12490407 -7179191
-15 -7179191 -5563368 2233775 3265333 1101837 1391036 1468342 104020 -13940737 -12564147 -12709056
-25 -12709056 -15735202 -19478006 -26180264 -22951080 -29867517 -26005757 -21626834 -13986130 -3384237
-34 -3384237 -6887929 -7886041 -12810197 -14210139 -18229051 -18221710 -14876292 -26454676 -48020057
-43 -48020057 -63754441 -70521380 -79228281 -79165331 -78659038 -76189513 -81330315 -84880549 -81305322
-52 -81305322 -81194712 -60254419 -43261441 -26367969 -14268192 -13937421 -15054679 -19350815 4819421
-61 4819421 26757412 31639014 29361058 20128282 7321212 -4989342 1117210 8641123 3028627
-70 3028627 -12861382 -25334125 -43239609 -54373589 -52615847 -52453426 -42967384 -41122915 -38027698
-79 -38027698 -43481705 -37377947 -10936377 -730330 16402542 32402113 42708215 40707132
-87 40707132 41841684 60267961 60432003 51426565 50505888 51294239 40796573 30853109 26280340
-96 26280340 25391193 19913719 16011019 18706115 10619360 14599570 12858226 15056506 22848427
-105 22848427 14388644 7319051 -5703058 4366194 11439737 1174998 -802238 -9124922
-113 -9124922 -15313325 -19158000 -7853930 7361577 4164787 -1452428 3596638 7497369 9897562
-122 9897562 12528025 13555713 21517315 16162356 16198761 13887203 6658149 6656125 -2690849 9871112
-132 9871112 15955367 12380099 9851178 2025036 7939132 5037965 9424433 17213146 13506381
-141 13506381 8772401 1078716 -3312108 -3180113 -4848610 -6031874 -4044355 -6051801 -2847429
-150 -2847429 -8281534 -7431530 269824 -5164760 1641957 3970241 10007494 6061358 -6198382
-159 -6198382 -2420174 -10115847 -8874785 -6619895 -9493131 -12310867 -20276550 -17317322 -13817669
-168 -13817669 -11733082 -6566675 -8369789 -11416768 -2627069 178654 320633 -4813015 -11722583
-177 -11722583 -13289112 -26136335 -19406412 -16688814 -24352524 -28144356 -38951113 -35593007 -41281865
-186 -41281865 -35856267 -19563921 -16768275 -12344512 -18576222 -21762531 -19962775 -16437577 -2238503
-195 -2238503 4454406 839373 -4067868 -17001297 -19926258 -14364392 -9934141 451988 -4621017
-204 -4621017 -4788608 -11758476 -24123394 -16455746 -14534795 -3457492 -4257207 -8435810 -7499465
-213 -7499465 -20979534 -14686917 -6984709 -1349890 1794349 -2266228 5442848 5533332 5050016
-222 5050016 9395264 1990548 -2397750 -2370567 -620751 3260624 -8125450 -14780642 -23552868
-231 -23552868 -32552572 -21036994 -16227708 -5431539 -3498474 -5997592 -1900434 -9853329
-239 -9853329 2249038 11853730 19332231 27077659 17722681 10952701 -5943567 -11269214 -3818565
-248 -3818565 -3886805 102803 -5190669 -15148635 -23487924 -30095163 -18676970 -10122450 -7035513
-257 -7035513 1488070 -3592985 -9499887 -19276001 -18337152 -5533394 -9043434 -3153461 -5210164
-266 -5210164 -13789024 -18737958 -22130541 -5685489 -2894470 420749 7779761 4052602 6587124
-275 6587124 3834093 8003478 12491707 10926441 14490679 5611831 -208736 -89464 -8093160
-284 -8093160 -8711423 -8297766 -9528842 -17296052 -26651434 -14356074 -13946180 -20434474 -16044525
-293 -16044525 -15295003 -13373801 -17620735 -4264583 8138775 1220163 5971528 8030952 11597634
-302 11597634 13022707 15613166 26604303 23364564 20611843 13817805 4277810 8519799 9401140
-311 9401140 10456318 10061236 4453713 -1352626 -10789297 -1552603 11103344 6937922 5868087
-320 5868087 1588493 -1630492 -6312070 -7490553 376776 -7792445 -12965932 -17753169 -26578878
-329 -26578878 -23986325 -22020059 -14286917 -11058763 -7182578 -1634177 -8276895 2872585 21079852
-338 21079852 27243970 27822132 26592316 29430804 21674211 20447934 32609532 28261870 20424272
-347 20424272 16920934 13789933 10466194 5693714 11863520 11341993 10431716 16694501 5194074
-356 5194074 -3137590 1043756 8376548 8167003 2394188 9556861 -1872458 -15716968 -392963
-365 -392963 13289205 8645200 -5418266 -453938 4371559 -6309162 1210897 8721017 -297476
-374 -297476 -10438767 -9382677 -1631018 -6953791 -8188253 -3262476 -5156828 1231517 4001031
-383 4001031 -1963968 -3073310 2297447 8216732 14453 -451531 290629 -20134624 -27946733
-392 -27946733 -17751024 -10994408 -23578928 -30997554 -18353622 -22627567 -26191554 -11460950
-400 -11460950 2771142 3012489 -1319862 9924666 12269422 5285061 7528846 8754600 5564615
-409 5564615 -961314 -4957816 -8624706 -14528232 -14148262 -18818954 -23989659 -17485974 -14693822
-418 -14693822 -16108717 -19113840 -17678071 -19190545 -27217147 -17719664 -12831231 -19374224 -25870350
-427 -25870350 -28621491 -22976159 -27117863 -22040184 -16495348 -21058804 -18110572 -18431227 -14013397
-436 -14013397 -14466080 -15980138 -10838382 -14303963 -11270412 -11537265 -18429865 -16993548 -15895590
-445 -15895590 -9002398 -7323068 -12427700 -9981896 -16853201 -16159157 -12822803 -15423728 -12879711
-454 -12879711 -26831553 -32756049 -36864164 -42446041 -35110684 -35855132 -23546241 -20408009 -23757217
-463 -23757217 -12379035 -4197893 19005643 39055538 53761450 65579346 59630038 63225977
-471 63225977 67422484 71361049 82368147 75373267 64498393 48652102 29657514 20473589
-479 20473589 6044109 11017382 13228965 -530427 -7180748 -24362784 -28405050 -23555690
-487 -23555690 -5642342 19348520 16825454 17308374 13909701 15841804 39596821 62915590
-495 62915590 79861934 74687643 66615334 63942874 54936326 61968580 72042818 61912240
-503 61912240 43293052 24825659 14997625 2313378 -5283376 3723847 -2147150 -10361427
-511 -10361427 -14949648 -17967500 -13726449 -9491149 5159533 11430614 14253293 16282267 7235925
-520 7235925 6921770 15318243 23253311 20872394 19470573 19039469 6444409 -1838006 7478517
-529 7478517 18153952 12355569 8298309 11762792 10579338 4806005 5643458 11188742 9436778
-538 9436778 8584542 14411737 20461969 15909034 5028652 -2687265 2431956 13398897 15369052
-547 15369052 13490120 2099290 -11696926 -25122061 -23226548 -7577833 -8105935 -12507125
-555 -12507125 -19906411 -22667602 -23033955 -21259528 -4325665 7791588 16060777 17073304 12342242
-564 12342242 12948378 12486509 15479626 22906761 24571593 15209173 -2122359 -9721918 -5275905
-573 -5275905 -9203705 -8901505 -7971925 -13497586 -15581368 -13395151 -214257 -689145 -2288590
-582 -2288590 3015468 -808682 2270855 6279267 11320536 8000490 3713775 6701181 -1825634
-591 -1825634 -5737650 1867656 8128653 7151503 4301056 1177374 -7186545 -12640614 -4055574
-600 -4055574 2475249 -1011489 -2202785 -8779898 -13725281 -13364257 -6759664 -2591949 -3962640
-609 -3962640 5558470 5750590 170475 652268 3645304 2579322 -1985089 5157355 4362802
-618 4362802 -6204536 -10926155 -8910980 -11749231 -17941202 -14798589 -10436435 -7524204 -5249064
-627 -5249064 -2169782 -5523110 -8577698 -5452030 -2326985 3851376 5094441 2087331 -5892861
-636 -5892861 -9362244 -8728719 -13498596 -14038711 -10142978 -4971644 -6750260 -11112523 -15824813
-645 -15824813 -19860653 -18267601 -9573878 2031852 2963876 -3193240 -12703626 -10450859 -1088336
-654 -1088336 4971571 11669569 11874588 13550629 9213899 9824004 16062493 13823384 12949672
-663 12949672 10218397 12193293 11792050 6352658 4929733 2823107 2879286 2189496 -832416
-672 -832416 3689515 10330387 11208867 11779818 7117200 3599797 -4162075 -5582825 9488378
-681 9488378 11356769 7386466 -4887367 -13376773 -13477709 -15967892 1452030 15052190 18692795
-690 18692795 13882963 2618371 5445139 7599172 16924689 33457765 37204217 29530881
-698 29530881 11680213 816362 5373092 9174584 19162463 22048535 12824499 8268133 -1046234
-707 -1046234 2570259 8946087 13503749 19333431 11064717 15592496 13458008 2867057 3762340
-716 3762340 6887141 13114993 7669773 6860881 10584280 -678650 -3446181 4830462 5950550
-725 5950550 998901 -5051411 -4738091 -6934540 -11561350 -5169618 -11603924 -18978120 -16352648
-734 -16352648 -17405758 -13197655 -10901790 -4712770 -7596767 -14029718 -4358663 -4648861 -9732996
-743 -9732996 -6954607 -3530605 -4772524 -9137320 -8371722 -10682011 -20855401 -17690187 -7127809
-752 -7127809 -3250712 3922414 746190 -6249452 -9792656 -7343433 2711738 2073299 6128188
-761 6128188 1413926 -14983264 -17555744 -17775330 -17805679 -16976951 -10939958 -3920981 -8737649 -8723509
-771 -8723509 -5934575 -12320677 -4684193 9142488 12561096 10867505 3515055 -2534675 -17172140
-780 -17172140 -15948545 224356 -5828876 -8821595 -6489849 -8608036 -15695220 -14785669 3254873
-789 3254873 4739326 5029397 17558541 15598146 5658072 3401095 7544350 7936145 6640477
-798 6640477 13033637 6694689 -6500048 28093 1934792 -2747665 1819637 10893074 8896819
-807 8896819 -1046253 10845933 16651755 2432768 1316490 11109775 8157852 -3702908 2297017
-816 2297017 11346448 1245641 -7719580 -567281 765644 -4965106 1305500 8726191 5840753
-825 5840753 -5362038 -8380337 -5672674 -5768879 -1891924 -4453017 -11042254 -13565434 -15737738
-834 -15737738 -15346930 -12155294 -9249187 -11291751 -18507705 -12730907 -3714465 -10002576 -12275746
-843 -12275746 -10882776 -8201983 -13067794 -15710751 -1557611 -4924573 -12694688 -10585728 -5590506
-852 -5590506 -4889982 -14359098 -3808774 6453356 -1967171 -4809859 -3555583 -2764610 -9413097
-861 -9413097 -8984859 6400651 3855362 -4637808 -4023402 -4845841 -1728044 -2088357 7366580
-870 7366580 12652612 4101118 4556522 565870 4751544 8832229 5411677 5491658 -174562
-879 -174562 2290972 -880168 -2845537 3819904 -2316139 -8606880 -6858279 2274426 2560198
-888 2560198 -8520256 -7046690 -5092899 -10734386 -8546187 -2416309 -1866840 -14205162 -16450649
-897 -16450649 -3929444 -3673455 -3728512 -4743273 -2172498 -2444555 -5717833 5832665 5588993
-906 5588993 4241738 899154 -2962619 1255288 -5856857 -3389745 -3602078 -4241119 -1450631
-915 -1450631 -12463620 -13969122 -14815587 -13005359 -4772855 -4841872 1136242 -3430278 -13078755
-924 -13078755 -5919750 -3407418 6954919 10907013 9275549 15259488 1091922 1902278 3677006
-933 3677006 5808304 18241615 8011599 8110619 -2295823 -11113310 -5828062 -12293715 -1591156
-942 -1591156 -4911374 -13847956 -10800506 -15192402 -9517707 -15096724 -17795408 -3465640 -4427287
-951 -4427287 618523 -37279 -8607220 -7886340 -18267286 -5229308 4861662 -2609027 -5172589
-960 -5172589 -21502446 -15345208 -15118451 -19410845 -7606115 -10442047 -6088934 -11389445 -11268618
-969 -11268618 -2067124 -11293391 -8019849 2909855 10885545 10616691 -3897087 -5503859 -4132914
-978 -4132914 -10673926 -4121283 -490680 -1812480 -13601517 -27143498 -17986164 -19881094 -20767524
-987 -20767524 -14128173 -8431953 -5782207 -18540791 -15752745 -8265241 -5900857 578640 6467270
-996 6467270 7704222 -57140 -4230275 -2263557 2599821 3745312 5357603 1728996 -936564
-1005 -936564 601036 -7578862 -6534920 -1453276 1986543 -1587486 -5400660 -98908 -7277733
-1014 -7277733 -12192256 -2327182 3162536 -3640854 -5274827 368448 2055945 -3188882 507465
-1023 507465 6794049 -3647310 1871878 8050532 4600218 -1037865 -7212274 -1654548 -10403737
-1032 -10403737 -5323840 4126395 -5398679 -8142866 -9037950 -4826670 -5792264 -2838116 9120940
-1041 9120940 6383224 879831 3148440 -1057050 -1218753 4239254 6696779 7081114 -3242905
-1050 -3242905 -2106887 -3347760 -3556571 9742197 4952387 2827356 691439 5282866 10421405
-1059 10421405 3637510 7361568 861481 -6349843 -4322999 -517096 -167451 -8495753 -13760656
-1068 -13760656 -11977981 -9734126 -6802734 601356 2689533 6555750 3511687 1725890 6766057
-1077 6766057 4879840 9524868 10273374 11818662 4263895 -10072084 -10607631 -7890043 -1519468
-1086 -1519468 890034 882228 -5042920 -11515904 -10862997 -3366352 5494041 6443344 6529652 -2641459
-1096 -2641459 -6416169 -8810906 -9315114 -1673320 -817635 410062 -8498996 -13130736 -9660182
-1105 -9660182 -6248369 950250 4101643 3666266 -1445358 -4144860 -2655520 2676584 -557493
-1114 -557493 -2157966 -723680 -38167 4831116 -263539 3419377 3040033 4822425 16795167
-1123 16795167 19460964 21967415 12111074 7885314 10041423 8775480 11780850 7326376 -1777936
-1132 -1777936 -7440284 -10123858 -10948858 -9855872 -11632863 -6434842 -6760364 -3252147 5479390
-1141 5479390 -1634844 753330 517452 7028410 12015214 7055060 12065721 621777 -5001291
-1150 -5001291 -2644456 -1299848 4540965 1910264 2316621 1510796 -4368324 -1372654 2961710
-1159 2961710 4159038 9689161 4779559 5699753 4096506 -3422585 2386541 -2358034 3686487
-1168 3686487 3602257 954207 6135824 -6489062 -2938389 -231303 2054163 7639955 2877014
-1177 2877014 1862379 -7775904 -8185237 3510720 1049800 -3562464 -3825593 -11267012 -12041571
-1186 -12041571 -6965736 4372202 1853930 -15786752 -8216477 -9990032 -10354481 549436
-1194 549436 4553792 2310703 -15767452 -9091682 -4357343 -8645981 3893406 8512914 2786972
-1203 2786972 -7762483 -7404058 -6919135 -9667914 1665342 9707709 -3766611 -11185613 -7381223
-1212 -7381223 -12970743 -11488690 1054928 12937608 -175153 -6491822 5552495 -1030771
-1220 -1030771 -4128756 5189043 16363871 5409943 -4907786 1820960 -2468239 -7592396
-1228 -7592396 -4217627 5923896 -17362 -5640050 -1835044 710433 5165762 3992503 6719740
-1237 6719740 3449869 5075387 8814298 7063347 8931419 3562754 -2965032 -5374598 1944427
-1246 1944427 7718413 5625029 -786216 -1807629 -2644816 -3810530 4338998 7362418 11420881
-1255 11420881 -846231 -7113043 -422687 -3381544 515537 492860 10660456 4891579 -8608228
-1264 -8608228 1485678 4608005 5295805 7612717 16724415 14322458 -2472676 -3323663 1862009
-1273 1862009 -3308368 552285 9550339 2236872 -7743987 -12686910 -2903930 -1859821 5183389
-1282 5183389 21522056 9861984 4450033 2755884 7734994 7958552 5563857 16326747
-1290 16326747 5662363 -545695 767056 -1333417 -3979648 -2723982 6874772 9164235 9259583
-1299 9259583 9678189 4209945 -5036891 1195464 4118110 -580746 -3818656 -9303380 -13839849
-1308 -13839849 -28014387 -23588127 -18193819 -20144593 -14400757 -6640596 3387544 -5449034
-1316 -5449034 -7310642 1229065 9556753 11880861 10272832 12565143 -817921 -14701495 -18992744
-1325 -18992744 -10334756 -14300709 -25213989 -19974454 -16329591 -16820544 -22440737 -14233179 -8950212
-1334 -8950212 -8632085 1641425 9570753 7506093 -5367620 -9653252 -10809849 -6292046 -5891728
-1343 -5891728 -10149552 -15603108 -20004831 -17022337 -25264488 -19495559 -15871899 -17772805 -14151749
-1352 -14151749 -9562465 -2975263 -21988355 -28032697 -19780920 -16579522 -12164995 -10038981 -10039612
-1361 -10039612 -24740794 -30507487 -18380599 -7635514 -7309496 -3684301 -6065260 -13950361
-1369 -13950361 -16219268 -16670273 -8717607 -14654765 -10345607 -6916524 -12528685 -10333727 -17039369
-1378 -17039369 -5547442 1376933 9449922 20869944 18807217 17342227 6226108 9754345
-1386 9754345 20851070 20101694 13735227 7366778 -2545438 -13608532 -15151406 -4531952 2439795
-1395 2439795 -9993753 -7442440 -3990627 -1619850 1878304 1686385 13078914 4250623 2475086
-1404 2475086 2444602 -1982783 -3545528 -18676821 -16621530 -13725887 -14718910 -19999118 -22127796
-1413 -22127796 -10683521 -7864461 -8546583 -194821 8431569 2892177 4027204 15849942 25048872
-1422 25048872 10297107 -5515578 719754 -2294277 -1706478 -1823616 2668436 -7309129 -27862788
-1431 -27862788 -19491666 -9501303 -985086 -2243017 1443116 4267682 -7959820 -8896929 -2789951
-1440 -2789951 6843208 7562013 8172698 6162499 -3456173 -11732482 -11330457 -957056 4656981
-1449 4656981 7500345 -1591988 -6679164 -6801052 -4534129 1573260 5411804 13163580 4594941
-1458 4594941 3702684 10552372 12084296 7620121 5326868 17114337 10826504 6714526 10554762
-1467 10554762 8427544 -4133324 -11606108 -686053 -6196184 -14174553 -10926549 -7356911
-1475 -7356911 -16842701 -22942997 -14428382 -15618687 -18641306 -12662077 -2836060 -10686779 -18596115
-1484 -18596115 -19637898 -22763690 -20527717 -17559316 -12862229 -24150502 -30927555 -32787762 -34230905
-1493 -34230905 -23309959 -17423314 -16169602 -23934037 -18528125 -9197315 -8065469 -673553 4341644
-1502 4341644 2741037 -4006724 4495097 12305012 6756881 237310 2168023 4055212 -4113142
-1511 -4113142 -2743201 -2805461 -6790374 -10449454 -4200656 1691478 -11244882 -18753767 -18666592
-1520 -18666592 -12079415 -7778897 -2806827 -3478661 -19345546 -27107313 -19274656 -5720897 -4189112
-1529 -4189112 -2396034 -2320322 -8502491 -9712698 -2392960 7782329 2570376 5653716 12354459
-1538 12354459 11300023 7824828 2212316 1549122 -5251905 -840520 6553165 2371099 -1849027
-1547 -1849027 -8033190 -15715766 -19815796 -10684369 -1486280 -3379238 -3028182 2181381 -8761743
-1556 -8761743 -18469432 -7131174 1763296 377589 -2662771 7148858 -1736789 -22525790 -18303070
-1565 -18303070 -13089552 -11766224 -11328058 -262705 -864257 -24170790 -27485312 -18502650 -7063390
-1574 -7063390 3906874 8503715 4212312 -11992773 -16139906 -4501153 3146446 5921460
-1582 5921460 -1867288 -14812697 -16643984 -16437469 -14582790 -20996276 -28467691 -27611097 -30525291
-1591 -30525291 -19238542 -12719997 -17985369 -21388459 -19602979 -3288246 2160837 6504457
-1599 6504457 15017503 12311084 11002627 10362032 13176423 10126603 1143510 7856327 12562755
-1608 12562755 1915726 -11943192 -19421994 -14055155 -12928742 -9137601 2640471 -4067224
-1616 -4067224 -16867913 -18970907 -4448855 6081351 -2055349 1812247 7252765 40380
-1624 40380 -7556691 -4853878 5981763 1516617 -4327819 4110666 5469554 -2504675 -7717914
-1633 -7717914 -1519619 5531596 -3512434 -8428979 -2298408 449176 -5771318 -18080265 -16944541
-1642 -16944541 -11351182 -13394834 -8391655 1734144 1423110 -15810940 -23779554 -2432210
-1650 -2432210 12665393 4733384 1175792 4101285 -2246055 -18665233 -15967908 3873740
-1658 3873740 -585253 -9679760 -4375363 -1034163 -12077396 -24571317 -7533398 10461022
-1666 10461022 6734050 -493462 -9100189 -14579222 -20563430 -24471839 -18285558 -21770493 -30892780
-1675 -30892780 -34874240 -32766302 -20740346 -30200887 -40370834 -23672695 -1608324 16296840
-1683 16296840 12122952 11739934 8139705 -9084385 2112612 18527430 21635578 5650479
-1691 5650479 -13160900 -13118486 -24420852 -34448076 -31858665 -27784967 -12045919 -5610846 -12826983
-1700 -12826983 -22915264 -39107013 -33595884 -18445736 2420510 16690876 -12943385 -36455098
-1708 -36455098 -43066470 -34673530 -19095563 -18633140 -5454887 -9550497 -16930207 -8458368 -6854172
-1717 -6854172 -103753 -822631 6054649 25052102 27756666 19486120 -345527 -15239032 -8271447
-1726 -8271447 -9001730 -1525364 11669263 3476822 -8914186 -27489403 -19777306 -9655226
-1734 -9655226 -13636170 4787164 7831991 2840638 -13399935 -28041873 -21365690 -27523628
-1742 -27523628 -24433708 -16286468 -12285813 -8251499 -24113143 -35074814 -29037647 -23738102
-1750 -23738102 -4841151 15605350 28128497 23609420 -6496952 -1133945 15698214 26079206
-1758 26079206 40800248 36893593 41479572 25969324 18690875 28650984 16601601 15544418
-1766 15544418 11484550 19472771 27245850 4165047 -16454760 -34515913 -38008935 -23523569
-1774 -23523569 -16019828 -3404727 -8953847 -31487582 -26249239 -20895514 -6431612 2882113
-1782 2882113 6924702 27117470 14215600 9457417 -3312868 -24975367 -20958614 -24446749
-1790 -24446749 -7739594 -10133602 -29375387 -44153534 -67781249 -57244808 -41663941 -29644499
-1798 -29644499 -8626306 -7491621 -15496601 -25832539 -26864781 -8747801 -6173623 9481095
-1806 9481095 25588956 5776177 -3640106 -12407520 -4875088 -2990061 -4990353 18975173
-1814 18975173 9103582 6212559 5915989 -5454272 -11787514 -23619926 -6515671 22152
-1822 22152 -4370447 -8042519 -31828591 -44531736 -40177595 -29013933 -17930607 -15603462 -13305790
-1831 -13305790 -16799297 -24323960 -8764729 -5743025 -10530239 -1227926 9004695 21458434
-1839 21458434 8927733 6395275 2942267 -10197244 1253230 14014985 28973909 20405232
-1847 20405232 8883872 8151277 2678465 7196789 12704106 23554883 25860449 20371646 14216739
-1856 14216739 7913913 321513 -3697052 3308924 8611023 10686461 -582394 -13199585
-1864 -13199585 -27769130 -33011970 -23120599 -17323259 -8533994 -9652794 -14522224 -22906462 -14998342
-1873 -14998342 8726078 20338813 29260194 34804517 40380242 33816963 39927678 52533738
-1881 52533738 44564022 30139159 19146856 21465989 9898156 4079513 591676 -18164426
-1889 -18164426 -31353677 -34017913 -20620986 -18795581 -17043565 -16137872 -27668041 -33432807
-1897 -33432807 -30950272 -24339116 -27373288 -29419157 -34890510 -47679830 -59408455 -56942898
-1905 -56942898 -49429154 -45216700 -33370242 -28988065 -22680353 -18822668 -1518784 18990687
-1913 18990687 27742108 40678956 36657418 37344003 34436984 37080016 43748329 33331503 28415430
-1922 28415430 13322058 7206372 6179228 9922003 24433286 23553638 18437569 12761298 14644837
-1931 14644837 21131955 26531606 35944881 37303006 18095193 4182804 2875236 2705331 3803867
-1940 3803867 -1468139 5402169 -3546859 -11611158 -2163424 -143941 11865323 8105623 16571008
-1949 16571008 24965277 20553976 27498642 18310298 22455269 19082126 10788970 17093250 16781500
-1958 16781500 20373129 8943458 -1661802 1625010 -2718749 -354216 8654372 9989045
-1966 9989045 6244178 -12698841 -14220482 -370918 -3784676 100571 -4302357 4061315 2627705
-1975 2627705 -11425759 8269461 7526041 2667041 -996518 9645469 23534931 -4245817
-1983 -4245817 -6239782 87890 -7176029 -9954610 -8417907 2118324 -9496848 -14636573
-1991 -14636573 4659949 5616034 2351528 7558500 9862781 22045236 26504047 28611605
-1999 28611605 16993645 -1302205 8968499 -667509 -651679 6557131 -9554209 -24514852
-2007 -24514852 -35335573 -12935472 -13240876 -25220827 -6191546 -3273873 -6791550 -3408588
-2015 -3408588 13230639 16038909 657979 11473690 23908105 13801114 11184469 15398122
-2023 15398122 12936061 6809469 2332832 11777047 6129709 3483476 10982659 5679806 6502511
-2032 6502511 -5979468 -8392516 -3827234 -6399893 -3591139 -10229099 -7218089 -12857469 -18924215
-2041 -18924215 -5367921 4488342 8356084 13417723 24477598 28543332 26930807 33406588
-2049 33406588 43868148 40134604 37255515 35960757 26623993 24201685 14636351 5325709
-2057 5325709 -4997215 -7854944 -9234082 -20618788 -9927597 -6564398 -20027790 -22742530
-2065 -22742530 -6025131 680572 -14106289 -4258123 13273918 2888355 -10870097 77787
-2073 77787 -108108 -18564170 -11651327 11510362 11033987 -10939959 -10285390 -5375854 -5043545
-2082 -5043545 9386940 21036733 17390116 1318728 -47675 778703 1336657 7923675 1199153
-2091 1199153 -9786467 -10142267 -3057879 -13101392 -18588756 -4543680 4725243 4074040 7881334
-2100 7881334 16827476 5719468 5239903 28335167 41768863 30465652 10656007 6237306
-2108 6237306 3940734 10767305 23625900 19785750 -626152 -17818216 -18337523 -8760088
-2116 -8760088 4892242 9816208 6695812 -2571016 -5485680 -8281290 -11201967 -129724 4404977
-2125 4404977 8518191 3171551 -10240930 -25217707 -37178251 -22328317 -12296294 -10534165
-2133 -10534165 -14317771 -30437938 -42797993 -46227179 -32280042 -24217640 -30336337 -27484104
-2141 -27484104 -25210353 -32372253 -35544353 -34741602 -31728643 -33206508 -27241697 -9887626 -15136558
-2150 -15136558 -23477528 -30416387 -33488311 -26735050 -24620126 -8250176 -4979918 -9272767 -12108427
-2159 -12108427 -23351480 -16899334 -9936771 2459504 15229185 19570192 23871571 10309751
-2167 10309751 2347536 11016290 17837895 26762088 34821050 41822421 34580325 10217423 8875517
-2176 8875517 18215552 24800369 36908889 42553979 44154828 21437426 8157181 17736208 16953072
-2185 16953072 20568306 19365090 23081939 15339944 -6113855 -11392712 -22457598 -24591959
-2193 -24591959 -16191505 -6696997 -791072 -16939009 -30953464 -37576470 -36114533 -18289373
-2201 -18289373 -9200870 -7468028 -9495350 -17271014 -17999789 -22569261 -15472018 -6245628 -6831529
-2210 -6831529 6771858 10949576 6696708 -6227190 -13304290 -892609 -2054938 5410331
-2218 5410331 10569130 307476 -11905365 -24395765 -18951435 -20927836 -22788742 -8694907
-2226 -8694907 -5924853 -7376931 -11566796 -13309045 -9460530 -8825632 6065115 14429626 9171502
-2235 9171502 11020638 4957165 2098903 -1573634 -3881633 1593404 -1107194 12594362 18223984
-2244 18223984 7726016 4765313 1161842 9726919 17109751 29868175 41316162 27279814
-2252 27279814 19629085 15769787 8705027 6917407 6663939 16286414 15380892 5808083 809137
-2261 809137 -15607269 -19388838 -10472677 871854 15731397 13371373 8071896 -3308804
-2269 -3308804 -8936617 3854834 5759651 12883282 20249923 16984734 11049618 631224 4063391
-2278 4063391 3703523 -1270470 9958233 14931078 13971473 8925460 -237326 -4537409 -18306321
-2287 -18306321 -18625924 -2747839 6877031 11328844 -7654402 -26074552 -33526284 -35323021
-2295 -35323021 -13620153 4192569 7462201 -8179661 -29667565 -25989233 -23168065 -19045518
-2303 -19045518 -5120732 1476539 7431344 3437661 -362127 -2022810 -11541480 4546480
-2311 4546480 26915885 39049078 39295991 14778980 1739476 -2040390 5417538 16042857
-2319 16042857 4969328 427292 -10732473 -19971746 -13407133 -18410584 -25103799 -28241770
-2327 -28241770 -10149833 17757536 14966325 10242337 4794396 -6055756 4308812 23518847
-2335 23518847 42953488 30217953 5019246 6569822 -3746680 -10108131 -6816204 -915402
-2343 -915402 4393045 -6642882 972976 589245 -15020818 -8769066 6908678 24507582 24663614
-2352 24663614 18073168 20134609 10274542 8535489 13095924 7199405 6929238 4243562 6011806
-2361 6011806 3930202 -9403391 -14737706 -26484287 -16790398 6113282 5598388 -2048547 -10617123
-2370 -10617123 -8529856 -15333213 -17376763 6022134 9432035 -4471260 -6164274 346317
-2378 346317 -10149586 -26308583 -9780381 15488044 10659981 2893143 7480864 3983167
-2386 3983167 -1043589 9093087 31125911 29162136 13656460 14608659 17748774 17446307 11134966
-2395 11134966 8249062 7356776 6045157 6619488 3693747 1523067 -1434509 -1384766 -799744
-2404 -799744 6212181 7968479 1564498 5138917 11886424 16512899 2765528 -6804785 2940275
-2413 2940275 9888270 12243775 7516957 3677226 -5611497 -14759858 1156787 18733453
-2421 18733453 7315419 -8466243 -5817057 5018845 2407122 -5529841 3148130 -8038934
-2429 -8038934 -15931973 2803060 10076311 -29451 -20245236 -8111719 5884516 4383968
-2437 4383968 22233324 18549947 2709354 669547 16025655 28473790 13878039 13888636
-2445 13888636 18292520 2572635 5375181 12643977 5856467 -174521 63585 16683327 8853493
-2454 8853493 648554 11958820 2319736 10401994 15525905 13975688 11264681 -1668756
-2462 -1668756 9772171 1492344 -3202346 8244945 -1274438 -1209667 -2166596 1579837 5239228
-2471 5239228 -5281768 8009695 13712906 336176 -156998 -1745886 11689200 4062134
-2479 4062134 -18424915 -9378840 -19143539 -20619903 -12665956 -3381566 -5995047 -50299379
-2487 -50299379 -35780170 2204697 4129695 3231585 -4272476 -4699230 -21667706 -8709631
-2495 -8709631 39621702 25699944 -3279342 -3690470 -10413 11999976 16094985 23116147
-2503 23116147 6964528 -12829029 16882977 10963737 -3262449 6045637 -6754546 -15567928
-2511 -15567928 -15782920 10498731 -13819107 -62681349 -23639564 459968 -18691807 -24059786
-2519 -24059786 -11778492 -18944020 -46787657 483151 49029269 5575350 -21173800 -5827991
-2527 -5827991 4214855 4966761 13563783 32379908 -5471429 -29898535 -1706957 -929491
-2535 -929491 5992989 5173388 -3038786 -7460658 -5997977 19696288 1509306 -6156956 17979641
-2544 17979641 5389465 -1843281 9400288 17884759 -3705413 -25120591 8661742 15754356
-2552 15754356 -11398659 -2316959 5174897 -368735 -11939701 1866619 26737495 1422084
-2560 1422084 -3144989 8399281 11314232 17023242 5115005 15701240 11507567 -1123912
-2568 -1123912 9324144 11511012 20278887 6780755 -8934556 1408674 -2684909 -3719598
-2576 -3719598 -6221449 -12000483 -8698948 -23367170 -20496483 -12840161 -21722060 -17207620 -21802788
-2585 -21802788 -4834211 7345054 -6297229 -2145726 -4323899 8745569 14273803 14563780
-2593 14563780 30210749 8549698 -5217686 2622900 10521022 14598976 -2109252 -809454
-2601 -809454 -2778649 -18853648 -5913212 -386598 -2953660 -6943772 -12875449 738845 -5029852
-2610 -5029852 -2149558 7149562 -1942682 5669318 -1197117 398952 6773811 2153714 12156782
-2619 12156782 4950464 4367859 2930102 -6534468 8506144 11612155 8972456 7623904 -694870
-2628 -694870 3566086 1383371 9945166 20580072 4354711 3525637 4463930 6624553 12227526
-2637 12227526 4721244 9402360 -1289142 -5708278 5283358 2930931 7227897 95579
-2645 95579 -3455170 3319857 2215179 8187359 9651669 13518491 19693275 9543798 9000140
-2654 9000140 11263428 4224934 8327868 13114178 17615463 2810580 -18464258 -11802332 -8678279
-2663 -8678279 -2456592 4480353 404102 -6586719 -19706380 -10526869 7172772 7807317 5001649
-2672 5001649 -1144938 -1555281 5893626 4270430 6094011 2308763 -6887358 -349603 4039025
-2681 4039025 16139441 12917986 -3667659 4238 -106586 10211587 14793892 11971942 14493601
-2690 14493601 -1578567 -5517271 -3348147 -6679786 -1320785 -3855622 217845 419560 -16309654
-2699 -16309654 -14859711 -13788101 -4077837 11228582 5669177 8308345 -8099577 -13919236
-2707 -13919236 -2144196 -3973077 9753305 -127292 -9102890 -11308068 -21029823 -8911943
-2715 -8911943 -11936861 -7053197 1842024 -8588772 -4932604 -6637693 -5423470 2890242 1107519
-2724 1107519 12252236 4094165 -7573507 2160050 -4661236 3050368
-2730C050368  $$ checkpoint
##END NTUPLES=
##END=
