##TITLE= S#483880
##JCAMP-DX= 5.00 $$ JEOL NMR v1.10
##DATA TYPE= NMR SPECTRUM
##DATA CLASS= NTUPLES
##NUM DIM= 1
##ORIGIN= DELTA_NMR
##OWNER= NMR
##SPECTROMETER/DATA SYSTEM= DELTA_NMR
##.OBSERVE FREQUENCY= 3.00529655924288E+02
##.OBSERVE NUCLEUS= ^1H
##.DELAY= (2.195E+02,2.195E+02)
##.ACQUISITION MODE= SIMULTANEOUS
##.FIELD= 7.0586013
##.FILTER WIDTH= 1.81675738660864
##.ACQUISITION TIME= 3.6339712
##.SPINNING RATE= 19
##.OBSERVE 90= 9.2
$$ ------------------------
$$ JEOL SPECIFIC PARAMETERS
##$FILENAME= C:\NMR/eb-4.jdf
##$TITLE= S#483880
##$AUTHOR= NMR
##$CREATION=  1-FEB-2018 13:19:40
##$REVISION=  1-FEB-2018 13:26:54
##$CONTENT= PROTON NMR EXPERIMENT
##$INSTRUMENT= DELTA_NMR
##$SITE= Center College ECP+ 300
##$NODENAME= nmr2
##$DIMENSIONS= 1
##$STORAGE= FLOAT
##$X_FORMAT= COMPLEX
##$X_CURR_POINTS= 16384
##$X_START= 12.50103 $$ppm
##$X_STOP= -2.50012 $$ppm
##$X_TITLE= 1H                             
##$X_ZERO_POINT= 0.33329
##$X_FREQ_FLIP= FALSE
##$X_POINTS= 16384
##$X_PRESCANS= 0
##$X_DOMAIN= 1H
##$X_OFFSET= 5 $$ppm
##$X_FREQ= 300.52966 $$MHz
##$X_SWEEP= 4.50857 $$kHz
##$X_RESOLUTION= 0.27518 $$Hz
##$SOLVENT= CHLOROFORM-D
##$TEMP_GET= 20.4 $$dC
##$ACQ_DELAY= 0.2195 $$ms
##$DIGITAL_FILTER= FALSE
##$FILTER_FACTOR= 1
##$FILTER_WIDTH= 2.254 $$kHz
##$FILTER_MODE= BUTTERWORTH
##$TRANSITION_RATIO= 0.9
##$ORDERS
##$FACTORS
##$LOCK_STRENGTH= 10
##$LOCK_LEVEL= 255
##$LOCK_GAIN= 30
##$LOCK_OSC_OFFSET= 25.6519 $$kHz
##$LOCK_PHASE= 187 $$deg
##$LOCK_OSC_STATE= 2H OSC ON
##$X_ANGLE= 45 $$deg
##$X90= 9.2 $$us
##$X90_HI= 10 $$us
##$X90_LO= 50 $$us
##$X_90_WIDTH= 9.2 $$us
##$X_PULSE= 4.6 $$us
##$RELAXATION_DELAY= 4 $$s
##$SCANS= 1
##$PROBE_ID= 1412
##$ITERATIONS= 1
##$FIELD_STRENGTH= 7.0586 $$T
##$TEMP_SET= 25 $$dC
##$SPIN_SET= 15 $$Hz
##$SPIN_GET= 19 $$Hz
##$HE_LEVEL= 75 $$%
##$N2_LEVEL= 82 $$%
##$CHANGER_SAMPLE= 0
##$ADC_CARD= 16/1MHz/20
##$EXPERIMENT= single_pulse.exp
##$OBS_NOISE= WAUGH
##$IRR_NOISE= WALTZ
##$TRI_NOISE= WALTZ
##$QUA_NOISE= WAUGH
##$OBS_PWIDTH= 1 $$us
##$IRR_PWIDTH= 1 $$us
##$TRI_PWIDTH= 1 $$us
##$QUA_PWIDTH= 1 $$us
##$RECVR_GAIN= 4
##$IRR90= 10 $$us
##$TRI90= 10 $$us
##$QUA90= 10 $$us
##$IRR90_HI= 10 $$us
##$QUA90_HI= 10 $$us
##$IRR90_LO= 10 $$us
##$TRI90_LO= 10 $$us
##$QUA90_LO= 10 $$us
##$MOD_RETURN= 1
##$TOTAL_SCANS= 1
##$X_ACQ_DURATION= 3.63397 $$s
##$DELAY_OF_START= 1 $$s
##$ACTUAL_START_TIME= 886339166
##$CLIPPED= FALSE
##$DC_BALANCED= FALSE
##$TRI90_HI= 10 $$us
##$SPIN_LOCK_90= 100 $$us
##$SPIN_LOCK_ATTN= 24.4 $$dB
##$DEUT_GRAD_SHIM_90= 213 $$us
##$DEUT_GRAD_SHIM_ATTN= 9 $$dB
##$IRR_CODE= 146
##$LOCK_STATE= LOCK OFF
##$AUTOLOCK_LEVEL= 200
##$SAWTOOTH_RANGE= 4
##$LOCK_STATUS= OFF
##$LOCK_SETTLE_POINT= 4096
##$LOCK_ACHIEVE_POINT= 0
##$SPIN_ACTION= SPIN ON
##$SPIN_STATE= SPIN ON
##$SPIN_STATUS= SPIN ON
##$SPIN_GAS_SOURCE= AIR
##$TEMP_ACTION= TEMP OFF
##$TEMP_STATE= TEMP OFF
##$TEMP_STATUS= TEMP OFF
##$TEMP_COMP= 0
##$TEMP_DELAY= 0 $$s
##$TEMP_LIMIT_HI= 150 $$dC
##$TEMP_LIMIT_LO= -100 $$dC
##$TEMP_MELTING= -63 $$dC
$$ [...]
##$VT_PID_STD_WB_H_TD= 5
##$VT_PID_STD_WB_H_CBL= 10
##$VT_PID_STD_WB_H_CBH= 0
##$VT_PID_STD_WB_H_HC= 2.4
##$VT_PID_STD_WB_H_HL= 70
##$VT_PID_STD_WB_M_PB= 1.5
##$VT_PID_STD_WB_M_TI= 30
##$VT_PID_STD_WB_M_TD= 5
##$VT_PID_STD_WB_M_CBL= 9.9
##$VT_PID_STD_WB_M_CBH= 2.3
##$VT_PID_STD_WB_M_HC= 2.5
##$VT_PID_STD_WB_M_HL= 70
##$VT_PID_STD_WB_L_PB= 1.3
##$VT_PID_STD_WB_L_TI= 29
##$VT_PID_STD_WB_L_TD= 5
##$VT_PID_STD_WB_L_CBL= 20
##$VT_PID_STD_WB_L_CBH= 20
##$VT_PID_STD_WB_L_HC= 0.6
##$VT_PID_STD_WB_L_HL= 100
##$VT_PID_LONG_0_H_PB= 1.5
##$VT_PID_LONG_0_H_TI= 30
##$VT_PID_LONG_0_H_TD= 5
##$VT_PID_LONG_0_H_CBL= 9.9
##$VT_PID_LONG_0_H_CBH= 2.3
##$VT_PID_LONG_0_H_HC= 2.5
##$VT_PID_LONG_0_H_HL= 70
##$VT_PID_LONG_0_M_PB= 1.5
##$VT_PID_LONG_0_M_TI= 30
##$VT_PID_LONG_0_M_TD= 5
##$VT_PID_LONG_0_M_CBL= 9.9
##$VT_PID_LONG_0_M_CBH= 2.3
##$VT_PID_LONG_0_M_HC= 2.5
##$VT_PID_LONG_0_M_HL= 70
##$VT_PID_LONG_40_H_PB= 1.5
##$VT_PID_LONG_40_H_TI= 30
##$VT_PID_LONG_40_H_TD= 5
##$VT_PID_LONG_40_H_CBL= 9.9
##$VT_PID_LONG_40_H_CBH= 2.3
##$VT_PID_LONG_40_H_HC= 2.5
##$VT_PID_LONG_40_H_HL= 70
##$VT_PID_LONG_40_M_PB= 1.5
##$VT_PID_LONG_40_M_TI= 30
##$VT_PID_LONG_40_M_TD= 5
##$VT_PID_LONG_40_M_CBL= 9.9
##$VT_PID_LONG_40_M_CBH= 2.3
##$VT_PID_LONG_40_M_HC= 2.5
##$VT_PID_LONG_40_M_HL= 70
##$SAMPLE_ACTION= LOADED
##$SAMPLE_STATE= LOAD
##$SAMPLE_STATUS= LOADED
##$AUTOSHIM_MODE= AUTOSHIM OFF
##$AUTOSHIM_DELAY= 3600 $$s
##$AUTOSHIM_TRACK= AUTOSHIM OFF
##$SHIM_MAX_RECALL= IDLE
##$SHIM_NAMES= SHIM_Z0
##$SHIM_Z0= 7934
##$SHIM_Z1= 5176
##$SHIM_Z2= 45
##$SHIM_Z3= -2829
##$SHIM_Z4= -240
##$SHIM_Z5= 46
##$SHIM_Z6= -33
##$SHIM_X= -14
##$SHIM_XZ= 16
##$SHIM_XZ2= 0
##$SHIM_XZ3= 0
##$SHIM_X2= -7
##$SHIM_X2Z= -40
##$SHIM_X3= 0
##$SHIM_Y= 1608
##$SHIM_YZ= 13
##$SHIM_YZ2= 10
##$SHIM_YZ3= 0
##$SHIM_Y2= -11
##$SHIM_Y2Z= -20
##$SHIM_Y3= 0
##$NUM_SCANS= 1
##$END_TIME= 886339180
##$LOCAL_TIME= 886339179
##$PROBE_ATN= 0
##$PROBE_TUNE= 0
##$PROBE_MATCH= 2077
##$PROBE_COARSE= A
##$LF_TUNE_DIAL= 0
##$LF_MATCH_DIAL= 0
##$HF_TUNE_DIAL= 0
##$HF_MATCH_DIAL= 0
##$PASS_RIPPLE= 0.01 $$dB
##$STOP_RIPPLE= 60 $$dB
##$PROBE_RECOVERY= 0 $$us
##$AF_DELAY_RATIO= 0
##$VERSION= 4.3.3
##$X_ACQ_TIME= 3.63397 $$s
##$DEAD_TIME= 0 $$us
##$DELAY= 0 $$us
##$PHASE_PRESET= 3 $$us
##$UNBLANK_TIME= 2 $$us
##$INITIAL_WAIT= 1 $$s
##$NORMALIZED= TRUE
$$ END OF JEOL SPECIFIC PARAMETERS
$$ -------------------------------
##NTUPLES= NMR SPECTRUM
##VAR NAME= FREQUENCY,    SPECTRUM/REAL, SPECTRUM/IMAG, PAGE NUMBER
##SYMBOL=   X,            R,             I,             N
##VAR TYPE= INDEPENDENT,  DEPENDENT,     DEPENDENT,     PAGE
##VAR FORM= AFFN,         ASDF,          ASDF,          AFFN
##VAR DIM=  16384, 16384, 16384, 2
##UNITS= PPM,     ARBITRARY UNITS, ARBITRARY UNITS, 
##FIRST=  1.2501033903057E+01, -4.15467037549329, -3.62379621843732, 1
##LAST=  -2.50011824950436, -2.96671125685466, -4.23935946972506, 2
##FACTOR=  9.1565355261926E-04, 4.49222636227756E-04, 4.49222636227756E-04, 1
##PAGE= N=1
##DATA TABLE=(X++(R..R)), XYDATA
$$ [...]
3036a8113099K415754q65829P22772n09021J798895j238345o39235M71952o5743J136300
3026a4885599m51730p52869j010933L392952J250309K462119k787898k865612m64585
3017a6113846j697526J300789L316375n11378J443958m018366j04872Q63851j345089
3008a6866104n37624K226914P20117j750165M68186J333894j646389K16634M209617
2999a1624920j570957j868955j431161K17709j495890J332780j357641J05860J905737
2990a5787438J250712q27751k60134l120561J919485J224260j050000J294916J586055
2981a3770456p66973k220674J518230k168541J265566J270695k317192J303186K070422
2972a3815737k275284j800724P25868l18006P31227K975016j132819J361832k839860
$$ y = [-18113099, -15697345, -16563174, -15840402, -16349423, -14550528, -15788873, -16428108, -15956156, -16021899, -14885599, -15337329, -16090198, -17101131, -13708179, -12457870, -9995751, -12783649, -15649261, -16113846, -17811372, -16510583, -13194208, -13705586, -12261628, -16279994, -16384866, -15521015, -16866104, -17403728, -15176814, -14456697, -16206862, -15738676, -14404782, -16051171, -15834537, -11624920, -13195877, -15064832, -16495993, -16278284, -17774174, -16441394, -17799035, -17693175, -15787438, -14536726, -15364477, -15624611, -18745172, -16825687, -15601427, -16651427, -15356511, -13770456, -14537429, -16758103, -15239873, -17408414, -16142848, -14872153, -17189345, -15886159, -13815737, -16091021, -17891745, -17165877, -17483883, -16752656, -13777640, -14910459, -13548627, -16388487]
2963a6388487J309986J291104k092275p43726n2261J332842j813566O65287J610032M67661
2953a4413403l81414j298495N8666k26959J724563o2523P7314R61289j046389r83138
2943a5590489L07307k86586P88876J445167j723897q84876m14795M07904k60598M237874
2933a1974113l425842j033103J026208o55799p00446m0484J468925K35135l430180L277301
2923a5252398j896408J389797l745585K350029J259385m2850R50953N63128j126486P7040
2913a5473395m37637K120870j131793j36977k70104M28222l84492j002440q23360K37214
2903a6873892J911885N91275l933008K352188Q56297j620482M42496k57878j991589
2894a8522708K221085J350089k080774o01723J640035r55521N78841K183298j816451
$$ y = [-16388487, -15078501, -13787397, -15879672, -16623398, -16675659, -15342817, -17156383, -16491096, -14881064, -14413403, -14794817, -16093312, -16034646, -16261605, -14537042, -14599565, -14522251, -13560962, -14607351, -15590489, -15283182, -15569768, -14780892, -13335725, -15059622, -15944498, -16359293, -15951389, -16211987, -11974113, -15399955, -16433058, -15406850, -16062649, -16763095, -16803579, -15334654, -15099519, -18529699, -15252398, -17148806, -15759009, -19504594, -17154565, -15895180, -15938030, -14987077, -14423949, -15550435, -15473395, -15911032, -13790162, -14921955, -15058932, -15329036, -14900814, -15285306, -16287746, -17111106, -16873892, -14962007, -14370732, -18303740, -15951552, -15095255, -16715737, -16273241, -16531119, -18522708, -16301623, -14951534, -17032308, -17634031, -15993996, -16949517, -16370676, -14187378, -16003829]
2885a6003829L25303o48052J867512j621147R44725j182922O57879m08313O14686j177470
2875a6631628J308968k296566J124788J45200J228492L61866j143404R02031k471925
2866a7472178K520731M19680k207446K733277R2217k378016M060804m052561K061671
2857a4221821k806955K95406m89717J261916k96952j500184K377624J098164k461190
2848a6743709r98947K865008r79790J084804q01285J63660J524353j644851m72355j569904
2838a7573016l83246Q02707L377469j484211k38721M25241p9883j133106j97719R33380
2828a5551105J262067r63865k05280j072007L20403r61879K039239J953672m33769K49300
2818a3363224j396017K78476r69771Q62522k982900O63592p45184J777456O68926k670070
$$ y = [-16003829, -15678526, -16326578, -14459066, -16080213, -15135488, -16318410, -15660531, -16068844, -15454158, -16631628, -15322660, -17619226, -16494438, -16349238, -15120746, -14758880, -15902284, -15000253, -17472178, -14951447, -14531767, -16739213, -14005936, -13913719, -16291735, -12230931, -16283492, -14221821, -17028776, -16733370, -17223087, -15961171, -16258123, -17758307, -15380683, -14282519, -16743709, -17742656, -14877648, -15857438, -14772634, -15573919, -15410259, -13885906, -15530757, -16003112, -17573016, -17956262, -17153555, -13776086, -15260297, -15499018, -15073777, -15153660, -16286766, -16484485, -15551105, -14289038, -15252903, -15458183, -16530190, -16209787, -17171666, -15132427, -13178755, -13612524, -13363224, -14759241, -14480765, -15450536, -14588014, -17570914, -16907322, -17652506, -15875050, -15206124, -17876194]
2808a7876194K875089j616640O58903J315439L03114j918480K798513k308396l474505
2799a9243157L178681J163241j899018N01981j925067L624576l196409J680120k88145
2790a6403197K869360k028888r67265K33289J37383j070331J166861j026225K06559
2781a6882454J721764P86732j156833J416582j217103O61647N73080j647973j274041
2772a7018599q42130K250969P14606q015N88819J82977k390173Q81659j092739j40528
2762a6873154o09860m31916K485139j559629m55274J098588j56673n12768K302756k779709
2752a7492500J040152j234330J612107K08057P89876p46358J679988l78130J401893
2743a3119245l368136P62638l17534P80130j003473J333599q84476j42602j133842J617124
$$ y = [-17876194, -15001105, -16617745, -15958842, -14643403, -14340289, -16258769, -13460256, -15768652, -19243157, -16064476, -14901235, -16800253, -16298272, -18223339, -14598763, -17795172, -16115052, -16403197, -13533837, -15562725, -16529990, -16296701, -16159318, -17229649, -16062788, -17089013, -16882454, -15160690, -14373958, -15530791, -14114209, -15331312, -14669665, -14096585, -15744558, -17018599, -17860729, -15609760, -14895154, -14903169, -14314350, -14131373, -16521546, -15639887, -16732626, -16873154, -17483014, -17914930, -15429791, -16989420, -17444694, -16346106, -16502779, -17015547, -14712791, -17492500, -16452348, -17686678, -16074571, -15866514, -15076638, -15822996, -14143008, -14521138, -13119245, -16487381, -15724743, -16042277, -15262147, -16265620, -14932021, -15816497, -15959099, -17092941, -15475817]
2733a5475817J14376j087145j13449L61852n54465L398689J408836m388942j070323
2724a7406388J215003k137615K869989j14437P66085k79079J036369j482596l242974
2715a8775643K065921k78419l59428J846173P5998O96563j531222j304651l28427R52982
2705a6940153j549705j203529L866759l287670P910619n670574r36528M708426m00264
2696a3502619k319648o31421j902485q61826J348873l5702J212921q39835k200946J555083
2686a8177605L67416j44173J124046J404703R67788J09328l420101M63964R61257o13390
2676a6956767l30105J914981n6045J677019l109146l82501p20709K185273r1414N10932
2666a5358482q35148p26194K094622N32524o91699M93674j916048J10994K76164J275153
$$ y = [-15475817, -15361441, -16448586, -16562035, -16200183, -16754648, -13355959, -11947123, -16336065, -17406388, -16191385, -18329000, -15459011, -15573448, -14807363, -15086442, -14050073, -15532669, -18775643, -16709722, -16988141, -17347569, -15501396, -15425398, -14728835, -16260057, -17564708, -17893135, -16940153, -18489858, -19693387, -15826628, -19114298, -11203679, -16874253, -17810781, -13102355, -13502619, -15822267, -16453688, -18356173, -19217999, -17869126, -17904828, -16691907, -17531742, -19732688, -18177605, -17810189, -17954362, -16830316, -15425613, -14457825, -14348497, -17768598, -17304634, -16343377, -16956767, -17286872, -15371891, -15427936, -13750917, -16860063, -17242564, -17963273, -15778000, -15869414, -15358482, -16193630, -16919824, -14825202, -14292678, -14984377, -14490703, -16406751, -16295757, -16019593, -14744440]
2656a4744440j592245J277894Q74539l067288J523437j404856J567641o74880J546879
2647a4693319R21034l647932j714100M094815k736095j565207L403277L35053j920002
2638a7522476j661511K535585O55212j977436O22688j379829K767828j561753L9635k27068
2628a7709125N12533L1059k1064J560574K178711k336350l61028l39022L58879k40921
2618a6365754R67492j007026J73414j530832K518220j44964L09672j04683K182908j474302
2608a4475855k89197k086783J392587M3772k56521R23602j399640R37374J16304R38930
2598a4155427k772987K97347J407125L36496j404745l294J95344M55138k484407J621032
2588a6508378M84439j527325P39312K795861j844461J311582q10262j628164Q2554P77191
$$ y = [-14744440, -16336685, -15058791, -14184252, -17251540, -15728103, -17132959, -15565318, -16240198, -14693319, -13772285, -17420217, -19134317, -15039502, -17775597, -19340804, -15937527, -15602474, -17522476, -19183987, -16648402, -15993190, -17970626, -17347938, -18727767, -15959939, -17521692, -17482057, -17709125, -17196592, -17165533, -17186597, -15626023, -13447312, -15783662, -16144690, -16483712, -16124833, -16365754, -15398262, -16405288, -16231874, -17762706, -15244486, -15389450, -15079778, -15184461, -13001553, -14475855, -14765052, -16851835, -15459248, -15415476, -15671997, -14748395, -16148035, -15210661, -15094357, -14155427, -16928414, -16631067, -15223942, -14887446, -16292191, -16295485, -16100141, -15645003, -18129410, -16508378, -16023939, -17551264, -16811952, -14016091, -15860552, -14548970, -15359232, -16987396, -16904842, -16127651]
2578a6127651J298262j957953n32396J987583k080723J025450l45256r95613k12490
2569a7940787K994445j03370j137000k58984k12275O85471k285804K271093J504414
2560a4482797j184098j37887M1993l91294K71824j516241k89668j095844P00466J299564
2550a6783982J156594l815888J06912J414897J868984l71662J177482j035644r2502
2541a6374809j031030N53473K267847j061737P01499n86155k013633L694899k544813
2532a6394459k768569K183983J309006l367354K060341J851328J319820r51065j416616
2523a6173585L9440Q77852r95164j696789J748051j697563n70123J949578L21518K646450
2513a3550335k276934r62848K66664J461557l422679L42961J961565M5612J766409j466439
$$ y = [-16127651, -14829389, -16787342, -17319738, -15332155, -17412878, -16387428, -16732684, -17728297, -17940787, -14946342, -15049712, -16186712, -16445696, -16657971, -15972500, -18258304, -15987211, -14482797, -15666895, -15804782, -15762789, -16154083, -15882259, -17398500, -17688168, -18784012, -18083546, -16783982, -15627388, -19443276, -19336364, -17921467, -16052483, -16424145, -15246663, -16282307, -16374809, -17405839, -16852366, -14584519, -15646256, -14944757, -15530912, -17544545, -13849646, -16394459, -19163028, -16979045, -15670039, -19037393, -16977052, -15125724, -13805904, -14756969, -16173585, -16134145, -15256293, -16251457, -17948246, -16200195, -17897758, -18467881, -16518303, -16196785, -13550335, -15827269, -16790117, -16523453, -15061896, -18484575, -18141614, -16180049, -16134437, -14368028, -15834467]
2503a5834467j421860m39960K328364p55833J589358j152332J059986l36024M26265
2494a4536503k867682K002418k316363L407319l048501Q28796m41345o9904k25545J777117
2484a5490193k551978K805362J457998R95763n36050l633127P10501N6068J633537k528950
2474a7081069K5292K88584q94538J263524p15282O21622Q06607k702818N32808N61558
2464a7293712L35251k0150J591570l68956J175583L09523k933387N95403L180603J91178
2454a3237094l170731j239951K338555L32632p94699r89381K886564l689099J010332K5717
2444a6527155R16893J451541Q30053n90373j587095j589439j082658K65508J01247k16941
2434a8028419Q94725q4941O09660j467086L65088p47002J078426J173038Q41491j047921
$$ y = [-15834467, -17256327, -17696287, -15367923, -16123756, -14534398, -15686730, -14626744, -14962768, -14536503, -17404185, -15401767, -17718130, -14310811, -17359312, -16530516, -16971861, -17041765, -17267310, -15490193, -18042171, -15236809, -13778811, -12783048, -13319098, -16952225, -16241724, -16185656, -14552119, -17081069, -17055777, -16767193, -17661731, -16398207, -17113489, -16491867, -15685260, -18388078, -17855270, -17293712, -16958461, -16978611, -15387041, -15755997, -14580414, -14270891, -17204278, -16608875, -13428272, -13237094, -16407825, -17647776, -15309221, -14976589, -15771288, -16760669, -13874105, -17563204, -16552872, -16527155, -15610262, -14158721, -13328668, -13919041, -15506136, -17095575, -18178233, -17912725, -17811478, -18028419, -17133694, -17218635, -16608975, -18076061, -17710973, -18457975, -17379549, -16206511, -15365020, -16412941]
2424a6412941J169582j590214k94062J240329j114378K087794j045252K45258L0423
2415a5683461j515203J62988K950347p16902j193009j5678j364770J756675j844313
2406a7463326j318926K876752N17893j202827K07018j698011R03201n91305J687610N73697
2396a5508224l2192k90897j19281J802680l141278J573874q02891o02074J93946q88325
2386a7814662O6854K16478l12318m79108O91813P164K009506l247962P95931P37224q55886
2375a8184966j02614R10877J34116K613014r99901O21286L29411j342056p2863j235394
2365a7329090j195050J761521L84593k658607P53700L172560p09084o85528k251657
2356a8756642L351592p62150k2999k51498K845654j836876j063909L626195k298932L19793
$$ y = [-16412941, -15243359, -16833573, -17127635, -15887306, -17001684, -14913890, -15959142, -15713884, -15683461, -17198664, -17035676, -14085329, -14802231, -15995240, -16010918, -17375688, -15619013, -17463326, -18782252, -15905500, -15387607, -16590434, -16383416, -18081427, -17178226, -17769531, -16081921, -15508224, -15540416, -15831313, -15950594, -14147914, -17289192, -15715318, -16518209, -17120283, -16926337, -17814662, -17747808, -17531330, -17843648, -18322756, -17630943, -17623779, -15614273, -18862235, -18066304, -17329080, -18184966, -18287580, -17376703, -17242587, -14629573, -15629474, -15008188, -14678777, -16020833, -16093696, -17329090, -18524140, -16762619, -16378026, -19036633, -18282933, -15110373, -15819457, -16504985, -18756642, -15405050, -16167200, -16190199, -16441697, -13596043, -15432919, -16496828, -12870633, -15169565, -14849772]
2346a4849772p45653j156866J653034K3698J63867k25032j74316j257901K618211k626775
2336a6577505j321717n63728K078908K25588j127805J70132L10461k61092r86423J147355
2326a6905826k567754J628384K80827L439961j781198J079464k538264K668860R82276
2317a3713270j900469j457265N7739L09105Q16330J031256m34338O13474l73549J07941
2307a4943046j645069j08605K358310j470919K81778j09183q38875K78058m56310K033833
2297a4620028j214283J063493k30518p63281J14306j065971K56813R1005M17335r02364
2287a6853493r58417j207314r89234J473209J748877j08223o59841O3182J47130P08208
2277a6635916o31800J293106r9814j172134l07959J007225K082528k405050l74659Q96099
$$ y = [-14849772, -15595425, -16752291, -15099257, -15075559, -14911692, -15136724, -15311040, -16568941, -13950730, -16577505, -17899222, -18462950, -16384042, -16158454, -17286259, -17116127, -16805666, -17066758, -18053181, -16905826, -19473580, -17845196, -17564369, -14124408, -15905606, -14826142, -17364406, -14695546, -13713270, -15613739, -17071004, -17013265, -16704160, -15887830, -14856574, -15290912, -14677438, -15050987, -14943046, -16588115, -16696720, -14338410, -15809329, -15527551, -15636734, -16475609, -16197551, -16653861, -14620028, -15834311, -14770818, -15001336, -15764617, -15650311, -16716282, -16459469, -16368464, -15951129, -16853493, -17811910, -19019224, -20008458, -18535249, -16786372, -16894595, -17554436, -17491254, -17344124, -16635916, -17267716, -15974610, -16074424, -17246558, -17554517, -16547292, -14464764, -16869814, -17244473, -16348374]
2267a6348374J037857O42702J808760j855834k817959R23989K841293k237016j34941
2258a6139523K390730k772476L247671j899632j594771j56617K368436l070226Q77098
2249a6749310j358158J207860P26391j749695J962374J263789Q32337j36579k944570
2240a6945561J266595j363617J35803j432276K289611J737822J333550j882917k212782
2231a7073772P25879j239617J916166o76934j127163J96728J941716j142374o87804j62576
2221a7329751J513362l87932q33361R94391p60099o85476J243300K03852M28458n72301
2211a6185557R58414p02464r88134K973471M80950l302671K215330j540087j531715L36004
2201a7286459J010987L88665O78255j148428j774228J183920J560413K61231J449776
$$ y = [-16348374, -15310517, -14667815, -12859055, -14714889, -17532848, -16608859, -13767566, -16004582, -16139523, -13748793, -16521269, -13273598, -15173230, -16768001, -16924618, -14556182, -17626408, -16749310, -18107468, -16899608, -16173217, -17922912, -15960538, -14696749, -13864412, -14000991, -16945561, -15678966, -17042583, -16906780, -18339056, -16049445, -14311623, -12978073, -14860990, -17073772, -16347893, -17587510, -15671344, -16348278, -17475441, -17278713, -15336997, -16479371, -17167175, -17329751, -15816389, -16204321, -17037682, -16043291, -16803390, -17488866, -16245566, -16041714, -15613256, -16185557, -15227143, -15929607, -16917741, -13944270, -13463320, -16765991, -14550661, -16090748, -17622463, -17286459, -16275472, -15886807, -15208552, -16356980, -18131208, -16947288, -15386875, -15125644, -13675868]
2192a3675868k994010J843482p73254j393847M2898L082093K33549j825927j679333J28586
2182a7011631K028470K94308j017403j78676K037534k119682j083351J492183m02818
2173a5961066k651265j302341K014095J611833N28401o30839J025431k196568N48114
2164a7014205q93953J676920k20241L08850N61169Q02452k610020J974508j098284k602584
2154a9115388J734715K68115k47598K759891j088477o47895M13935j557993P23158j403603
2144a8161140K045797j322907M20867j70669q02711J042149l72592J673632j898631
2135a7546205K517681j64974j316840k70196P47683P22081O10028j254107j907845K14480
2125a7648214j60563K258022j523998K217000r70983k71686O51798j969763R24953l093
$$ y = [-13675868, -16669878, -14826396, -15599650, -16993497, -16950599, -13868506, -13634957, -15460884, -17140217, -17011631, -14983161, -14688853, -15706256, -15884932, -13847398, -15967080, -17050431, -15558248, -15961066, -18612331, -19914672, -17900577, -16288744, -15760343, -16391182, -15365751, -17562319, -17014205, -17908158, -16231238, -16451479, -16142629, -15581460, -14779008, -17389028, -15414520, -16512804, -19115388, -17380673, -17112558, -17360156, -14600265, -15688742, -16336637, -15922702, -17480695, -16757537, -18161140, -16115343, -17438250, -17017383, -17188052, -17990763, -16948614, -17321206, -15647574, -17546205, -15028524, -15193498, -16510338, -16780534, -16032851, -15310770, -14700742, -15954849, -17862694, -17648214, -17808777, -15550755, -17074753, -14857753, -15828736, -16100422, -15448624, -17418387, -16493434, -16496527]
2115a6496527K63235m600197K531991R42289O34477J799641l10166k771101M98157j745405
2105a9253606R50337O09964l90528N24911J344273o08990q53858O67371j08120R01003
2095a6217243J455963l689464Q01608J956871k059672J585428j887139J362253j535333
2086a8226728j241292Q44889m25717J250927n26859O9207K067327Q1645m46537j373206
2076a7926344j420476L550070J264758l556747M757536j060561j490396m13731j443305
2067a7739196j434459J661150K006668J132861r54723j509509J620411k630192j520132
2058a9367121K328217j200267R53963j465604o54665R58721j22788K849968l58391n86755
2048a6664722K373977M0463k005442k072350J320073r36552j547654J613519j42290
$$ y = [-16496527, -16233292, -20833489, -18301498, -17359209, -16724732, -14925091, -15235257, -18006358, -17508201, -19253606, -18303269, -17693305, -18083833, -17558922, -16214649, -16823639, -17677497, -17010126, -17118246, -16217243, -14761280, -18450744, -17649136, -15692265, -17751937, -16166509, -18053648, -16691395, -18226728, -19468020, -18623131, -19048848, -17797921, -18324780, -18255573, -16188246, -16106601, -16553138, -17926344, -19346820, -15796750, -14531992, -18088739, -13331203, -14391764, -15882160, -16295891, -17739196, -19173655, -17512505, -15505837, -14372976, -15327699, -16837208, -15216797, -17846989, -19367121, -17038904, -18239171, -17285208, -18750812, -19405477, -18446756, -18569544, -15719576, -16077967, -16664722, -14290745, -14250282, -16255724, -18328074, -17008001, -17944553, -19492207, -17878688, -18020978]
2039a8020978K266475J277797j653223k078508J942420j352212J500830o89875j211594
2030a8018868R37582N82145J765274k020340k706673L465590q03231M29484n54987k279013
2020a9203037J535520N55044n76932K85979n17496J763111r72150L93470K385893n317124
2010a9667722L453036J088055J02329l964620N9032M633673Q83554O77295R35222j652283
2000a3452429j987266j661720o11393Q34278K588839p94441j274238j192821N81664J67194
1990a6802333j755829k071920P19732L230198M50089K81662k108924J201569j114410
1981a7970166J68512Q10974L188099j761723r71896j53824q6875r87883j12554K029350
1971a5847986k635851Q88461J174834R00590j731155j461683r08056Q44110n26222J174131
$$ y = [-18020978, -15754503, -14476706, -16129929, -18208437, -16266017, -17618229, -16117399, -16807274, -18018868, -17081286, -16499141, -14733867, -16754207, -19460880, -15995290, -16798521, -16369037, -16924024, -19203037, -17667517, -17112473, -17689405, -17403426, -17920922, -16157811, -17129961, -16736491, -14350598, -19667722, -16214686, -15126631, -15024302, -18988922, -18929890, -14296217, -13412663, -12735368, -11800146, -13452429, -15439695, -17101415, -17712808, -16878530, -14289691, -15084132, -16358370, -17551191, -16969527, -16802333, -18558162, -20630082, -19910350, -16680152, -16230063, -15948401, -18057325, -16855756, -17970166, -17801654, -16990680, -13802581, -15564304, -16536200, -16690024, -16776899, -17764782, -17877336, -15847986, -18483837, -17595376, -16420542, -15519952, -17251107, -18712790, -19620846, -18776736, -19302958, -18128827]
1961a8128827L448187j747012L53955j359483J12277R66123J264473j372574j962366
1952a8425247J466936j080841J405582L30779j91598j03520J873283K60244L037333
1943a1427049l675853k462890M35897K651127j720085o05984o45063J468743j2079L53001
1933a5640235q16165j478563K353731R32605k655125J241792K13030n95153J79537M33790
1923a5830756j300695K712978k615627J396821j277733j632487J579165R59590j180234
1914a7188978L028897l825366M34173J037205n37586j105795J603582j499622K269421
1905a5784069J143797j281638R5090K98495P10893J209768k189506q78298K24593p91287
1895a7242162J948446q27585k84978K9404j259293P26613P21151p3930j086785J236745
$$ y = [-18128827, -14680640, -16427652, -16073697, -17433180, -17320903, -16354780, -15090307, -16462881, -18425247, -16958311, -18039152, -16633570, -16302791, -16494389, -16597909, -14724626, -14464382, -11427049, -15102902, -17565792, -17129895, -14478768, -16198853, -16804837, -17449900, -15981157, -15993236, -15640235, -16456400, -17934963, -15581232, -14648627, -17303752, -16061960, -15848930, -16444083, -16264546, -15830756, -17131451, -14418473, -17034100, -15637279, -16915012, -18547499, -16968334, -16008744, -17188978, -14160081, -17985447, -17551274, -16514069, -17051655, -18157450, -16553868, -18053490, -15784069, -14640272, -15921910, -15826820, -15528325, -14817432, -13607664, -15797170, -16675468, -16450875, -17242162, -15293716, -16121301, -16406279, -16376875, -17636168, -16909555, -16188404, -16262334, -17349119, -16112374]
1885a6112374Q89167m302572P57023J539967j293237K889275r09164O70450O74946l400619
1875a8597138K59813Q51468R61579p85981j012983J491986J076581N9384r27233r90124
1865a7612648j335338J785760K52258P57868N49002R62674P59933j232773l546897R29349
1855a7730812p98246L306429J738536o12749k185967J262573J542902K21197k050458
1846a5306595o33654L13721J273114k484819q45608o6523J290141j585120j30425K322402
1836a5853366k252642P10329R82728L67372M0082K190543l714513J06590l41693J296669
1826a6467901L15178k537612J865083N12145j080415q12201j45349K120944m43558J621577
1816a5052109n51223j415588q69067n6284J753110J131970M66626l339465J572510j161928
$$ y = [-16112374, -15223207, -19525779, -18768756, -17228789, -18522026, -15632751, -16541915, -15871465, -15196519, -18597138, -18337325, -17485857, -16524278, -17310259, -18323242, -16831256, -15754675, -15695291, -16622524, -17612648, -18947986, -17162226, -16909968, -16152100, -15603098, -14640424, -13880491, -15113264, -18660161, -17730812, -18529058, -15222629, -13484093, -14096842, -16282809, -15020236, -13477334, -13256137, -15306595, -15940249, -15626528, -14353414, -16838233, -17683841, -17750364, -16460223, -18045343, -18175768, -15853366, -18106008, -17395679, -16412951, -16045579, -16005497, -13814954, -17529467, -17422877, -17764570, -16467901, -16152723, -18690335, -16825252, -16313107, -17393522, -18205723, -18351072, -16230128, -16673686, -15052109, -15603332, -17018920, -17887987, -17944271, -16191161, -15059191, -14592565, -17932030, -16359520, -17521448]
1806a7521448j822815L821591k20679J486024m381057n94136Q51917L037009m94414
1797a5838008j213996J972004j097776q48868n56557p41710J633568J513905l88158
1788a5565596j686322j72859O3532j207735R78168K378487j700449p42400Q53765r70893
1778a7772302P34089L90439q84722K192328q29747P19836Q119Q92759o94990k526309
1768a7770500O13860M07428o69405m66902k242680Q49383J647973l55277J984941J112326
1758a4888853N75726l012872K68150L11898J545532r21216o55281q09622j091644K064357
1748a6613825Q8025k32809j201869p985K024143m61680j20374J568237Q90953j861217
1738a5928401n62852j537122J639934M05846J48652j763466L2976J92482L102546j312078
$$ y = [-17521448, -19344263, -15522672, -15743351, -14257327, -18638384, -19232520, -18380603, -15343594, -15838008, -17052004, -15080000, -16177776, -17026644, -17583201, -18324911, -16691343, -15177438, -15565596, -17251918, -17424777, -17361245, -18568980, -17590812, -15212325, -16912774, -17655174, -16801409, -17772302, -17038213, -16647774, -17532496, -15340168, -16169915, -15450079, -15441960, -14549201, -15244191, -17770500, -17156640, -16749212, -17418617, -17885519, -20128199, -19278816, -17630843, -17986120, -16001179, -14888853, -14313127, -17325999, -17057849, -16745951, -15200419, -16121635, -16776916, -17586538, -18678182, -16613825, -16525800, -16758609, -17960478, -17968463, -15944320, -16406000, -16526374, -14958137, -14067184, -15928401, -16491253, -18028375, -16388441, -15982595, -15833943, -17597409, -17564433, -17371951, -14269405, -15581483]
1728a5581483o16107J515682k884244Q88486R93915k310198J941883N02771q80752J325957
1718a5104090l135642J749769L95737j052573k28509J96437k19151K69536K747507k306279
1708a6687258j114380p68723m27204J917539l7408k4518M35108J62068R00136l300887
1698a8945527K31815k79535K464359j380010J123095J000605K91835K86260l33717Q34359
1688a4706461j546964N96106o08859L15471n91079j565141L33312J301564M47701j525231
1678a7549581k48259N94707k414434L849714r81849j512071J553269M43768K05055n59616
1668a6619297q06235j39823Q45084j852128J564876k77044l42220N96940K38381m76915
1658a7268381l48762n96460j611808K855319n8743j181107K483747l147703P94164N13455
$$ y = [-15581483, -16197590, -14681908, -17566152, -16677666, -15683751, -17993949, -16052066, -15549295, -16430047, -15104090, -18239732, -16489963, -16094226, -17146799, -17375308, -17178871, -17398022, -17128486, -14380979, -16687258, -17801638, -18570361, -18997565, -17080026, -17117434, -17141952, -16706844, -16544776, -15644640, -18945527, -18713712, -18993247, -16528888, -17908898, -16785803, -15785198, -15493363, -15207103, -15540820, -14706461, -16253425, -15657319, -16266178, -15950707, -16541786, -18106927, -17773615, -16472051, -16024350, -17549581, -17797840, -17203133, -19617567, -15767853, -16749702, -18261773, -16708504, -16264736, -16059681, -16619297, -17425532, -17565355, -16720271, -18572399, -17007523, -17284567, -17626787, -17029847, -16791466, -17268381, -17617143, -18213603, -19825411, -16970092, -17028835, -18209942, -15726195, -18873898, -18079734, -17566279]
1648a7566279q9219K425951k513420j11233j613999K353859J739485j411545K14503N6113
1638a6515784K477470k396376q4460j455110K220563p27117J188886l438406K627445
1629a6102889N25664j70096j998539k307083K379708Q60778j107137k83948k59353K831216
1619a5631679q1823j140517J922242k31636J10452j345886L389931l002222K239229
1610a3771909k512790j788736J614365L88350O06097q25028k679719l2052O24058M69058
1600a7908306k226473M516338J1128N52712k517030J416199j120277L386039j447938
1591a5337608k215407J044287M20244Q39480M51190j348545j504221K202545J096900
1582a4351135k667585L45520J087807Q76020j737997K08727J241944l43022k953292
$$ y = [-17566279, -17655498, -15229547, -17742967, -17854200, -19468199, -17114340, -15374855, -16786400, -16571897, -16515784, -14038314, -16434690, -16519150, -17974260, -15753697, -16480814, -15291928, -18730334, -16102889, -15577225, -15747321, -17745860, -20052943, -17673235, -16812457, -17919594, -18203542, -18462895, -15631679, -15713502, -16854019, -14931777, -15163413, -15052961, -16398847, -13008916, -16011138, -13771909, -16284699, -18073435, -16459070, -16070720, -15464623, -16289651, -18969370, -19001422, -18377364, -17908306, -20134779, -15618441, -15607313, -15054601, -17571631, -16155432, -17275709, -13889670, -15337608, -17553015, -16508728, -16088484, -15249004, -14797814, -16146359, -17650580, -15448035, -14351135, -17018720, -16673200, -15585393, -14709373, -16447370, -16238643, -14996699, -15339721, -18293013]
1573a8293013J544762P40132J573266j012616k93535q58089N19464j714243j155975N87099
1563a8362748J120692p37908j792484L595692k217817M34414K99871o57973J271970
1554a7046291K163129j727525R57150J1239j318441P21186m38263O63090Q79085q10452
1544a5946093k291800R1179o9674L452752N55659j460943o69515p26684m29866L81084
1534a7113901L414839r01276m33904k019278q12578m01949O77315j984981K779541j72729
1524a6968901J400683k097877Q45615R28155j826634P06033j133424Q00881K122236
1515a5223233j335046Q37561k607130K948898m22062O30726N58979k903770J373188
1506a6141889j296802Q62865n7926k021682J022250Q21898P45056l317254J858276L06615
$$ y = [-18293013, -16748251, -16008119, -14434853, -15447469, -15741004, -16599093, -16079629, -17793872, -18949847, -18362748, -17242056, -17979964, -19772448, -16176756, -18394573, -17960159, -17660288, -18318261, -17046291, -14883162, -16610687, -15653537, -15642298, -16960739, -16239553, -16677816, -16014726, -15135641, -15946093, -18237893, -18146714, -18216388, -14763636, -14207977, -15668920, -16338435, -17065119, -17494985, -17113901, -13699062, -14600338, -15034242, -17053520, -17866098, -18268047, -17590732, -19575713, -16796172, -16968901, -15568218, -17666095, -16820480, -15892325, -17718959, -17012926, -18146350, -17345469, -15223233, -16558279, -15720718, -18327848, -15378950, -15801012, -15170286, -14611307, -17515077, -16141889, -17438691, -16575826, -16633752, -18655434, -17633184, -16811286, -16066230, -19383484, -17525208, -17218593]
1496a7218593R0990l87453J472933k557737J646170n04225J958909j01787k956322J016044
1486a7541071l408q47144l64834L173024k559650k76689j043294n90335J082371K252662
1476a6718368k054731J659841r16431J88435J21851N16765Q12893K234846j064828Q36842
1466a4382885n66398k7254q43282n05310k189263J621588n92652m81471J827077j908567
1456a8048417q76984K069211j064760l51693J735794J635873j087913j092009J00920
1447a6979978j663975L15081P74313K619693j328371k66057j280001p80694K063797
1438a6526192J353007K20033m42508k439593J276014j221306K27698k30924j632378
1429a9416149K588678J89542m88622q10966O53604Q84629Q32474k146577J55563Q35089
$$ y = [-17218593, -17127603, -17515056, -16042123, -18599860, -16953690, -17457915, -15499006, -15600793, -18557115, -17541071, -17544479, -18391623, -18756457, -15583433, -18143083, -18419772, -19463066, -20053401, -18971030, -16718368, -18773099, -17113258, -18029689, -17841254, -17719403, -17202638, -16389745, -14154899, -15219727, -14382885, -14949283, -14976537, -15819819, -16325129, -18514392, -16892804, -17485456, -17966927, -16139850, -18048417, -18925401, -16856190, -17920950, -18272643, -16536849, -14900976, -15988889, -17080898, -16979978, -18643953, -18328872, -17554559, -14934866, -16263237, -16529294, -17809295, -18589989, -16526192, -15173185, -14953152, -15395660, -17835253, -16559239, -17780545, -17552847, -17783771, -19416149, -16827471, -16637929, -17126551, -17937517, -17283913, -16399284, -15566810, -17713387, -17557824, -16722735]
1419a6722735M49596l03210J288871q99470j184722p77609q02741n29154K761150N3236
1409a6666788k34279j419633J916501N15747K287969m011614r87697J630773r93157
1400a7962178K087292K020470k030219M33272k654497M332551j797844j898611J949r92531
1390a8460346K673054k056037J212879M08658J06942J554884j218801j73931j365912
1381a7318610m96389M96657j080190o7086Q40995J814972j150549l69436J209005j421639
1371a7542270r3658Q44366j613705Q7806P04916j615785J993832K584745k224056l579719
1361b0453528J760652P13618Q0749j331558R18938K339505P5632J985847j819397k102023
1351a7831565P32243J14924J730738j308013L221308k533309k66109l02730j110271
$$ y = [-16722735, -16273139, -16576349, -15287478, -16186948, -17371670, -18149279, -18952020, -19481174, -16720024, -16666788, -16901067, -18320700, -16404199, -15888452, -13600483, -17612097, -18599794, -16969021, -17962178, -15874886, -13854416, -15884635, -15451363, -18105860, -13773309, -15571153, -17469764, -17467815, -18460346, -15787292, -17843329, -16630450, -16221792, -16114850, -14559966, -15778767, -15952698, -17318610, -17814999, -17318342, -18398532, -18465618, -17624623, -15809651, -16960200, -17329636, -16120631, -17542270, -17635928, -16791562, -18405267, -18317461, -17612545, -19228330, -17234498, -14649753, -16873809, -20453528, -18692876, -17979258, -17898509, -19230067, -18311129, -15971624, -15895992, -13910145, -15729542, -17831565, -17099322, -16984398, -15253660, -16561673, -13340365, -15873674, -16139783, -16442513, -17552784]
1342a7552784J492247o11495J279225q50441j177786Q40563j903920l80063M18468J122569
1332a7323417j230718K566120K1797j27506j945132R57007R99252N48422q02562k675644
1322a9012381N353560m426129N192620o608395L287959r1013R61645l388863Q590q18861
1312a9541268L902924j452734L784411l36426R85005k447649k060319J931410r67329
1303a6201975K46526j179517Q81331K332133o43172j971845J294544l854468J38986l61429
1293a9318886K749707j78832p84654N16926r52211K460134l287007J503672K363496o81552
1283a5609207j310153M94262l28837M62999k558703K708909k84705k137091N6443J408531
1273a7097552K383352j625475k159651R36165j37254p87728j134221K220355m07972
$$ y = [-17552784, -16060537, -16672032, -15392807, -16243248, -17421034, -16580471, -18484391, -18864454, -18445986, -17323417, -18554135, -15988015, -15966218, -16093724, -18038856, -17081849, -16082597, -15534175, -16336737, -19012381, -13658821, -18084950, -12892330, -19500725, -16212766, -16303779, -15342134, -18730997, -18722407, -19541268, -15638344, -17091078, -13306667, -13643093, -12658088, -15105737, -17166056, -15234646, -16201975, -15955449, -17134966, -16253635, -13921502, -14564674, -16536519, -15241975, -19096443, -18957457, -19318886, -16569179, -16748011, -17532665, -17015739, -17967950, -15507816, -18794823, -17291151, -14927655, -15609207, -16919360, -16425098, -16753935, -16290936, -18849639, -16140730, -16425435, -18562526, -18506083, -17097552, -14714200, -16339675, -18499326, -17563161, -17700415, -18488143, -19622364, -17402009, -17809981]
1264a7809981M700549m356961P00302O50329o46836N5752m05780l98413K86391l60333
1254a7584981m80374K711653J314216k171610l449J03385j420407r06026K123469m18656
1244a6732780m34979j631543L563344j847307K43497p65724Q87010J519793m102397
1235a9301086L050591l37251m61029L21467k634862O69800J629997K81814n80703J329364
1225a6031898j725462k95014J309640P12662O49301j693673J646950J041365J35873
1216a4250256k678490q4430n9085m10107o58615J657599L51949j496617O61646Q60570
1206a6105836J843998m25212l596211K351510j257749j259264J98122P15136j51385j58449
1196a7845340R53246O9157j842450K360250l0416L56611M3981J92923Q29068k274991
$$ y = [-17809981, -13109432, -17466393, -16766091, -16115762, -16762598, -16706846, -17112626, -17511039, -17224648, -17584981, -18065355, -15353702, -14039486, -16211096, -16214545, -16111160, -17531567, -18437593, -16314124, -16732780, -17167759, -18799302, -15235958, -17083265, -16839768, -17605492, -16718482, -15198689, -19301086, -16250495, -16587746, -17048775, -16727308, -19362170, -18692370, -17062373, -16780559, -17361262, -16031898, -17757360, -18052374, -16742734, -16030072, -15380771, -17074444, -15427494, -14386129, -14250256, -16928746, -17013176, -17072261, -17482368, -18140983, -16483384, -16131435, -17628052, -16966406, -16105836, -14261838, -14687050, -18283261, -15931751, -17189500, -18448764, -18250642, -17535506, -17686891, -17845340, -16892094, -16822937, -18665387, -16305137, -16335553, -15978942, -15934961, -15742038, -14912970, -17187961]
1186a7187961M95390o11735J409731R20414j376186L56628j254438m43144k453953J756588
1176a8388666q80397M83238J3691K673747j681112J771016j613515j49879K83104Q69693
1166a6619080j968221P83832l60481j101908l326J522446J919835O98487n65966o63054
1156a6357436p67048Q98801R7774k386159m58330R09401N8163K625909k565031L25531
1146a7618425m55223K470673m31249n96789l07281J539050k255655k181385K159485l44380
1136a8021179K102768L87466j898615L18704L93189o00583J372052M55047j203910J485936
1126a5209125r17501j508462M88233L683432k270519j543052K383182l83244k027537
1117a7304593q48320J371206k095671Q0393J88265j312049O12432P53497L970860k29829
$$ y = [-17187961, -16692571, -17304306, -15894575, -14974161, -16350347, -15993719, -17248157, -17691301, -20145254, -18388666, -19269063, -18785825, -18772134, -16098387, -17779499, -16008483, -17621998, -17771877, -17488773, -16619080, -18587301, -17803469, -18163950, -19265858, -19269184, -17746738, -15826903, -15128416, -15694382, -16357436, -17124484, -16225683, -16127909, -18514068, -18972398, -18062997, -18004834, -15378925, -17943956, -17618425, -18073648, -15602975, -16034224, -16631013, -16938294, -15399244, -17654899, -19836284, -17676799, -18021179, -15918411, -15530945, -17429560, -17110856, -16717667, -17318250, -15946198, -15491151, -16695061, -15209125, -16126626, -17635088, -17146855, -13463423, -15733942, -17276994, -14893812, -15277056, -17304593, -18152913, -16781707, -18877378, -18796985, -18608720, -19920769, -19308337, -18554840, -14583980, -14813809]
1107a4813809j658653k4936J527455k604235K862784j652709k358888R64147j663594
1098a9422438M578142P52931k312486r34914j14139n21108K223181q48747p96522J000082
1088a6396018J791788j774961j5495m5238k345997Q4109J469563j018625K071184k13916
1078a6393606o01428p47222Q13685J785333M35957l202779N84213q64456j366332J691350
1068a7865285K692560l03483N82770k125853J79329j373224J651182J004055j907360
1059a7465309K261312k026752L41201Q69964j668973K81098J655073K47831r74541J721435
1049a4757661j528626j616315N43426J609195o28147j837242P94903P39474R97398j117283
1039a6800878J176292j182425Q21173q30680j285778N22988K313879k291116J601735
$$ y = [-14813809, -16472462, -16497398, -14969943, -17574178, -14711394, -16364103, -18722991, -17758844, -19422438, -14844296, -14091365, -16403851, -17338765, -17452904, -17974012, -15750831, -16599578, -17396100, -16396018, -14604230, -16379191, -16394686, -16439924, -18785921, -18701812, -17232249, -18250874, -16179690, -16393606, -16995034, -17742256, -16928571, -15143238, -14707281, -17910060, -17325847, -18190303, -19556635, -17865285, -15172725, -15476208, -14893438, -17019291, -16839962, -18213186, -16562004, -15557949, -17465309, -15203997, -17230749, -16889548, -16019584, -17688557, -17407459, -15752386, -15504555, -16479096, -14757661, -16286287, -17902602, -17359176, -15749981, -16378128, -18215370, -17420467, -16680993, -15683595, -16800878, -15624586, -16807011, -15985838, -16816518, -18102296, -17579308, -15265429, -17556545, -15954810]
1030a5954810o38774j524154K214049j004478j49585L8544J564969j721623J580835
1021a5595027k932595M71297N43494K261823k96110r3423K56249n04397R24506n87779
1011a5551962j680465J105698j856116R41763l92955n70583R67370J274027j873755
1002a7636978k633426N717978q657k416042j059247L021021k45678r27738r85269R6234
992a7077802j08759J528421o62394k240742j74885j676667K517995J202540J194663
983a5497630k345164j866303M84720J151478J766497j620511L41737L54198J997490
974a5233488j458627M31078M14104j3270K268105k106422K96224j202744O88264k411956
964a8328732J065933j001594j917019N9107K325563K293817j092350M34845n01951Q39312
$$ y = [-15954810, -16593584, -18117738, -15903689, -16908167, -17057752, -17019208, -15454239, -17175862, -15595027, -18527622, -18056325, -17512831, -15251008, -15547118, -15640541, -15384292, -15888689, -14964183, -15551962, -17232427, -16126729, -17982845, -17041082, -17434037, -18004620, -17037250, -15763223, -17636978, -20270404, -14552426, -14561083, -16977125, -18036372, -15015351, -15261029, -16188767, -17174036, -17077802, -17186561, -15658140, -16320534, -18561276, -18736161, -20412828, -17894833, -16692293, -15497630, -17842794, -19709097, -19224377, -18072899, -16306402, -17926913, -17585176, -17230978, -15233488, -16692115, -16261037, -15846933, -15860203, -13592098, -15698520, -15402296, -16605040, -15916776, -18328732, -17262799, -18264393, -20181412, -20122305, -17796742, -15502925, -16595275, -16160430, -16662381, -15823069]
954a5823069m06692j860292J587999o99529n92930m1330K77386K257505k54017k423333
944a7978302L64638O91547J43893m99802M83125K328842O84056k065916O47673j569471
934a6769717j441382J378643j852353l75506L835474L7975j007942j012948O32588m51507
924a7026675J684499j497166o99470J074771j904148J815345J749965l267011K223652
915a5846238j84784P17183K02037r04663M04890j719020K136364o77779j98724M64828
905a5605906j708785L706182j787040l95896J69110o70048m60468j690767J046455j169475
895a8566638M999225l725427n35388r21646k39908L473092p8981J541763l268267N34788
885a6787387O00899k799719M40576N2373K070423m88593k003092K061333j465685k0300
$$ y = [-15823069, -16229761, -18090053, -16502054, -17201583, -17794513, -17835843, -17558457, -15300952, -15554969, -17978302, -17613664, -16922117, -16778224, -17278026, -16794901, -14466059, -13782003, -15847919, -15200246, -16769717, -18211099, -16832456, -18684809, -19060315, -15224841, -15186866, -16194808, -17207756, -16575168, -17026675, -15342176, -16839342, -17538812, -16464041, -18368189, -16552844, -14802879, -18069890, -15846238, -16031022, -15313839, -15111802, -16016465, -15611575, -17330595, -15194231, -15872010, -16070734, -15605906, -17314691, -13608509, -15395549, -15791445, -15622335, -16292383, -16752851, -18443618, -17397163, -18566638, -13567413, -17292840, -17828228, -18749874, -18989782, -15516690, -15595671, -14053908, -17322175, -16787387, -16186488, -18986207, -18545631, -18493258, -16422835, -16911428, -18914520, -16853187, -18318872, -18339172]
875a8339172K456100M85440j365833Q85847q33769m20948K31429j466082J115389k739869
865a9991468K889285P89940j816871J592689k529907J790346k323028r544703J2897378
856a6246339n12680q74078J158173p23498k348368R70089q73663m88173K188730J920201
846a5829606j000399J952129r39269M4672k626657J004183k13168j959929L551655P08231
836a5308158j253804l86730J046956o15987L02271J014782m9939j180106P23379J591042
826a4116294m342759l02359J933070J05472R9230j725814J27313J428316j67287J493181
816a5467931r01334J200489O58860o70718N10337k221785m03901J794922k269932J150336
806a6620657J359105k334170q81846J562395K16231r77263K5677k028660J657069j134588
$$ y = [-18339172, -15883072, -15397632, -16763465, -15877618, -16711387, -17132335, -16900906, -18366988, -17251599, -19991468, -17102183, -16312243, -18129114, -16536425, -19066332, -17275986, -19599014, -29143717, -16246339, -16759019, -17633097, -16474924, -17198422, -19546790, -18576701, -19450364, -19938537, -17749807, -15829606, -16830005, -14877876, -15817145, -15772473, -18399130, -17394947, -17608115, -19568044, -16016389, -15308158, -16561962, -16948692, -15901736, -16517723, -16215452, -15200670, -15250609, -16430715, -15707336, -14116294, -18459053, -18761412, -16828342, -16722870, -16623640, -18349454, -18222141, -16793825, -16961112, -15467931, -16369265, -15168776, -14509916, -15180634, -14670297, -16892082, -17295983, -15501061, -17770993, -16620657, -15261552, -17595722, -18477568, -16915173, -16698942, -17676205, -17650528, -19679188, -18022119, -19156707]
796a9156707J457819P83182r17365j274870j862456K541051R08974j357882N9234o43778
786a9462798J620318q33630K811106l110922J774296J40982R7492O4939k97894j1996n1780
775a7259887j275417j316795L313608J38085q0175m90421J187002q32928R4445Q61870
765a5660613k328401K117502k712157K571973j399464P89862j499214j815694J858951
756a8077255O68037K015998l456662J298099M13435O47272q78504m81861L49504p41593
746a8243530r29488K492853M42378j533459P17983N06326J262j273289J486765j245350
736a7577549J513442J023011n26212k886185k48024K271144J093417j803008O35852L40977
726a6163135m059593R45081J026853O56962p56359O66126R39157j486169J165735K443048
$$ y = [-19156707, -17698888, -16915706, -17833071, -19107941, -20970397, -18429346, -17520372, -18878254, -18819020, -19462798, -17842480, -18676110, -15865004, -18975926, -17201630, -17060648, -16963156, -16898217, -17196111, -17208107, -17259887, -18535304, -19852099, -16538491, -16400406, -16480581, -16971002, -15784000, -16616928, -16522483, -15660613, -17989014, -15871512, -18583669, -16011696, -17411160, -16621298, -18120512, -19936206, -18077255, -17409218, -15393220, -18849882, -17551783, -17138348, -16491076, -17369580, -17851441, -17501937, -18243530, -19173018, -16680165, -16237787, -17771246, -17053263, -16546937, -16545675, -17818964, -16332199, -17577549, -16064107, -15041096, -15567308, -18453493, -18701517, -16430373, -15336956, -17139964, -16504112, -16163135, -20222728, -19277647, -18250794, -17593832, -18350191, -17684065, -16744908, -18231077, -17065342, -14622294]
716a4622294j225150j446301k542801J616936J530468Q52751j819849j10084N62268l61179
706a7565235O18091q97352J510485J025269k00099k200300l108481N131133N85255M45454
696a4655780j607425R7669j064989M82352k709715K140126o53219M15647l93746J832409
686a6116671o12823J251238j474574o37249N92950R94310j681109J096269j9037j099367
676a7706063k92118q66479L619062j202415Q77013k364612J318585O73850p09470o91907
666a7344554j417179J188016J572599j457960J353007n62894l09056r02960O72154j869238
656a9078065j012614L098483J67124J4047j417929K42663K423313k335057p62478j235251
646a9895764K011519j63184j93401J176819l177710L276330j419305J072225L428951
$$ y = [-14622294, -15847444, -17293745, -19836546, -18219610, -16689142, -15836391, -17656240, -17766324, -17204056, -17565235, -16947144, -17844496, -16334011, -15308742, -15508841, -17709141, -20817622, -15686489, -15101234, -14655780, -16263205, -16165536, -17230525, -16748173, -19457888, -17317762, -17970981, -17555334, -17949080, -16116671, -16729494, -15478256, -16952830, -17590079, -16997129, -16002819, -17683928, -16587659, -16606696, -17706063, -17998181, -18864660, -15245598, -16448013, -15571000, -17935612, -16617027, -15943177, -16652647, -17344554, -18761733, -17573717, -16001118, -17459078, -16106071, -16668965, -16978021, -17880981, -17208827, -19078065, -20090679, -16992196, -16825072, -16811025, -18228954, -17986291, -15562978, -17898035, -18660513, -19895764, -17884245, -18047429, -18240830, -17064011, -20241721, -16965391, -18384696, -17312471, -13883520]
637a3883520j200121j203863m73965q99710O06653j838536M149695m091355J004433
628a7830289K691178j237538j746053k867032L528302J774267K62473j636437k331803
619a9392932j25354N41941J474805l33187L70065L78560N06256q24915o05153k19315
609a8229229R28581J065953j377347M6184K858050l675266K697236M7055j837581m02649
599a7879013K359161k22111K06261j428948k721155L959224J556721l140354R02529Q99508
589a5508177j502903J154532j50029l66576M80182p67292J617142o52812r41335K359396
579a4277872j436661K539331k304343M22585k574243j203587k58187K688311l271138
570a9675804J396102M30585J226119O28330j521185J271671j163442j651306J474348
$$ y = [-13883520, -15083641, -16287504, -16761469, -17661179, -17054526, -18893062, -14743367, -18834722, -17830289, -15139111, -16376649, -18122702, -20989734, -17461432, -15687165, -15424692, -17061129, -19392932, -19518286, -18976345, -17501540, -17834727, -17464662, -17086102, -16579846, -17404761, -18009914, -18229229, -17300648, -16234695, -17612042, -17565858, -14707808, -18383074, -15685838, -15638783, -17476364, -17879013, -15519852, -15741963, -15535702, -16964650, -19685805, -15726581, -14169860, -17310214, -16407685, -15508177, -17011080, -15856548, -16006577, -16373153, -15892971, -16660263, -15043121, -15695933, -16637268, -14277872, -15714533, -13175202, -15479545, -15056960, -17631203, -18834790, -19092977, -16404666, -19675804, -18279702, -17849117, -16622998, -15994668, -17515853, -16244182, -17407624, -19058930, -17584582]
561a7584582k407865l29350K076949M89956m63564j274057J578097j002354R16394O19884
551a7380492k67814N55344j626882k17358J445658K247945j984153j199119m14854P34681
541a8107044j387064R48321k28423j928371K549759j136501k64852j204064k36637K059723
531a8935153K57869P77492P17778j620207Q11556m41785j222527K823177r78643p41598
521a8552041N59554J405821l05232M71663p65289l63455k83452k196535K673954j908665
511a9263677l35213Q85362n13321p94517J115186k25856j284150J22375J66301o1960
501b0189470m60131L280153k88652l27633J748477j754192Q37144j36374o59970m61272
491a8411920P20269K298512n628031K639983J649295j524436q67807P92236N13086J622808
$$ y = [-17584582, -19992447, -20321797, -18244848, -17754892, -18218456, -19492513, -17914416, -18916770, -18000376, -17380492, -17648306, -17092962, -18719844, -18937202, -17491544, -15243599, -17227752, -18426871, -18841725, -18107044, -19494108, -18545787, -18774210, -20702581, -18152822, -19289323, -19554175, -20758239, -20994876, -18935153, -18677284, -17899792, -17182014, -18802221, -17990665, -18432450, -19654977, -16831800, -17810443, -18552041, -17992487, -16586666, -16891898, -16420235, -17185524, -17548979, -17832431, -20028966, -17355012, -19263677, -19598890, -18713528, -19226849, -20021366, -18906180, -19132036, -20416186, -20293811, -20127510, -20189470, -20649601, -17369448, -17658100, -17985733, -16237256, -17991448, -17154304, -17290678, -17950648, -18411920, -17691651, -15393139, -21021170, -18381187, -16731892, -18256328, -19124135, -18331899, -17818813, -16196005]
481a6196005q31109J089815j114868k951560J236055J468584J580817p69097R40823
472a5546545k525813K122795J176842l198195J52158Q47130K13457R59600p63515n36349
462a7098435J050257j770293O63107J177416p10177j827740n5696k54636R36051j664588
452a9554734J353948k060491J580386K31914n11621J52513K143570o43400r65749r04437
442a9178101J381039j185282J706371j181152J837570j247948j607692l89879J429939
433a8435135J520028j804473L50293m36283l28414M062377r2595k833464K032473k506920
423a8472113R2947l89440J339909j886117J116156l73925r84551P13547L201312r82023
413a6624298M00101p44421j188501M50400R9150J346549k06998J887106l164104J847239
$$ y = [-16196005, -17027114, -15937299, -17052167, -20003727, -18767672, -17299088, -15718271, -16487368, -15546545, -18072358, -15949563, -14772721, -17970916, -17818758, -16971628, -16758171, -15798571, -16562086, -17098435, -16048178, -17818471, -17155364, -15977948, -16688125, -18515865, -18571561, -18826197, -17890146, -19554734, -18200786, -20261277, -18680891, -18448977, -18960598, -18808085, -16664515, -17307915, -18273664, -19178101, -17797062, -18982344, -17275973, -18457125, -16619555, -17867503, -19475195, -19865074, -18435135, -16915107, -18719580, -18369287, -18805570, -19133984, -15071607, -15164202, -17997666, -15965193, -18472113, -18379166, -18768606, -17428697, -19314814, -18198658, -18572583, -19557134, -18843587, -15642275, -16624298, -16224197, -16968618, -18157119, -17706719, -17607569, -16261020, -16468018, -14580912, -17745016, -15897777]
403a5897777m69285m67729N18214k08660j77385k067268J9036j176093L658144j631877
393a7900680J934169Q19739j174168m175945L673929j619281P21007k5084Q80464K73578
383a6592272q23679l76370k21061j190814K239782L02913r22187j442201N47857J744042
373a6733990o99478J359600q97110k78803R97660j912146K546574j451495k975714L251733
363a6793169N80586q34127j839267J941686M66225j201341m69675R42049r53775k091214
353b0252022K825792M9098J154933P24850N13949j945875q39283j261587Q59858J424239
343a6746048j747358J144141j303371k085809K771213j158003J259847L07259k688327
334b0246456J280924R17339j230107P78446J350211j621024n48089K015327O083k141516
$$ y = [-15897777, -16367062, -16834791, -16316577, -16525237, -16702622, -18769890, -18750854, -19926947, -16268803, -17900680, -15966511, -15146772, -16320940, -20496885, -16822956, -18442237, -17721230, -17746314, -16865850, -16592272, -17415951, -17792321, -18013382, -19204196, -16964414, -16661501, -17583688, -19025889, -18478032, -16733990, -17433468, -16073868, -16970978, -17249781, -16252121, -18164267, -15617693, -17069188, -20044902, -16793169, -16212583, -17046710, -18885977, -16944291, -16478066, -17679407, -18149082, -17207033, -18160808, -20252022, -17426230, -17377132, -16222199, -15497349, -14983400, -16929275, -17768558, -19030145, -18170287, -16746048, -18493406, -17349265, -18652636, -20738445, -17967232, -19125235, -17865388, -17558129, -20246456, -18965532, -18048193, -19278300, -18499854, -17149643, -18770667, -19318756, -17303429, -17297346, -19438862]
324a9438862Q95718Q02111J059527r43507J55521P64176r57882J189846J077099k676291
314a8072544J603265p06408p54192j781982K678984O28094m29545j35069q1037M70307
304a6580127n97956m48617J496251l031966K034786J49959J437230k119145j31669J456242
294a6335012k393254K71379R57916q220K701958k767263J663253j478218J935100K031880
284a3420481o680967J411412K71554J312598J852866q48648m072671L552568Q04157o99665
274a6517277Q21244r59168N85955k667896J350611K386528k514404J165447M69822m246578
264b0125716J635163K37564M10783j548122R53577K582218p28720N24968k584395J440547
254a7202133O25252k965104J309293P43647J225064m07486j067365M23152R9441L21317
$$ y = [-19438862, -18543144, -17741033, -16681506, -17625013, -17469492, -16705316, -17663198, -16473352, -15396253, -18072544, -16469279, -17175687, -17929879, -19711861, -17032877, -16404783, -16834328, -16969397, -17050434, -16580127, -17178083, -17626700, -16130449, -19162415, -17127629, -16977670, -15540440, -17659585, -17791254, -16335012, -18728266, -18456887, -17498971, -17507191, -14805233, -17572496, -15909243, -17387461, -15452361, -13420481, -20101448, -18690036, -18418482, -17105884, -15253018, -16101666, -20174337, -16621769, -15817612, -16517277, -15696033, -16655201, -16069246, -18737142, -17386531, -15000003, -17514407, -16348960, -15879138, -20125716, -18490553, -18252989, -17842206, -19390328, -18436751, -15854533, -16583253, -16058285, -18642680, -17202133, -16576881, -19541985, -18232692, -17489045, -16263981, -16671467, -17738832, -17315680, -17216239, -16894922]
244a6894922K63082j563792K376922p75022j040077j524103p33871K33652K274032L158
234a7380941j07887l65520o74184o97157K637980k559205k78212L078124j615150L46655
224a7615497J071250Q15502k467754K758493r99622m36512k28664j80384k50892N23256
214a7010824J280834j122135L43709k77999m38530l14324k72322K409451k642720K221007
204a5823853k242892j60503O85315Q34082N1748m50453O53612J57382j51655o13592q94321
193a7955130M44389J721112j562014Q76424K853425k734210j471725P46175j895653
184a8977207j213388L043700j250546J774845q63482J614648k179767O45262J731376
175a5674559j135495J457365l712957J945093R43936k52752M4086k249871l61252J131233
$$ y = [-16894922, -16631840, -18195632, -15818710, -16593732, -17633809, -19157912, -19891783, -19658131, -17384099, -17380941, -17488828, -17854348, -18528532, -19225689, -16587709, -19146914, -19425126, -16347002, -17962152, -17615497, -16544247, -15728745, -18196499, -15438006, -16437628, -16874140, -17102804, -17283188, -17534080, -17010824, -15729990, -16852125, -16508416, -16786415, -17224945, -17539269, -17811591, -15402140, -18044860, -15823853, -18066745, -18227248, -17541933, -16707851, -16656103, -17106556, -16452944, -16295562, -16447217, -17060809, -17955130, -17510741, -15789629, -17351643, -16475219, -13621794, -16356004, -17827729, -17081554, -18977207, -20190595, -17146895, -18397441, -16622596, -17486078, -15871430, -18051197, -17405935, -15674559, -16810054, -15352689, -19065646, -17120553, -16176617, -16429369, -16385283, -18635154, -18996406, -17865173]
165a7865173j515140L655256k777354R4809l95854L81432Q77669N68085j297818J21129
155a8152959P18782j221336K245054j464473j410722K285117r05538j030070J704670
146a7231475N23615M14547j762291M98948j034977P63176K52662J687114k76999q74776
136a7040456M13287J096493j585639J976460Q93461k115621k868787K032056l513502
127b0712248J995645J490476Q79007l657330K604636R72148p74460K041831k589049o3129
117a7812473k46185R26899P74246J702820j042033j83800j04328j827019K337323N42569
107a4931981j957431R55412j363802K280112k447412O22172P28621q26637J029080l186351
97a9098217M072780j668169J54126J05925J303682J557269q00227k410641k624096J377359
$$ y = [-17865173, -19380313, -15725057, -18502411, -18407602, -18803456, -18422024, -17544355, -16976270, -18274088, -18152959, -17434177, -18655513, -16410459, -17874932, -19285654, -17000537, -17906075, -18936145, -17231475, -16707860, -16293313, -18055604, -17556656, -18591633, -17828457, -17575795, -15888681, -16165680, -17040456, -16627169, -15530676, -17116315, -15139855, -14246394, -16362015, -19230802, -17198746, -20712248, -18716603, -17226127, -16347120, -20004450, -17399814, -16427666, -17202126, -15160295, -17749344, -17812473, -18058658, -17131759, -16357513, -14654693, -15696726, -15880526, -15984854, -17811873, -15474550, -14931981, -16889412, -15934000, -17297802, -15017690, -17465102, -16842930, -16114309, -16940946, -15911866, -19098217, -15025437, -16693606, -16539480, -16433555, -15129873, -13572604, -14372831, -16783472, -19407568, -18030209]
87a8030209L120270j244418k547620J970017J151164j846454J14620m01525N63397P65558
77a6385200P28064q27134l48749k968639K926036j399189J36073k80812Q17225J81940
67a7420385m1337j72227J008193J381325Q92302r98878J507201M72621k490306J169642
57a4691849q40656J944500k151991o26337J018667n56836k587059K649714N76489p68695
47a6034053j84465J132841l058935m08256K069240j796694J466254P00701j1343p8893
37a6203603J201977k66802k190503k638912K156368K6917P67921O01151M54304J812963
27a4278219l355677L67878q01252J579990J931411k507455K68540J396121M27338l01793
17a5273118j124636k053746j294477L186099j898969O73504j785619J989435J444693
$$ y = [-18030209, -14909939, -16154357, -18701977, -16731960, -15580796, -17427250, -17312630, -17714155, -17150758, -16385200, -15657136, -16484270, -16833019, -19801658, -16875622, -18274811, -18138738, -18419550, -17602325, -17420385, -17461722, -17633949, -16625756, -15244431, -14352129, -15351007, -13843806, -13371185, -15861491, -14691849, -15532505, -13588005, -15739996, -16366333, -15347666, -15904502, -18491561, -15841847, -15265358, -16034053, -16218518, -15085677, -18144612, -18552868, -16483628, -18280322, -16814068, -16113367, -16124710, -16203603, -15001626, -15268428, -17458931, -20097843, -17941475, -17914558, -17146637, -16545486, -16091182, -14278219, -17633896, -17266018, -18067270, -16487280, -14555869, -17063324, -16794784, -15398663, -14971325, -15273118, -16397754, -18451500, -19745977, -16559878, -18458847, -17785343, -19570962, -17581527, -16136834]
8a6136834l935413K321341j066339k82722K094717J651659l031963O22222k28042O70946
-2a7320428q59201J67733N61678J2019k10256j066998L265929l70160j24124j568231
-12a7512039R19491j715347J169100j592522J31152P29889k352847O55239M428159l280152
-22a8419877N59624q23206R14041j899832J931180o43316l3441N87117k45702j220831
-32a9294243J321287k27590j03530k20650j200539p5799j007501J696502K744365J445133
-42a4922565k023131P56178j358840j289932k54114N82113J993538p05394k05839k468677
-52a9896663J444934K054951l175728r05557L117880k62623k070019J405656P93010
-61a7494159J540160k008885j366285O03107Q74161J491816J88888k269303j383610
$$ y = [-16136834, -20072247, -17750906, -18817245, -19099967, -17005250, -15353591, -18385554, -17763332, -17991374, -17320428, -18179629, -18011896, -17450218, -17438199, -17648455, -18715453, -15449524, -15819684, -15943808, -17512039, -16592548, -18307895, -17138795, -18731317, -18600165, -17870276, -20223123, -19567884, -15139725, -18419877, -17860253, -18683459, -17769418, -19669250, -17738070, -18381386, -18414827, -17827710, -18073412, -19294243, -17972956, -18200546, -18304076, -18524726, -19725265, -19801064, -20808565, -19112063, -16367698, -14922565, -16945696, -16189518, -17548358, -18838290, -19092404, -18510291, -16516753, -17222147, -17427986, -19896663, -18451729, -16396778, -19572506, -20478063, -17360183, -17622806, -19692825, -18287169, -17494159, -15953999, -17962884, -19329169, -18726062, -17851901, -16360085, -16171197, -18440500, -19824110]
-70a9824110K790141K1314j603635O88137m96356J955127j941085k03167K91414j034102
-80a9356322o32574R59435m32606L163555n92032k243849L082971j47958R20990l099840
-90a8378230J044978K24617o59714o13586j533974L165263Q1458p37157j29674k60958
-100a7796977k245914J424951M51566J929406m270615N56112J491700K007181P03945
-109a5748645j923926J180118j731766K619240j224102P85851m5155j428338M17680Q83960
-119a6215083m32435m60091J922802j084450N53852q88990m35251m103984N546261R53499
-129a4643870k736970j300901J135347p57180K730071j630912N24323j183992J83471
-138a7680613K432699k033993l51534L06117k32240l39364J047538j55491R04795J256420
$$ y = [-19824110, -17033969, -17012655, -18616290, -17928153, -18424509, -16469382, -18410467, -18613634, -18322220, -19356322, -19988896, -19029461, -19462067, -16298512, -16890544, -19134393, -16051422, -16199380, -15278390, -18378230, -17333252, -17108635, -17768349, -18381935, -19915909, -16750646, -16669188, -17406345, -17536019, -17796977, -20042891, -18617940, -18166374, -16236968, -20507583, -19951471, -18459771, -16452590, -15748645, -17672571, -16492453, -18224219, -15604979, -16829081, -16043230, -16088385, -17516723, -17099043, -16215083, -16647518, -17107609, -15184807, -16269257, -15715405, -16604395, -17039646, -21143630, -15597369, -14643870, -17380840, -18681741, -17546394, -18303574, -15573503, -17204415, -16680092, -17864084, -17680613, -15247914, -17281907, -17633441, -17327324, -17559564, -17898928, -16851390, -17006881, -16102086, -14845666]
-148a4845666j355586N98308j362250J668645k366754J617070O4666O28773J282950r63725
-158a5033569j413658j558795J918590P63670j182708J934986j863235J110392o04198
-167a5928525k650480k93357R60859O67664K32717K290598k283209k92902k809272J847250
-177a8258657L106228K3127l8897m2943j214246L84824J244381O54614k741700q85727
-187a7768996J27477J88379J147583j725270j346501J497674J387087N85183M32413
-196a5474971k238003J741411J002449j667503L10123m99073m73808K664590j114344
-205a5749129l155361K833713j932278j21549J914168K520330q37067n08277k849016L0194
-215a7854272q25911J286375J513646n22594p71407J390638j665442J076936J701112
$$ y = [-14845666, -16201252, -15602944, -16965194, -15296549, -17663303, -16046233, -15981567, -15352794, -14069844, -15033569, -16447227, -18006022, -16087432, -15323762, -16506470, -14571484, -16434719, -15324327, -15928525, -18579005, -18872362, -17911503, -17243839, -17011122, -14720524, -17003733, -17296635, -20105907, -18258657, -15152429, -15129302, -15168199, -15211142, -16425388, -16040564, -14796183, -14141569, -16883269, -17768996, -17641519, -17453140, -16305557, -18030827, -19377328, -17879654, -16492567, -15907384, -15474971, -17712974, -15971563, -14969114, -16636617, -16326494, -16825567, -17299375, -14634785, -15749129, -18904490, -16070777, -18003055, -18124604, -16210436, -13690106, -14527173, -15035450, -17884466, -17854272, -18680183, -17393808, -15880162, -16402756, -17174163, -15783525, -17448967, -16372031, -14670919]
-224a4670919n22511j754059O09502J332651J474196j463773J665585j265954K39123
-233a4356159j596397j776713j635905J900699J062023k686631J111673o44849R45532
-242a7676727K125816j372622R68393j815282K7513o13658J170437J533994j896012
-251a7548148j685175K386304K163773k731726O67179l3317j436868J333968l489218
-260b0373228K224927p44161J424458L55710m65731Q72199r62249p48276K499689j273964
-270a7190626p19969Q84870O8135l20698R05882K83549J883367k870813k087670j648421
-280b0812394J372103N25552M64789K146659J160570N72216n192736O66196L652707
-289a5444338j200375N80073j079387P00174k23741j483606k46158J241519N89543O07393
$$ y = [-14670919, -15193430, -16947489, -16337987, -15005336, -13531140, -14994913, -13329328, -14595282, -14356159, -15952556, -17729269, -19365174, -17464475, -16402452, -19089083, -17977410, -18622259, -17676727, -15550911, -16923533, -15955140, -17770422, -17742909, -18356567, -17186130, -15652136, -17548148, -19233323, -16847019, -14683246, -17414972, -16747793, -16781110, -18217978, -16884010, -20373228, -18148301, -18892462, -17468004, -17112294, -17578025, -16705826, -17668075, -18416351, -15916662, -17190626, -17910595, -17025725, -16957590, -17278288, -16372406, -16088857, -14205490, -17076303, -19163973, -20812394, -19440291, -18914739, -18449950, -16303291, -15142721, -14570505, -19763241, -19097045, -15444338, -16644713, -16064640, -17144027, -16443853, -16667594, -18151200, -18397358, -17155839, -16566296, -15958903]
-299a5958903J761753l65868j282412l88604q85052q21120J143923j526390L603966o53951
-309a5372658n08414j167033L033924o41131n48905j612834l445439K163038J208384
-318a6891068J585271k384893j393435K21378K347186M08425j429437K156778j765098
-327a7144893L047066k790000J569878N56441J64617p89231k404031p34955O98179m55261
-337a8282190l10840L281787k238419n59881J593844J38246k108413L074970j821575
-346a7232471R48336j987537K619915K22597j600627j265954J912402n04903q05628K9351
-356a7664519Q7654M92255P34930j992267K122086j813140M33116Q2853l10074Q10001
-366a7017105n8727k271913J348147j490524K263066N51788r43619k7917j5120P43980
$$ y = [-15958903, -14197150, -14563018, -15845430, -16234034, -17119086, -17940206, -16796283, -18322673, -14718707, -15372658, -15881072, -17048105, -14014181, -14655312, -15204217, -16817051, -20262490, -18099452, -16891068, -15305797, -17690690, -19084125, -18862747, -16515561, -16107136, -17536573, -15379795, -17144893, -14097827, -16887827, -15317949, -14761508, -14596891, -15386122, -17790153, -18525108, -17826929, -18282190, -18593030, -15311243, -17549662, -18109543, -16515699, -16377453, -18485866, -15410896, -17232471, -16284135, -18271672, -15651757, -15429160, -17029787, -18295741, -16383339, -16888242, -17693870, -17664519, -17576865, -17084610, -16349680, -18341947, -16219861, -18033001, -17599885, -17517032, -17827106, -17017105, -17075832, -19347745, -17999598, -19490122, -17227056, -16675268, -17618887, -17646804, -17661924, -16917944]
-376a6917944R71124j412602J093252J022152j336230j104672J416400Q79713l668326
-385a9057133K694987l51574j410900J457021M26158l04056j460782J694310J480233p7945
-395a4909681k089019p04512J187035J667700j939510j584994L224468n56344k291300
-404a7996157M510916k607752r90225L158178k002427J32077n26244O623l113123L75738
-414a9052396J320392J250081R15773k004043P10786K906516k785635j221237J713592
-423a6246171p78033j283894J05678L754107p93506M14851j150278k921864Q83490J379326
-433a6636294j865041K185862j002131j350187K225917k536874J013021J436198J625906
-442a4903623J290635j811913j359576K261211R53475j389900o78529J262301j692477
$$ y = [-16917944, -15946820, -17359422, -16266170, -15244018, -16580248, -17684920, -16268520, -15388807, -19057133, -16362146, -16713720, -18124620, -16667599, -16241441, -16545497, -18006279, -16311969, -14831736, -14909681, -16998700, -17703212, -16516177, -14848477, -16787987, -18372981, -15148513, -15704857, -17996157, -13485241, -16092993, -17083218, -13925040, -15927467, -15795390, -16321634, -16315011, -19428134, -19052396, -17732004, -16481923, -15566150, -17570193, -16859407, -13952891, -16738526, -17959763, -16246171, -17024204, -18308098, -18202420, -14448313, -15241819, -14826968, -15977246, -18899110, -18015620, -16636294, -18501335, -16315473, -17317604, -18667791, -16441874, -18978748, -17965727, -16529529, -14903623, -13612988, -15424901, -16784477, -14523266, -13569791, -14959691, -15638220, -14375919, -16068396]
-451a6068396q67687l03901j747223O34158R08197j536798N81229J041368j284130L685313
-461a4957870j213524K89322l85513l37260M85840K286269q00375q96634n98019k12526
-471a6340290o0531J28933k8530r63529o50929J655022j53770J749881k182927J504773
-481a5341897j651373M67151k77038p23302K501034O32599K49893p51250q73586j289618
-491a7057387J923219l363650n63934Q98775Q24011j49649r8441j770802J803309J45023
-501a7409526J452031J193848k977281K90804J49983o0455N24588J542893J245711j073994
-511a5121398j477189l14062n56698R2168K333813J747255J8299k433031M64o0039J249
-522a5769169n3930k49768L63470o2159J20259k032665K023615J403417j488483o22332
$$ y = [-16068396, -16936083, -17239984, -18987207, -18353049, -17444852, -18981650, -18400421, -17359053, -18643183, -14957870, -16171394, -15882072, -16267585, -16604845, -16119005, -13832736, -14633111, -15529745, -16127764, -16340290, -16400821, -16271888, -16300418, -17263947, -17914876, -16259854, -16413624, -14663743, -16846670, -15341897, -16993270, -16526119, -16803157, -17526459, -15025425, -14392826, -14142933, -14894183, -15767769, -17057387, -15134168, -18497818, -19061752, -18162977, -17338966, -17488615, -17587056, -19357858, -17554549, -17409526, -15957495, -14763647, -17740928, -17450124, -17300141, -17360596, -16836008, -15293115, -14047404, -15121398, -16598587, -16912649, -17469347, -17377179, -15043366, -13296111, -13277812, -15710843, -15710379, -15770418, -15769169, -15823099, -16072867, -15709397, -15771556, -15651297, -17683962, -15660347, -14256930, -15745413, -16367745]
-532a6367745K166412j561230J77363l265953N77011K236837J167255o68411L101038
-541a2437423l495860J252881l08463k110637J184275j133926J846098j010090K457668
-550a3755477O6500k61587j889043K16704J082419j313197J781890j719905J62587O12662
-560a5016447n02921J172347Q42622j436737J024661j666365J517389j480193R40016
-569a4605628J23939o77909q08778J273447j245174k378511M815678J02897k375205n90094
-579a6365338K224016k873533R20249K195722j123963l039238K819704q57866m24142
-588a6524389K130268J060867l54506j280122j52157O91046J6903J984677l627557J730394
-598a4324576N20468j137231n63906R63772K65606J211462j458285k48345K685352l65817
$$ y = [-16367745, -14201333, -15762563, -15585200, -18851153, -18274142, -16037305, -14870050, -15538461, -12437423, -15933283, -14680402, -14988865, -17099502, -15915227, -17049153, -15203055, -16213145, -13755477, -13688977, -13950564, -15839607, -15622903, -14540484, -15853681, -14071791, -15791696, -15629109, -15016447, -15519368, -14347021, -13504399, -14941136, -13916475, -15582840, -14065451, -15545644, -14605628, -14481689, -15159598, -15968376, -14694929, -15940103, -18318614, -13502936, -13400039, -15775244, -16365338, -14141322, -17014855, -16094606, -13898884, -15022847, -18062085, -15242381, -16100247, -16524389, -14394121, -13333254, -13687760, -14967882, -15120039, -14428993, -14412090, -12427413, -16054970, -14324576, -13804108, -14941339, -15505245, -14541473, -14275867, -13064405, -14522690, -14771035, -12085683, -12451500]
-608a2451500j332968N85747j702058P82619J743549j320296m40659q65994q13166J394443
-618a4420283K170332m3160q61539Q96028k65540J851671K63610M17524j694728p65630
-628a2451715J255022O00325p38771N19618o52827K259530j270377K114273j925735J33651
-638a0157006P57171r23138l562437K2705K342494L025509o01417q55626n75804o04363
-648a1131912o06393n79872J02108P16111m82593J272706m17427o06348m31012M61118
-658a1703514Q79769R45107M88538r7124j96998j554871J584796J663848j248978Q41336
-668h398091O30731K225411j277842j973177m43160m10333M39562j261095o20657L50182
-678a0738469r04776K268793k862934j59577K602893O919074n002846k978979J77270
$$ y = [-12451500, -13784468, -13198721, -14900779, -14118160, -12374611, -13694907, -14135566, -15001560, -15814726, -14420283, -12249951, -12293111, -13154650, -12258622, -12524162, -10672491, -10408881, -9991357, -11686085, -12451715, -11196693, -10596368, -11335139, -10815521, -11468348, -9208818, -10479195, -8364922, -10290657, -10157006, -9399835, -10322973, -13885410, -13862705, -11520211, -8494702, -9096119, -9951745, -10527549, -11131912, -11738305, -12318177, -12216069, -11499958, -11982551, -10709845, -11127272, -11733620, -12164632, -11703514, -10823745, -9878638, -9390100, -9487224, -9684222, -11239093, -9654297, -7990449, -9239427, -8398091, -7767360, -5541949, -6819791, -8792968, -9236128, -9646461, -9206899, -10467994, -11088651, -10738469, -11643245, -9374452, -12237386, -12396963, -9794070, -2874996, -7877842, -10856821, -10679551]
-687a0679551K10692N38098J94204k34885P14926L526024k904298j444556K020398n61514
-697h620462r99652q57754N80299k00157k91448n67161Q4241J569397K84446j414889
-707a0433140j12849J291727R68515k22788j958259J558801n60003K683513j623893
-716h408376J256980k403078R39260k026662K762134J56969j543345J069124K592176
-725e604818n11234p28792k68212O80045j060705J520273p67434q30402K532489n7740
-735e096530K557406j565872m63129K180607j322978J591175k688725L141355k549062
-744d215753Q34256J508542p22698K116837P93210j789797k254148o65295M75532O89944
-754c229370n11976j02960K611917j798220J359724q72723l38108j024965j290001L619610
$$ y = [-10679551, -10468859, -9930761, -9736557, -9971442, -9256516, -5730492, -8634790, -10079346, -8058948, -8620462, -9620114, -10477868, -9897569, -10097726, -10389174, -10956335, -10872094, -9302697, -9018251, -10433140, -10545989, -9254262, -8285747, -8508535, -10466794, -8907993, -9467996, -6784483, -8408376, -7151396, -9554474, -8615214, -10641876, -7879742, -7722773, -9266118, -8196994, -5604818, -6116052, -6844844, -7113056, -6433011, -7493716, -5973443, -6740877, -7571279, -5038790, -5096530, -2539124, -4104996, -4568125, -2387518, -3710496, -2119321, -4808046, -1666691, -4215753, -3381497, -1872955, -2595653, -478816, 314394, -1475403, -3729551, -4394846, -3919314, -3229370, -3741346, -3844306, -1232389, -3030609, -1670885, -2543608, -2881716, -3906681, -5196682, -1577072]
-764a577072j985944K030613j05191m49585Q8000J12057O68163J982666O70369r2301
-774A341775j603296j1686L18025j098881j368132M41745P86633j838768j924078p61317
-784e717980l88471J857941N66863J435749m743750J423548M60968K38558J649012m04544
-794c622106k124397L43520N64854J137857P35148K31138j279P38363m05887o98342P61632
-805b339499k16367K409470q43617J84328j353777J545680R9973K388622N2372j374344
-815E52841J22385Q92215L2496j43009K156889J281468j589786K293140k452073K009699
-825E156265N743922P25148P00306K497653K798955R31440n06692N140857k104101J178272
-835B2262025N063989K469267J925938j552218P211610K968700M70721K878907O481527
$$ y = [-1577072, -3563016, -1532403, -1637594, -2087179, -1999179, -1887122, -1218959, 763707, 1434076, 1341775, -261521, -273207, 44818, -1054063, -2422195, -1980450, -1193817, -3032585, -4956663, -5717980, -6106451, -4248510, -3681647, -2245898, -6989648, -5566100, -5105132, -4866574, -3217562, -3622106, -5746503, -5402983, -4838129, -3700272, -2965124, -2733986, -2735265, -1996902, -2402789, -3101131, -2339499, -2555866, -146396, -990013, -805685, -2159462, -613782, -513809, 1874813, 1927185, 552841, 675226, 1567441, 1599937, 1456928, 3613817, 4895285, 3305499, 5598639, 3146566, 5156265, 10900187, 11625335, 12325641, 14823294, 17622249, 18553689, 18046997, 23187854, 21083753, 22262025, 27326014, 29795281, 31721219, 30169001, 37380611, 40349311, 40820032, 43698939, 50180466]
-844E0180466J085934N914919M358285O476595O217461M220466N009082N941201M138513
-853I3542922M004430N343062M951740L657623O549723M446212N773788P169784M598174
-862A40037458O040725O168256Q968336M602916P226358J0658858R202165Q530404R656373
-871B11091849R095157R780648J1202488J0748478J1751494J5872148J7711736J5681100
-879C12935098J0987379J7828980J5959647O822403K87731M656061M471070M609745
-887C78558114O859873O452796J199114R125592O297394M909009M810312N382925P994342
-896D31589471Q162110J1671235J2013412J1433714J1901975J4904738J8245641K5987188
-904E45909484K2810307J8245301J5597791K5630504J8428344R159526P131483R027755
$$ y = [50180466, 51266400, 57181319, 61539604, 68016199, 74233660, 78454126, 83463208, 89404409, 93542922, 97547352, 102890414, 107842154, 111499777, 118049500, 122495712, 128269500, 135439284, 140037458, 146078183, 152246439, 161214775, 165817691, 173044049, 183702907, 192905072, 201435476, 211091849, 220187006, 229967654, 241170142, 251918620, 263670114, 279542262, 297253998, 312935098, 323922477, 341751457, 357711104, 364533507, 364821238, 369477299, 373948369, 378558114, 385417987, 391870783, 393069897, 402195489, 408492883, 413401892, 418212204, 423595129, 431589471, 439751581, 451422816, 463436228, 474869942, 486771917, 501676655, 519922296, 545909484, 568719791, 586965092, 602562883, 628193387, 646621731, 655781257, 662912740, 671940495]
-912F71940495M000050P23050R045790J4710874L4308963N4243472M8542972J8920471
-920H56436137R239529L6625220M3316418j0585185o1953875n9786757k7374490r804325
-928G76112672n084010k0356303k4437376k3691500J614008J7848917J7605185J4214597
-936G53826190J8399166J6139829J5630015J8698517J8334923L3751433O3700429
-943I38480502J13019715J60138187J40060938O0840448L6143472Q5965148O0636008
-950A595284418m8838104p9918372m7869638o0063342j16555863j43314762j32524528
-957I66199809r7436168o4246707l7568660q113283N948686J6584802K3459208K5218399
-965H30046086L4512462O1807219O1469654J5021428k3574637j0879323K9665902R4922489
$$ y = [671940495, 675940545, 676663595, 685709385, 700420259, 734729222, 788972694, 837515666, 856436137, 865675666, 902300886, 945617304, 935032119, 873078244, 813291487, 785916997, 776112672, 771028662, 750672359, 726234983, 702543483, 704157491, 722006408, 739611593, 753826190, 772225356, 788365185, 803995200, 822693717, 841028640, 874780073, 938480502, 1051500217, 1211638404, 1351699342, 1412539790, 1448683262, 1534648410, 1595284418, 1546446314, 1466527942, 1418658304, 1358594962, 1242039099, 1098724337, 966199809, 868763641, 804516934, 766948274, 758834991, 764783677, 781368479, 804827687, 830046086, 864558548, 926365767, 987835421, 1002856849, 979282212, 968402889, 998068791, 1092991280]
-973A092991280J99478503K38705168J24418169j1868818o4949372j19909682j74081645
-980A284783603j60363727r6595393o9557821o9787517m8804121l0448585O346430M388126
-988H19960995J7472477J4396333L739143m40736q291207j4072398j0654684p674981
-996H14434942M607110O003508J3634810J0183594J1524793P757004O948852Q900878
-1004H83995491N042923O501532J1005400J2986294J0029062R606586J7667768J1507260
-1012I68342316J3288150J8928325J1541844J6459571J6094917K3775530M8234542
-1019A116665195O6938866Q9794979J11732434J06639408Q2454274R7726124N6813576
-1026A728764856J11913376J15600082J38011346N3193987q225050j41589166k21260931
$$ y = [1092991280, 1292469783, 1531174951, 1655593120, 1643724302, 1578774930, 1458865248, 1284783603, 1124419876, 1027824483, 958266662, 888479145, 839675024, 809226439, 815572869, 819960995, 837433472, 851829805, 855568948, 855128212, 846837005, 832764607, 822109923, 814434942, 819042052, 825045560, 838680370, 848863964, 860388757, 868145761, 875094613, 883995491, 889038414, 895539946, 906545346, 919531640, 929560702, 939167288, 956835056, 968342316, 981630466, 1000558791, 1012100635, 1028560206, 1044655123, 1068430653, 1116665195, 1183604061, 1273399040, 1385131474, 1491770882, 1574225156, 1671951280, 1728764856, 1840678232, 1956278314, 2094289660, 2147483647, 2139258597, 1997669431, 1776408500]
-1033A776408500k55009252k26360008j57278424r3911991L136144J3070874N1335386
-1040A111391229K9118133j0802517l2486490n9644906m7574273m9672663j5522734
-1047I24805779j0304312K7440101J7996223K2935121L7404030J9188673L2225344
-1054A071690959J3545702j5227826j9937877m4816309o2866165m4777021n7366401
-1061H40245062o1932341o3391529p6300422o3803001m7439163q416301K8417789L7167900
-1069E84547994N2304955K9481054n709202o1139746r8083683j09493861r2921925
-1076B98985586o0610136l9559086n827742P54738o348205k1852926k9038147j6998374
-1084A19505708j2496665n470213j507649P896554J1732235K7493119K7913121P146493
$$ y = [1776408500, 1521399248, 1295039240, 1137760816, 1043848825, 1046984969, 1060055843, 1111391229, 1140509362, 1129706845, 1097220355, 1037575449, 990001176, 940328513, 924805779, 914501467, 941941568, 959937791, 982872912, 1020276942, 1039465615, 1071690959, 1085236661, 1070008835, 1050070958, 1005254649, 942388484, 897611463, 840245062, 778312721, 714921192, 638620770, 574817769, 527378606, 518962305, 547380094, 584547994, 636852949, 666334003, 660624801, 599485055, 501401372, 391907511, 298985586, 238375450, 198816364, 192988622, 193743360, 187395155, 165542229, 136504082, 119505708, 107009043, 101538830, 100031181, 107927735, 119659970, 147153089, 175066210, 182212703]
-1092A82212703j6537167j1044984J25185J0665173R122924o547530j9653008l5060321
-1100A13282975j5185517j4890176j3100630j4173351j6730875j6528733j1928073r293337
-1108A452283n112435m022302l073039j144130j103556k511843L094583j93736K44852
-1117a2369323m14586j286551l848524o25857N57932j501833j838686j461474Q64843
-1126b1924059j885421q48261K472073j867948q64647J001782R80290p23057J8985J747177
-1136b1893086J950530k899941J341562K766720j148947j0568107R666827q435700
-1144b9220142j0909642Q830118R324901K145799Q50736k114951R49115N23965p2157
-1153a9692258M80336J112841k420830j504124K320583j746941J149654r76749n76667
$$ y = [182212703, 165675536, 154630552, 154755737, 165420910, 174543834, 167996304, 148343296, 113282975, 98097458, 83207282, 70106652, 55933301, 39202426, 22673693, 10745620, 1452283, -3660152, -7682454, -10755493, -11899623, -13003179, -15515022, -12420439, -12614175, -12369323, -12783909, -14070460, -17918984, -18544841, -17986909, -19488742, -21327428, -22788902, -21924059, -23809480, -24657741, -22185668, -24053616, -24918263, -23916481, -22936191, -23659248, -23640263, -21893086, -19942556, -22842497, -21500935, -18734215, -19883162, -30451269, -20784442, -29220142, -40129784, -31299666, -21974765, -19828966, -18978230, -21093181, -20144066, -19620101, -19692258, -19211922, -18099081, -20519911, -22024035, -19703452, -21450393, -20300739, -21277488, -21854155]
-1162b1854155j934725n75364K144370k471019L901845J725829l926015Q87840k26621
-1171b2328015K549748L99301j865188J477299j989733m24169R99443j032270L66261N3125
-1181b1794198M59371K636185l09810j48509O39937j132331o16425J03869P24664J129181
-1191a8308066o39940J69631k840770K404945n7717r46525J318854r70448j686689L191989
-1201a8364736M95216j332388J584761L61509O48667n72161P33525p27395J36175J322868
-1211a5713959j381955K79187K222022R60551j88918m15123p29034j252782j211762P7788
-1221a7353985Q60923o78364j101489J80668R59988p4292j536065J282568k97544q44429
-1231a8602021N91899j453132L29231J732315J945536j019306K52689j967525J424902
$$ y = [-21854155, -23788880, -24364244, -22219874, -24690893, -20789048, -19063219, -22989234, -22101394, -22328015, -19778267, -19378966, -21244154, -19766855, -21756588, -22180757, -21181314, -22213584, -21847323, -21794198, -21334827, -18698642, -19008452, -19156961, -18517024, -19649355, -20265780, -20161911, -19437247, -18308066, -18948006, -18778375, -21619145, -19214200, -19271917, -20218442, -18899588, -19870036, -21556725, -18364736, -17869520, -19201908, -17617147, -17255638, -16606971, -17179132, -16445607, -17173002, -17036827, -15713959, -17095914, -16816727, -14594705, -13634154, -13823072, -14238195, -14967229, -16220011, -17431773, -17353985, -16493062, -17171426, -18272915, -18092247, -17132259, -17206551, -18742616, -17460048, -17757592, -18602021, -18010122, -19463254, -19134023, -17401708, -15456172, -16475478, -16222789, -18190314, -16765412]
-1240a6765412o9912m1449J406407J826856j182129o15003L11295j299982J372216p07781
-1250a5764894r63924J861051o66292j010081l30133k248530L698687L23544j215525
-1259a6316097J522559o29147j439031J65969Q47435J319517K20291j082795n59777J7433
-1269a5933643J439187r68999O8576K135250J418276k679710l79059R15208j290543J61020
-1279a5114437n35255o8664q33832J618225j074076K258457l19648j683314N74687K18578
-1289a4959279J4771j026777l98213K355014j373057L000122l288797J560503r96200l4501
-1299a5146414K122683R57857j748671K052811q89087R94533P90638J820482k098965
-1308a1144133J309266J078570k587911M48583J52921K302028P14887l412545K76182
$$ y = [-16765412, -16835324, -16876773, -15470366, -13643510, -14825639, -15440642, -15129347, -16429329, -15057113, -15764894, -16728818, -14867767, -15534059, -16544140, -16874273, -19122803, -15424116, -15100572, -16316097, -14793538, -15422685, -16861716, -16695747, -15848312, -14528795, -14308504, -15391299, -15951076, -15933643, -14494456, -15463455, -15394879, -13259629, -11841353, -14521063, -14900122, -13984914, -15275457, -15114437, -15649692, -15718356, -16552188, -14933963, -16008039, -13749582, -14069230, -15752544, -15177857, -14959279, -14944508, -15971285, -16369498, -14014484, -15387541, -12387419, -15676216, -14115713, -15111913, -15146414, -13023731, -12065874, -13814545, -11761734, -12650821, -11656288, -10865650, -9045168, -11144133, -9834867, -8756297, -11344208, -10895625, -10742704, -8440676, -7725789, -11138334, -10862152]
-1317a0862152j948542n40740K819011l713503J318197k61939J592940k185695Q46509
-1326a2935914m19920O12305j593350J755115n48484j689612J521237L056109K694991
-1335g547523j253967j492068j753523n12203O42348J058763J95068k801996j885046
-1344a5350147j002736K043339K91382P96026j148242j355133m57598m13617Q28036k75175
-1354a6043865j564427j08403M681168o53020k098113Q78363p144k20937l245017J651945
-1364a6729450J678610j850680M06045p588k454087J388415p53947Q43777R71235k118856
-1374a8626526J128757K1795k811424m69429L83052j90205m35295L945875j891568o00002
-1384a9544970j048550L785430Q10442J950104n50267l732113j666973l82551J019211
$$ y = [-10862152, -12810694, -13351434, -10532423, -14245926, -12927729, -13189668, -11596728, -13782423, -12935914, -13355834, -12743529, -14336879, -12581764, -13130248, -14819860, -13298623, -10242514, -7547523, -8801490, -10293558, -12047081, -12559284, -11916936, -10858173, -10663105, -13465101, -15350147, -16352883, -14309544, -14018162, -13222136, -14370378, -15725511, -16183109, -16596726, -15768690, -16043865, -17608292, -17716695, -13035527, -13688547, -15786660, -14908297, -14915441, -15136378, -18381395, -16729450, -15050840, -16901520, -16495475, -16503063, -18957150, -17568735, -18322682, -17478905, -16507670, -18626526, -17497769, -17475974, -20287398, -20756827, -20373775, -20563980, -20999275, -17053400, -18944968, -19544970, -20593520, -16808090, -15997648, -14047544, -14597811, -18329924, -19996897, -20379448, -19360237]
-1393a9360237J599577j028312K281617k58646k530649l24159R82233k59440k68006
-1402a9166022k213163J86465L199067j852024Q77455L37012q63171L97023k96025J005154
-1412a8388229J41613L80470N2044l884823L21911L402610r08332n98317j343739k805
-1422b0827597M99301K071556j608135O24189J221357o257j777331J11789J230274k94818
-1432a8755672j836971Q27829j238634K21481J017082r86922N51856n22049K34790J110659
-1442a9376551K071029K69906k569278k243464K140638k327766N18361q66058K624700
-1451a9758483L608785k698262j924969J712544N72754J84994j637860j88508J224992
-1460a8904013J006196k53019J235922j894859r52030J009490p88491Q21168K58019
$$ y = [-19360237, -17760660, -18788972, -16507355, -16766001, -19296650, -19620809, -18638576, -18898016, -19166022, -21379185, -21192720, -17993653, -19845677, -18968222, -18631210, -19494381, -19097358, -19393383, -18388229, -18246616, -17866146, -17814102, -21698925, -21377014, -17974404, -18882736, -19481053, -20824792, -20827597, -20328296, -18256740, -19864875, -19240686, -18019329, -18025586, -19802917, -19691128, -18460854, -18755672, -20592643, -19764814, -21003448, -20781967, -19764885, -20751807, -20199951, -20722000, -20487210, -19376551, -17305522, -17035616, -19604894, -21848358, -19707720, -22035486, -21517125, -22383183, -19758483, -16149698, -18847960, -20772929, -19060385, -18487631, -18302637, -19940497, -20129005, -18904013, -17897817, -18150836, -16914914, -18809773, -19761803, -18752313, -19540804, -18719636, -18461617]
-1469a8461617K014768l685510K168319J435016j125546j132617J760795j950854L721928
-1478a5255318l087119J559057j537879n88154K547542j095295k094474o41068L367505
-1487a6825203j096347j39331N10409j748234M43262N83994k809664K866410P68021m35304
-1497a7881987o33003J62658J205383j277279k098142L295076J051255k017025o5774
-1506a8258838k67547J142776j52253j028793O2699k37928J767777r51267p94484J723846
-1516a6994012J434170r54369l066116J296674j255981J050338Q93016p11551r08328
-1525a9216159P46067q65729L119596N13451k710319p76451J198261l22342O01113O18680
-1535a7093832o97061P36226o93136p7041l06166j083576J093919j80280R05459R33378
$$ y = [-18461617, -16446849, -20132359, -17964040, -16529024, -17654570, -18787187, -17026392, -18977246, -15255318, -18342437, -16783380, -18321259, -18909413, -16361871, -17457166, -19551640, -20192708, -16825203, -17921550, -18060881, -17550472, -19298706, -18855444, -18271450, -21081114, -18214704, -17446683, -17881987, -18514990, -18352332, -17146949, -18424228, -20522370, -17227294, -16176039, -18193064, -18258838, -18526385, -17383609, -17535862, -18564655, -18501956, -18739884, -16972107, -17923374, -18717858, -16994012, -15559842, -16514211, -19580327, -18283653, -19539634, -18489296, -17596280, -18307831, -19216159, -18470092, -19335821, -16216225, -15702774, -18413093, -19189544, -17991283, -18313625, -17712512, -17093832, -17790893, -17054667, -17747803, -17824844, -18131010, -19214586, -18120667, -18300947, -17395488, -16462110]
-1545a6462110l200518Q38704R26796k62255O58497p92540J508983l079166j06074K411085
-1555a7558598o81256j36383R75848j32094J4652j446113J346421n90856K901357l041590
-1565a8348612P98777k29589J442147k547900K42432K01801j63918j032157J750401
-1574a7886618K390291J004028r92477o54735j98528j573671j286487Q72664j258795
-1583a9584328J814593J428334n88034r37740K49037p32693J097457k39792R24069p47692
-1593a7316789J03552k083492K534990O17735r2013k59062l774128K431885j86866N12017
-1603a7512171M65945j612703Q45279j625519Q16186k79461J122571j428719Q54447o14634
-1613a8968779K128342r2984O74574k078125N06567J427678p35435p02500M6693Q32817
$$ y = [-16462110, -19662628, -18823924, -17897128, -18159383, -17500886, -18293426, -16784443, -19863609, -19969683, -17558598, -18239854, -18376237, -17400389, -17532483, -17517831, -18963944, -17617523, -18208379, -15307022, -18348612, -17549835, -17779424, -16337277, -18885177, -18642745, -18440944, -18604862, -19637019, -17886618, -15496327, -14492299, -15484776, -16139511, -16338039, -17911710, -19198197, -18325533, -19584328, -17769735, -16341401, -16929435, -17867175, -17618138, -18350831, -17253374, -17493166, -16569097, -17316789, -17213237, -19296729, -16761739, -16144004, -16236017, -16495079, -20269207, -17837322, -18024188, -17512171, -17046226, -18658929, -17813650, -19439169, -18622983, -18902444, -17779873, -19208592, -18354145, -18968779, -16840437, -16933421, -16258847, -18336972, -17830405, -16402727, -17138162, -17840662, -17793969, -16961152]
-1623a6961152K384440j706139K28499r42783k269318j888125P32585K685806R03547
-1632a6832640J73695l1721j505945J53912k296195Q40771K043752j226197r47186L538705
-1642a6089049m295224L661526j31185k527465N84443k61345K939j347602k01273r45904
-1652b1550139J216861J87869R30240K22952j606972O99444O33607o65123J746757R43970
-1662a7240534k07957p28271k505997L929352k994166J53073M311358j461358J084785
-1671a5659715l673882l60066K488720R98067J057424m5412r71333l669087J816518
-1680a8018766J778764p25359l65208K34062k86096O3231K137963l15853j351390p22501
-1690a7571153j038382K292991l803689J778945j356759M24345J791468L80847j574706
$$ y = [-16961152, -14576712, -16282851, -16054352, -16997135, -19266453, -21154578, -20421993, -17736187, -16832640, -16658945, -16690666, -18196611, -18042699, -20338894, -19498123, -17454371, -18680568, -19627754, -16089049, -20384273, -16722747, -16853932, -19381397, -18796954, -19058299, -19055360, -20402962, -20604235, -21550139, -20333278, -20145409, -19215169, -18992217, -20599189, -19899745, -19266138, -19931261, -18184504, -17240534, -17448491, -18176762, -20682759, -16753407, -19747573, -19594500, -15283142, -16744500, -15659715, -19333597, -19693663, -17204943, -16206876, -15149452, -15194864, -16166197, -19835284, -18018766, -16240002, -16965361, -17330569, -17096507, -17382603, -17319372, -15181409, -15497262, -16848652, -17571153, -18609535, -16316544, -20120233, -18341288, -19698047, -19273702, -17482234, -17101387, -18676093]
-1699a8676093j295078k577891K436708J667254m26877M27402K0776m12295J115411n86646
-1709a8307329R1073K298846M53394j891534J027652q3853q66896m04284M01562o45101
-1719a7926470J483598j291352L51457k953994J170636j437461J870555J899773k225006
-1728a9058264j063109K181203k83389r75477N18724J988275q82556p42552J494717
-1737a6822428j246361J28936J947582k663269l05060O88996k06565n6731l68104O22087
-1747a8280917J094389P71039J73443j555624L05865n3287Q42408j552569j16123J344886
-1757a7026490k010370K308115o18876J40210K3205k251020R53149K043796j688419
-1766a8126700k502038J362691J112832O41357k062974K158877k811969J609744L63906
$$ y = [-18676093, -19971171, -22549062, -20112354, -18445100, -18871977, -18444575, -18423799, -18836094, -17720683, -18307329, -18216256, -15917410, -15464016, -17355550, -16327898, -16411751, -17278647, -17682931, -17281369, -17926470, -16442872, -17734224, -17382767, -20336761, -19166125, -20603586, -18733031, -16833258, -19058264, -20121373, -17940170, -18223559, -19199036, -18680312, -16692037, -17574593, -18317145, -16822428, -18068789, -17939853, -15992271, -18655540, -18960600, -18271604, -18478169, -18534900, -18903004, -18280917, -17186528, -16415489, -16242046, -17797670, -17491805, -17545092, -16702684, -18255253, -18371376, -17026490, -19036860, -16728745, -17347621, -17207411, -17184206, -19435226, -18482077, -16438281, -18126700, -20628738, -19266047, -18153215, -17511858, -19574832, -17415955, -20227924, -18618180, -18254274]
-1775a8254274J150735n06862Q66937k07565J691860m184291J640219k495651K040770
-1784a8258122O26747L4818J159140j534713j140708M65480k844912L161666j795277
-1793b0125881K299598j250809J252127k8808J511279m26264m713982L400374j81701
-1802a8264067o49668n22846J174237K733604l566441m09195r83648J446766J051406
-1811a7989852m25910K507150j358990j960424J630738j24487j531858K229874r38825
-1820a7962584o28758N88035K413293j4126k059241J723129R97034o17670k881703K178864
-1830a6263727j191555m20502o27606M77220Q62711J95691J08453m04496j24074N03777
-1840a6884108J491255o092470L234839J106998p29195j91625j95272o23089k79834m94783
$$ y = [-18254274, -17103539, -17610401, -16743464, -16951029, -15259169, -19443460, -17803241, -20298892, -18258122, -17631375, -17596557, -16437417, -17972130, -19112838, -18647358, -21492270, -18330604, -20125881, -17826283, -19077092, -17824965, -17853773, -16342494, -16768758, -21482740, -18082366, -18264067, -18913735, -19436581, -18262344, -15528740, -19095181, -19504376, -20488024, -19041258, -17989852, -18415762, -15908612, -17267602, -19228026, -17597288, -17721775, -19253633, -17023759, -17962584, -18591342, -18003307, -15590014, -15604140, -17663381, -15940252, -14943218, -15560888, -18442591, -16263727, -17455282, -17875784, -18503390, -18026170, -17163459, -16967768, -16859315, -17263811, -17387885, -16884108, -15392853, -21485323, -18250484, -17143486, -17872681, -18064306, -18259578, -18882667, -19162501, -19657284]
-1850a9657284K51900L075708j989636J613808m12598j24328j030027j645805J571915
-1859a8346347O69599O63449K42007m9364p27102k309495J828624K766645j531762j854504
-1869a8648250p91010K569139p025K453890k865896J321113k848755J513618J54030J76432
-1879a6972714j111089J174127o15880R66984k451128J424350q13224K543682k534845
-1888a8389737J919627j397268m12095L79380N50055Q39996L77268l72413j139387K185759
-1898a5458815l18779l430634K360218L88753j063351L35091k490585L594924J487941
-1907a4595237o40239k354776K270834j047192O40067p22630p75271j076222K456110
-1916a5844556j242677j539241J092915J097531n66476K51111j258234K730930l59681
$$ y = [-19657284, -19405384, -16329676, -18319312, -16705504, -17118102, -17242430, -18272457, -19918262, -18346347, -17676748, -17013299, -16771292, -16820656, -17547758, -19857253, -18028629, -15261984, -16793746, -18648250, -19439260, -16870121, -16877146, -14423256, -17289152, -15968039, -18816794, -17303176, -17149146, -16972714, -18083803, -16909676, -17525556, -16558572, -19009700, -17585350, -18398574, -15854892, -18389737, -16470110, -17867378, -18279473, -17900093, -17350038, -16510042, -16132774, -16505187, -17644574, -15458815, -15777594, -19208228, -16848010, -16459257, -17522608, -17187517, -19678102, -16083178, -14595237, -15235476, -17590252, -15319418, -16366610, -15726543, -16449173, -17224444, -18300666, -15844556, -17087233, -18626474, -17533559, -16436028, -17002504, -16751393, -18009627, -15278697, -15638378]
-1925a5638378p62756O47595J257979l460423J770880j39758K74511l107932N32657
-1934a8625625J300569l8273K604839j434264p22181n46801l53541J139580j806648j44116
-1944a8626461K692222j533943J705390k422742L592952l713630N09934P13972K02684
-1953a6879622K143094j794209O86742N47831r97381j122963K748999j720041k002041
-1962a8389591M98244p59158J294588j039531m31357K861963k621423R27570L00563
-1971a7358132K340268k152775n592l36749j49952K65872l64494K865968k160695j542110
-1981a8598391J552180j373941J429907m82966M5649r31395J805942J853509m18449P66872
-1991a4351083j967803o74200p42504J134387R28429j658790j011428J02399q46799
$$ y = [-15638378, -16401134, -15753539, -14495560, -17955983, -16185103, -16324861, -16050350, -19158282, -18625625, -17325056, -17363329, -14758490, -16192754, -16914935, -17461736, -17815277, -16675697, -18482345, -18626461, -15934239, -17468182, -15762792, -18185534, -14592582, -18306212, -17796278, -17082306, -16879622, -14736528, -16530737, -15843995, -15296164, -16293545, -17416508, -14667509, -16387550, -18389591, -17891347, -18650505, -17355917, -18395448, -18826805, -15964842, -18586265, -17658695, -17358132, -15017864, -17170639, -17176231, -17512980, -17662932, -17397060, -17761554, -14895586, -17056281, -18598391, -17046211, -18420152, -16990245, -17473211, -17427562, -18358957, -16553015, -14699506, -15117955, -14351083, -16318886, -16993086, -17735590, -16601203, -15672774, -17331564, -18342992, -18240593, -19087392]
-2000a9087392L002426n53593m75196n5395N11161j909671k176437M114784m1360q34491
-2010a7505164N39385m82331J613757n20388o00712Q94888j928777J513563k449j229853
-2020a7708081l55347J95564J988057k028025j099675K370156j779556l05843l25491
-2029a9048241J937048K82944l453852M277444j813094l74218R99041j350957J244527
-2038a7299358j919517J236593J03801M96611j763499O73394L064621k968567N5357J96948
-2048a8123616n68930N84346K554027o24268k556326N23455J182878Q69054j66845K15110
-2058a6111115K264494k153069k020864o38233K49726R21088j295980P26528K201644
-2067a5855781k598612J052672j662811q89203J321986K299891k265046J93075P93986
$$ y = [-19087392, -16084966, -16638559, -17113755, -17169150, -16657989, -18567660, -20744097, -16629313, -16670673, -17505164, -16965779, -17448110, -15834353, -16354741, -16955453, -16060565, -17989342, -16475779, -16478228, -17708081, -18063428, -17867864, -15879807, -17907832, -19007507, -16637351, -18416907, -18722750, -19048241, -17111193, -16828249, -20282101, -16004657, -17817751, -18191969, -17192928, -18543885, -17299358, -19218875, -17982282, -17878481, -17381870, -19145369, -18471975, -15407354, -18375921, -18320564, -18123616, -18692546, -18108200, -15554173, -16178441, -18734767, -18211312, -17028434, -16159380, -16326225, -16111115, -13846621, -15999690, -18020554, -18658787, -18409061, -17487973, -18783953, -18057425, -15855781, -18454393, -17401721, -19064532, -19953735, -18631749, -16331858, -18596904, -18403829, -17609843]
-2076a7609843l94346O28258O32863K48203j809755O85843k249477L012163P94748k58604
-2086a6319947p85332j606744K247796j65330P0226N12840r55592P00824M67689k205190
-2096a8038760O64360J476730k892978J5450l04055J502990K089231j387861J732502
-2105a5142391j705166j383379R91551r69024J287605j043213K755801j488650l4875
-2114a6731741R07485n52369l75945Q76664l668614J518699J607152k611207J210458n5527
-2124a7874945K952432k566088p48936l11914K842526j854463q8430R17699J082881
-2133a5649238k146456J413936M90010q51458k342573J353063l45204l59646L146898
-2142a5290668Q84896R42830l202498j282411M00317J128832O72793k118369j28166O15381
$$ y = [-17609843, -18004189, -17375931, -16743068, -16494865, -18304620, -17618777, -19868254, -16856091, -16061343, -16319947, -17105279, -18712023, -16464227, -16629557, -16559331, -16046491, -17002083, -16301259, -15833570, -18038760, -17374400, -15897670, -18790648, -18775198, -19079253, -17576263, -15487032, -16874893, -15142391, -16847557, -18230936, -17239385, -18208409, -16920804, -17964017, -15208216, -16696866, -16731741, -15824256, -16376625, -16752570, -15875906, -19544520, -18025821, -16418669, -19029876, -17819418, -17874945, -14922513, -17488601, -18237537, -18549451, -15706925, -17561388, -17649818, -16732119, -15649238, -17795694, -16381758, -15891748, -16743206, -19085779, -17732716, -18077920, -18437566, -15290668, -14405772, -13462942, -16665440, -17947851, -17547534, -16418702, -15745909, -17864278, -17992444, -17377063]
-2152a7377063o5900j409524K66102q43406J67975J765451p24113J174J347671j614560
-2162a8486193p29555p5783K778291m87673N79089k34894q88807j039219K035610m29179
-2172a6978313J932565j817263n85259l85382K041045J366548j286386j309716K661504
-2181a4360657j104657n1745k382008J02626J148518j061842K18963K119620k212264
-2190a7583446K109282J057766j175957k005062L09740O05517j97318j845722K488513
-2199a6236687J173045r11433L93576Q08721J132242p38240q47405j579430J724723
-2208a5080888j883049k375450m49540J954729o94859Q92001M71157n16436p21285P13255
-2218a7690365O737934n126313Q80920j915834j989514R73475J103053n67714L93745
$$ y = [-17377063, -17442963, -18852487, -18586385, -19429791, -19261816, -17496365, -18220478, -18219304, -16871633, -18486193, -19215748, -19291531, -16513240, -17000913, -16421824, -16656718, -17545525, -18584744, -16549134, -16978313, -15045748, -16863011, -17448270, -17833652, -15792607, -14426059, -15712445, -17022161, -14360657, -15465314, -15517059, -17899067, -17796441, -16647923, -17709765, -17490802, -15371182, -17583446, -15474164, -14416398, -15592355, -17597417, -17287677, -16682160, -16879478, -18725200, -16236687, -15063642, -15975075, -15581499, -14772778, -13640536, -14378776, -15226181, -16805611, -15080888, -16963937, -19339387, -19788927, -17834198, -18529057, -17637056, -17165899, -17682335, -18403620, -17690365, -10952431, -16078744, -15197824, -17113658, -19103172, -18129697, -17026644, -17594358, -17200613]
-2227a7200613R88203Q75274K899531m357595J725036m732881K200956L545395l813252
-2236a7869946M07937N58978K974927l136325n52925j335435J300246R81954l80167q46381
-2246a7897137J717785K84158k006754K984473M09912n03369K96591j026625n93000J89985
-2256a6143981m71024k410093M201985n32926l1195k148210J332968l37945j136717j48996
-2266a7826134J527049q62209j363625K869567M7086k460243N50701m24160J567242
-2275a6374726J240936j325578j152271K54358K02068J25800R63135O53288j068347
-2284a6481337j997412K933431l111537J807882J909104n23530M8368q74476j132768
-2293a7422275R83295q2711r97938N62257K37742K031566J16230j283989j372287J038188
$$ y = [-17200613, -16212410, -15337136, -12437605, -16795200, -15070164, -19803045, -17602089, -14056694, -17869946, -17462009, -16903031, -13928104, -17064429, -17617354, -18952789, -17652543, -16670589, -17050756, -17897137, -16179352, -15895194, -17901948, -14917475, -14507563, -15010932, -14714341, -15740966, -16333966, -16143981, -16615005, -19025098, -14823113, -15356039, -15387234, -17535444, -16202476, -16540421, -17677138, -17826134, -16299085, -17161294, -18524919, -15655352, -15608266, -18068509, -17517808, -17941968, -16374726, -15133790, -16459368, -17611639, -17357281, -17155213, -17029413, -16066278, -15412990, -16481337, -18478749, -15545318, -18656855, -16848973, -14939869, -15463399, -15415031, -16289507, -17422275, -16438980, -16521691, -17519629, -16957372, -16719630, -14688064, -14571834, -15855823, -17228110, -16189922]
-2303a6189922J396462k839859J103063M07860j00967L3459K7866j078141J314925j844331
-2313a7769585J215917j56200k131700Q57838j016368q33439L821222N1453M1009r38480
-2323a6858333j667933J420425J286816J303765j965176j543382J279577J302358M54352
-2332a4987531k862097J150610p06143P94296L69616l008336M705018j95260l289984
-2341a8029811j080353J485366Q64399Q66261k4934j381764O68412N70996j482247o73981
-2351a8217656K027970p46867J096583m039669J425647J57906O75020R69945j926316
-2360a8577437Q23231J002584j510261Q95103J312388K66491k565690J158121k57504
-2369a7452974J535398o32202N6404P94792j290052o33147R49039n64020N22234P69527
$$ y = [-16189922, -14793460, -17633319, -16530256, -16122396, -16223363, -16189904, -16162038, -17240179, -15925254, -17769585, -16553668, -16709868, -18841568, -17983730, -19000098, -19833537, -16012315, -15960862, -15919853, -16858333, -18526266, -17105841, -15819025, -14515260, -16480436, -18023818, -16744241, -15441883, -14987531, -17849628, -16699018, -17405161, -16610865, -16241249, -19249585, -14544567, -14739827, -18029811, -19110164, -17624798, -16760399, -15894138, -15919072, -17300836, -16632424, -16061428, -17543675, -18217656, -16189686, -16936553, -15839970, -19879639, -18453992, -18296086, -17621066, -16651121, -18577437, -17754206, -16751622, -18261883, -17366780, -16054392, -15787901, -18353591, -17195470, -17452974, -15917576, -16549778, -16493374, -15698582, -16988634, -17621781, -16672742, -17236762, -16714528, -15945001]
-2379a5945001j223410P57006r75016K026257j90972k060359K117950j306735M78154
-2388a6322126j718408k327636M266753j955288K494014r71606k105939j32109R13030
-2397a7859315R45802j900168J624259N78218q54898j055774J133982K878450k346813
-2406a6856257q09387N39710P14707L448733r35708j77522k569394N27833J161795k081063
-2416a7036553J106668P62179j408911q17796j11493L26849k12169k11472P66514K330848
-2426a4505336K9206N66679l517391O34939J532875p40878k231289J720838q20292M24125
-2436a6906524J617513j108555J292415m77912l259724O91043O66584J79579R11405Q61197
-2446a5532979m86215l98979l80603o2919j031287L45336J145817q79337L877212l115804
$$ y = [-15945001, -17168411, -16411405, -17386421, -15360164, -15551136, -17611495, -15493545, -16800280, -16322126, -18040534, -20368170, -16101417, -18056705, -15562691, -16534297, -18640236, -18772345, -17859315, -16913513, -18813681, -17189422, -16611204, -17466102, -18521876, -17387894, -14509444, -16856257, -17665644, -17125934, -16411227, -12962494, -13898202, -14075724, -16645118, -16117285, -14955490, -17036553, -15929885, -15167706, -16576617, -17394413, -17505906, -17179057, -17391226, -17602698, -16836184, -14505336, -14476130, -13909451, -17426842, -16791903, -15259028, -15999906, -18231195, -16510357, -17330649, -16906524, -15289011, -16397566, -15105151, -15583063, -18842787, -18151744, -17485160, -17305581, -16394176, -15532979, -16019194, -16418173, -16798776, -16861695, -17892982, -17547646, -16401829, -17281166, -13403954, -16519758]
-2456a6519758o87861m82613J895865J182487J971249l407648N12586j605882J884016
-2465a5257559k030656R66249j849792K251839O6795j236323K184427J074334k808721
-2474a6639407Q82030J306146l95716k12473l73786j006265Q98017R64317k444519L77195
-2484a6644461J007178r64969j665376K59818J391779j306473p97732K925062N55649
-2493a5239525j11588O81341J169820k632129J410639l233919N84180k249807M231894
-2502a5389094P55154o09004o83475j862723K540504j173109k6383k42315P39894Q60436
-2512a5090115p26409M16537l49700m9221q65943N02730J475550k091697J344345K180482
-2522a3253441l468532M54631j144738R04067n14118l69260K938742J019778k245611p0143
$$ y = [-16519758, -17207619, -17690232, -15794367, -14611880, -12640631, -16048279, -15535693, -17141575, -15257559, -17288215, -16321966, -18171758, -15919919, -15853124, -17089447, -14905020, -13830686, -16639407, -15757377, -14451231, -14846947, -15059420, -15433206, -16439471, -15541454, -14577137, -17021656, -16644461, -15637283, -16602252, -18267628, -18007810, -16616031, -17922504, -18720236, -15795174, -15239525, -15351113, -14669772, -13499952, -16132081, -14721442, -17955361, -17371181, -19620988, -15389094, -14633940, -15242944, -15926419, -17789142, -15248638, -16421747, -16448130, -16690445, -15950551, -15090115, -15816524, -15399987, -15749687, -15798908, -16664851, -16162121, -14686571, -16778268, -15433923, -13253441, -16721973, -16267342, -17412080, -16508013, -17022131, -17391391, -14452649, -13432871, -15678482, -15748625]
-2532a5748625k380445J269027L269976L84184j429198l275035J565742J312701k282053
-2541a7313726K63144J774324j799760L191924k559136J684074n33954j064324o00607
-2550a6958041K81504j437307K208571J350936k905173j698156L49789K467635r41755
-2559a7281997R36749J333017O92285p77194l017415K778947O6528K232301j143403q69327
-2569a5049509J382677k477995N86199L97535j458228K759050j223858k155834l09615
-2578a7549578J303720J291157K420915l045863J81271m583990O0961J766644K977828
-2587a5176935L00679q09605J326479k816864m97141N97293K43458j089507J646303
-2596a6275840j763790j839741j451337L905283L462691j425799j903040K778865k297959
$$ y = [-15748625, -18129070, -16860043, -13590067, -13205883, -14635081, -17910116, -16344374, -15031673, -17313726, -17050582, -15276258, -17076018, -13884094, -16443230, -14759156, -15293110, -16357434, -16958041, -16676537, -18113844, -15905273, -14554337, -17459510, -19157666, -18807877, -16340242, -17281997, -16345248, -15012231, -14319946, -15097140, -18114555, -15335608, -15269080, -13036779, -14180182, -15049509, -13666832, -16144827, -15558628, -15161093, -16619321, -13860271, -15084129, -17239963, -17549578, -16245858, -14954701, -12533786, -15579649, -15398378, -19982368, -19921407, -18154763, -15176935, -14876256, -15685861, -14359382, -17176246, -17673387, -17076094, -16832636, -17922143, -16275840, -18039630, -19879371, -21330708, -17425425, -13962734, -15388533, -17291573, -14512708, -16810667]
-2605a6810667N00095L96524J432929j127468K619971l498626l70622j677366L277647
-2614a5257583n0792J399590K081233j025584j794616k302018O73364o38204K422781
-2623a4491829J757238j354669k802551K94977j79790k47069K696068J09234j473464K9181
-2633a5662674k60524q32688q15917M08639K2474J155113m35655j297759J702964j464951
-2643a7480978K055688M75495o77331q83965J355481l5019J905844n49914k153025k85005
-2653a6272729K808855J642187k171874k105092j401954J232475k654398L159318r4785
-2662a5857997j311339K618697k053468J023633L55195N47598l058634L002182k18853
-2671a4952986Q52843M71512j266136l30947L57112J695459j663660j791423M70237P66681
$$ y = [-16810667, -16310572, -15914048, -14481119, -15608587, -12988616, -16487242, -16857864, -18535230, -15257583, -15308375, -13908785, -11827552, -12853136, -14647752, -16949770, -16276406, -16914610, -14491829, -12734591, -14089260, -16891811, -16596834, -16776624, -17023693, -14327625, -14218391, -15691855, -15662674, -15923198, -16755886, -17571803, -17163164, -17140690, -15985577, -16421232, -17718991, -16016027, -17480978, -15425290, -14949795, -15627126, -16511091, -15155610, -15190629, -13284785, -13834699, -15987724, -16272729, -13463874, -11821687, -13993561, -16098653, -17500607, -16268132, -18922530, -15763212, -15857997, -17169336, -14550639, -16604107, -15580474, -15225279, -14677681, -17736315, -14734133, -14952986, -14100143, -13628631, -14894767, -15225714, -14868602, -13173143, -14836803, -16628226, -16157989, -15391308]
-2681a5391308k61074p17811Q7679j721865j056927J292967L297603m84249r10998J231337
-2691a4634646N12915J383453j492619j252815P15383l231288L261879j167200J290718
-2700a4614220O71648K95416j932766j131796J637129O1500j388925J649475J888588
-2709a2863951k978515k172059M185811k197668n18143J784955j881200l69990L38328
-2718a6672432J342443J204630j458540j438800P58431q14495J934149N53645O75315
-2727a3915654n66758k156143J937381
$$ y = [-15391308, -15652382, -16370193, -16282514, -18004379, -19061306, -17768339, -14470736, -14954985, -15865983, -14634646, -14121731, -12738278, -14230897, -15483712, -14768329, -17999617, -14737738, -15904938, -14614220, -13942572, -13647156, -15579922, -16711718, -15074589, -15013089, -16402014, -14752539, -12863951, -15842466, -18014525, -13828714, -16026382, -16544525, -14759570, -16640770, -17010760, -16672432, -15329989, -14125359, -15583899, -17022699, -16264268, -17078763, -15144614, -14590969, -13915654, -14482412, -16638555, -14701174]
-2730a4701174  $$ checkpoint
##PAGE= N=2
##DATA TABLE=(X++(I..I)), XYDATA
13653a7957278J677774J284859J216065m83310q83480l062846K893772k678646k553426
13644b0546516K303933L000874j331446j140320J277470j94081J286338j841140j948053
13635a9132941l16296P61165J024052m1777L188949j649011Q92144l476321Q66698Q40110
13625a7043228K79565O51806p93524m23545k04484K62851j266329J668936J045726j769104
13615a7591330Q96595J785034j05902N28340j05393N73606J984735l230103l198167
13606a8462585J770181M40477J465761j292695q57421M84184N1512k81395n01934K740179
13596a4443736r57410N57465k196784n28961J630109K680845l078035K036009o83449
13587a4983947j739392Q07804j108745L195955j359597j156700p98437r03427L638100
$$ y = [-17957278, -16279504, -14994645, -13778580, -14261890, -15145370, -18208216, -15314444, -17993090, -20546516, -18242583, -15241709, -16573155, -17713475, -16436005, -16630086, -15343748, -17184888, -19132941, -19449237, -18688072, -17664020, -17705797, -14516848, -16165859, -15273715, -18750036, -17883338, -17043228, -16763663, -16111857, -16905381, -17328926, -17533410, -17270559, -18536888, -16867952, -15822226, -17591330, -16694735, -14909701, -15015603, -14487263, -14592656, -14019050, -12034315, -15264418, -18462585, -16692404, -16251927, -14786166, -16078861, -16936282, -16452098, -16400586, -16681981, -17183915, -14443736, -15401146, -14843681, -17040465, -17569426, -15939317, -13258472, -16336507, -14300498, -14983947, -16723339, -15915535, -17024280, -13828325, -15187922, -16344622, -17143059, -18046486, -14408386]
13578a4408386M17107o16049O02391l3436j498742M74610J431853p01337J168748j309205
13568a4472446J418378J009406l182727m52104j208422J632692J389212l31688k471696
13559a6669395j242204O81865J365203O17825j069109R27180l14418J080607J510147
13550a3112299q88946k080219J560950Q59335L608957l341381j288593K145525J0945
13541a2525726j199144m87954j705146J652548J681236j659580j913142J081053Q39345
13532a4236510j092098K929603j449140j777175j500777J341881J591290r98521K634198
13523a2557249J491061j206554k296692j362750J286616N44303J699943k227107j078035
13514a5706464m13136J071411L869100k981249K91670r69975M49514n56935L056464l84812
$$ y = [-14408386, -13991279, -14607328, -14004937, -14038373, -15537115, -15062505, -13630652, -14331989, -13163241, -14472446, -13054068, -12044662, -15227389, -15679493, -16887915, -15255223, -13866011, -14197699, -16669395, -17911599, -17229734, -15864531, -15246706, -16315815, -15388635, -15703053, -14622446, -13112299, -14001245, -16081464, -14520514, -13661179, -10052222, -13393603, -14682196, -12536671, -12525726, -13724870, -14212824, -15917970, -14265422, -12584186, -14243766, -16156908, -15075855, -14236510, -15328608, -12399005, -13848145, -15625320, -17126097, -15784216, -14192926, -15191447, -12557249, -11066188, -12272742, -14569434, -15932184, -14645568, -14101265, -12401322, -14628429, -15706464, -16119600, -15048189, -11179089, -14160338, -13868668, -14838643, -14389129, -14946064, -11889600, -12274412]
13504a2274412k538869k11879K655364o70880L07253j342826K219377K98077j675580
13495a3234375M00628j166515k505316K648031j545822K559957j148298m05758L48423
13486a4049045j367969R46005j134704J348717j646224K313969O40729J570431l039713
13477a4417804r84060J553486k89654j461168L621891j507675K300276k106322j900724
13468a5191754K134323J20776j707748j472557K970344K50012j009868j70026K244733
13459a1831765J45804j608361J402725r89155J782863k235360m95314k106236P90590
13450a5144209J794197m81505k126297L465835n53209n74080j150941p33053P4861M86025
13440a4942376K353769O69800J33574o5657k125557o99319o16867J806194o20373J510358
$$ y = [-12274412, -14813281, -15025160, -12369796, -13040676, -12733423, -14076249, -11856872, -11558795, -13234375, -12833747, -14000262, -16505578, -13857547, -15403369, -12843412, -13991710, -14397468, -14049045, -15417014, -14471009, -15605713, -14256996, -15903220, -13589251, -12948522, -11378091, -14417804, -15401864, -13848378, -14138032, -15599200, -11977309, -13484984, -11184708, -13291030, -15191754, -13057431, -12936655, -14644403, -16116960, -13146616, -12896604, -13906472, -14076498, -11831765, -11685961, -13294322, -11891597, -12880752, -11097889, -13333249, -13828563, -15934799, -15144209, -13350012, -13831517, -15957814, -12491979, -13045188, -13619268, -14770209, -15503262, -15428401, -14942376, -12588607, -11918807, -11785233, -11850890, -13976447, -14675766, -15292633, -13486439, -14106812, -12596454]
13430a2596454N38628o58734p32787P86317j331662R37382K200236o49878n75025n156055
13420a7238032O874170j9970o97341o78764j90624j325522j367042K067030k929155
13411a5505250L066625j34639j780922R12186J347269M11831n05575J056362R63322q54884
13401a1023675N82623j139692j202333P42965J052059O74160j503973n71472J87422M98934
13391a1702982l85234r5857K16268J450650p94733J581343K17325l406707R10845K306339
13381i702743j205668R6134o05233n83172M37166Q23224J205350k551190p24921K541649
13371a0269404j492424l66881M51752K387478j963074O6152R5112J139938j991292m42055
13361a2384698J143747l82916K373239q41665j033066J084227k47647P92396j928767
$$ y = [-12596454, -12057826, -12716560, -13449347, -12663030, -13994692, -13057310, -10857074, -11506952, -12081977, -17238032, -10363862, -10383832, -11081173, -11759937, -11950561, -13276083, -14643125, -12576095, -15505250, -12438625, -12573264, -14354186, -13442000, -12094731, -11682900, -12188475, -11132113, -10168791, -11023675, -10441052, -11580744, -12783077, -12040112, -10988053, -10313893, -11817866, -12389338, -12201916, -11702982, -12088216, -12184073, -11967805, -10517155, -11311888, -9730545, -9513220, -12919927, -12009082, -9702743, -10908411, -10812277, -11417510, -12000682, -11563516, -10740292, -9534942, -12086132, -12811053, -10269404, -11761828, -12128709, -11676957, -9289479, -11252553, -11186401, -11091289, -9951351, -11942643, -12384698, -11240951, -11623867, -9250628, -10092293, -11125359, -10041132, -10288779, -9496383, -11425150]
13352a1425150o26435Q62617j869363K088052J688233j944687O82296L67413j061339
13343a1238363O54217j262592J590700j490386j063803O84304J333963j620819p22390
13334a3135169j026149K824993k298366L531323r94435k24058L563058j520067l700737
13325a2979607J657813L369239j094993n91578J362354j909564q03798M08411j757113
13316a2338836O42831Q45397j583542R47857L220594p93278R32325l10201M73546n421572
13306a3384879L632052j17377p67811l627507J151366K530505J549437j303215J190947
13297i146482k035149j204006M52795k579J067770l628763J147987J022730j015297
13288a3340994J843857J352249j709842j541331o28296L084301j14976n9363r53611Q75350
$$ y = [-11425150, -12051585, -11188968, -13058331, -10970279, -9282046, -11226733, -10544437, -10177024, -11238363, -10584146, -11846738, -10256038, -11746424, -12810227, -12125923, -10791960, -12412779, -13135169, -14161318, -11336325, -13634691, -10103368, -11097803, -11321861, -7758803, -9278870, -12979607, -11321794, -7952555, -9047548, -9639126, -8276772, -10186336, -10990134, -10581723, -12338836, -11696005, -10850608, -12434150, -11486293, -8265699, -9058977, -8126652, -8436853, -7963307, -13384879, -9752827, -9870204, -10638015, -14265522, -13114156, -10583651, -9034214, -10337429, -9146482, -11181631, -12385637, -11932842, -11935421, -10867651, -14496414, -13348427, -12325697, -13340994, -11497137, -10144888, -11854730, -13396061, -14024357, -10940056, -11055032, -11114395, -12068006, -11192656]
13278a1192656Q97107k268383J505053q69212J156549j55655r45012K07660L292662
13269h371887k087263R2916j899519k68022L289750j586922j329008K731884O10059
13260h818012l305267K164171J678203M59238k666380m69058J694516k508320K517836
13251i253073k027261n08629J354976k85112l04071M158784k90510k414412j729746r37941
13241a2236995K501668o91329P69993j38679k5372K299949p65575k578154l37456R32416
13231a0269534K0361J998904k349716K29360p33420K157484j017992l78922m7310j055354
13221a1446139L067145r59921J251251k262513j15646M60985Q88721Q44754p68632j536654
13211a0576649P50115j6715j72107l15137r73722L619428k287887k25854Q3251n39387
$$ y = [-11192656, -10295549, -12563932, -11058879, -11928091, -10771542, -10927197, -11872209, -11664549, -8371887, -10459150, -10366234, -12265753, -12533775, -9244025, -10830947, -12159955, -9428071, -8818012, -12123279, -9959108, -8280905, -7821667, -10488047, -10957105, -9262589, -11770909, -9253073, -11280334, -11788963, -10433987, -10719099, -11023170, -6864386, -7154896, -9569308, -11299054, -12236995, -9735327, -10426656, -9656663, -9795342, -9820714, -7520765, -8286340, -10864494, -11201950, -10269534, -10249173, -8250269, -10599985, -10370625, -11104045, -8946561, -9964553, -10343475, -10390785, -11446139, -8378994, -9338915, -8087664, -10350177, -10465823, -10004838, -9116117, -8271363, -9039995, -10576649, -9826534, -9843249, -10015356, -10330493, -11304215, -7684787, -9972674, -10198528, -10115277, -10654664]
13201a0654664k07712j7970K08967J356347p26010L02074R78210J542556l774499L200048
13191g792653j555208R39078Q75928N16167k371143j13374N1945J04026O76945K10143
13181h458146j726044M42937L80503q44895O87559J944836k213510m31721K6682M95338
13171i696461M97883J88992N49808J801712l004651j278134J961228p76566m91375L28100
13161i919464K317051O16902j137523j887095J580442J965986k001671J124702j511017
13152h851687j291926J489298j612379M94206J67778j215112K598125j152247K56386
13143i117558n23270l973102O032202j151988J173467K55654k037009L331750k442214
13134h452068J700220j492541R82092r93723k896419J578634K232091j424533J442478
$$ y = [-10654664, -10862376, -10880346, -10671379, -9315032, -10041042, -9738968, -8760758, -7218202, -10992701, -7792653, -9347861, -8408783, -7532855, -7016688, -9387831, -9501205, -9449260, -9345234, -8668289, -8458146, -10184190, -9741253, -9360750, -10205645, -9518086, -7573250, -9786760, -10218481, -10191799, -9696461, -9198578, -9009586, -8459778, -6658066, -9662717, -10940851, -8979623, -9756189, -10247564, -9919464, -7602413, -6985511, -8123034, -10010129, -8429687, -6463701, -8465372, -7340670, -8851687, -10143613, -8654315, -10266694, -9772488, -9604710, -10819822, -8221697, -9373944, -9117558, -9640828, -13613930, -7581728, -8733716, -7560249, -7304595, -9341604, -6009854, -8452068, -6751848, -8244389, -7262297, -8256020, -11152439, -9573805, -7341714, -8766247, -7323769]
13125g323769J802232j786099o64984p19320m1104J113821k55921R1425K760392k821706
13115g845033J33610k598532J206613l1824P77132r77597P4103j182922k58466J77920
13105a0524996r30987K941609p86323j067733K283787J701873R12768j479108j742952
13096h692062O73357K05157Q30499J065558j122818J52664m22887K338659k885771P43116
13086g114528J34788o31100j84613m35299L949372n127217J988695k614234L417134
13077f617002J531200j279845j982100Q19643J334922m16165K506302j000234J39407
13068d963872l44186J7482l695723j26213R47172Q64199K764677q71513k916327j980394
13058a0304698L415094J0157j016787j690665p20759k14001L35879J113568M331906
$$ y = [-7323769, -5521537, -7307636, -7972620, -8691940, -8733044, -7619223, -7875144, -7783719, -5023327, -7845033, -7711423, -10309955, -9103342, -9135166, -8358034, -9335631, -9261528, -10444450, -10702916, -10524996, -11455983, -8514374, -9300697, -10368430, -8084643, -6382770, -5470002, -6949110, -8692062, -8018705, -7813548, -6983049, -5917491, -7040309, -6887645, -7310532, -4971873, -7857644, -7114528, -6979740, -7610840, -7795453, -8230752, -4281380, -9408597, -7419902, -10034136, -6617002, -5085802, -6365647, -8347747, -7528104, -6193182, -6609347, -4103045, -5103279, -4963872, -5308058, -5290576, -8986299, -9112512, -8165340, -7301141, -4536464, -5407977, -8324304, -10304698, -6889604, -6879447, -7896234, -9586899, -10307658, -10521659, -10185780, -9072212, -4740306]
13049d740306j586347j399423R16708n05673m52099l34632Q43929Q5609r19041K99219
13039g792056o32177R10858l85496K566737J55693j178374k641891J678583n54177r11435
13029h783735L47691J285668J240755j208589K042429n56246j674173k614065o07249
13020a0527514L050356l86623n30039J523931k688129O07227J394180K660402k193654
13011g089863Q06221l019549J376833L58901j027205L764238j96224k964658P19486
13002g271820K472466n98936k819988L245995J057419j924784j78312p49887k439892
12993i207739Q02659k57580R68055j41764M06690l46373J881783o20873k403804J559765
12983g359181k030888J141222J574597k22847k102087L0198L150868l61677l412952
$$ y = [-4740306, -6326653, -7726076, -6809368, -7315041, -7767140, -8101772, -7257843, -7172234, -8091275, -7792056, -8424233, -7513375, -7898871, -5332134, -5176441, -6354815, -8996706, -7318123, -7872300, -8783735, -8436044, -7150376, -5909621, -7118210, -5075781, -5632027, -7306200, -9920265, -10527514, -7477158, -7863781, -8393820, -6869889, -9558018, -8950791, -7556611, -4896209, -7089863, -6283642, -9303191, -7926358, -7567457, -8594662, -4830424, -5026648, -7991306, -7271820, -4799354, -5398290, -8218278, -4972283, -3914864, -5839648, -6017960, -6767847, -9207739, -8405080, -8662660, -7694605, -7836369, -7429679, -7776052, -5894269, -6515142, -8918946, -7359181, -9390069, -8248847, -6674250, -6897097, -8999184, -8968986, -5818118, -6179795, -9592747]
12974i592747K750202k673793L225796N30326r24868j774299L496604p8429J79239k265550
12964g127519k23127M24582J455910j66695k99126J638185j319315j118712r51826L82787
12954g304856j65801j254306j389759L406660K755478p84770j601363o77263Q96624Q63258
12944e256098j62618j457658k5360J25040M99058j824722L689176l686455K023595l268129
12934i344171J818664M3924J215208m641r31883l82525L226365j917669l94363o61357
12924g332448J785771j03650r55475p31207j95844j056270j03162j304105K581344J881657
12914e533389J915286j676590M74815L85939n93145k36306n7632j835545J03099l45808
12904g399276L572361m058388j221627K840577j149466L240178n90044l24388j976940
$$ y = [-9592747, -6842545, -9516338, -6290542, -5760216, -6685084, -8459383, -4962779, -5041208, -4861969, -7127519, -7350646, -6926064, -5470154, -5636849, -5935975, -4297790, -5617105, -6735817, -7687643, -7304856, -7470657, -8724963, -10114722, -6708062, -3952584, -4737354, -6338717, -7015980, -6119356, -5256098, -5418716, -6876374, -6901734, -6776694, -6277636, -8102358, -4413182, -8099637, -6076042, -9344171, -7525507, -7481583, -6266375, -6271016, -7202899, -7585424, -4359059, -6276728, -6671091, -7332448, -5546677, -5650327, -6605802, -7337009, -7532853, -8589123, -8692285, -9996390, -7415046, -5533389, -3618103, -5294693, -4819878, -4433939, -5027084, -5263390, -5321022, -7156567, -7053468, -7399276, -3826915, -7885303, -9106930, -6266353, -7415819, -4175641, -4765685, -5090073, -7067013]
12895g067013J029743M56405M61944k291191j762555K997568l51544J294749J559199
12886c672695k88108l335420p4561P27942o68972K818099L11806Q43259o96921k163002
12876f198573K332542j991232K701894j047222m325500J491889k692855K950380K919979
12867c858698j546213j006196N6656J885221m73160j183239j286275J300239K604926
12858c506739n88462k343914M67406Q5205O88141j318106J011136J559364q02396K83864
12848d464501O24604n61171L15464Q5128O27432Q6649j062898J143491l019096N81817
12838e643081k108624m35150k61627J948425J170547M12270o70074J247751R19786o01908
12828d021685K78908k34024l581455K055842o95403l05809J891073q51028N65820K467650
$$ y = [-7067013, -6037270, -5580865, -5118921, -7410112, -9172667, -6175099, -6526643, -5231894, -3672695, -3960803, -7296223, -7370784, -6642842, -7311814, -4493715, -4181909, -3338650, -4035571, -6198573, -3866031, -5857263, -3155369, -4202591, -8528091, -7036202, -9729057, -6778677, -3858698, -5404911, -6411107, -6354451, -4469230, -4942390, -6125629, -7411904, -6111665, -3506739, -4095201, -6439115, -5971709, -5886504, -5198363, -6516469, -5505333, -3945969, -4748365, -4464501, -3839897, -4401068, -4085604, -4000476, -3373044, -3286395, -4349293, -3205802, -6224898, -5643081, -7751705, -8186855, -8448482, -6500057, -5329510, -4917240, -5587314, -4339563, -3419777, -4021685, -3742777, -3976801, -7558256, -5502414, -6197817, -6503626, -4612553, -5463581, -4897761, -2430111]
12818b430111j748001M4122n5620J520251L9736k09568l510984L043726M88792K92788
12808b524869j702800j102889K381509k321910j011445q09676R1933K539040j014900
12799e476007j121328j761332L296337K28844k287745K337502K6190J699938o91743k59689
12789d009033J58186L58826j228698n50512J548334R96547k287522l52154Q31786L02174
12779d232066k3567J185352j763530J423865J081965j976641N86216J210377l491618
12770e999647P86214o28528P83870K40859j119790L274001r89117J950821j527654j170304
12760d399275m36794N89845j331633r12004k85508J527932m30520j274106L23702J150692
12750e477669J261251J954337l246368Q56201j538217R3223R4720J216484j448689L290106
$$ y = [-2430111, -4178112, -4133990, -4189610, -2669359, -2629623, -2839191, -6350175, -3306449, -2817657, -2524869, -4227669, -5330558, -2949049, -5270959, -6282404, -7092080, -7000147, -4461107, -5476007, -6597335, -8358667, -5062330, -4833486, -7121231, -4783729, -4757539, -3057601, -3749344, -4009033, -3850847, -3492021, -4720719, -5271231, -3722897, -2726350, -5013872, -5366026, -4534240, -4232066, -4255633, -3070281, -4833811, -3409946, -2327981, -4304622, -3718406, -2508029, -5999647, -5213433, -5841961, -5058091, -4817232, -5937022, -2663021, -3652138, -1701317, -3228971, -4399275, -4836069, -4246224, -5577857, -6489861, -6775369, -5247437, -5677957, -6952063, -6628361, -5477669, -4216418, -2262081, -5508449, -4652248, -6190465, -6097242, -6002522, -4786038, -6234727, -2944621]
12740b944621j49649p58006M02424J9510N1875k47464k030770J372810P4007k167399
12730f377283K830750K87647j05270j399599J116598j316913J088521q16934j44745
12721d837228k205195J824216K49032n99367J960539J041039k280307m14559Q31023k91157
12711d721964J22873J269022J200623j503462k025017j089211J561432J549200K872681
12702g63823j655217m53991j854630N63040K221939p86541l627256N05465j619007K443800
12692e026221j010110N79826p96397L581147j207969m57521m27584K184276j077310Q10450
12682b847413m598536J013150M411391M36879j134122r84106J089406L21Q65194l162511
12672d910347k479677K945632m9631M784n15917L07464q75116J248730j755239J314463
$$ y = [-2944621, -3094270, -3852276, -3449852, -3430342, -3378467, -3625931, -5656701, -4283891, -4209884, -6377283, -3546533, -3258886, -3364156, -4763755, -3647157, -4964070, -3875549, -4692483, -4837228, -7042423, -5218207, -4969175, -5568542, -3608003, -2566964, -4847271, -5261830, -4430807, -4721964, -4599091, -3330069, -2129446, -3632908, -5657925, -6747136, -5185704, -3636504, -763823, -2419040, -2873031, -4727661, -4164621, -1942682, -2729223, -6356479, -5851014, -7470021, -5026221, -6036331, -5456505, -6252902, -2671755, -3879724, -4337245, -4764829, -2580553, -3657863, -2847413, -7445949, -6432799, -2021408, -1584529, -2718651, -3702757, -2613351, -2613030, -1747836, -4910347, -7390024, -4444392, -4494023, -4489239, -5005156, -4697692, -5572808, -4324078, -6079317, -4764854]
12662d764854P65202r68324R87419J784087j981383Q45949J089048n18405k100638J147000
12652c714899j462227q05722K788642J19040J374202L22969j140112k028928k10764
12643d757799j710689J783937J402411j296634k17732J270784R93345J106581m76649
12634a902445m42780J69477J484688k46688j679670k718105K899413m61095K95044n68689
12624c170850k56901K308579j704030P35935j375112J424519k838652M306813k003546
12615b573245j195981K544824j455201J061386j293701M82645j133413n4131O37651
12606b979166K444056o72220j23894j14740K474j744700N60434l159333N62242J105090
12596d119757j245986K391676M38989l01525l58185r73006K549698p49352R71113n89722
$$ y = [-4764854, -3999652, -4967976, -3980557, -2196470, -4177853, -3331904, -2242856, -2761261, -4861899, -3714899, -5177126, -5982848, -3194206, -3075166, -1700964, -1377995, -2518107, -4547035, -4757799, -6468488, -4684551, -3282140, -4578774, -4796506, -3525722, -2532377, -1425796, -1902445, -2345225, -2175748, -691060, -937748, -2617418, -5335523, -2436110, -2897205, -2602161, -3170850, -3427751, -1119172, -2823202, -2087267, -3462379, -2037860, -4876512, -569699, -2573245, -3769226, -1224402, -2679603, -1618217, -2911918, -2429273, -3562686, -3616817, -2979166, -535110, -1207330, -1331224, -1445964, -1443490, -3188190, -2627756, -5787089, -5224847, -4119757, -5365743, -2974067, -2535078, -2836603, -3194788, -4167794, -1618096, -2367448, -1396335, -1986057]
12586a986057k150421j612989j7300J524881J383083L53953J359732j147136k272923
12577d565177R97108J289969k287308j396192K103330M64786j145137K592369q08596
12568b754848J051081L04868j261806j5606j354825J135153o77918L352381m332140
12559d553660J023227Q41595J08857J341355N68215p74232L21012L66074l345696K992745
12549a110508k98874o56525M59354j837490O57021Q08091j549903J578704R92906p18397
12539a675621K875880j861152k830638J282152J076644j428793l048179K507505J700097
12530a402105M28288j389273J010703J05655n87464j695973p06312J114126J84495J093287
12520a844573j230781R12572k85430j294976L46401M13270K233371j231906p72742q2823
$$ y = [-1986057, -4136478, -5749467, -5766767, -4241886, -2858803, -2504850, -1145118, -2292254, -4565177, -3568069, -2278100, -4565408, -5961600, -3858270, -3393484, -4538621, -1946252, -2754848, -1703767, -1398899, -2660705, -2676311, -4031136, -2895983, -3573901, -221520, -4553660, -3530433, -2688838, -2579981, -1238626, -670411, -1444643, -1123631, -757557, -4103253, -1110508, -1409382, -2065907, -1606553, -3444043, -2787022, -1978931, -3528834, -1950130, -957224, -1675621, 1200259, -660893, -3491531, -2209379, -1132735, -2561528, -5609707, -3102202, -1402105, -973817, -2363090, -1352387, -1246732, -1834196, -3530169, -4236481, -3122355, -2937860, -1844573, -3075354, -2162782, -2448212, -3743188, -3396787, -2983517, -750146, -1982052, -2754794, -2837617]
12510b837617J461730J16119k263563J905782J620786m7254k646287N44410k926504
12501e072398K940920J049312J465529j199027j480582o28859M05373Q87446k547014
12492d179300J913851j592900M72439j174374L510899j812558P66904m83923p08535
12483c287497j943947J956440J951965l190826Q92449Q07303J099301q18290J041328
12474a491774r33158j461526J825320r30329J180691M83215j33478j538625j568981
12465d568645K146910M79934J778417j456004O5710m3096Q64427K37066k558913J72666
12455b881528j404682L513333k72804J17078j318522J463002j231676j016039l211857
12446f243695K376493J302489L97674o80460J647131Q25152J218866k186254n53019
$$ y = [-2837617, -1375887, -1259768, -3523331, -1617549, 3237, -44017, -2690304, -2145894, -5072398, -2131478, -1082166, 383363, -815664, -2296246, -2925105, -2519732, -1632286, -4179300, -2265449, -3858349, -3385910, -4560284, -1049385, -2861943, -2095039, -2578962, -3287497, -5231444, -3275004, -1323039, -4513865, -3621416, -2814113, -1714812, -2533102, -1491774, -2424932, -3886458, -2061138, -2991467, -1810776, -1327561, -1461039, -2999664, -4568645, -2421735, -1941801, -163384, -1619388, -1553678, -1596774, -732347, -495281, -3054194, -2881528, -4286210, -772877, -1045681, -928603, -2247125, -784123, -2015799, -3031838, -6243695, -3867202, -2564713, -2167039, -2847499, -1200368, -375216, 843650, -1342604, -1895623]
12437a895623j444625J105382m91589J116023p60767J345761J692471L99705k864462
12428a797724J097875l64649j244152j242305K486101j076215p8564R54129j58236P57088
12418f66652j665932J396030q78784P17480r5949O32491r84806k694605J025760L326269
12408A11302j541124R85808j315539J562361k752960J814408J529216j140067r00983
12399a647578K05895j353755R32248j954340L002275j215357N72384j718720L29529j83204
12389c030623Q01192k254861J254072O3497Q28091L480257j235173j2439j003148J652565
12379E43430M36376j847669m91572k135932K403961N99619J112769j187570j821345
12370b387933K510266l13886j904596K15171J019033N88741k957328K391283q0303R65648
$$ y = [-1895623, -3340248, -2234866, -2726455, -1610432, -2371199, -1025438, 667033, 1066738, -1797724, -699849, -1064498, -2308650, -3550955, -1064854, -2141069, -2219633, -1265504, -1423740, -666652, -2332584, -936554, -1815338, -1097858, -1193807, -561316, -1546122, -4240727, -3214967, 111302, -1429822, -444014, -1759553, -197192, -2950152, -1135744, 393472, -746595, -1647578, -1441683, -2795438, -1863190, -3817530, -815255, -2030612, -1458228, -3176948, -2847419, -3030623, -2229431, -4484292, -3230220, -3166723, -2338632, 1141625, -93548, -105987, -1109135, 543430, 979806, -867863, -1359435, -3495367, -1091406, -491787, 620982, -566588, -2387933, 122333, -191553, -2096149, -1880978, -861945, -273204, -3230532, -839249, -919552, 46096]
12360D6096n84190j367850j562366K181046J206525k583714J417230j835791Q24064
12351b258950J869017l178149K089050k698700K467701j335475K191682J729397p30945
12342A44628r30743K615232l018223j702564J229101l49506J753409o35860j004488
12333a899014K214339O82525j87746R54987l170575j167452l03853J924291J95511j828646
12323b585633r5534K449849N55265j654245K188502j024284L38134m78059K35479k030094
12313b100620J32435M11696J016794n76908j457938J848768L78309m2265Q44098j750369
12303a296000l81138J679334j21229m59614l79180N37049J469175q31561j247365k88299
12293a318828j360179J544276K60354L51568j092817m29690q08886M77148J519186n60806
$$ y = [46096, -538094, -1905944, -3468310, -1287264, -80739, -2664453, -1247223, -3083014, -2258950, -389933, -3568082, -1479032, -4177732, -1710031, -3045506, -853824, 875573, 144628, -786115, 1829117, -1189106, -2891670, -1662569, -2012075, -258666, -894526, -1899014, 315325, 997850, 810104, 1765091, -1405484, -2572936, -2876789, -952498, -756987, -2585633, -2681167, -231318, 323947, -1330298, 858204, -166080, 172054, -306005, -70526, -2100620, -1968185, -1556489, -539695, -1116603, -2574541, -725773, -347464, -389729, 454369, -1296000, -1677138, 2196, -119033, -578647, -957827, -420778, 1048397, 216836, -1030529, -1318828, -2679007, -1134731, -874377, -522809, -1615626, -2045316, -2854202, -2377054, -857868, -1418674]
12283a418674j707714J630532M43498k14988Q41827m93785p64768j187615J688055K55492
12273i28140K51892k021203m27078P20283K890117J763786r01422l248068O55529J016899
12263b27405o68369J212629k80044j858184n21475Q31401j184580N9138M386856P6972
12253A826939j703233o57626P48654l84539J032686k098311k18188P38438n1945r09595
12243a676720J87166J59454J272696l02395j941467J42155L345151j99023L66756j385852
12233c2079L48392k468165n91993O53263O58393J134690n04149j7838P17487l37184l44076
12222g83259r91871p05237k128580L010792l99302l59995J044985r82446N13040J368187
12212d13686J010408j874318K229492q59361l91454P81304k652291k56977Q76455J380083
$$ y = [-1418674, -3126388, -1495856, -1052358, -1267346, -425519, -919304, -1684072, -2871687, -1183632, -928140, -676248, -2697451, -3124529, -2404246, 485871, 2249657, 1348235, -1899833, -1244304, -227405, -895774, 316855, 36811, -1821373, -2342848, -1511447, -2696027, -2636889, 1749967, 1826939, 123706, -533920, 214734, -169805, 862881, -1235430, -1453618, -715180, -767125, -1676720, -1489554, -1330100, -57404, -359799, -2301266, -2159111, 1186040, 987017, 1353773, -32079, 316313, -2151852, -2743845, -2090582, -1432189, -297499, -801648, -819486, -101999, -439183, -783259, -1775130, -2480367, -4608947, -1598155, -1997457, -2357452, -1312467, -2294913, -1781873, -413686, 596722, -1277596, 951896, 92535, -298919, 482385, -2169906, -2426883, -1550428, -170345]
12202a70345n77661L161475j323381j050790m33743j78334L72033M12637l05945J33489
12192C9435j941941J446265O50952j906573J858362j294072n20539Q31160j85915J242819
12182B19953k211380K124681j454797l00893J139738q75926J897270M09299j29168q56828
12172c8051j387245k76740J800099J808646m554951K209610N20507k312058J442174
12163g88009J060431M28839k019322j8824j583470J341144k42663l87729K24100q9931
12153b075434O11911L906451j649529L08572R94260m157130q57627O13206j61843J849954
12143f17209M14251j150679Q1458J451443j302921Q65513J707332m03174j72413n53298
12133C20303r57829L114937j504932k336179L140079m50721q05565j838883j27126J869936
$$ y = [-170345, -748006, 2413469, 1090088, 39298, -394445, -572779, -200746, 211891, -94054, 39435, -1902506, -456241, 194711, -1711862, 146500, -1147572, -1668111, -836951, -1022866, 219953, -1991427, 133254, -1321543, -1622436, -482698, -1358624, 538646, 947945, 818777, -38051, -1425296, -1702036, 98063, 1906709, -2648242, -438632, 81875, -2230183, -788009, 272422, 701261, -1318061, -1336885, -2920355, -1579211, -1821874, -2209603, -1985503, -2075434, -1463523, 2442928, 793399, 1101971, 2096231, -2060899, -2918526, -2305320, -2467163, -617209, -202958, -1353637, -1272179, 179264, -1123657, -258144, 1449188, 1046014, 873601, 320303, -637526, 2477411, 972479, -1363700, 1776379, 1325658, 520093, -1318790, -1445916, 424020]
12123D24020o62973N83677o81448J600030J317665m227439J685843L29732L33072j772251
12113a070072J972105J776498k213329j953008Q86963J250879m0953o76264J316214o34715
12103F14318k68031j12453p74135M87034m53298j157130J736700J153862q93205J206558
12093A540220m63690l296711J349397j634932l141001K531635K405208K18011p78570
12084a270433q03658K271460J250942o52022r26520L7392p1165M2491j733262j906812
12074c761587L088450J797175j157493j420947J041367O678953Q031230r282197p464543
12065b449592J0325154j0436660j054818K235916K473910L38088j772253p08397M31806
12056f16846m64806m58188J603474j148376J21845M26844J154250O44426R30330l934214
$$ y = [424020, -238953, 344724, -336724, 1263306, 2580971, -1646468, 39375, 369107, 702179, -1070072, 902033, 2678531, 465202, -1487806, -600843, 650036, 609083, -67181, 1249033, 614318, 346287, 233834, -540301, -53267, -506565, -1663695, 73005, 1226867, 333662, 1540220, 1076530, -2220181, -870784, -2505716, -5646717, -3115082, -709874, -491863, -1270433, -2074091, 197369, 1448311, 796289, -130231, -92839, -164004, -121513, -1854775, -3761587, -673137, 1124038, -33455, -1454402, -413035, 6265918, 14297148, 5014951, -2449592, 7875562, -2561098, -3615916, -1380000, 1093910, 1431998, -340255, -1048652, -616846, -1081652, -1539840, 63634, -1084742, -962897, -536053, 618197, 1262623, 2192953, -1741261]
12046a741261Q99137J892107M22090k020303J47133j074388J225094k77307m69146k06286
12036a203130P12785J640663r19684M12263n01743k377130J555793J245381J697144
12027B262342j432287m348998K175599J146540Q03242l90628k469956J239357l52710
12018a367499K970753o24624q94222m45936n13556m77799O95815m12015j023246K887370
12008G95041J342980k585178K6714J016682p56227K049064p4277n526864n29846J517569
11998b724342k540767M51143J39107J844558j020335K082160J493593K24525j595147
11989a645505j23985R51280k208136o35861q90424K618933j73994Q84797j780136j670652
11979d673683j151789J948458q09922K360173k480612N34664L87810L069770k973709
$$ y = [-1741261, -842124, 1049983, 1472073, -548230, -401097, -1475485, -250391, -527698, -996844, -1203130, -490345, 1150318, 230634, 642897, 141154, -2235976, -680183, 565198, 2262342, 830055, -3518943, -1343344, -196804, 606438, 215810, -2254146, -1014789, -1367499, 1603254, 978630, 84408, -361528, -875084, -1352883, -657068, -1069083, -2092329, 795041, 2138021, -447157, -420443, 596239, -159988, 1889076, 1814799, -3712065, -4241911, -2724342, -5265109, -4813966, -4674859, -2830301, -3850636, -1768476, -274883, -50358, -1645505, -1769490, -818210, -3026346, -3662207, -4552631, -1933698, -2107692, -1222895, -3003031, -4673683, -5825472, -3877014, -4686936, -2326763, -4807375, -4272711, -3884901, -815131, -3788840]
11970c788840K930470r05393j061486l109742J889989K430326j184702j722111L517231
11961a004258j076701j339483L48218k379626l00307r99251j699664j76333J171829
11952g455576J650142J881974K554463M12037J49535k013644L894032J827130N48806
11943C448899k682635Q24319J129430k172022L68415j16582j856433J67570j808984
11934b698023J387644K821161P66208k038746J849064L90949q12603r99684P75868k935682
11924a493844K357649O96564K011333l122757j058973k38602M17637l64256J315186
11915E19937k037886r06162j71118L387995N41114j92476l45370k206183k09796O65357
11905i54588M29692j690419j047134l459065L94094O22076K213988K466415L38486K22215
$$ y = [-3788840, -858370, -1763763, -2825249, -5934991, -4045002, -1614676, -2799378, -4521489, -1004258, -2080959, -3420442, -3072224, -5451850, -5752157, -6751408, -8451072, -8627405, -7455576, -5805434, -3923460, -1368997, -956960, -807425, -2821069, 1072963, 2900093, 3448899, 766264, 1590583, 2720013, 547991, 916406, 799824, -1056609, -889039, -2698023, -1310379, 1510782, 2276990, 238244, 2087308, 2478257, 1665654, 665970, 1441838, -1493844, 863805, 1560369, 3571702, 448945, -610028, -848630, -430993, -795249, 519937, -1517949, -2424111, -2595229, 792766, 1333880, 1141404, 796034, -1410149, -1619945, -954588, -524896, -2215315, -3262449, -6721514, -6327420, -5705344, -3491356, -1024941, -686455, -464240]
11895d64240M21899j025714K783168j584242K05984J143771j214717K115507k595683
11886b14267J11288O19504J30404j165543j697355q1120K246736j293028j161378L69471
11876b135288J151574j543465J270692Q82008k74285J391819j494593J898067K041093
11867C187622j560478j267107j86102l52929R6812l84821K446705r78849k74398P40380
11857A466835k146101m31981M219280r32414o76305k582855j120778J565354m28636
11848a067601J098768j58600J245535k47141N43388j059087J612820J527797l66449j32708
11838B996722k411468O929L190396k024298q84791J20370M34452j424032K779155J063163
11828C846598K56703L05086N77521j252532j202923k81406o47378K597597l73429r71472
$$ y = [-464240, -42341, -1068055, 1715113, 130871, 336855, 1480626, 265909, 2381416, -214267, -102979, 516525, 646929, -518614, -2215969, -2297089, -50353, -1343381, -2504759, -2135288, -983714, -2527179, -1256487, -374479, -648764, 743055, -751538, 1146529, 3187622, 1627144, 360037, 173935, -178994, -82182, -467003, 1979702, 1000853, 726455, 1466835, -679266, -1111247, 3108033, 2175619, 1499314, -1083541, -2204319, -638965, -1067601, 31167, -127433, 1118102, 870961, 1414349, 355262, 1968082, 3495879, 3129430, 2996722, 585254, 592183, 3782579, 1758281, 873490, 993860, 1428312, 4280, 2783435, 3846598, 4103301, 4408387, 4985908, 3733376, 2530453, 2249047, 1601669, 4199266, 3825837, 2854365]
11818B854365l758355K104167J060504n24795o37949L011478k067016J07536L111635
11809E261570j239781j084342K115991j89721k828887r8276k662907K027247J01402R76596
11799B378892K087727J382995j734617j549124l30764K19059m75443j358051K227709
11790B848383q65573M43636j570516K406640J590560k455276N7463J20850M29760R50418
11780C956345J000828J313171q76466L99288j619208Q2828R98137k281717o22002L52420
11770B703624o32921p38392J546315M005365j062587j042540j308329o77935N87146P82316
11760D162062J1039o93005k43065m61540K724004k320908M096587j367901j290075p74832
11750C842366j396845J543539q36022O68350J948593k03765o38636O64979k930207j299843
$$ y = [2854365, -903990, 1200177, 2260681, 1735886, 1097937, 4109415, 2042399, 2149935, 5261570, 4021789, 2937447, 5053438, 4863717, 2034830, 1936554, -726353, 1300894, 1402296, 2378892, 4466619, 5849614, 4114997, 2565873, 2235109, 2454168, 1978725, 620674, 2848383, 1982810, 2426446, 855930, 3262570, 4853130, 2397854, 2455317, 2576167, 3005927, 3956345, 4957173, 6270344, 5393878, 5793166, 4173958, 4256786, 5254923, 2973206, 2351204, 2703624, 2070703, 1332311, 2878626, 6883991, 5821404, 4778864, 3470535, 2792600, 3379746, 4162062, 4173101, 3480096, 3237031, 2775491, 5499495, 3178587, 7275174, 5907273, 4617198, 3842366, 2445521, 3989060, 3153038, 3821388, 5769981, 5566216, 4927580, 5592559, 2662352, 1362509]
11740A362509J389006k41131O98195Q06263r59347N40968J423138K984976j492835k319436
11730D192306J318301M23741j874420P94727j140987J416929j312471j073319j82079
11721B562728p16830q34092K99107L420398m16565k944766r16315K603187J203487N21597
11711D781936q01003N07267l155717K617582O41974j536284P33150J740062K01771k082754
11701C647984P90001j467580J607450J708116l086031K156333K08052q39861r43435
11692C781029k605697M87790o47019K507835j579130J830830j53740J684790j117874
11683D188814o53357j925777o74192J121591J208281J165743m39702o70327K275915j98200
11673E398789n1531j823833M53238L3279K385385j675836j834365l13205m92322J782731
$$ y = [1362509, 2751515, 2510384, 3208579, 4014842, 3055495, 3596463, 5019601, 8004577, 6511742, 4192306, 5510607, 5934348, 4059928, 4854655, 3713668, 5130597, 3818126, 2744807, 2562728, 1845898, 1011806, 1310913, 4731311, 4314746, 1369980, 453665, 3056852, 4260339, 4781936, 3980933, 4488200, 1332483, 3950065, 4592039, 3055755, 3788905, 5528967, 5730738, 3647984, 4437985, 2970405, 4577855, 6285971, 3199940, 5356273, 5564325, 4724464, 3781029, 1175332, 1663122, 1016103, 3523938, 1944808, 3775638, 3621898, 5306688, 4188814, 3535457, 1609680, 935488, 2057079, 3265360, 4431103, 3991401, 3321074, 5596989, 5398789, 5347258, 3523425, 3976663, 4009942, 6395327, 4719491, 2885126, 2571921, 2079599, 3862330]
11663C862330J713530m53317J51696j27184j644007n86204J608213K30178l510201O47183
11653A892217K401007J302925J003881l248671J88247k589581K072426J286066j909541
11644B398976N18836j589848K459148K931751m201881J783658N13483n31744j19154
11635D163225j043311l12951K307233l81166O86107j235824P6953j36806j846956J856721
11625D133225J091991p47799k38797m16852j276535J137991j72634j494674J299181P05527
11615D020624J051391Q15696l734361Q04478J290411J2620j057315j216385J791043Q51225
11605D629427j375393R92775j927770J177911R50481Q4897p47948K107520N61531n23917
11595E929514l284030J133228k89544K37337J88150L295792k254307l9030q26215r68153
$$ y = [3862330, 5575860, 5122543, 5274239, 5147055, 3503048, 2916844, 4525057, 4755235, 1245034, 1892217, 4293224, 5596149, 6600030, 3351359, 3539606, 950025, 3022451, 4308517, 2398976, 2917812, 1327964, 3787112, 6718863, 2516982, 4300640, 4814123, 4282379, 4163225, 3119914, 2806963, 5114196, 4733030, 5419137, 4183313, 4260266, 4123460, 2276504, 4133225, 5225216, 4477417, 4238620, 3821768, 2545233, 3683224, 3510590, 2015916, 3315097, 4020624, 5072015, 5887711, 2153350, 2957828, 4248239, 4260859, 3203544, 1987159, 3778202, 4629427, 3254034, 4246809, 2319039, 3496950, 4447431, 4532328, 3784380, 5891900, 6453431, 5929514, 2645484, 3778712, 3489168, 3726505, 3914655, 7210447, 4956140, 4917110, 4090895, 3122742]
11585C122742K581508j752720j025342O040R62391j93095q71687O02530P96009l9469
11575D188907q79657J512064J721597j738212K43908K40091L20610j484572J014176m7322
11565E091590q14135j149442l25002K109010l53107J58763J192488k215532M031120
11556G725753k528194m20863k276380J258511J317223p48741n02891N38159J589331
11547E951908j126032L34323O8932r31228M13398K586252k998593J549967J222923L95610
11537G467460j525421r51932l6967l363651p80437M295289q04496J9863O03022J552853
11527F475583o91392j783132k42375J211817m93356K7580L25319r51319n38824J612042
11517D951943P54171n137j55454q07581J609114k562775J707961J61543J650622m064365
$$ y = [3122742, 5704250, 3951530, 2926188, 2932228, 3894619, 3701524, 2829837, 3432367, 4228376, 4188907, 3309250, 4821314, 6542911, 4804699, 5048607, 5288698, 5609308, 4124736, 5138912, 5091590, 4277455, 3128013, 2803011, 4912021, 4558914, 4717677, 5910165, 3694633, 7725753, 5197559, 4776696, 2500316, 3758827, 5076050, 4327309, 3824418, 4362577, 5951908, 4825876, 5160199, 5229131, 4297903, 4711301, 7297553, 4298960, 5848927, 7071850, 7467460, 5942039, 4990107, 4953140, 1589489, 809052, 5104341, 4299845, 4319708, 4922730, 6475583, 5784191, 4001059, 3758684, 4970501, 4477145, 4504725, 4830044, 3878725, 3339901, 4951943, 5706114, 5700977, 5545523, 4737942, 6347056, 3784281, 5492242, 5653785, 7304407, 3240042]
11507C240042J862399Q40079j633290J232858J929556j546543j946674l879455M61082
11498E60054J664394J137895K094294J122703k929288j693673q0557M30473N77850Q93719
11488C777864j133296J890849J041430j527965j649546J802179M06566r60286o42905
11479C004890p90661M477000l125006Q30832l586395K364538J257779J07699j794856
11470B745820R41068r70544K517035J54054L57108J151087k166470K08528N89151K227904
11460G754741j262459J209148M01871l016480k185690J335625j542630O80961J845994
11451E221081j19318J175847J365899p41405j519733k426639K424823L82594p84884O0974
11441E039239n10427K295382r76821j400932p63775P80179j240202k443346M390577n83579
$$ y = [3240042, 5102441, 5942520, 4309230, 5542088, 7471644, 5925101, 3978427, 98972, 560054, 2224448, 3362343, 5456637, 6579340, 3650052, 1956379, 1875822, 2306295, 2884145, 3777864, 2644568, 4535417, 5576847, 4048882, 2399336, 4201515, 4608081, 3647795, 3004890, 2214229, 6691229, 3566223, 4397055, 810660, 3175198, 4432977, 4540676, 2745820, 3686888, 2716344, 5233379, 5387433, 5744541, 6895628, 4729158, 4937686, 5526837, 7754741, 6492282, 7701430, 8103301, 5086821, 2901131, 4236756, 2694126, 3375087, 5221081, 5101763, 6277610, 7643509, 6902104, 5382371, 2955732, 5380555, 5763149, 4978265, 5039239, 4528812, 6824194, 5847373, 4446441, 3682666, 4462845, 3222643, 779297, 5169874, 4586295]
11431D586295j402522M568469L3557j730986l07193L82670j739187J86204r1242J941922
11421F427987o08668n01440j592336L02488J751603j47917m21618l211658J089954J946305
11411E034700r07318p81685M378998k299313m30414J161056j956270n02842J787577
11402E484489J556342o04431j013252J519370l134551L639984m75626m024534J307798
11393D255589J186097j862631K481354q35641R76342L99899j660383O13537m54189K241942
11383G341916j637812o36391m22315P63257l29869J10397J94124K053882j251579p79856
11373E405754L82471J713375k570737J404102Q38176k49196k449818J560484k023405
11364D011206J53056R29408j16434O81974k83307L39706K59127K85169L59618R7847n64595
$$ y = [4586295, 3183773, 7752242, 7785799, 6054813, 5747620, 6130290, 4391103, 4577307, 4486065, 6427987, 5819319, 5317879, 3725543, 4028031, 5779634, 5631717, 5210099, 1998441, 3088395, 5034700, 4127382, 3345697, 7724695, 5425382, 4994968, 6156024, 4199754, 3696912, 5484489, 7040831, 6436400, 5423148, 6942518, 3807967, 7447951, 6972325, 2947791, 4255589, 5441686, 3579055, 6060409, 5224768, 6201110, 6601009, 4940626, 5554163, 5099974, 7341916, 5704104, 5067713, 4645398, 5408655, 5078786, 5189183, 5383307, 7437189, 6185610, 5405754, 5788225, 7501600, 4930863, 6334965, 7173141, 6923945, 4474127, 6034611, 4011206, 4164262, 5093670, 4977236, 5659210, 5375903, 5715609, 5974736, 6259905, 6619523, 6717370, 6152775]
$$ [...]
-2730b1007626  $$ checkpoint
##END NTUPLES=
##END=
