##TITLE= S#497215
##JCAMP-DX= 5.00 $$ JEOL NMR v1.10
##DATA TYPE= NMR SPECTRUM
##DATA CLASS= NTUPLES
##NUM DIM= 1
##ORIGIN= DELTA_NMR
##OWNER= NMR
##SPECTROMETER/DATA SYSTEM= DELTA_NMR
##.OBSERVE FREQUENCY= 3.00529655924288E+02
##.OBSERVE NUCLEUS= ^1H
##.DELAY= (2.195E+02,2.195E+02)
##.ACQUISITION MODE= SIMULTANEOUS
##.FIELD= 7.0586013
##.FILTER WIDTH= 1.81675738660864
##.ACQUISITION TIME= 3.6339712
##.SPINNING RATE= 17
##.OBSERVE 90= 9.2
$$ ------------------------
$$ JEOL SPECIFIC PARAMETERS
##$FILENAME= C:\NMR/eb-6.jdf
##$TITLE= S#497215
##$AUTHOR= NMR
##$CREATION=  1-FEB-2018 13:41:59
##$REVISION=  1-FEB-2018 13:49:10
##$CONTENT= PROTON NMR EXPERIMENT
##$INSTRUMENT= DELTA_NMR
##$SITE= Center College ECP+ 300
##$NODENAME= nmr2
##$DIMENSIONS= 1
##$STORAGE= FLOAT
##$X_FORMAT= COMPLEX
##$X_CURR_POINTS= 16384
##$X_START= 12.50103 $$ppm
##$X_STOP= -2.50012 $$ppm
##$X_TITLE= 1H                             
##$X_ZERO_POINT= 0.33329
##$X_FREQ_FLIP= FALSE
##$X_POINTS= 16384
##$X_PRESCANS= 0
##$X_DOMAIN= 1H
##$X_OFFSET= 5 $$ppm
##$X_FREQ= 300.52966 $$MHz
##$X_SWEEP= 4.50857 $$kHz
##$X_RESOLUTION= 0.27518 $$Hz
##$SOLVENT= CHLOROFORM-D
##$TEMP_GET= 20.5 $$dC
##$ACQ_DELAY= 0.2195 $$ms
##$DIGITAL_FILTER= FALSE
##$FILTER_FACTOR= 1
##$FILTER_WIDTH= 2.254 $$kHz
##$FILTER_MODE= BUTTERWORTH
##$TRANSITION_RATIO= 0.9
##$ORDERS
##$FACTORS
##$LOCK_STRENGTH= 658
##$LOCK_LEVEL= 200
##$LOCK_GAIN= 27
##$LOCK_OSC_OFFSET= 25.6519 $$kHz
##$LOCK_PHASE= 187 $$deg
##$LOCK_OSC_STATE= 2H OSC ON
##$X_ANGLE= 45 $$deg
##$X90= 9.2 $$us
##$X90_HI= 10 $$us
##$X90_LO= 50 $$us
##$X_90_WIDTH= 9.2 $$us
##$X_PULSE= 4.6 $$us
##$RELAXATION_DELAY= 4 $$s
##$SCANS= 2
##$PROBE_ID= 1412
##$ITERATIONS= 1
##$FIELD_STRENGTH= 7.0586 $$T
##$TEMP_SET= 25 $$dC
##$SPIN_SET= 15 $$Hz
##$SPIN_GET= 17 $$Hz
##$HE_LEVEL= 75 $$%
##$N2_LEVEL= 82 $$%
##$CHANGER_SAMPLE= 0
##$ADC_CARD= 16/1MHz/20
##$EXPERIMENT= single_pulse.exp
##$OBS_NOISE= WAUGH
##$IRR_NOISE= WALTZ
##$TRI_NOISE= WALTZ
##$QUA_NOISE= WAUGH
##$OBS_PWIDTH= 1 $$us
##$IRR_PWIDTH= 1 $$us
##$TRI_PWIDTH= 1 $$us
##$QUA_PWIDTH= 1 $$us
##$RECVR_GAIN= 4
##$IRR90= 10 $$us
##$TRI90= 10 $$us
##$QUA90= 10 $$us
##$IRR90_HI= 10 $$us
##$QUA90_HI= 10 $$us
##$IRR90_LO= 10 $$us
##$TRI90_LO= 10 $$us
##$QUA90_LO= 10 $$us
##$MOD_RETURN= 1
##$TOTAL_SCANS= 2
##$X_ACQ_DURATION= 3.63397 $$s
##$DELAY_OF_START= 1 $$s
##$ACTUAL_START_TIME= 886340497.0
##$CLIPPED= FALSE
##$DC_BALANCED= FALSE
##$TRI90_HI= 10 $$us
##$SPIN_LOCK_90= 100 $$us
##$SPIN_LOCK_ATTN= 24.4 $$dB
##$DEUT_GRAD_SHIM_90= 213 $$us
##$DEUT_GRAD_SHIM_ATTN= 9 $$dB
##$IRR_CODE= 146
##$LOCK_STATE= LOCK ON
##$AUTOLOCK_LEVEL= 200
##$SAWTOOTH_RANGE= 5
##$LOCK_STATUS= IDLE
##$LOCK_SETTLE_POINT= 4096
##$LOCK_ACHIEVE_POINT= 0
##$SPIN_ACTION= SPIN ON
##$SPIN_STATE= SPIN ON
##$SPIN_STATUS= SPIN ON
##$SPIN_GAS_SOURCE= AIR
##$TEMP_ACTION= TEMP OFF
##$TEMP_STATE= TEMP OFF
##$TEMP_STATUS= TEMP OFF
##$TEMP_COMP= 0
##$TEMP_DELAY= 0 $$s
##$TEMP_LIMIT_HI= 150 $$dC
##$TEMP_LIMIT_LO= -100 $$dC
##$TEMP_MELTING= -63 $$dC
$$ [...]
##$VT_PID_STD_WB_H_CBL= 10
##$VT_PID_STD_WB_H_CBH= 0
##$VT_PID_STD_WB_H_HC= 2.4
##$VT_PID_STD_WB_H_HL= 70
##$VT_PID_STD_WB_M_PB= 1.5
##$VT_PID_STD_WB_M_TI= 30
##$VT_PID_STD_WB_M_TD= 5
##$VT_PID_STD_WB_M_CBL= 9.9
##$VT_PID_STD_WB_M_CBH= 2.3
##$VT_PID_STD_WB_M_HC= 2.5
##$VT_PID_STD_WB_M_HL= 70
##$VT_PID_STD_WB_L_PB= 1.3
##$VT_PID_STD_WB_L_TI= 29
##$VT_PID_STD_WB_L_TD= 5
##$VT_PID_STD_WB_L_CBL= 20
##$VT_PID_STD_WB_L_CBH= 20
##$VT_PID_STD_WB_L_HC= 0.6
##$VT_PID_STD_WB_L_HL= 100
##$VT_PID_LONG_0_H_PB= 1.5
##$VT_PID_LONG_0_H_TI= 30
##$VT_PID_LONG_0_H_TD= 5
##$VT_PID_LONG_0_H_CBL= 9.9
##$VT_PID_LONG_0_H_CBH= 2.3
##$VT_PID_LONG_0_H_HC= 2.5
##$VT_PID_LONG_0_H_HL= 70
##$VT_PID_LONG_0_M_PB= 1.5
##$VT_PID_LONG_0_M_TI= 30
##$VT_PID_LONG_0_M_TD= 5
##$VT_PID_LONG_0_M_CBL= 9.9
##$VT_PID_LONG_0_M_CBH= 2.3
##$VT_PID_LONG_0_M_HC= 2.5
##$VT_PID_LONG_0_M_HL= 70
##$VT_PID_LONG_40_H_PB= 1.5
##$VT_PID_LONG_40_H_TI= 30
##$VT_PID_LONG_40_H_TD= 5
##$VT_PID_LONG_40_H_CBL= 9.9
##$VT_PID_LONG_40_H_CBH= 2.3
##$VT_PID_LONG_40_H_HC= 2.5
##$VT_PID_LONG_40_H_HL= 70
##$VT_PID_LONG_40_M_PB= 1.5
##$VT_PID_LONG_40_M_TI= 30
##$VT_PID_LONG_40_M_TD= 5
##$VT_PID_LONG_40_M_CBL= 9.9
##$VT_PID_LONG_40_M_CBH= 2.3
##$VT_PID_LONG_40_M_HC= 2.5
##$VT_PID_LONG_40_M_HL= 70
##$SAMPLE_ACTION= LOADED
##$SAMPLE_STATE= LOAD
##$SAMPLE_STATUS= LOADED
##$AUTOSHIM_MODE= AUTOSHIM OFF
##$AUTOSHIM_DELAY= 3600 $$s
##$AUTOSHIM_TRACK= AUTOSHIM OFF
##$SHIM_MAX_RECALL= MAX FOUND
##$SHIM_NAMES= SHIM_Z0
##$SHIM_Z0= 9198
##$SHIM_Z1= 5176
##$SHIM_Z2= 45
##$SHIM_Z3= -2829
##$SHIM_Z4= -240
##$SHIM_Z5= 46
##$SHIM_Z6= -33
##$SHIM_X= -14
##$SHIM_XZ= 16
##$SHIM_XZ2= 0
##$SHIM_XZ3= 0
##$SHIM_X2= -7
##$SHIM_X2Z= -40
##$SHIM_X3= 0
##$SHIM_Y= 1608
##$SHIM_YZ= 13
##$SHIM_YZ2= 10
##$SHIM_YZ3= 0
##$SHIM_Y2= -11
##$SHIM_Y2Z= -20
##$SHIM_Y3= 0
##$NUM_SCANS= 7
##$END_TIME= 886340564
##$LOCAL_TIME= 886340518
##$PROBE_ATN= 0
##$PROBE_TUNE= 0
##$PROBE_MATCH= 2077
##$PROBE_COARSE= A
##$LF_TUNE_DIAL= 0
##$LF_MATCH_DIAL= 0
##$HF_TUNE_DIAL= 0
##$HF_MATCH_DIAL= 0
##$PASS_RIPPLE= 0.01 $$dB
##$STOP_RIPPLE= 60 $$dB
##$PROBE_RECOVERY= 0 $$us
##$AF_DELAY_RATIO= 0
##$VERSION= 4.3.3
##$X_ACQ_TIME= 3.63397 $$s
##$DEAD_TIME= 0 $$us
##$DELAY= 0 $$us
##$PHASE_PRESET= 3 $$us
##$UNBLANK_TIME= 2 $$us
##$INITIAL_WAIT= 1 $$s
##$NORMALIZED= TRUE
$$ END OF JEOL SPECIFIC PARAMETERS
$$ -------------------------------
##NTUPLES= NMR SPECTRUM
##VAR NAME= FREQUENCY,    SPECTRUM/REAL, SPECTRUM/IMAG, PAGE NUMBER
##SYMBOL=   X,            R,             I,             N
##VAR TYPE= INDEPENDENT,  DEPENDENT,     DEPENDENT,     PAGE
##VAR FORM= AFFN,         ASDF,          ASDF,          AFFN
##VAR DIM=  16384, 16384, 16384, 2
##UNITS= PPM,     ARBITRARY UNITS, ARBITRARY UNITS, 
##FIRST=  1.2501033903057E+01, 4.33127231991964E+02, -7.35719567773241E+01, 1
##LAST=  -2.50011824950436, 4.53689789003244E+02, 7.39292673617851E+01, 2
##FACTOR=  9.1565355261926E-04, 4.0630685196308E-03, 4.0630685196308E-03, 1
##PAGE= N=1
##DATA TABLE=(X++(R..R)), XYDATA
$$ [...]
$$ plain form
9267 -4857981 10312566 22582050 30930580 36289605 40252880 43660170 45633172 42685961 32809662
9258 32809662 19259068 10511190 9280825 11647699 8759064 -1474800 -10886216 -10016328 305777
9249 305777 8443335 4172337 -8946940 -15532789 -6598514 9663090 17210583 10202411 2662510
9240 2662510 11291232 37254664 61601395 67079938 57579552 52417297 65258577 85054570
9232 85054570 88802659 67137700 36997878 22497933 28964808 35903562 23223121 -5824726
9224 -5824726 -26096407 -19322273 4847754 19092927 9274852 -9601145 -11891275 8857606
9216 8857606 31314382 30363225 6041633 -16712834 -15547483 4230099 16560479 5517779
9208 5517779 -16513383 -22738852 -2017364 28428471 41633689 31087714 17032222 21806384
$$ packed form
9267d857981J5170547J2269484Q348530N359025L963275L407290J973002k947211r876299
9258C2809662j3550594q747878j230365K366874k888635j0233864r411416Q69888J0322105
9249C05777Q137558m270998j3119277o585849Q934275J6261604P547493p008172p539901
9240B662510Q628722K5963432K4346731N478543r500386n162255J2841280J9795993
9232H5054570L748089k1664959l0139822j4499945O466875O938754j2680441k9047847
9224e824726k0271681O774134K4170027J4245173r818075j8875997k290130K0748881
9216H857606K2456776r51157k4321592k2754467J165351J9777582J2330380j1042700
9208E517779k2031162o225469K0721488L0445835J3205218j0545975j4055492M774162
$$ plain form
9200 21806384 44984678 62968305 55473283 28605484 6804327 6855048 19260495 20311218
9192 20311218 -916643 -30690648 -44985613 -36419399 -21822710 -23607440 -44665011 -66150206
9184 -66150206 -68073699 -51264372 -36497323 -40996593 -59949213 -71784915 -60826181 -35817904
9176 -35817904 -20268226 -26367325 -43325277 -47955368 -31677212 -10551757 -7612453 -28027945
9168 -28027945 -52042509 -56464424 -40136681 -23819020 -28263232 -47963595 -58024192 -40363761
9160 -40363761 -4764330 20224313 19934116 8473105 12562175 40353752 70166392 73831100
9152 73831100 48864005 21486722 17941708 34420141 42080157 21289942 -15135802 -34851284
9144 -34851284 -22441882 2908419 8275246 -13891304 -38800441 -37112216 -10440942 9619892
$$ packed form
9200B1806384K3178294J7983627p495022k6867799k1801157N0721J2405447J050723
9192B0311218k1227861k9774005j4294965Q566214J4596689j784730k1057571k1485195
9184f6150206j923493J6809327J4767049m499270j8952620j1835702J0958734K5008277
9176c5817904J5549678o099099j6957952m630091J6278156K1125455K939304k0415492
9168b8027945k4014564m421915J6327743J6317661m444212j9700363j0060597J7660431
9160d0363761L5599431K4988643k90197j1461011M089070K7791577K9812640L664708
9152G3831100k4967095k7377283l545014J6478433P660016k0790215l6425744j9715482
9144c4851284J2409402K5350301N366827k2166550k4909137J688225K6671274K0060834
$$ plain form
9136 9619892 -1675021 -34682997 -55229874 -44460072 -20233084 -15713819 -40422505 -68535813
9128 -68535813 -68386524 -40183624 -15003666 -19870867 -46042645 -59899298 -43595384 -14746589
9120 -14746589 -7572669 -30603724 -58339179 -58584139 -31419810 -7438888 -11115412 -32448186
9112 -32448186 -38271084 -12047495 25481070 40731414 25736752 6617866 10782661 35797398
9104 35797398 50882875 33836251 -1239689 -20526970 -9478461 11889895 12320474 -11412900
9096 -11412900 -31384651 -21455943 10792466 32638529 23761522 -1321786 -10677829 5787398
9088 5787398 24120137 14891919 -21657857 -54550982 -57904644 -39742613 -31883039 -50940338
9080 -50940338 -78496998 -82114576 -53811877 -20687847 -13486099 -32131042 -46723632 -32901398
$$ packed form
9136I619892j1294913l3007976k0546877J0769802K4226988M519265k4708686k8113308
9128f8535813J49289K8202900K5179958m867201k6171778j3856653J6303914K8848795
9120a4746589P173920k3031055k7735455k44960K7164329K3980922l676524k1332774
9112c2448186n822898K6223589L7528565J5250344j4994662j9118886M164795K5014737
9104C5797398J5085477j7046624l5075940j9287281J1048509K1368356M30579k3733374
9096a1412900j9971751R928708L2248409K1846063q877007k5083308r356043J6465227
9088E787398J8332739r228218l6549776l2893125l353662J8162031P859574j9057299
9080e0940338k7556660l617578K8302699L3124030P201748j8644943j4592590J3822234
$$ plain form
9072 -32901398 -1624879 13072604 -4649942 -34952872 -43535583 -21125689 7111323 10835617
9064 10835617 -9048220 -22099102 -3139691 36851063 63258011 56387654 33069922 26105304
9056 26105304 46363759 69724184 64984398 31158176 -1617241 -4909885 16452907 30939427
9048 30939427 17121077 -12054042 -23557413 -3557915 27110969 35050083 11492002 -18559203
9040 -18559203 -25588120 -9236193 2801009 -14319757 -52249670 -78651712 -72071590 -44796988
9032 -44796988 -28611556 -38428389 -55442964 -49791779 -14844253 24064086 35774373 18571148
9024 18571148 -967527 3125516 25931415 37645384 18403442 -18952502 -41359784 -31738385
9016 -31738385 -7086611 1542667 -16056692 -36900289 -32192109 -199816 30257371 31614651
$$ packed form
9072c2901398L1276519J4697483j7722546l0302930q582711K2409894K8237012L724294
9064A0835617j9883837j3050882J8959411L9990754K6406948o870357k3317732o964618
9056B6105304K0258455K3360425m739786l3826222l2775417l292644K1362792J4486520
9048C0939427j3818350k9175119j1503371J9999498L0668884P939114k3558081l0051205
9040a8559203p028917J6351927J2037202j7120766l7929913k6402042O580122K7274602
9032d4796988J6185432r816833j7014575N651185L4947526L8908339J1710287j7203225
9024A8571148j9538675M093043K2805899J1713969j9241942l7355944k2407282R621399
9016c1738385K4651774Q629278j7599359k0843597M708180L1992293L0457187J357280
$$ plain form
9008 31614651 7552291 -12205032 -5239395 17953586 26438429 4185573 -29920176 -43504657
9000 -43504657 -25569278 816893 5514950 -14567840 -32782607 -23708516 7163526 28871555
8992 28871555 19449148 -9368735 -25676986 -14642721 6968057 9745309 -13377104 -37678058
8984 -37678058 -35983703 -7691674 20002683 23880080 9840026 4313748 23008127 51616952
8976 51616952 61560100 42981598 14435322 863887 6532177 11078246 -3940382 -34349768
8968 -34349768 -56344901 -54436607 -37214250 -26851727 -33216684 -44091085 -41321514 -23359459
8960 -23359459 -6343511 -5785493 -19384885 -32121477 -32575390 -25849495 -24769194 -34100365 -44707532
8951 -44707532 -44144875 -31838660 -16855256 -7202509 -1580000 6391734 19553966 32533654
$$ packed form
9008C1614651k4062360j9757323O965637K3192981Q484843k2252856l4105749j3584481
9000d3504657J7935379K6386171M698057k0082790j8214767R074091L0872042K1708029
8992B8871555r422407k8817883j6308251J1034265K1610778K777252k3122413k4300954
8984c7678058J694355K8292029K7694357L877397j4040054n526278J8694379K8608825
8976E1616952R943148j8578502k8546276j3571435N668290M546069j5018628l0409386
8968c4349768k1995133J908294J7222357J0362523o364957j0874401K769571J7962055
8960b3359459J7015948N58018j3599392j2736592m53913O725895J080301r331171j0607167
8951d4707532N62657J2306215J4983404R652747N622509P971734J3162232J2979688
$$ plain form
8943 32533654 38839713 38289332 35583606 33074258 29155254 21435175 12260720 6785429 6250620
8934 6250620 7192485 5335976 3964456 8918614 21070347 32957152 36222299 31444410 28661739
8925 28661739 33948196 41804847 40060428 25042026 8345467 3823116 12284089 18986803 11957037
8916 11957037 -3715506 -10577466 506974 17973602 21752684 6611590 -11363642 -12579852
8908 -12579852 1931661 11995668 1533756 -21345449 -31652715 -17084728 7460955 17854880
8900 17854880 7789310 -2916998 7897820 37796194 61275031 58038475 37167952 25855960
8892 25855960 38014005 57416588 57933201 33423040 6796206 4157448 24078838 40778054
8884 40778054 33739514 11506556 2227060 18781784 44779631 51981418 32870909 9031357
$$ packed form
8943C2533654O306059n50381k705726k509348l919004p720079r174455n475291n34809
8934F250620R41865j856509j371520M954158J2151733J1886805L265147m777889k782671
8925B8661739N286457P856651j744419j5018402j6696559m522351Q460973O702714p029766
8916A1957037j5672543o861960J1084440J7466628L779082j5141094j7975232j216210
8908a2579852J4511513J0064007j0461912k2879205j0307266J4567987K4545683J0393925
8900A7854880j0065570j0706308J0814818K9898374K3478837l236556k0870523j1311992
8892B5855960J2158045J9402583N16613k4510161k6626834k638758J9921390J6699216
8884D0778054p038540k2232958r279496J6554724K5997847P201787j9110509k3839552
$$ plain form
8876 9031357 5694744 21776828 33149451 20431837 -7945801 -24247447 -14788367 6836738
8868 6836738 15151226 3080900 -11052432 -5325096 19838280 42264329 43343703 28518628
8860 28518628 19739077 29767939 47811244 53071732 38917182 19836011 14890432 25566517
8852 25566517 36370780 32645406 16781347 5429779 8184543 19140308 23915098 15076391
8844 15076391 522737 -6475881 -1888317 5847258 6771992 -735676 -7975600 -6311087 4432218
8835 4432218 16138265 22312641 22370737 22797747 29070936 40907433 51961181 56151172 53147388
8826 53147388 48638065 50056783 57205401 63993719 62651344 52844147 43281390 42651836 49399512
8817 49399512 53632254 45887159 29288838 17020813 18127815 26378515 26897374 12663944
$$ packed form
8876I031357l336613J6082084J1372623j2717614k8377638j6301646R459080K1625105
8868F836738Q314488j2070326j4133332N727336K5163376K2426049J079374j4825075
8860B8518628q779551J0028862J8043305N260488j4154550j9081171m945579J0676085
8852B5566517J0804263l725374j5864059j1351568K754764J0955765M774790q838707
8844A5076391j4553654o998618M587564P735575R24734p507668p239924J664513J0743305
8835D432218J1706047O174376N8096M27010O273189J1836497J1053748M189991l003784
8826E3147388m509323J418718P148618O788318j342375r807197r562757o29554O747676
8817D9399512M232742p745095j6598321j2268025J107002Q250700N18859j4233430
$$ plain form
8809 12663944 -5810655 -11135571 857814 15737006 15898055 1538984 -8651711 1429184
8801 1429184 25392773 41651690 36278764 21001527 19247364 39735252 65318679 71486051
8793 71486051 55560231 40016693 46751872 71909351 88715792 78791163 52730347 39568718
8785 39568718 52158701 72102400 70760498 43264150 13533207 8424987 26659500 39572548
8777 39572548 25390857 -5357973 -22185385 -9315944 15071668 20418620 -1726627 -28299359
8769 -28299359 -31151175 -10618684 5479069 -6591805 -38203152 -59555484 -52993257 -33209761
8761 -33209761 -29711159 -51811541 -78495947 -82116468 -61226829 -40280624 -41709992 -60417683
8753 -60417683 -70090627 -53658267 -23377205 -4846003 -9134631 -19382258 -12103589 15970040
$$ packed form
8809A2663944j8474599n324916J1993385J4879192J61049j4359071j0190695J0080895
8801A429184K3963589J6258917n372926j5277237j754163K0487888K5583427O167372
8793G1486051j5925820j5543538O735179K5157479J6806441r924629k6060816j3161629
8785C9568718J2589983J9943699j341902k7496348k9730943n108220J8234513J2913048
8777C9572548j4181691l0748830j6827412J2869441K4387612N346952k2145247k6572732
8769b8299359k851816K0532491J6097753j2070874l1611347k1352332O562227J9783496
8761c3209761L498602k2100382k6684406l620521K0889639K0946205j429368j8707691
8753f0417683r672944J6432360L0281062J8531202m288628j0247627P278669K8073629
$$ plain form
8745 15970040 44560942 53065280 43867236 37501316 48642548 68617357 76690730 63037243
8737 63037243 39649648 25501143 26326289 28006719 16314189 -7958161 -29022669 -33825828
8729 -33825828 -25865650 -19751600 -23914320 -32034099 -31302546 -16802497 1191725 11255614 11174257
8720 11174257 9307003 14811546 26645276 35759714 36026316 29965992 26241784 29971118 37204370
8711 37204370 40435619 36510121 29859455 26696455 27994076 28841734 23970300 12920251 1278716
8702 1278716 -5354421 -7516383 -9971570 -15381495 -21321359 -22230083 -15328282 -3779831 6644603
8693 6644603 13160150 19542213 29596812 42534174 52265093 53357599 47493931 40692565 36400192
8684 36400192 31868562 21451974 3789960 -14433600 -26025699 -30245031 -33694767 -42334913
$$ packed form
8745A5970040K8590902Q504338r198044o365920J1141232J9974809Q073373j3653487
8737F3037243k3387595j4148505Q25146J680430j1692530k4272350k1064508m803159
8729c3825828P960178O114050m162720q119779P31553J4500049J7994222J0063889q1357
8720A1174257j867254N504543J1833730R114438K66602o060324l724208L729334P233252
8711C7204370L231249l925498o650666l163000J297621Q47658m871434j1050049j1641535
8702A278716o633137k161962k455187n409925n939864r08724O901801J1548451J0424434
8693F644603O515547O382063J0054599J2937362R730919J092506n863668o801366m292373
8684C6400192m531630j0416588j7662014j8223560j1592099m219332l449736q640146
$$ plain form
8676 -42334913 -52750741 -56399626 -48895755 -36078683 -28466316 -27999834 -26776733 -14891246
8668 -14891246 5741634 23134095 28571450 26560422 30729766 45959692 62674811 66096197
8660 66096197 53457959 38319666 34700639 40508760 39287263 19907820 -8453089 -25950776
8652 -25950776 -22893198 -11821692 -11872622 -25928601 -35837385 -22724548 9023384 36620941
8644 36620941 42869481 35709467 39495494 63555889 90790459 96301059 74916965 48867675
8636 48867675 42629993 54631554 59864493 39578012 4452441 -15698574 -6550111 14883550
8628 14883550 19419915 151070 -21004867 -17119766 10258154 32790017 27888050 3987629
8620 3987629 -8288589 7502747 36023929 46953326 31735608 12555504 17347559 47208099
$$ packed form
8676d2334913j0415828l648885P503871J2817072P612367M66482J223101J1885487
8668a4891246K0632880J7392461N437355k011028M169344J5229926J6715119L421386
8660F6096197j2638238j5138293l619027N808121j221497j9379443k8360909j7497687
8652b5950776L057578J1071506n0930j4055979r908784J3112837L1747932K7597557
8644C6620941O248540p160014L786027K4060395K7234570N510600k1384094k6049290
8636D8867675o237682J2001561N232939k0286481l5125571k0151015R148463K1433661
8628A4883550M536365j9268845k1155937L885101K7377920K2531863m901967k3900421
8620C987629j2276218J5791336K8521182J0929397j5217718j9180104M792055K9860540
$$ plain form
8612 47208099 75149418 77008972 58833668 48392641 62362327 87584673 94810875 73586193
8604 73586193 43319032 30176840 37653331 44465872 29356894 -3163050 -28683572 -30192985
8596 -30192985 -17243162 -12742992 -26838455 -45892417 -48883642 -31854962 -11834354 -6136375
8588 -6136375 -14381999 -19080384 -8068227 12121246 25131948 22465188 12362817 8417835
8580 8417835 13582486 18101105 11608528 -4962939 -21199616 -30251785 -33276226 -37193330 -44950338
8571 -44950338 -51061090 -49426561 -39686251 -25248181 -9697901 7505145 27807249 49314787
8563 49314787 68504296 83606520 96084425 106338703 111088090 106542196 93355981 77356822
8555 77356822 63846330 52097454 35701766 13205230 -8479937 -19635465 -18196687 -12619714
$$ packed form
8612D7208099K7941319J859554j8175304j0441027J3969686K5222346P226202k1224682
8604G3586193l0267161j3142192P476491O812541j5108978l2519944k5520522j509413
8596c0192985J2949823M500170j4095463j9053962k991225J7028680K0020608N697979
8588f136375q245624m698385J1012157K0189473J3010702k666760j0102371l944982
8580H417835N164651M518619o492577j6571467j6236677r052169l024441l917104p757008
8571d4950338o110752J634529R740310J4438070J5550280J7203046K0302104K1507538
8563D9314787J9189509J5102224J2477905J0254278M749387m545894j3186215j5999159
8555G7356822j3510492j1748876j6395688k2496536k1685167j1155528J438778N576973
$$ plain form
8547 -12619714 -12840613 -17206613 -15109249 504160 23537913 39387533 41378547 36910254 40043467
8538 40043467 53722510 65666488 62157985 44124082 26457319 22984268 29661398 30383824
8530 30383824 15123732 -7165055 -17916918 -9822553 5003612 8963441 -1600692 -11345335
8522 -11345335 -4322961 17957017 37277490 38457476 25879085 18150101 25855585 40294740
8514 40294740 41542497 21775254 -5714277 -21163182 -19652436 -15390903 -25126827 -48072226
8506 -48072226 -65657775 -62247527 -41081898 -21875004 -18271878 -22823786 -17322137 6307418
8498 6307418 35784493 50638360 44411830 30335060 26704219 35615099 41057941 27497550
8490 27497550 -2400951 -29709406 -39183024 -35680092 -37817630 -55960429 -80324372 -91186387
$$ packed form
8547a2619714k20899m366000K097364J5613409K3033753J5849620J991014m468293L133213
8538D0043467J3679043J1943978l508503j8033903j7666763l473051O677130P22426
8530C0383824j5260092k2288787j0751863Q094365J4826165L959829j0564133r744643
8522a1345335P022374K2279978J9320473J179986j2578391p728984P705484J4439155
8514D0294740J247757j9767243k7489531j5448905J510746M261533r735924k2945399
8506d8072226j7585549L410248K1165629J9206894L603126m551908N501649K3629555
8498F307418K9477075J4853867o226530j4076770l630841Q910880N442842j3560391
8490B7497550k9898501k7308455r473618L502932k137538j8142799k4363943j0862015
$$ plain form
8482 -91186387 -81993184 -65162369 -59602703 -68679343 -77479164 -69479110 -45919389 -24499779
8474 -24499779 -19477759 -25857932 -25829581 -9013791 15103420 27977003 22378191 10389645 8930427
8465 8930427 20503713 30212898 23382639 3062587 -14269207 -15873969 -7619085 -5290780
8457 -5290780 -16459753 -30915002 -32904577 -19259231 -2960832 1782547 -4612868 -9284822
8449 -9284822 -2200004 11111582 16108118 6393882 -9566252 -18701094 -18122833 -17789284 -27658777
8440 -27658777 -45867605 -59454612 -60835745 -55911657 -55392817 -62613353 -69608275 -66679005 -54300366
8431 -54300366 -42447297 -38732414 -38395615 -31674311 -14078114 5284723 17508367 22118054
8423 22118054 27753968 41185291 57497243 64983789 59738171 48645668 40807792 37496780
$$ packed form
8482i1186387R193203J6830815N559666r076640q799821Q000054K3559721K1419610
8474b4499779N022020o380173K8351J6815790K4117211J2873583n598812j1988546j459218
8465H930427J1573286R709185o830259k0320052j7331794j604762Q254884K328305
8457e290780j1168973j4455249j989575J3645346J6298399M743379o395415m671954
8449i284822P084818J3311586M996536r714236j5960134r134842N78261L33549r869493
8440b7658777j8208828j3587007j381133M924088N18840p220536o994922K929270J2378639
8431e4300366J1853069L714883L36799O721304J7596197J9362837J2223644M609687
8423B2118054N635914J3431323J6311952P486546n245618j1092503p837876l311012
$$ plain form
8415 37496780 29298943 8853369 -18957233 -41970986 -53731173 -59593716 -68886208 -82924489
8407 -82924489 -92212644 -86872153 -69044751 -50381576 -39197762 -31879782 -18295904 4556698
8399 4556698 28194710 41583986 42937657 41157723 45311471 54059710 57966958 51145527 38850473
8390 38850473 30420370 30442360 33156957 31192813 22439512 13488303 10772141 13832004 17015086
8381 17015086 15716677 11625232 9623573 12846005 19746577 27308777 32987845 37243104 41793837
8372 41793837 47382585 54763905 61840875 65703462 63909548 56527768 48457058 44085383 42476097
8363 42476097 37246040 24315687 8217706 -890385 2199261 10868781 12940813 5092818 -2057391
8354 -2057391 4367008 23502536 39791104 38779265 25053110 17633113 28348173 47466005
$$ packed form
8415C7496780q197837k0445574k7810602k3013753j1760187n862543r292492j4038281
8407h2924489r288155N340491J7827402J8663175J1183814P317980J3583878K2852602
8399D556698K3638012J3389276J353671j779934M153748Q748239L907248o821431j2295054
8390C8850473q430103K1990K714597j964144q753301q951209k716162L059863L183082
8381A7015086j298409m091445k001659L222432O900572P562200N679068M255259M550733
8372D1793837N588748P381320P076970L862587j793914p381780q070710m371675j609286
8363D2476097n230057j2930353j6097981r108091L089646Q669520K072032p847995p150209
8354b057391O424399J9135528J6288568j011839j3726155p419997J0715060J9117832
$$ plain form
8346 47466005 53146141 37469916 17351878 16914876 39645540 62710483 63567535 45329740
8338 45329740 35601396 54124526 88587249 106653890 93661210 68694573 64246360 88260438
8330 88260438 112716625 106610823 71505177 41106757 43399278 67731587 76959314 49755158
8322 49755158 6751923 -12475093 4936860 29921840 24852466 -11660546 -43727747 -38371867
8314 -38371867 -3620814 20598507 8556464 -21713476 -29198089 2082096 43624692 55608916
8306 55608916 30692283 2695315 5369649 33398398 49402140 25746704 -21986950 -54231621
8298 -54231621 -52137248 -36727182 -43585397 -80381673 -116969688 -121085652 -93878203 -66618484
8290 -66618484 -64964580 -79647952 -79560768 -48811600 -5331898 20087837 17981287 8151728 15548482
$$ packed form
8346D7466005N680136j5676225k0118038m37002K2730664K3064943Q57052j8237795
8338D5329740r728344J8523130L4462723J8066641j2992680k4966637m448213K4014078
8330H8260438K4456187o105802l5105646l0398420K292521K4332309R227727k7204156
8322D9755158m3003235j9227016J7411953K4984980n069374l6513012l2067201N355880
8314c8371867L4751053K4219321j2042043l0269940p484613L1280185M1542596J1984224
8306E5608916k4916633k7996968K674334K8028749J6003742k3655436m7733654l2244671
8298e4231621K094373J5410066o858215l6796276l6588015m115964K7207449K7259719
8290f6618484J653904j4683372Q7184L0749168M3479702K5419735k106550r829559P396754
$$ plain form
8281 15548482 40355829 59434292 54161561 30446554 11528509 10620175 18087706 15165124
8273 15165124 -3347737 -24263163 -31131339 -23443123 -14322827 -14564547 -20604840 -21771484 -12908134
8264 -12908134 -277182 6962451 7639046 6989262 9514607 12655383 12166567 8335144 4676914
8255 4676914 2840459 751222 -4808427 -11204383 -12647354 -7815048 -2359532 -2035063 -5931255
8246 -5931255 -5481554 5802158 20839194 28768655 25798509 21471203 27380003 43549318 56460132
8237 56460132 55071499 43757788 38300426 47725525 63024893 67095136 54919483 39346463
8229 39346463 37235052 50002355 61112856 55601788 37379182 25573588 31225525 47064196
8221 47064196 53507461 42478191 25064447 20384899 31840395 44116624 41099273 22608778
$$ packed form
8281A5548482K4807347J9078463n272731k3715007j8918045r08334P467531k922582
8273A5165124j8512861k0915426o868176P688216R120296k41720o040293j166644Q863350
8264a2908134J2630952P239633O76595o49784K525345L140776m88816l831423l658230
8255D676914j836455k089237n559649o395956j442971M832306N455516L24469l896192
8246e931255M49701J1283712J5037036P929461k970146m327306N908800J6169315J2910814
8237E6460132j388633j1313711n457362R425099J5299368M070243j2175653j5573020
8229C9346463k111411J2767303J1110501n511068j8222606j1805594N651937J5838671
8221D7064196O443265j1029270j7413744m679548J1455496J2276229l017351j8490495
$$ plain form
8213 22608778 5400251 3350101 13337509 18278891 8751447 -8114450 -15441544 -5614372
8205 -5614372 12235188 23414814 22734543 19745909 26987913 46068231 64982960 71561168 64854505
8196 64854505 55414355 53337045 58271104 60423407 51377759 33587181 17985962 14274980 20500457
8187 20500457 26527208 24280081 15875744 11673756 19249307 34395452 43791518 39088227 25416421
8178 25416421 16321475 19807910 28511894 28642642 14924377 -1266834 -3798259 11161978
8170 11161978 30262714 36956188 30388724 26131288 37945982 61822287 78039292 73209308
8162 73209308 55257392 44683597 52258960 65374383 65032308 46457526 27141048 27104632
8154 27104632 46335282 65090388 65887865 53387213 47451378 59982277 79999934 85465576
$$ packed form
8213B2608778j7208527k050150R987408M941382r527444j6865897p327094R827172
8205e614372J7849560J1179626o80271k988634P242004J9080318J8914729O578208o706663
8196F4854505r440150k077310M934059K152303r045648j7790578j5601219l710982O225477
8187B0500457O026751k247127q404337m201988P575551J5146145R396066m703291j3671806
8178B5416421r094946L486435Q703984J30748j3718265j6191211k531425J4960237
8170A1161978J9100736O693474o567464m257436J1814694K3876305J6217005m829984
8162G3209308j7951916j0573795P575363J3115423l42075j8574782j9316478l6416
8154B7104632J9230650J8755106P97477j2500652n935835J2530899K0017657N465642
$$ plain form
8146 85465576 68453798 43807568 32442367 36892969 40964581 30120108 9329485 -2494781
8138 -2494781 6196616 27394782 43142545 46172153 47074575 58702927 80931051 99306237
8130 99306237 102145878 93004052 84383058 82896750 82117085 72617673 54544145 38552979 31809919
8121 31809919 31524526 28608144 21334112 16946409 20387034 27800646 29236241 22793767 16713622
8112 16713622 19338758 26468237 27959100 19076271 10720289 15777683 34055783 50232546 52387794
8103 52387794 46578166 49704778 69498865 91863934 95363431 76741433 56176080 55392750
8095 55392750 71935020 84047329 73035325 48355257 42551509 76779360 126888189 150013650
8087 150013650 137757703 125399699 146600987 190757144 212826302 184099564 131123388 99786373
$$ packed form
8146H5465576j7011778k4646230j1365201M450602M071612j0844473k0790623j1824266
8138b494781Q691397K1198166J5747763L029608R02422J1628352K2228124J8375186
8130I9306237K839641r141826q620994j486308p79665r499412j8073528j5991166o743060
8121C1809919k85393k916382p274032m387703L440625P413612J435595o442474o080145
8112A6713622K625136P129479J490863q882829q355982N057394J8278100J6176763K155248
8103E2387794n809628L126612J9794087K2365069L499497j8621998k0565353p83330
8095E5392750J6542270J2112309j1012004k4680068n803748L4227851N0108829K3125461
8087A50013650j2255947j2358004K1201288M4156157K2069158k8726738n2976176l1337015
$$ plain form
8079 99786373 103821051 113107656 92843956 40415578 -3379569 465494 47330258 96005755
8071 96005755 116571472 122944072 156090838 236076761 333902072 396881097 405502832 402660180
8063 402660180 436489280 490619679 505415876 458063676 383863100 328986207 303911404 280450006
8055 280450006 228730130 155065650 92247090 63104214 68882124 85077601 84075670 73086263
8047 73086263 84532044 134743720 208426754 272143476 309440293 340275672 396196325 473797838
8039 473797838 542754838 586711488 608688138 621077167 637169225 656948519 655843210 609458998
8031 609458998 531475882 443060854 354224008 266668083 171188065 74742765 -177442 -51837729
8023 -51837729 -93159641 -129693257 -159929351 -182744125 -200165825 -215965382 -233895003 -254206935
$$ packed form
8079I9786373M034678R286605k0263700n2428378m3795147L845063M6864764M8675497
8071I6005755K0565717O372600L3146766P9985923R7825311O2979025Q621735k842652
8063D02660180L3829100N4130399J4796197m7352200p4200576n4876893k5074803k3461398
8055B80450006n1719876p3664480o2818560k9142876N777910J6195477j001931j0989407
8047G3086263J1445781N0211676P3683034O3716722L7296817L0835379N5920653P7601513
8039D73797838O8957000M3956650K1976650J2389029J6092058J9779294j105309m6384212
8031F09458998p7983116q8415028q8836846q7555925r5480018r6445300p4920207n1660287
8023e1837729m1321912l6533616l0236094k2814774j7421700j5799557j7929621k0311932
$$ plain form
8015 -254206935 -275921861 -301135212 -332657958 -367871688 -397223102 -412514686 -415267559 -415245223
8007 -415245223 -415555764 -405411628 -372153377 -315600213 -252635428 -200019273 -155453487 -100885281
7999 -100885281 -25828616 59787819 131617136 182028620 227854028 293836623 382300717 469535539
7991 469535539 533357320 579682663 632494734 708260929 790896986 840999794 850737664 832561178
7983 832561178 829942296 826300748 817704841 757419077 669479355 578224411 525197169 469094034
7975 469094034 415019793 320151776 244808422 213532179 233248353 264064748 269950899 249009368
7967 249009368 240755099 254526422 282059385 281996005 251746788 207138126 195160232 207775606
7959 207775606 226648334 213014173 183573080 160725529 173528428 201085224 211290972 186135639
$$ packed form
8015b54206935k1714926k5213351l1522746l5213730k9351414j5291584k752873K2336
8007d15245223l10541J0144136L3258251N6553164O2964785N2616155M4565786N4568206
7999a00885281P5056665Q5616435P1829317N0411484M5825408O5982595Q8464094Q7234822
7991D69535539O3821781M6325343N2812071P5766195Q2636057N0102808R737870j8176486
7983H32561178k618882l641548q595907o0285764q7939722r1254944n3027242n6103135
7975D69094034n4074241r4868017p5343354l1276243J9716174L0816395N886151k0941531
7967B49009368q254269J3771323K7532963o3380l0249217m4608662j1977894J2615374
7959B07775606J8872728j3634161k9441093k2847551J2802899K7556796J0205748k5155333
$$ plain form
7951 186135639 165577439 159036641 183337710 206099339 198760284 183309487 184716813 211816571
7943 211816571 255185329 279359124 284123570 289882423 309697443 337527683 341578754 310276534
7935 310276534 251697430 193946172 146185162 96199870 27626089 -54592371 -126015162 -169476502
7927 -169476502 -193570442 -220286649 -256482312 -283747641 -281113073 -249332023 -213579042 -195083201
7919 -195083201 -187380417 -168402139 -130248819 -89717292 -70132285 -73855333 -75781856 -56791359
7911 -56791359 -20778144 5867075 13567331 10734980 26064444 61094909 96761966 108081626
7903 108081626 96849102 83569906 84084395 88029807 72837851 30965912 -19976781 -55330235
7895 -55330235 -71041661 -84380182 -112373515 -148797428 -170425254 -163842291 -140576480 -124605499
$$ packed form
7951A86135639k0558200o540798K4301069K2761629p339055j5450797J407326K7099758
7943B11816571M3368758K4173795M764446N758853J9815020K7830240M051071l1302220
7935C10276534n8579104n7751258m7761010m9985292o8573781q2218460p1422791m3461340
7927a69476502k4093940k6716207l6195663k7265329K634568L1781050L5752981J8495841
7919a95083201P702784J8978278L8153320M0531527J9585007l723048j926523J8990497
7911e6791359L6013215K6645219P700256k832351J5329464L5030465L5667057J1319660
7903A08081626j1232524j3279196N14489L945412j5191956m1871939n0942693l5353454
7895e5330235j5711426j3338521k7993333l6423913k1627826O582963K3265811J5970981
$$ plain form
7887 -124605499 -124482020 -126161849 -110691785 -77516270 -46610534 -36028518 -40488721 -40602746
7879 -40602746 -24366382 -387702 12365808 5908698 -6489454 -8266510 2078163 9696462
7871 9696462 441482 -23350947 -46090317 -56595651 -59318783 -67471574 -85626363 -104889849
7863 -104889849 -111416252 -101894113 -85916099 -73406912 -66272694 -56925227 -39292509 -17684471
7855 -17684471 -2137588 1250595 -4978810 -14147743 -22297556 -30750165 -43852815 -61406791
7847 -61406791 -78163771 -88056207 -88584944 -81400094 -70625827 -57282698 -41385358 -21737278
7839 -21737278 331558 21749795 38385818 47492416 48928463 45358994 39883784 31904336
7831 31904336 19859207 2922744 -15796262 -31775235 -42195190 -48114035 -53426456 -59953064
$$ packed form
7887a24605499J23479j679829J5470064L3175515L0905736J0582016m460203j14025
7879d0602746J6236364K3978680J2753510o457110j2398152j777056J0344673P618299
7871I696462r254980k3792429k2739370j0505334k723132q152791j8154789j9263486
7863a04889849o526403R522139J5978014J2509187P134218R347467J7632718K1608038
7855a7684471J5546883L388183o229405r168933q149813q452609j3102650j7553976
7847f1406791j6756980r892436n28737P184850J0774267J3343129J5897340J9648080
7839b1737278K2068836K1418237J6636023R106598J436047l569469n475210p979448
7831C1904336j2045129j6936463j8719006j5978973j0419955n918845n312421o526608
$$ plain form
7823 -59953064 -66124873 -68598542 -66458254 -62776324 -62803164 -66887776 -71542188 -72414521 -69778067
7814 -69778067 -65984097 -64464116 -64599606 -62802281 -56574861 -47097147 -38251682 -32747550 -30560302
7805 -30560302 -28730442 -25454629 -21102049 -18062804 -17885229 -20097317 -21692267 -19010345 -12066516
7796 -12066516 -3734849 2219653 4694141 6912233 12587787 21268775 27021399 23856641 12934170
7787 12934170 1432080 -4286396 -5126381 -9490699 -22173358 -37546077 -43849549 -36479325
7779 -36479325 -22861409 -15823927 -18320940 -20579684 -10599262 10253963 26501989 25923839
7771 25923839 12779194 3976953 10030870 21862692 21919097 3775112 -18362694 -24626526
7763 -24626526 -12694759 -807536 -6984452 -28353656 -43340301 -36801071 -18259474 -11599974
$$ packed form
7823e9953064o171809k473669K140288L681930k6840m084612m654412q72333K636454
7814f9778067L793970J519981j35490J797325O227420R477714Q845465N504132K187248
7805c0560302J829860L275813M352580L039245J77575k212088j594950K681922O943829
7796a2066516Q331667N954502K474488K218092N675554Q680988N752624l164758j0922471
7787A2934170j1502090n718476q39985m364318j2682659j5372719o303472P370224
7779c6479325J3617916P037482k497013k258744R980422K0853225J6248026n78150
7771B5923839j3144645q802241O053917J1831822N6405j8143985k2137806o263832
7763b4626526J1931767J1887223o176916k1369204j4986645O539230J8541597O659500
$$ plain form
7755 -11599974 -27044564 -49090020 -53803788 -35065388 -13160609 -10646356 -25640474 -34831282
7747 -34831282 -18758243 12638811 31694758 23944094 3931862 -1886883 12876158 27853157
7739 27853157 18081302 -15027261 -45759091 -52091711 -41095497 -38265306 -58300083 -85776926
7731 -85776926 -93817792 -74660112 -48970507 -41969147 -54582419 -63730699 -50146225 -21591239
7723 -21591239 -3913093 -11303358 -30047589 -35051014 -19863465 -2396710 -4140576 -24963466
7715 -24963466 -42692377 -40389578 -25447971 -20315706 -35428429 -57621231 -65413281 -54443123
7707 -54443123 -41569491 -43290627 -56047515 -60767542 -45009825 -18179638 432036 4318469
7699 4318469 5401149 19318249 43690253 61370059 60192809 45864396 34640710 33805271 33094405
$$ packed form
7755a1599974j5444590k2045456m713768J8738400K1904779K514253j4994118r190808
7747c4831282J6073039L1397054J9055947p750664k0012232n818745J4763041J4976999
7739B7853157r771855l3108563l0731830o332620J0996214K830191k0034777k7476843
7731h5776926q040866J9157680K5689605P001360j2613272r148280J3584474K8554986
7723b1591239J7678146p390265j8744231n003425J5187549J7466755j743866k0822890
7715b4963466j7728911K302799J4941607N132265j5112723k2192802p792050J0970158
7707e4443123J2873632j721136j2756888m720027J5757717K6830187J8611674L886433
7699D318469J082680J3917100K4372004J7679806j177250j4328413j1223686q35439p10866
$$ plain form
7690 33094405 18637661 -8627119 -32866151 -41595407 -38772641 -39449670 -49552183 -59370311
7682 -59370311 -55152203 -36909660 -18956262 -14136937 -18693887 -18132071 -5514185 9671788
7674 9671788 12795342 2310895 -7432827 -3488875 11050262 21670232 19363657 12526331 16044009
7665 16044009 33081324 51040847 54553878 44557453 35678412 38617831 46935303 45984634 29527160
7656 29527160 9224307 683056 5903293 12670776 7807908 -4884993 -10899227 -2217414
7648 -2217414 13254898 19988114 12935804 2963812 3157458 13389339 20939360 16282949 4711916
7639 4711916 447470 8977378 22107965 28111184 24579845 21693627 27038117 37520945 41771292
7630 41771292 34059303 20106613 9543366 4895484 -299495 -12172745 -27864688 -37709957
$$ packed form
7690C3094405j4456744k7264780k4239032q729256K822766o77029j0102513r818128
7682e9370311M218108J8242543J7953398M819325m556950N61816J2617886J5185973
7674I671788L123554j0484447r743722L943952J4539137J0619970k306575o837326L517678
7665A6044009J7037315J7959523L513031r996425q879041K939419Q317472r50669j6457474
7656B9527160k0302853q541251N220237O767483m862868j2692901o014234Q681813
7648b217414J5472312O733216p052310r971992J93646J0231881P550021m656411j1571033
7639D711916m264446Q529908J3130587O003219l531339k886218N344490J0482828M250347
7630D1771292p711989j3952690j0563247m647882n194979j1873250j5691943r845269
$$ plain form
7622 -37709957 -36875466 -30394561 -25753967 -23446672 -17398041 -4097561 11439231 20837139 21404728
7613 21404728 18994340 18698250 19193516 12521646 -3661748 -22022511 -32673324 -34486787 -35710649
7604 -35710649 -43047296 -51828754 -51514386 -37490014 -20132169 -11780697 -13962049 -15508575 -6159081
7595 -6159081 9539102 16491276 7435568 -7892698 -12289345 -1315979 11356823 10608464
7587 10608464 -2004308 -8788149 3631526 26335417 38598667 30424137 14840893 12808196
7579 12808196 27675239 40542197 32724238 8402090 -9573452 -5220859 12573763 19055766
7571 19055766 3761606 -17510498 -20596824 -3245563 13088114 4973208 -23748890 -48073252
7563 -48073252 -50079333 -40050076 -43342781 -70941906 -104069424 -115534689 -100124650 -80126297
$$ packed form
7622c7709957Q34491O480905M640594K307295O048631J3300480J5536792R397908N67589
7613B1404728k410388k96090M95266o671870j6183394j8360763j0650813j813463j223862
7604c5710649p336647q781458L14368J4024372J7357845Q351472k181352j546526R349494
7595f159081J5698183O952174r055708j5328266m396647J0973366J2672802p48359
7587A0608464j2612772o783841J2419675K2703891J2263250q174530j5583244k032697
7579A2808196J4867043J2866958p817959k4322148j7975542M352593J7794622O482003
7571A9055766j5294160k1272104l086326J7351261J6333677q114906k8722098k4324362
7563d8073252k006081J0029257l292705k7599125l3127518j1465265J5410039J9998353
$$ plain form
7555 -80126297 -79288314 -94783447 -101170483 -80715713 -45831801 -24669573 -30860060 -47887963
7547 -47887963 -49281408 -29870711 -11558305 -17061072 -42659881 -61420437 -54593173 -30646429
7539 -30646429 -16063467 -23188557 -35935995 -30087931 -1035542 29371634 37448955 25013471
7531 25013471 15121821 24755167 45081866 51969534 35205299 9489781 -1118065 8588263
7523 8588263 20465802 14641426 -6360306 -21964524 -16700578 686723 8721179 -2330555
7515 -2330555 -19913752 -23822070 -10205242 4931167 5471657 -7036688 -13893965 -2795542
7507 -2795542 18613789 32018843 29373304 20661832 21810661 34830769 44872192 38588748
7499 38588748 18939122 1431712 -3611478 -2230232 -7535060 -23338731 -39061858 -41638547
$$ packed form
7555h0126297Q37983j5495133o387036K0454770L4883912K1162228o190487j7027903
7547d7887963j393445J9410697J8312406n502767k5598809j8760556O827264K3946744
7539c0646429J4582962p125090j2747438N848064K9052389L0407176Q077321j2435484
7531B5013471r891650R633346K0326699O887668j6764235k5715518j0607846R706328
7523H588263J1877539n824376k1001732j5604218N263946J7387301Q034456j1051734
7515b330555j7583197l908318J3616828J5136409N40490j2508345o857277J1098423
7507b795542K1409331J3405054k645539q711472J148829J3020108J0041423o283444
7499C8588748j9649626j7507410n043190J381246n304828j5803671j5723127k576689
$$ plain form
7491 -41638547 -29705772 -15096084 -7720523 -5904010 1729638 20201248 42373805 56008512
7483 56008512 57652413 55071064 57671794 64739782 67198988 59109554 45083955 34966619 32966728
7474 32966728 33537713 28752508 18703185 10582005 10201547 14820167 16927270 12541656 6822247
7465 6822247 6482918 12507088 18384213 19305420 16680454 17869920 25713396 35882895 41333887
7456 41333887 41226662 41160873 45973374 53366197 56670066 52879461 46051173 43559569 46560750
7447 46560750 48980293 45031822 37608841 33821113 37843547 45024703 46590490 40634057 33659685
7438 33659685 32734807 36679082 36710570 27234859 12192174 1711994 336033 2143025 -2414088
7429 -2414088 -14354509 -24130410 -22573956 -11877878 -3459087 -5629055 -13859251 -16194196 -8648876
$$ packed form
7491d1638547J1932775J4609688P375561J816513P633648J8471610K2172557J3634707
7483E6008512J643901k581349K600730P067988K459206q089434j4025599j0117336j999891
7474C2966728N70985m785205j0049323q121180l80458M618620K107103m385614n719409
7465F822247l39329O024170N877125R21207k624966J189466P843476J0169499N450992
7456D1333887j07225o5789M812501P392823L303869l790605o828288k491604L001181
7447D6560750K419543l948471p422981l787728M022434P181156J565787n956433o974372
7438C3659685r24878L944275L1488r475711j5042685j0480180j375961J806992m557113
7429b414088j1940421r775901J556454J0696078Q418791k169968q230196k334945P545320
$$ plain form
7420 -8648876 666609 -1193583 -16215201 -32711491 -38923017 -35411518 -35467965 -49057659 -69524041
7411 -69524041 -81671701 -78140337 -67480535 -65716684 -76579717 -87780002 -83712426 -64823794
7403 -64823794 -47285086 -44303145 -51719707 -51641233 -33963282 -7995955 6336947 1647861
7395 1647861 -9300633 -8253111 6635369 17696695 7636213 -21225038 -47510797 -56299980
7387 -56299980 -54364834 -61896799 -88401438 -119929177 -133201223 -121353614 -101699278 -95815893
7379 -95815893 -103704780 -105168475 -83154126 -44517179 -14586987 -8603226 -16212573 -13835429
7371 -13835429 7662878 31096008 33085763 10712790 -14597508 -20583658 -9626870 -5109726
7363 -5109726 -23855588 -56281024 -76952866 -73420392 -60542528 -62531921 -85684021 -110007950
$$ packed form
7420h648876R315485j860192j5021618j6496290o211526L511499n6447j3589694k0466382
7411f9524041j2147660L531364J0659802J763851j0863033j1200285M067576J8888632
7403f4823794J7538708K981941p416562P8474J7677951K5967327J4332902m689086
7395A647861j0948494J047522J4888480J1061326j0060482k8861251k6285759q789183
7387e6299980J935146p531965k6504639l1527739j3272046J1847609J9654336N883385
7379i5815893p888887j463695K2014349L8636947K9930192N983761p609347K377144
7371a3835429K1498307K3433130J989755k2372973k5310298n986150J0956788M517144
7363e109726j8745862l2425436k0671842L532474J2877864j989393k3152100k4323929
$$ plain form
7355 -110007950 -113224333 -94958046 -77373805 -79391699 -94698003 -99007190 -79285995 -47847905
7347 -47847905 -29580904 -32939977 -41969322 -35328433 -12243626 7236414 5641872 -12424329
7339 -12424329 -25256329 -18937203 -2040438 4831156 -4724234 -17149896 -14045954 6303360
7331 6303360 26772028 31483126 22738329 16713625 22717912 32802706 30658849 11569009
7323 11569009 -13149984 -28685217 -33176571 -37339552 -50033056 -66711895 -74633495 -67827998
7315 -67827998 -53478754 -42843016 -38576848 -33293622 -20767779 -4690925 5177506 4490542
7307 4490542 -1589338 -5141401 -5505687 -9218729 -19873658 -32971642 -39971635 -38578545 -35170129
7298 -35170129 -36081876 -39217349 -36627937 -25129980 -11177954 -4666594 -5614652 -5355656 3463754
$$ packed form
7355a10007950l216383J8266287J7584241k017894j5306304m309187J9721195L1438090
7347d7847905J8267001l359073r029345O640889K3084807J9480040j594542j8066201
7339a2424329j2832000O319126J6896765O871594r555390j2425662L103942K0349314
7331F303360K0468668M711098q744797o024704O004287J0084794k143857j9089840
7323A1569009k4718993j5535233m491354m162981j2693504j6678839p921600O805497
7315f7827998J4349244J0635738M266168N283226J2525843J6076854R868431o86964
7307D490542o079880l552063l64286l713042j0654929j3097984o999993J393090L408416
7298c5170129r11747l135473K589412J1497957J3952026O511360r48058K58996Q819410
$$ plain form
7289 3463754 17087666 24558796 21128322 14696001 16958211 28978864 38979056 36610509
7281 36610509 24100218 14907227 16941943 23062601 18480615 -547726 -21209815 -28666732
7273 -28666732 -21766734 -14840724 -18460096 -27822144 -26509357 -6582608 21645707 40590989
7265 40590989 44761968 45746565 57116078 77241676 89627299 82992416 63091394 47088389
7257 47088389 43975040 45899548 38007700 18842610 1736736 129754 12398977 23162473
7249 23162473 22310429 14913153 12998692 21069185 28677494 23727017 5819806 -13707546 -25618680
7240 -25618680 -31592727 -40951408 -57825243 -74302075 -80944901 -76266699 -69087329 -66215398 -65163101
7231 -65163101 -59290655 -46883357 -35522896 -32430362 -36335577 -39195685 -36935475 -35310831 -40803192
$$ packed form
7289C463754J3623912P471130l430474o432321K262210J2020653J0000192k368547
7281C6610509j2510291r192991K034716O120658m581986j9028341k0662089p456917
7273b8666732O899998O926010l619372r362048J312787J9926749K8228315J8945282
7265D0590989M170979R84597J1369513K0125598J2385623o634883j9901022j6003005
7257D7088389l113349J924508p891848j9165090j7105874j606982J2269223J0763496
7249B3162473q52044p397276j914461Q070493P608309m950477j7907211j9527352j1911134
7240b5618680n974047r358681j6873835j6476832o642826M678202P179370K871931J052297
7231f5163101N872446J2407298J1360461L092534l905215k860108K260210J624644n492361
$$ plain form
7222 -40803192 -51927000 -59695542 -56780652 -48022607 -43921146 -47282426 -49040253 -38868962
7214 -38868962 -19462745 -4514740 -2664096 -7411413 -3347648 14988093 34778027 40424828
7206 40424828 31946327 26501185 38038884 60080066 71448446 60655908 39903418 30195381
7198 30195381 37100769 42560660 25514565 -11361617 -44222400 -52914506 -44199590 -43044247
7190 -43044247 -61594188 -84335339 -84040839 -54406472 -17875912 -1227049 -5739156 -6997904
7182 -6997904 15483671 52443537 74261634 64216513 37817002 25402760 38049941 55096425
7174 55096425 50232314 22212836 -1571940 2833626 29424416 49255173 43238925 22418676
7166 22418676 15640359 33894346 57351529 59059864 34634186 6903740 1094902 14890674
$$ packed form
7222d0803192j1123808p768542K914890Q758045M101461l361280j757827J0171291
7214c8868962J9406217J4948005J850644m747317M063765J8335741J9789934N646801
7206D0424828q478501n445142J1537699K2041182J1368380j0792538k0752490r708037
7198C0195381O905388N459891j7046095l6876182l2860783q692106Q714916J155343
7190d3044247j8549941k2741151K94500K9634367L6530560J6648863m512107j258748
7182f997904K2481575L6959866K1818097j0045121k6399511j2414242J2647181J7046484
7174E5096425m864111k8019478k3784776M405566K6590790J9830757o016248k0820249
7166B2418676o778317J8253987K3457183J708335k4425678k7730446n808838J3795772
$$ plain form
7158 14890674 24983815 12907963 -11547496 -23656030 -10519801 13806828 24697788 14526862
7150 14526862 45140 235068 16294277 29247728 23118028 1688931 -14730359 -13893590
7142 -13893590 -2132163 3481124 -4218069 -14964651 -13653515 2216880 20777676 29122173
7134 29122173 26269558 22348003 26391514 36018345 41598691 37201304 26957514 19503440 20365292
7125 20365292 25331607 28336057 26561415 22875309 21682088 23340023 24590540 21706430 12341690
7116 12341690 -1779996 -17775559 -32714959 -45668077 -58660339 -72541077 -86545828 -96425021
7108 -96425021 -99526115 -94596498 -86092655 -79188310 -74648849 -69449650 -59577588 -47000491 -37839115
7099 -37839115 -36456245 -40406641 -42632683 -38570068 -30194706 -23659090 -21611674 -20379427 -12605675
$$ packed form
7158A4890674J0093141j2075852k4455459j2108534J3136229K4326629J0890960j0170926
7150A4526862j4481722J89928J6059209J2953451o129700k1429097j6419290Q36769
7142a3893590J1761427N613287p699193j0746582J311136J5870395J8560796Q344497
7134B9122173k852615l921555M043511R626831N580346m397387j0243790p454074Q61852
7125B0365292M966315L004450j774642l686106j193221J657935J250517k884110r364740
7116A2341690j4121686j5995563j4939400j2953118j2992262j3880738j4004751r879193
7108i6425021l101094M929617Q503843O904345M539461N199199R872062J2577097R161376
7099c7839115J382870l950396k226042M062615Q375362O535616K047416J232247P773752
$$ plain form
7090 -12605675 2863065 19586736 29356277 29109656 24553504 21478738 19779660 13493153 -3011453
7081 -3011453 -26759345 -49209344 -62209756 -65936979 -66733302 -68785605 -70082940 -62864844 -43411003
7072 -43411003 -17307709 5217046 17642873 22443763 27299067 35187311 40742913 34581894
7064 34581894 15297649 -8999154 -25639748 -31354896 -32985813 -40415907 -53077091 -60009814
7056 -60009814 -51125302 -29059985 -7814847 1363476 2156197 8342815 27323800 50874530
7048 50874530 62565347 56853833 45175026 43938726 55869527 66064707 58268123 33890839
7040 33890839 10926341 2895822 3604956 -6439824 -36636391 -74220421 -97387600 -98277620
7032 -98277620 -90997956 -94004596 -106537956 -109661312 -86911474 -44526729 -6185860 12165272
$$ packed form
7090a2605675J5468740J6723671R769541k46621m556152l074766j699078o286507j6504606
7081c011453k3747892k2449999j3000412l727223p96323k052303j297335P218096J9453841
7072d3411003K6103294K2524755J2425827M800890M855304P888244N555602o161019
7064C4581894j9284245k4296803j6640594n715148j630917p430094j2661184o932723
7056f0009814Q884512K2065317K1245138R178323P92721O186618J8980985K3550730
7048E0874530J1690817n711514j1678807j236300J1930801J0195180p796584k4377284
7040C3890839k2964498q030519P09134j0044780l0196567l7584030k3167179q90020
7032i8277620P279664l006640j2533360l123356K2749838M2384745L8340869J8351132
$$ plain form
7024 12165272 18637656 32737623 59459923 80824420 75716633 43503537 4352001 -21069375
7016 -21069375 -35490129 -56931754 -94691075 -134464542 -153014412 -142531611 -119785594 -104786308
7008 -104786308 -99020813 -86248787 -54817426 -15356209 8734171 6526711 -9720211 -21094196
7000 -21094196 -24857050 -36462308 -69106836 -114181791 -149469325 -162752818 -163947643 -170769173
6992 -170769173 -185501712 -191027709 -172232564 -135816495 -103199501 -86927367 -75451517 -49556794
6984 -49556794 -7250032 32546346 51420177 54152138 62700090 89768116 121871654 134286897
6976 134286897 120955602 101182082 97295742 106217420 102915833 70806970 23216626 -9288980
6968 -9288980 -13589469 -7793861 -17518086 -43522353 -57952764 -35891390 13669555 57164529
$$ packed form
7024A2165272O472384J4099967K6722300K1364497n107787l2213096l9151536k5421376
7016b1069375j4420754k1441625l7759321l9773467j8549870J0482801K2746017J4999286
7008a04786308N765495J2772026L1431361L9461217K4090380k207460j6246922j1373985
7000b1094196l762854j1605258l2644528m5074955l5287534j3283493j194825o821530
6992a70769173j4732539n525997J8795145L6416069L2616994J6272134J1475850K5894723
6984d9556794M2306762L9796378J8873831K731961Q547952K7068026L2103538J2415243
6976A34286897j3331295j9773520l886340Q921678l301587l2108863m7590344l2505606
6968i288980m300489N795608r724225k6004267j4430411K2061374M9560945M3494974
$$ plain form
6960 57164529 73240175 75882459 94871108 136808495 174215649 173862641 135704169 91701984
6952 91701984 70576684 64524626 41730308 -13372324 -77729877 -114023059 -110741034 -94095192
6944 -94095192 -96591459 -119640159 -131813006 -109650971 -65401527 -35896797 -41456796 -63256972
6936 -63256972 -68362592 -47324473 -23836672 -26597946 -53598157 -74961249 -66550114 -36850309
6928 -36850309 -16191240 -21156610 -37416774 -39281901 -20041932 -1253060 -6036672 -33883840
6920 -33883840 -61726318 -71124359 -66327337 -66440293 -79421360 -92705274 -87717149 -60493835
6912 -60493835 -24551542 5411450 28184317 53747343 86411806 118896902 140187331 147195426
6904 147195426 145449788 140837733 132873918 118653375 100453542 84653797 74910216 67525219
$$ packed form
6960E7164529J6075646K642284J8988649M1937387L7407154l53008l8158472m4002185
6952I1701984k1125300o052058k2794318n5102632o4357553l6293182L282025J6645842
6944i4095192k496267k3048700j2172847K2162035M4249444K9504730n559999k1800176
6936f3256972n105620K1038119K3487801k761274k7000211k1363092Q411135K9699805
6928c6850309K0659069m965370j6260164j865127J9239969J8788872m783612k7847168
6920c3883840k7842478r398041M797022j12956j2981067j3283914M988125K7223314
6912f0493835L5942293K9962992K2772867K5563026L2664463L2485096K1290429P008095
6904A47195426j745638m612055p963815j4220543j8199833j5799745r743581p384997
$$ plain form
6896 67525219 59178658 52287545 54567687 66560052 78178202 78803412 68296679 59426300 60779709
6887 60779709 64552372 54160976 25608358 -6038320 -20729020 -16671011 -14328584 -31022759
6879 -31022759 -60785673 -78222841 -70138906 -52198709 -53026674 -81372307 -114667764 -123733147
6871 -123733147 -107244980 -92711628 -103929161 -130461870 -137204879 -104332914 -50015647 -11287350
6863 -11287350 -1490965 3354548 35547487 93651454 141479071 146889243 117092475 89841408
6855 89841408 89804053 99690935 83802125 31155162 -28165531 -55010309 -43323233 -25157199
6847 -25157199 -31081922 -55222436 -62909787 -32808181 16595705 46264675 39731443 18822091
6839 18822091 16141124 36191438 50953318 34122162 -7945925 -42200080 -47137064 -33777508
$$ packed form
6896F7525219q346561o891113K280142J1992365J1618150O25210j0506733q870379J353409
6887F0779709L772663j0391396k8552618l1646678j4690700M058009K342427j6694175
6879c1022759k9762914j7437168Q083935J7940197q27965k8345633l3295457r065383
6871a23733147J6488167J4533352j1217533k6532709o743009L2871965N4317267L8728297
6863a1287350R796385M845513L2192939N8103967M7827617N410172k9796768k7251067
6855H9841408l7355R886882j5888810n2646963n9320693k6844778J1687076J8166034
6847b5157199n924723k4140514p687351L0101606M9403886K9668970o533232k0909352
6839A8822091k680967K0050314J4761880j6831156m2068087l4254155m936984J3359556
$$ plain form
6831 -33777508 -30535755 -49259907 -71569619 -72276387 -48812588 -24256520 -20146288 -33066664
6823 -33066664 -41763140 -33440991 -17318220 -11954202 -23260962 -37451263 -38979951 -26992006
6815 -26992006 -15048087 -13504691 -17926059 -17373140 -8527969 -294292 -1458254 -10443867 -19018872
6806 -19018872 -22188956 -25070617 -31570491 -40372197 -41847725 -31724166 -15951519 -2947808
6798 -2947808 7703395 24804086 52408982 81551144 98823882 100091209 95665787 96758532
6790 96758532 101071586 94251836 68229568 32441009 6986116 -632950 -1678371 -13170964
6782 -13170964 -35151248 -49888331 -41861994 -17064447 2181542 1403673 -9025325 -8787442
6774 -8787442 9394953 29846020 30719919 10828690 -8843481 -8349541 8990068 21813473
$$ packed form
6831c3777508L241753j8724152k2309712p06768K3463799K4556068M110232j2920376
6823c3066664q696476Q322149J6122771N364018j1306760j4190301j528688J1987945
6815b6992006J1943919J543396m421368N52919Q845171Q233677j163962q985613q575005
6806a9018872l170084k881661o499874q801706j475528J0123559J5772647J3003711
6798b947808J0651203J7100691K7604896K9142162J7272738J267327m425422J092745
6790I6758532M313054o819750k6022268l5788559k5454893p619066j045421j1492593
6782a3170964k1980284j4737083Q026337K4797547J9245989p77869j0428998K37883
6774h787442J8182395K0451067Q73899j9891229j9672171M93940J7339609J2823405
$$ plain form
6766 21813473 15542385 -1067702 -4846418 13467636 39718038 50494305 40691103 26344973
6758 26344973 27491121 43502079 56267847 49813708 29713699 15974857 21610364 39083358
6750 39083358 49291041 44147871 33541181 33642821 48515575 65328258 68768090 56817328
6742 56817328 41665213 35625748 39498892 42503930 34905545 18995439 7237794 9481124
6734 9481124 23054338 37620798 44393030 44718332 48115388 61343554 80319380 92804663
6726 92804663 90392635 76544005 62934371 57806142 57049427 48750004 26474256 -1037902
6718 -1037902 -18864353 -19630828 -12240995 -11686371 -22241571 -31839706 -25492146 -2231371 22248809
6709 22248809 31493455 27005392 26019730 41610940 66625522 81460670 75221274 58218186
$$ packed form
6766B1813473o271088j6610087l778716J8314054K6250402J0776267r803202j4346130
6758B6344973J146148J6010958J2765768o454139k0100009j3738842N635507J7472994
6750C9083358J0207683n143170j0606690J01640J4872754J6812683L439832j1950762
6742E6817328j5152115o039465L873144L005038p598385j5910106j1757645K243330
6734I481124J3573214J4566460O772232L25302L397056J3228166J8975826J2485283
6726I2804663k412028j3848630j3609634n128229p56715q299423k2275748k7512158
6718a037902j7826451p66475P389833N54624j0555200r598135O347560K3260775K4480180
6709B2248809R244646m488063r85662J5591210K5014582J4835148o239396j7003088
$$ plain form
6701 58218186 50455786 58789225 68724928 61549448 35052716 7265475 -4099243 -614981
6693 -614981 -2034560 -20643630 -48478314 -65545064 -61469294 -47588416 -43098190 -52687999 -61880100
6684 -61880100 -55709997 -34659482 -15057741 -10644322 -17411399 -20273829 -11473798 1511837
6676 1511837 5149051 -4676499 -17525661 -23100964 -20435952 -18097887 -22743568 -31413012 -36454908
6667 -36454908 -34610250 -29639932 -26295588 -24911220 -22110822 -17450777 -12780693 -9831964 -6679863
6658 -6679863 -1095835 5243703 6913913 2022912 -2902130 -1177810 5953672 8807592 605539
6649 605539 -12789813 -17608581 -8258858 3919860 3711983 -10261334 -21395458 -14472379 6123349
6640 6123349 18572825 8829596 -12258153 -20127046 -4794523 15050668 13781389 -11531803
$$ packed form
6701E8218186p762400Q333439R935703p175480k6496732k7787241j1364718L484262
6693f14981j419579j8609070k7834684j7066750M075770J3880878M490226r589809r192101
6684f1880100O170103K1050515J9601741M413419o767077k862430Q800031J2985635
6676A511837L637214r825550j2849162n575303K665012K338065m645681q669444n041896
6667c6454908J844658M970318L344344J384368K800398M660045M670084K948729L152101
6658f679863N584028O339538J670210m891001m925042J724320P131482K853920q202053
6649F05539j3395352m818768R349723J2178718k07877j3973317j1134124O923079K0595728
6640F123349J2449476r743229k1087749p868893J5332523J9845191j269279k5313192
$$ plain form
6632 -11531803 -34738138 -30453462 -3611647 15362820 6011957 -17835622 -22560643 5586577
6624 5586577 43305884 55260638 34804229 11747639 17223449 47217868 65876432 46826474
6616 46826474 4581875 -21370583 -10730816 13434498 12953625 -20873099 -56052099 -56710294
6608 -56710294 -24737751 2884508 -4708033 -35979637 -51510624 -30465742 5001341 15702688
6600 15702688 -9979122 -42309430 -44909030 -16440224 8956752 1900860 -28316876 -44958818
6592 -44958818 -27756080 5283158 18212252 -1322562 -29299056 -34635732 -15079876 1257583
6584 1257583 -10228735 -43272740 -66944536 -63287334 -45176353 -40005122 -57203851 -78297169
6576 -78297169 -80275852 -62101951 -45310742 -48089772 -66654911 -81267861 -80174484 -72609066
$$ packed form
6632a1531803k3206335M284676K6841815J8974467r350863k3847579m725021K8147220
6624E586577L7719307J1954754k0456409k3056590N475810K9994419J8658564j9049958
6616D6826474m2244599k5952458J0639767K4165314m80873l3826724l5179000o58195
6608e6710294L1972543K7622259p592541l1271604j5530987K1044882L5467083J0701347
6600A5702688k5681810l2330308k599600K8468806K5396976p055892l0217736j6641942
6592d4958818J7202738L3039238J2929094j9534814k7976494n336676J9555856J6337459
6584A257583j1486318l3044005k3671796L657202J8110981N171231j7198729k1093318
6576g8297169j978683J8173901J6791209k779030j8565139j4612950J093377P565418
$$ plain form
6568 -72609066 -76136444 -95055148 -115971964 -123458617 -117526005 -109275892 -107040605 -107251433 -98451348
6559 -98451348 -77308500 -51607106 -30456640 -14672547 1423571 20697162 39629593 51282902
6551 51282902 56186423 59896925 65763844 70386797 69276251 63729682 60015961 62179776 65008697
6542 65008697 61460546 50734240 40579047 37378094 38115306 33147234 17660819 321530
6534 321530 -7220786 -2956830 2825432 -100989 -9080594 -10818063 1405566 18839654 25825274
6525 25825274 16286424 406583 -8876653 -12138551 -23303003 -53499345 -96361418 -133686090
6517 -133686090 -155390722 -168362000 -186082747 -211061671 -228670631 -224550602 -199832145 -170896775
6509 -170896775 -150836516 -134787607 -109847834 -70980364 -30390476 -4499287 3470372 5970967
$$ packed form
6568g2609066l527378j8918704k0916816p486653N932612Q250113K235287k10828Q800085
6559i8451348K1142848K5701394K1150466J5784093J6096118J9273591J8932431J1653309
6551E1282902M903521L710502N866919M622953j110546n546569l713721K163815K828921
6542F5008697l548151j0726306j0155193l200953P37212m968072j5486415j7339289
6534C21530p542316M263956N782262k926421q979605j737469J2223629J7434088O985620
6525B5825274r538850j5879841r283236l261898j1164452l0196342m2862073l7324672
6517a33686090k1704632j2971278j7720747k4978924j7608960M120029K4718457K8935370
6509a70896775K0060259J6048909K4939773L8867470M0589888K5891189P969659K500595
$$ plain form
6501 5970967 15213685 28992490 34094200 22637512 2851752 -10517006 -12022859 -11413131 -20963663
6492 -20963663 -39188144 -54022122 -56884732 -52300546 -52065564 -61626054 -71916679 -71399180 -59154622
6483 -59154622 -45768712 -40121412 -37822188 -28563510 -7718882 15432222 28864105 31215417 31310198
6474 31310198 37423990 45170218 42990842 26190360 2940186 -13728246 -20759306 -27230824
6466 -27230824 -42087172 -61357488 -71989961 -66093739 -51601351 -41804669 -41416997 -41690139
6458 -41690139 -31278057 -11833101 2938586 1735901 -10347068 -18155946 -14582828 -7776314
6450 -7776314 -11320040 -27936442 -45004781 -48964033 -40544128 -34573918 -42719204 -60775039
6442 -60775039 -73392722 -73057909 -68361802 -74733303 -96030279 -119837599 -130268850 -125857183
$$ packed form
6501E970967R242718J3778805N101710j1456688j9785760j3368758j505853O09728r550532
6492b0963663j8224481j4833978k862610M584186K34982r560490j0290625N17499J2244558
6483e9154622J3385910N647300K299224R258678K0844628K3151104J3431883K351312R4781
6474C1310198O113792P746228k179376j6800482k3250174j6668432p031060o471518
6466b7230824j4856348j9270316j0632473N896222J4492388R796682L87672k73142
6458d1690139J0412082J9444956J4771687j202685j2082969p808878L573118O806514
6450g776314l543726j6616402j7068339l959252Q419905N970210q145286j8055835
6442f0775039j2617683L34813M696107o371501k1296976k3807320j0431251M411667
$$ plain form
6434 -125857183 -119754610 -123772355 -133828007 -134310724 -116640332 -88612230 -66584853 -58882303
6426 -58882303 -56340776 -45796281 -25114447 -7605704 -7021694 -21734664 -37194674 -41271578
6418 -41271578 -37821456 -39231902 -52816898 -70073129 -76231873 -66628881 -50872561 -42797157
6410 -42797157 -44069973 -44710850 -34353028 -15434137 -614676 934304 -6139529 -9856295 -3940935
6401 -3940935 5777427 7674023 -436377 -10070993 -10681212 -2445884 5191893 4222118 -3190607
6392 -3190607 -7850549 -4050830 3305396 5825367 821310 -5798737 -6330824 -289569 6521645
6383 6521645 7833250 5946351 6361403 12514071 20653892 24916907 24114156 22702565 24713580
6374 24713580 29011031 31863898 32065710 33159099 39005269 49674268 60815503 70434408 80468749
$$ packed form
6434a25857183O102573m017745j0055652m82717J7670392K8028102K2027377P702550
6426e8882303K541527J0544495K0681834J7508743N84010j4712970j5460010m076904
6418d1271578L450122j410446j3584996j7256231o158744R602992J5756320Q075404
6410d2797157j272816o40877J0357822J8918891J4819461J548980p073833l716766N915360
6401c940935R718362J896596q110400r634616o10219Q235328P637777r69775p412725
6392c190607m659942L799719P356226K519971n004057o620047n32087O041255O811214
6383F521645J311605j886899M15052O152668Q139821M263015q02751j411591K011015
6374B4713580M297451K852867K01812J093389N846170J0668999J1141235R618905J0034341
$$ plain form
6365 80468749 94885878 111747757 125738590 132241514 132367740 132056790 132567407 128417406 114144027
6356 114144027 90931634 67510280 50950101 39169575 24010534 2741981 -17540341 -25571778
6348 -25571778 -19820044 -10659003 -8524620 -12347384 -9998375 5574103 27755881 41145485
6340 41145485 39244467 32523893 35240298 49083756 60215686 55217381 37581293 23785845
6332 23785845 25776746 36052938 37067689 20759923 89924 -6396748 3867487 15634772
6324 15634772 11795982 -5155993 -15963803 -7235932 13521055 25767387 19590258 7510914
6316 7510914 9178713 28933339 49690502 53259276 40131919 30025685 37914762 57189591
6308 57189591 67083460 57132827 39437777 33948194 45680455 58604356 55077641 35495519
$$ packed form
6365H0468749J4417129J6861879J3990833O502924J26226l10950N10617m150001j4273379
6356A14144027k3212393k3421354j6560179j1780526j5159041k1268553k0282322q031437
6348b5571778N751734R161041K134383l822764K349009J5572478K2181778J3389604
6340D1145485j901018o720574K716405J3843458J1131930m998305j7636088j3795448
6332B3785845J990901J0276192J014751j6307766k0669999o486672J0264235J1767285
6324A5634772l838790j6951975j0807810Q727871K0756987J2246332o177129j2079344
6316G510914J667799J9754626K0757163L568774j3127357j0106234P889077J9274829
6308E7189591R893869r950633j7695050n489583J1732261J2923901l526715j9582122
$$ plain form
6300 35495519 17787626 16228431 25009003 25503032 8756508 -14316771 -25319026 -19688521
6292 -19688521 -9852664 -10447547 -20839173 -25779063 -13627032 9790367 28543510 34279096 35037063
6283 35037063 43116636 60455389 75501725 76365089 64932142 52263687 46347152 43141743
6275 43141743 32858980 12608803 -9440626 -23394740 -27909779 -31004128 -37994426 -45985540
6267 -45985540 -46547613 -37242736 -23757199 -12778672 -4862284 4918097 20509452 38745561
6259 38745561 52041809 58357718 62017219 67590980 73382118 73501828 65023865 51941265 40599787
6250 40599787 32170750 22035997 6935367 -10625788 -23182430 -26883010 -25343836 -24253552
6242 -24253552 -24553087 -21091810 -9092184 8791925 25204428 34944892 39744488 45410741 53260061
$$ packed form
6300C5495519j7707893j559195Q780572M94029j6746524k3073279j1002255N630505
6292a9688521R835857n94883j0391626m939890J2152031K3417399J8753143N735586P57967
6283C5037063Q079573J7338753J5046336Q63364j1432947j2668455n916535l205409
6275D3141743j0282763k0250177k2049429j3954114m515039l094349o990298p991114
6267d5985540n62073R304877J3485537J0978527P916388R780381J5591355J8236109
6259C8745561J3296248O315909L659501N573761N791138J19710q477963j3082600j1341478
6250D0599787q429037j0134753j5100630j7561155j2556642l700580J539174J090284
6242b4253552k99535L461277J1999626J7884109J6412503R740464M799596N666253P849320
$$ plain form
6233 53260061 57430564 52696083 38762068 22183339 8571633 -2199123 -14735191 -31171634
6225 -31171634 -48024638 -58602470 -60922102 -58289311 -55305026 -53296701 -49156467 -40094477
6217 -40094477 -26679875 -12974259 -2371366 4706745 10465176 17515281 25149474 31559838
6209 31559838 34281401 32322885 27925713 23640193 20810462 17376171 9726475 -3361068 -18247349
6200 -18247349 -29998606 -36561828 -41012675 -48925409 -59852814 -67667183 -65132598 -53737834
6192 -53737834 -41380791 -35399821 -33091761 -25276736 -7389795 13593871 25573697 24451491
6184 24451491 19918322 23043102 34943458 44102245 39811965 25763222 17483375 24941258
6176 24941258 40605423 48117434 41189931 31182057 34001677 51049245 66353942 63807526
$$ packed form
6233E3260061M170503m734481j3934015j6578729j3611706j0770756j2536068j6436443
6225c1171634j6853004j0577832k319632K632791K984285K008325M140234R061990
6217d0094477J3414602J3705616J0602893P078111N758431P050105P634193O410364
6209C1559838K721563j958516m397172m285520k829731l434291p649696j3087543j4886281
6200a8247349j1751257o563222m450847p912734j0927405p814369K534585J1394764
6192e3737834J2357043N980970K308060P815025J7886941K0983666J1979826j122206
6184B4451491m533169L124780J1900356R158787m290280j4048743q279847P457883
6176B4941258J5664165P512011o927503j0007874K819620J7047568J5304697k546416
$$ plain form
6168 63807526 46400210 32253316 34704918 44990868 43962982 23943865 -939898 -10610155
6160 -10610155 -1869276 7909571 1165397 -19152765 -32677834 -26006697 -7707476 -266957
6152 -266957 -12419455 -29982762 -32387320 -16673035 -313585 -962886 -15604502 -24223599
6144 -24223599 -13340339 8347297 19916441 12647398 -890943 -1919489 11604172 23440413
6136 23440413 18040195 -1627305 -17506676 -16969579 -7635346 -5684631 -17105874 -30567625 -30089498
6127 -30089498 -14675871 2186200 8184407 6056203 8423088 21927546 39620149 48790229
6119 48790229 46035045 38937251 37651853 42003564 42819243 34836294 21682457 10639670 5175579
6110 5175579 795319 -7967529 -20784177 -33213119 -42737522 -50604788 -60099798 -70509022 -78969110
$$ packed form
6168F3807526j7407316j4146894K451602J0285950j027886k0019117k4883763r670257
6160a0610155Q740879R778847o744174k0318162j3525069O671137J8299221P440519
6152b66957j2152498j7563307k404558J5714285J6359450o49301j4641616q619097
6144b4223599J0883260K1687636J1569144p269043j3538341j028546J3523661J1836241
6136B3440413n400218j9667500j5879371N37097R334233J950715j1421243j3461751M78127
6127c0089498J5413627J6862071N998207k128204K366885J3504458J7692603R170080
6119D8790229k755184p097794j285398M351711Q15679p982949j3153837j1042787n464091
6110E175579m380260q762848j2816648j2428942r524403p867266r495010j0409224q460088
$$ plain form
6101 -78969110 -83672259 -86624642 -89596820 -90115244 -84284181 -72787255 -60620126 -51928363 -44081902
6092 -44081902 -31038242 -12441298 4551100 11489322 9401498 8261826 14638120 22868509
6084 22868509 21132460 6774523 -9867739 -15070817 -8378317 -3864056 -12778122 -29329576
6076 -29329576 -36369878 -25378874 -8071648 -2859712 -14718897 -26333619 -20601812 -398056
6068 -398056 12847256 4503604 -16227474 -25851253 -14712449 1194299 -1943237 -26882607
6060 -26882607 -50926240 -52058808 -34822041 -24900580 -38725310 -61963534 -66210601 -41137692
6052 -41137692 -7351829 7684666 2448119 2556429 30132000 76598415 110206729 113423261
6044 113423261 100734596 101931295 124656312 145452557 136187359 98476172 61826761 49688254
$$ packed form
6101g8969110m703149k952383k972178n18424N831063J1496926J2167129Q691763P846461
6092d4081902J3043660J8596944J6992398O938222k087824j139672O376294Q230389
6084B2868509j736049j4357937j6642262n203078O692500M514261q914066j6551454
6076b9329576p040302J0991004J7307226N211936j1859185j1614722N731807K0203756
6068c98056J3245312q343652k0731078r623779J1138804J5906748l137536k4939370
6060b6882607k4043633j132568J7236767R921461j3824730k3238224m247067K5072909
6052d1137692L3785863J5036495n236547J08310K7575571M6466415L3608314L216532
6044A13423261j2688665J196699K2725017K0796245r265198l7711187l6649411j2138507
$$ plain form
6036 49688254 53208188 44147139 8466949 -34844216 -55324750 -45799214 -30316117 -34256524
6028 -34256524 -55005341 -65544216 -47266204 -12075121 11179724 10011942 1891771 11684300
6020 11684300 41618140 69024717 72337704 56671847 45605986 52821965 66286160 63156338
6012 63156338 38304231 8861068 -5461910 -5852734 -10031606 -29305291 -54686248 -67376370
6004 -67376370 -61346733 -48503491 -43760352 -45775597 -40868334 -21052667 5169841 23663871
5996 23663871 29984775 35031404 47989849 64210535 71314053 64262044 53404158 50802065
5988 50802065 55334511 53815204 39097740 20317363 12327722 17223625 20347952 8494915
5980 8494915 -13362591 -26305569 -20925995 -9916268 -13623464 -33472483 -49118034 -41672805
$$ packed form
6036D9688254L519934r061049l5680190m3311165k0480534R525536J5483097l940407
6028c4256524k0748817j0538875J8278012L5191083K3254845j167782q120171R792529
6020A1684300K9933840K7406577L312987j5665857j1065861P215979J3464195l129822
6012F3156338k4852107k9443163j4322978l90824m178872j9273685k5380957j2690122
6004f7376370O029637J2843242M743139k015245M907263J9815667K6222508J8494030
5996B3663871O320904N046629J2958445J6220686P103518p052009j0857886k602093
5988E0802065M532446j519307j4717464j8780377p989641M895903L124327j1853037
5980H494915k1857506j2942978N379574J1009727l707196j9849019j5645551P445229
$$ plain form
5972 -41672805 -16596876 1326955 -2324198 -13640121 -5429963 27620206 61690326 69640488
5964 69640488 52426390 38346608 50040304 74875607 80702461 52361263 12602469 -3859645
5956 -3859645 10521385 26998986 14562293 -21384740 -45427724 -32637587 1610990 17934499
5948 17934499 -1152361 -30961601 -34627126 -5824727 22204213 16574566 -18286830 -43249826
5940 -43249826 -31532505 1706166 17598608 -1326831 -30355741 -31812847 187875 33738465
5932 33738465 35472619 8482259 -11879551 301499 31306112 46167830 28601438 -204968
5924 -204968 -5677483 20056362 50490053 56575101 39521373 27348245 41132438 70159016
5916 70159016 85485926 71504900 43410778 26855644 29332538 33180296 18788614 -13228243
$$ packed form
5972d1672805K5075929J7923831l651153j1315923Q210158L3050169L4070120P950162
5964F9640488j7214098j4079782J1693696K4835303N826854k8341198l9758794j6462114
5956c859645J4381030J6477601j2436693l5947033k4042984J2790137L4248577J6323509
5948A7934499j9086860k9809240l665525K8802399K8028940n629647l4861396k4962996
5940d3249826J1717321L3238671J5892442j8925439k9028910j457106L2000722L3550590
5932C3738465J734154k6990360k0361810J2181050L1004613J4861718j7566392k8806406
5924b04968n472515K5733845L0433691O085048j7053728j2173128J3784193K9026578
5916G0159016J5326910j3981026k8094122j6555134K476894L847758j4391682l2016857
$$ plain form
5908 -13228243 -41705981 -50264730 -42561507 -35616964 -39828479 -47914558 -45812351 -29179842
5900 -29179842 -8073509 4716823 6269114 5068366 7398600 12404409 15244922 12466860 5248808
5891 5248808 -2319892 -7043149 -8661030 -6751504 -2828624 616783 439291 -1212163 371768
5882 371768 7681118 16012628 17566369 9856068 1175008 1955657 13203695 24613090 25613246
5873 25613246 18890906 18856328 34424087 57385463 70052099 64416363 51214232 47657402 56649843
5864 56649843 62701912 49328660 19597547 -6371211 -11865489 -3320997 -911654 -15202848
5856 -15202848 -33407609 -34401111 -12761663 13467076 22693350 13387004 4594410 12742861
5848 12742861 32033534 41556856 28632201 4514345 -8391413 -1114777 12547795 14020505
$$ packed form
5908a3228243k8477738q558749P703223O944543m211515q086079K102207J6632509
5900b9179842K1106333J2790332J552291j200748K330234N005809K840513k778062p218052
5891E248808p568700m723257j617881J909526L922880L445407j77492j651454J583931
5882C71768P309350Q331510J553741p710301q681060P80649J1248038J1409395J000156
5873B5613246o722340l4578J5567759K2961376J2666636n635736j3202131l556830Q992441
5864E6649843O052069j3373252k9731113k5968758n494278Q544492K409343j4291194
5856a5202848j8204761r93502K1639448K6228739R226274r306346q792594Q148451
5848A2742861J9290673R523322j2924655k4117856j2905758P276636J3662572J472710
$$ plain form
5840 14020505 1989794 -7693112 -85152 22107332 40712155 42320960 32324213 26325662
5832 26325662 30909626 37848709 33748894 15634201 -5596818 -18052962 -19775090 -19010146 -23114665
5823 -23114665 -30158748 -32710938 -26171517 -12892508 78565 9241057 14835894 19694256 25273098
5814 25273098 31647867 37296725 39891839 37633921 31383396 24793612 22577392 24240522 23739713
5805 23739713 14418420 -2060972 -16649926 -22314071 -23138484 -30083187 -48543449 -69589930
5797 -69589930 -78021724 -69006428 -52919512 -45098322 -46233546 -41038768 -16402663 22720507
5789 22720507 55821705 67520683 64596737 66761405 82717691 98230675 91379276 57795810
5781 57795810 17561091 -6090548 -11743923 -19640862 -46866480 -85724473 -110480748 -105635998
$$ packed form
5840A4020505j2030711r682906P607960K2192484J8604823J608805r996747n998551
5832B6325662M583964O939083m099815j8114693k1231019j2456144j722128P64944m104519
5823b3114665p044083k552190O539421J3279009J2971073R162492N594837M858362N578842
5814B5273098O374769N648858K595114k257918o250525o589784k216220J663130n00809
5805B3739713r321293j6479392j4588954n664145q24413o944703j8460262k1046481
5797f9589930q431794R015296J6086916P821190j135224N194778K4636105L9123170
5789B2720507L3101198J1698978k923946K164668J5956286J5512984o851399l3583466
5781E7795810m0234719k3651639n653375p896939k7225618l8857993k4756275M844750
$$ plain form
5773 -105635998 -83362744 -69892056 -76511970 -87096040 -77540905 -44652073 -10422849 1997213
5765 1997213 -6282816 -11591075 5566760 38148911 60969526 59260619 44882346 42831595
5757 42831595 62591185 87256144 93008028 74416970 51088510 43936131 54008803 60381861
5749 60381861 46372443 17365569 -4224419 -3194115 12918229 22999174 15837677 1911825
5741 1911825 1230158 19882176 43513919 52295866 41356134 25110521 21301443 31166961 39016097
5732 39016097 29794942 5834986 -15256526 -18416014 -7986189 -1623664 -12054192 -32317562
5724 -32317562 -44477597 -38633094 -24560737 -21351699 -35700199 -55339563 -60747806 -46281570
5716 -46281570 -26316622 -18715125 -24257641 -25756111 -7375146 27173717 57483584 66947032
$$ packed form
5773a05635998K2273254J3470688o619914j0584070R555135L2888832L4229224J2420062
5765A997213q280029n308259J7157835L2582151K2820615j708907j4378273k050751
5757D2831595J9759590K4664959N751884j8591058k3328460p152379J0072672O373058
5749F0381861j4009418k9006874k1589988J030304J6112344J0080945p161497j3925852
5741A911825o81667J8652018K3631743Q781947j0939732j6245613l809078R865518P849136
5732C9016097r221155k3959956k1091512l159488J0429825O362525j0430528k0263370
5724c2317562j2160035N844503J4072357L209038j4348500j9639364n408243J4466236
5716d6281570J9964948P601497n542516j498470J8380965L4548863L0309867R463448
$$ plain form
5708 66947032 60700964 57972322 68942527 83082424 79036389 49500208 10039034 -17106802
5700 -17106802 -26201278 -33464348 -55257646 -89377364 -115222827 -116109352 -98318749 -83906833
5692 -83906833 -85341301 -94541799 -91570438 -70092594 -44352249 -33878107 -42933065 -54163250
5684 -54163250 -50611442 -32796011 -17932339 -18863192 -30840366 -34838111 -22188464 -2172701
5676 -2172701 8281073 2458842 -9542867 -12661928 -4711072 3118827 -1056963 -15713141
5668 -15713141 -28011164 -26983680 -15064161 -3405730 616756 -442284 3623210 17114594
5660 17114594 34098297 43862019 41259009 30890675 21905705 18502114 16647800 9339005
5652 9339005 -5344858 -20897043 -27538469 -21276423 -7996798 2181897 5381793 7070088
$$ packed form
5708F6947032o246068k728642J0970205J4139897m046035k9536181l9461174k7145836
5700a7106802r094476p263070k1793298l4119718k5845463q86525J7790603J4411916
5692h3906833j434468r200498K971361K1477844K5740345J0474142r054958j1230185
5684e4163250L551808J7815431J4863672r30853j1977174l997745J2649647K0015763
5676b172701J0453774n822231j2001709l119061P950856P829899m175790j4656178
5668a5713141j2298023J027484J1919519J1658431M022486j059040M065494J3491384
5660A7114594J6983703R763722k603010j0368334q984970l403591j854314p308795
5652I339005j4683863j5552185o641426O262046J3279625J0178695L199896J688295
$$ plain form
5644 7070088 16315602 34039576 49116404 49587522 35315678 18680587 12010453 14353818 12258640
5635 12258640 -3510079 -24907197 -34250765 -22565942 -1289463 10071290 4529324 -3483171
5627 -3483171 3587584 24143848 37280224 25391718 -4482246 -27780018 -29136181 -19111219
5619 -19111219 -21657204 -43637199 -64286510 -57887319 -22756810 14085543 28031060 23870882
5611 23870882 28524068 57745979 95307891 108818052 86816749 53562080 40557409 51414641
5603 51414641 58844393 38394856 -347811 -23432983 -10438917 21260212 37015516 23344343
5595 23344343 3618341 8026105 37119359 59676264 48497130 11469379 -16447265 -14920627
5587 -14920627 1944707 2294262 -22781995 -49947274 -49212141 -19102964 12085841 19090670
$$ packed form
5644G070088R245514J7723974J5076828M71118j4271844j6635091o670134K343365k095178
5635A2258640j5768719k1397118r343568J1684823K1276479J1360753n541966q012495
5627c483171P070755K0556264J3136376j1888506k9873964k3297772j356163J0024962
5619a9111219k545985k1979995k0649311O399191L5130509L6842353J3945517m160178
5611B3870882M653186K9221911L7561912J3510161k2001303l3254669j3004671J0857232
5603E1414641P429752k0449537l8742667k3085172J2994066L1699129J5755304j3671173
5595B3344343j9726002M407764K9093254K2556905j1179134l7027751k7916644J526638
5587a4920627J6865334L49555k5076257k7165279P35133L0109177L1188805P004829
$$ plain form
5579 19090670 7133112 2014714 19165718 45175140 53633256 36876459 13061155 5450639
5571 5450639 16809655 31024943 34332343 30685263 35507754 56913890 86735165 112091748
5563 112091748 126984678 134827474 139281523 139626910 134909115 126425678 114483456 97190001
5555 97190001 72892770 48080516 37366204 47048002 65580250 73552003 67296342 66782866
5547 66782866 92508770 136257732 162142502 145485352 103057326 79186523 94168449 116036799
5539 116036799 96132203 29313237 -30680493 -27130101 31519002 75466839 53575193 -3482535
5531 -3482535 -14585753 54865238 144358496 159748584 83215538 -741756 957301 79043559
5523 79043559 127037051 64408547 -60551980 -118378052 -45536223 75870845 107909944
$$ packed form
5579A9090670j1957558n118398J7151004K6009422Q458116j6756797k3815304p610516
5571E450639J1359016J4215288L307400l647080M822491K1406136K9821275K5356583
5563A12091748J4892930P842796M454049L45387m717795q483437j1942222j7293455
5555I7190001k4297231k4812254j0714312R681798J8532248P971753o255661n13476
5547F6782866K5725904M3748962K5884770j6657150m2428026k3870803J4981926K1868350
5539A16036799j9904596o6818966n9993730L550392N8649103M3947837k1891646n7057728
5531c482535j1103218O9450991Q9493258J5390088p6533046q3957294J699057P8086258
5523G9043559M7993492o2628504j24960527n7826072P2841829J21407068L2039099
$$ plain form
5516 107909944 17562579 -79529812 -50554823 92142608 197294006 143150336 -16485605
5509 -16485605 -107853899 -37339087 95257791 109853512 -40252748 -203578657 -198157810
5502 -198157810 -23211448 134750356 114578196 -27855886 -81863313 72232984 313527711
5495 313527711 411147118 288090784 113683788 107055282 279432179 414710454 316632673
5488 316632673 42157874 -157917366 -126209847 18261459 16159760 -226225561 -520209929
5481 -520209929 -606179843 -451203872 -286661070 -335860843 -549052984 -651769079 -458772342
5474 -458772342 -87663377 174205703 204376078 184525271 385800844 845489184 1310306917
5467 1310306917 1517375457 1485326724 1481693718 1698353395 2019541137 2147483647 1939150726
$$ packed form
5516A07909944r0347365r7092391K8974989J42697431J05151398n4143670j59635941
5509a6485605r1368294P0514812J32596878J4595721j50106260j63325909N420847
5502a98157810J74946362J57961804k0172160j42434082n4007427J54096297K41294727
5495C13527711R7619407j23056334j74406996o628506J72376897J35278275r8077781
5488C16632673k74474799k00075240L1707519J44471306k101699k42385321k93984368
5481e20209929q5969914J54975971J64542802m9199773k13192141j02716095J92996737
5474d58772342L71108965K61869080L0170375j9850807K01275573M59688340M64817733
5467A310306917K07068540l2048733l633006K16659677L21187742J27942510k08332921
$$ plain form
5460 1939150726 1576903964 1357996416 1354447988 1343166589 1076629345 583032472 146598210
5453 146598210 -9878080 30440548 -13828831 -288360516 -631779556 -763047901 -607051279
5446 -607051279 -382158637 -348793478 -513001904 -629947935 -493343737 -179526267 41780920
5439 41780920 14359093 -128798725 -129881333 92785782 351571103 407707284 244313667
5432 244313667 79542613 110212505 286771916 379014772 246581451 618210 -126742529
5425 -126742529 -47272273 92585848 89227899 -80340263 -236166037 -207763354 -28999268
5418 -28999268 106570394 69619940 -65196114 -114978653 -5152662 148302558 177246866
5411 177246866 54959244 -80393230 -87937871 18860202 98102453 49084418 -72513931
$$ packed form
5460A939150726l62246762k18907548l548428j1281399k66537244m93596873m36434262
5453A46598210j56476290M0318628m4269379k74531685l43419040j31268345J55996622
5446f07051279K24892642L3365159j64208426j16946031J36604198L13817470K21307187
5439D1780920k7421827j43157818j082608K22667115K58785321N6136181j63393617
5432B44313667j64771054L0669892J76559411R2242856j32433321k45963241j27360739
5425a26742529P9470256J39858121l357949j69568162j55825774K8402683J78764086
5418b8999268J35569662l6950454j34816054m9782539J09825991J53455220K8944308
5411A77246866j22287622j35352474p544641J06798073P9242251m9018035j21598349
$$ plain form
5404 -72513931 -126546296 -50213647 75045373 122390752 62819359 -10889295 505313 89077007
5396 89077007 154601501 123413826 29299961 -31121412 -8440186 49605992 63754571 15208960
5388 15208960 -37378949 -28748981 37782160 101382156 113492295 87678721 75377731 102071569
5380 102071569 141882180 150396734 117521176 72632301 50459659 54110816 60197429 51027043
5372 51027043 33624936 27765421 42350136 68991252 92696406 107697729 117125839 123284726
5364 123284726 124741159 121551471 114367016 103660121 85848202 58485653 29147779 10578744
5356 10578744 8468009 13367325 9650832 -4026218 -12314020 -1214218 23058592 36623682
5348 36623682 24369391 -2140513 -16584622 -9139004 2204352 -7826071 -39735311 -65395410
$$ packed form
5404g2513931n4032365P6332649J25259020M7345379n9571393p3708654J1394608Q8571694
5396H9077007O5524494l1187675r4113865o0421373K2681226N8046178J4148579m8545611
5388A5208960n2587909Q629968O6531141O3599996J2110139k5813574j2300990K6693838
5380A02071569L9810611Q514554l2875558m4888875k2172642L651157O086613r170386
5372E1027043j7402107n859515J4584715K6641116K3705154J5001323R428110O158887
5364A23284726J456433l189688p184455j0706895j7811919k7362549k9337874j8569035
5356A0578744k110735M899316l716493j3677050q287802J1099802K4272810J3565090
5348C6623682j2254291k6509904j4444109P445618J1343356j0030423l1909240k5660099
$$ plain form
5340 -65395410 -59893356 -29634638 -5649805 -8601032 -24428546 -21764934 9518128 43827956
5332 43827956 49235884 22743285 -5094260 -5683863 15396169 25958237 7272538 -22880741
5324 -22880741 -30180367 -1948069 36645957 52860766 42261311 32673931 48212659 79889090
5316 79889090 95216693 75079467 34961073 7267713 4748954 7963153 -8837316 -46154300
5308 -46154300 -76375490 -76239494 -51428901 -29564005 -28353655 -37479737 -32717351 -6889209
5300 -6889209 21561955 28709764 11927053 -8710935 -13489537 -4669377 -675822 -13745798
5292 -13745798 -33773335 -41540999 -28480891 -5961797 8091675 8756128 6689674 14415309
5284 14415309 30715171 42258223 37915440 20459683 2774312 -5217902 -6372535 -9711219
$$ packed form
5340f5395410N502054L0258718K3984833k951227j5827514K663612L1283062L4309828
5332D3827956N407928k6492599k7837545n89603K1080032J0562068j8685699l0153279
5324b2880741p299626K8232298L8594026J6214809j0599455r587380J5538728L1676431
5316G9889090J5327603k0137226m0118394k7693360k518759L214199j6800469l7316984
5308d6154300l0221190J35996K4810593K1864896J210350r126082M762386K5828142
5300f889209K8451164P147809j6782711k0637988m778602Q820160L993555j3069976
5292a3745798k0027537p767664J3060108K2519094J4053472O64453k066454P725635
5284A4415309J6299862J1543052m342783j7455757j7685371p992214j154633l338684
$$ plain form
5276 -9711219 -20039803 -31824247 -35358818 -25958295 -9183313 5026614 10931643 12118737
5268 12118737 15494205 24503876 33101065 32492097 20014233 2280037 -10118386 -12808625 -11915819
5259 -11915819 -16356447 -28265620 -38555472 -36506944 -22445833 -8430165 -6470560 -15440153
5251 -15440153 -22604505 -17992273 -6256607 -2902213 -15838676 -36196264 -46269563 -40048894
5243 -40048894 -28767465 -30114331 -46235692 -62505831 -63302634 -50709827 -43433967 -56365700
5235 -56365700 -82211052 -100648707 -99730563 -88778932 -87193175 -101280227 -114928428 -107630261
5227 -107630261 -77478172 -42139350 -21780360 -15403008 -4372089 24337454 62041240 86112140
5219 86112140 84037731 66294158 54212231 56402941 59628381 45290050 12310307 -21060047
$$ packed form
5276i711219j0328584j1784444l534571R400523J6774982J4209927N905029J187094
5268A2118737L375468R009671Q597189o08968j2477864j7734196j2398423k690239Q92806
5259a1915819m440628j1909173j0289852K048528J4061111J4015668J959605q969593
5251a5440153p164352M612232J1735666L354394j2936463k0357588j0073299O220669
5243d0048894J1281429j346866j6121361j6270139p96803J2592807P275860j2931733
5235e6365700k5845352j8437655R18144J0951631J585757j4087052j3648201P298167
5227a07630261L0152089L5338822K0358990O377352J1030919K8709543L7703786K4070900
5219H6112140k074409j7743573j2081927K190710L225440j4338331l2979743l3370354
$$ plain form
5211 -21060047 -35919224 -31718495 -26180708 -35003053 -54058678 -64627687 -55304968 -34139010
5203 -34139010 -20825495 -26064938 -39542334 -42483604 -27657098 -7164115 827726 -6691647
5195 -6691647 -15616239 -9400396 13196327 35581307 41348427 31315357 21481775 26780903
5187 26780903 42769276 50647239 38379308 13713709 -2571795 1393484 15918276 21210095
5179 21210095 9861981 -4644806 -1824133 22299849 50538081 60905397 51916622 42346813
5171 42346813 50913520 73724060 88090548 77256932 50166984 31837269 35636643 48640533
5163 48640533 46190330 19840861 -12575559 -26277478 -18865731 -12014564 -27428791 -62577268
5155 -62577268 -91782537 -95781087 -82298537 -75584477 -88784504 -107443162 -105396016 -74787390
$$ packed form
5211b1060047j4859177M200729N537787q822345j9055625j0569009R322719K1165958
5203c4139010J3313515n239443j3477396k941270J4826506K0492983P991841p519373
5195f691647q924592O215843K2596723K2384980N767120j0033070r833582N299128
5187B6780903J5988373P877963j2267931k4665599j6285504L965279J4524792N291819
5179B1210095j1348114j4506787K820673K4123982K8238232J0367316q988775r569809
5171D2346813Q566707K2810540J4366488j0833616k7089948j8329715L799374J3003890
5163D8640533k450203k6349469l2416420j3701919P411747O851167j5414227l5148477
5155f2577268k9205269l998550J3482550O714060j3200027j8658658K047146L0608626
$$ plain form
5147 -74787390 -34275742 -8881273 -2434429 4324308 30079561 69333157 97289710 97033150
5139 97033150 76963712 59791394 57041901 57216556 41051545 5159176 -33050585 -53835457
5131 -53835457 -55416450 -52903721 -60422568 -74414252 -79325273 -66194916 -42997404 -24840917
5123 -24840917 -18864304 -17805008 -10722832 4550200 20136926 27431309 26564051 24161531 26594347
5114 26594347 32568022 37669091 38129173 33803131 26901398 20050890 14184694 9163490 2887805
5105 2887805 -6797131 -19395243 -30912467 -35234429 -30401290 -22197935 -17767311 -17556668 -14140609
5096 -14140609 168164 21950784 37867187 39047217 30285819 26113247 32364151 40620521
5088 40620521 35737190 15488535 -5561540 -10015437 1834405 13052826 9563757 -4101339
$$ packed form
5147g4787390M0511648K5394469O446844O758737K5755253L9253596K7956553k56560
5139I7033150k0069438j7172318k749493J74655j6165011l5892369l8209761k0784872
5131e3835457j580993K512729p518847j3991684m911021J3130357K3197512J8156487
5123b4840917N976613J059296P082176J5273032J5586726P294383q67258k402520K432816
5114B6594347N973675N101069M60082m326042o901733o850508n866196n021204o275685
5105B887805r684936j2598112j1517224m321962M833139Q203355M430624K10643L416059
5096a4140609J4308773K1782620J5916403J180030q761398m172572O250904Q256370
5088D0620521m883331k0248655k1050075m453897J1849842J1218421l489069j3665096
$$ plain form
5080 -4101339 -8400189 6995321 30646009 39848942 27201464 7584327 1559912 11341610
5072 11341610 18846046 6818030 -19487657 -37781265 -32289719 -12030426 1361293 -2004978
5064 -2004978 -8902134 25283 27801380 55879555 65208097 55934365 46364582 50591925 62398530
5055 62398530 64884235 48839972 25087843 11476901 13286197 19730053 17461782 5648516
5047 5648516 -4356850 -3302084 6399421 13131643 10291785 1264371 -5210540 -5780984 -3939873
5038 -3939873 -4065107 -7277527 -10750536 -11779833 -9217995 -3547816 3861602 10190669 11828949
5029 11828949 7867350 2520050 408981 1475776 -2086729 -16070010 -36547583 -50390842
5021 -50390842 -49168951 -39265789 -34762692 -41260462 -46053775 -33282992 -1989987 28483905
$$ packed form
5080d101339m298850J5395510K3650688R202933j2647478j9617137o024415R781698
5072A1341610P504436j2028016k6305687j8293608N491546K0259293J3391719l366271
5064b004978o897156Q927417K7776097K8078175R328542r273732r569783M227343J1806605
5055F2398530K485705j6044263k3752129j3610942J809296O443856k268271j1813266
5047E648516j0005366J054766R701505O732222k839858r027414o474911n70444J841111
5038c939873j25234l212420l473009j029297K561838N670179P409418O329067J638280
5029A1828949l961599n347300k111069J066795l562505j3983281k0477573j3843259
5021e0390842J221891R903162M503097o497770m793313J2770783L1293005L0473892
$$ plain form
5013 28483905 39401969 33554628 32248317 50334186 76289992 84457360 64423258 34602132
5005 34602132 23776412 37609788 52471861 42125281 10190693 -11925147 -1917546 27446699
4997 27446699 41294340 22442162 -8296799 -15832173 7324491 31601869 24750265 -11058459
4989 -11058459 -39398433 -32074628 -1368687 13911964 -5708262 -37767509 -43884484 -14775454
4981 -14775454 17888627 18174652 -12368216 -37802754 -29251841 1867402 17042374 -3143495
4973 -3143495 -35774698 -42716946 -14038618 21415602 29591564 11288129 -251411 20340523
4965 20340523 60050886 82614998 71048393 44331690 34996775 49885372 63809348 50430262
4957 50430262 13810177 -16819816 -20692775 -8234243 -6429787 -25482014 -48291879 -51126435
$$ packed form
5013B8483905J0918064n847341j306311J8085869K5955806Q167368k0034102k9821126
5005C4602132j0825720J3833376J4862073j0346580l1934588k2115840J0007601K9364245
4997B7446699J3847641j8852178l0738961p535374K3156664K4277378o851604l5808724
4989a1058459k8339974P323805L0705941J5280651j9620226l2059247o116975K9109030
4981a4775454L2664081K86025l0542868k5434538Q550913L1119243J5174972k0185869
4973c143495l2631203o942248K8678328L5454220Q175962j8303435j1539540K0591934
4965B0340523L9710363K2564112j1566605k6716703r334915J4888597J3923976j3379086
4957E0430262l6620085l0629993l872959J2458532J804456j9052227k2809865k834556
$$ plain form
4949 -51126435 -31962726 -12044418 -10170619 -20696326 -23683695 -8015784 13875546 23658806
4941 23658806 19153758 14927931 24572763 43262539 55442055 54594738 49309479 51866185 61582409
4932 61582409 65570343 55134875 37261868 24149940 19236784 11284316 -8478095 -34284284
4924 -34284284 -51082903 -52570979 -48950272 -53284195 -64081136 -66032537 -49104473 -21861472
4916 -21861472 -3728188 -602811 955325 17501972 46818474 67992599 66408917 51060588
4908 51060588 44282532 55387468 68274095 59935419 29626319 798211 -6248060 2656679
4900 2656679 1358934 -23814294 -56760420 -69301719 -53633324 -31862679 -29230428 -43775496
4892 -43775496 -48132969 -21863864 23353053 55962320 61491878 57283216 71621539 108079446
$$ packed form
4949e1126435J9163709J9918308J873799j0525707k987369J5667911K1891330R783260
4941B3658806m505048m225827R644832J8689776J2179516q47317n285259K556706R716224
4932F1582409L987934j0435468j7873007j3111928m913156p952468j9762411k5806189
4924c4284284j6798619j488076L620707m333923j0796941j951401J6928064K7243001
4916b1861472J8133284L125377J558136J6546647K9316502K1174125j583682j5348329
4908E1060588o778056J1104936J2886627q338676l0309100k8828108p046271Q904739
4900B656679j297745k5173228l2946126j2541299J5668395K1770645K632251j4545068
4892d3775496m357473K6269105M5216917L2609267N529558m208662J4338323L6457907
$$ plain form
4884 108079446 140362426 141367460 115285742 91690077 91051912 100778447 91810618 53230387
4876 53230387 7451696 -16241146 -13213759 -8815173 -25968871 -58772011 -78741528 -68863445
4868 -68863445 -43491022 -31554496 -42811241 -58136621 -52502377 -25862382 -2759394 -3183943
4860 -3183943 -20129579 -29196804 -17007256 3063629 7976795 -8068960 -27624200 -30085284
4852 -30085284 -16871009 -6823896 -14040087 -31425615 -39799919 -29740241 -12692421 -5521872
4844 -5521872 -11231797 -16867796 -9758277 6955185 19157996 17907344 8046525 1726487 2600715
4835 2600715 3045347 -6167870 -24370714 -42771290 -54304033 -61290897 -69362220 -80321693 -89630684
4826 -89630684 -92814762 -89883950 -84973751 -80079457 -73299796 -63216696 -51537156 -41596252 -32961337
$$ packed form
4884A08079446L2282980J005034k6081718k3595665o38165R726535q967829l8580231
4876E3230387m5778691k3692842L027387M398586j7153698l2803140j9969517R878083
4868f8863445K5372423J1936526j1256745j5325380N634244K6639995K3102988m24549
4860c183943j6945636r067225J2189548K0070885M913166j6045755j9555240k461084
4852c0085284J3214275J0047113p216191j7385528q374304J0059678J7047820P170549
4844e521872n709925n635999P109519J6713462J2202811j250652r860819o320038Q74228
4835B600715M44632r213217j8202844j8400576j1532743o986864q071323j0959473r308991
4826h9630684l184078K930812M910199M894294O779661J0083100J1679540R940904Q634915
$$ plain form
4817 -32961337 -23074562 -10185643 2060463 9966902 13717995 19094145 29819862 41950854
4809 41950854 47376482 43813556 38897555 40086829 46051370 46464530 34322787 15934574 3412746
4800 3412746 2318768 4144200 -3247632 -20301477 -33242876 -30570985 -15645153 -4945871
4792 -4945871 -7777593 -16665844 -14720049 2516843 20855336 23432459 9292027 -3504170
4784 -3504170 -302939 13178886 17926783 3808480 -17506714 -25464896 -14652194 -416222
4776 -416222 -2382669 -19642371 -33081715 -27369476 -8789656 1244269 -8337940 -25374441
4768 -25374441 -28608468 -12478790 7518148 11861237 1331391 -5166234 7497140 32914616
4760 32914616 50351327 48207401 36980327 36126810 50543070 65620050 64447665 46904680
$$ packed form
4817c2961337R886775J2888919J2246106P906439L751093N376150J0725717J2130992
4809D1950854N425628l562926m916001J189274N964541M13160j2141743j8388213j2521828
4800C412746j093978J825432p391832j7053845j2941399K671891J4925832J0699282
4792d945871k831722q888251J945795J7236892J8338493K577123j4140432j2796197
4784c504170L201231J3481825M747897j4118303k1315194p958182J0812702J4235972
4776d16222j966447j7259702j3439344N712239J8579820J0033925r582209j7036501
4768b5374441l234027J6129678J9996938M343089j0529846o497625J2663374K5417476
4760C2914616J7436711k143926j1227074q53517J4416260J5076980j172385j7542985
$$ plain form
4752 46904680 30142396 29142476 39418814 44430401 34615672 19118528 13675673 23509461
4744 23509461 36635542 38361618 27129011 15040868 12589491 17212264 16165558 2176557
4736 2176557 -19366025 -35703768 -41446552 -42765200 -48692101 -59751483 -68675104 -67896613 -57665932
4727 -57665932 -45308622 -36890453 -31737618 -24190217 -11443211 3617832 15524550 21726964
4719 21726964 24109586 26178825 29554336 32686882 32828908 28535351 20951494 12225724 5028171
4710 5028171 -1441139 -9168382 -20042052 -33483034 -45517128 -52597345 -54686219 -55177151 -56807105
4701 -56807105 -57128069 -52010919 -38611166 -20619223 -3932593 8041624 18657093 31925855
4693 31925855 47373361 58643866 60619684 53327097 44196516 37585492 31403445 20411640
$$ packed form
4752D6904680j6762284r99920J0276338N011587r814729j5497144n442855R833788
4744B3509461J3126081J726076j1232607j2088143k451377M622773j046706j3989001
4736B176557k1542582j6337743n742784j318648n926901j1059382q923621P78491J0230681
4727e7665932J2357310Q418169N152835P547401J2747006J5061043J1906718O202414
4719B1726964K382622K069239L375511L132546J42026m293557p583857q725770p197553
4710E028171o469310p727243j0873670j3440982j2034094p080217k088874m90932j629954
4701e6807105l20964N117150J3399753J7991943J6686630J1974217J0615469J3268762
4693C1925855J5447506J1270505J975818p292587r130581o611024o182047j0991805
$$ plain form
4685 20411640 3422048 -13545174 -23663157 -24897320 -22991089 -22906165 -22675529 -16629429 -1974323
4676 -1974323 16021113 30559476 39541965 47445720 58104046 69573728 75266337 72363669
4668 72363669 64575220 57809771 52572950 44391609 29619524 11285716 -3940737 -12752609
4660 -12752609 -19771373 -30026060 -42026749 -48251441 -44598935 -34789585 -26644047 -22460324 -15607884
4651 -15607884 127634 22618455 41597636 49715314 51714559 56849524 68439466 77138149
4643 77138149 72112948 54398855 36743366 29408748 28281313 20720018 1047296 -20786142
4635 -20786142 -29169953 -21327250 -10266258 -10285286 -19435348 -22315543 -7930697 15655830 30490725
4626 30490725 27666132 19159765 22741093 41331006 59073916 59327150 44410761 33677215
$$ packed form
4685B0411640j6989592j6967222j0117983j234163J906231Q4924K30636O046100J4655106
4676a974323J7995436J4538363Q982489P903755J0658326J1469682N692609k902668
4668G2363669p788449o765449n236821q181341j4772085j8333808j5226453q811872
4660a2752609p018764j0254687j2000689o224692L652506R809350Q145538M183723O852440
4651a5607884J5735518K2490821J8979181Q117678J999245N134965J1589942Q698683
4643G7138149n025201j7714093j7655489p334618j127435p561295j9672722k1833438
4635b0786142q383811P842703J1060992j9028r150062k880195J4384846K3586527J4834895
4626C0490725k824593q506367L581328J8589913J7742910K53234j4916389j0733546
$$ plain form
4618 33677215 40885890 58227984 64904855 52256112 32890513 26888957 38162322 49299631
4610 49299631 42922614 20652660 2608282 3861299 16816418 20887254 6705118 -12970388
4602 -12970388 -18104057 -4360992 12224502 14105542 1847201 -6339291 3551473 24739976
4594 24739976 38952597 35619150 25041481 25045042 39977025 55794047 57255806 43738018
4586 43738018 30223318 28767640 35283545 34814789 19274048 -2579477 -15744310 -15380871 -10534152
4577 -10534152 -12263805 -19859416 -22520786 -10840868 11565818 33480080 48123845 59787031
4569 59787031 76740054 99453312 120145759 130544252 130892065 127578048 125439052 122484239
4561 122484239 113047205 96683089 78385389 64059468 53868175 44162701 32804876 23031806
$$ packed form
4618C3677215P208675J7342094O676871j2648743j9365599o001556J1273365J1137309
4610D9299631o377017k2269954j8044378J253017J2955119M070836j4182136j9675506
4602a2970388n133669J3743065J6585494J881040j2258341q186492R890764K1188503
4594B4739976J4212621l333447j0577669L561J4931983J5817022J461759j3517788
4586D3738018j3514700j455678O515905m68756j5540741k1853525j3164833L63439M846719
4577a0534152j729653p595611k661370J1679918K2406686K1914262J4643765J1663186
4569E9787031J6953023K2713258K0692447J0398493L47813l314017k138996k954813
4561A22484239r437034j6364116j8297700j4325921j0191293r705474j1357825r773070
$$ plain form
4553 23031806 18132198 18050669 17858165 14748291 10779372 9273356 10959084 11237620 6229744
4544 6229744 -1752770 -7154730 -6782232 -4750982 -6624296 -13064695 -18463351 -16534865 -9392571
4535 -9392571 -4986486 -8442639 -15756103 -18350759 -12920817 -6165507 -6432350 -15003924 -22193852
4526 -22193852 -20012403 -10044803 -3107018 -6830289 -17159397 -22368145 -18197277 -12080393 -15914795
4517 -15914795 -32346773 -50886339 -59086210 -57235250 -56043066 -64570753 -79225908 -86042049
4509 -86042049 -76397102 -57761876 -45177497 -45093064 -48668350 -43159415 -27776378 -15761604 -20181000
4500 -20181000 -40109403 -60869692 -70451089 -72844172 -81644304 -104544092 -130641889 -144088250
4492 -144088250 -138894070 -126818010 -122197940 -127102445 -128310977 -114026569 -88347518 -67982336
$$ packed form
4553B3031806m899608q1529j92504l109874l968919j506016J685728K78536n007876
4544F229744p982514n401960L72498K031250j873314o440399n398656J928486P142294
4535i392571M406085l456153p313464k594656N429942O755310k66843q571574p189928
4526b2193852K181449R967600O937785l723271j0329108n208748M170868O116884l834402
4517a5914795j6431978j8539566q199871J850960J192184q527687j4655155o816141
4509h6042049R644947J8635226J2584379Q4433l575286N508935J5383037J2014774m419396
4500b0181000j9928403k0760289r581397k393083q800132k2899788k6097797j3446361
4492a44088250N194180J2076060M620070m904505j208532J4284408K5679051K0365182
$$ plain form
4484 -67982336 -63591521 -68511948 -67363355 -53130915 -36162694 -29966817 -37455473 -45038682 -39040345
4475 -39040345 -21063515 -6393139 -5225859 -13413727 -16144383 -7670862 2555963 326144
4467 326144 -16485806 -36020190 -44914954 -43413976 -43787141 -53621164 -66656216 -68845571 -55097090
4458 -55097090 -34536491 -20026374 -13858817 -6102001 10921445 32503971 46109468 44493030
4450 44493030 34271472 26955214 25561274 20846204 4491845 -19733980 -39130770 -46511245
4442 -46511245 -47818192 -53763779 -66384056 -76248411 -73797454 -61556199 -52097549 -52193487 -55899119
4433 -55899119 -51121169 -34463974 -16966732 -9761018 -11146897 -9179148 4479157 22325252
4425 22325252 29795780 20612300 4354266 -6062517 -10253566 -21905625 -51506108 -93027574
$$ packed form
4484f7982336M390815m920427J148593J4232440J6968221O195877p488656p583209N998337
4475c9040345J7976830J4670376J167280q187868k730656Q473521J0226825k229819
4467C26144j6811950j9534384q894764J500978l73165r834023j3035052k189355J3748481
4458e5097090K0560599J4510117O167557P756816J7023446K1582526J3605497j616438
4450D4493030j0221558p316258j393940m715070j6354359k4225825j9396790p380475
4442d6511245j306947n945587j2620277r864355K450957J2241255R458650r5938l705632
4433e5899119M777950J6657195J7497242P205714j385879J967749J3658305J7846095
4425B2325252P470528r183480j6258034j0416783m191049j1652059k9600483m1521466
$$ plain form
4417 -93027574 -129715076 -150857462 -164113916 -182433594 -207785208 -225890054 -222184992 -197772912
4409 -197772912 -169236626 -149427106 -133709828 -108228237 -68210775 -26454638 51346 7679499
4401 7679499 9220880 17845998 31744830 37694299 27007195 8395030 -2589352 983791
4393 983791 9926368 11723052 5561031 2700385 12225933 29898139 43762940 46952594 45368448
4384 45368448 48383816 58158860 67177656 68194546 63601447 60714825 63429451 67316815 66016771
4375 66016771 59504704 52007572 46586489 39427638 25514530 4795128 -15192562 -31210213
4367 -31210213 -47163588 -68208485 -92506912 -110420226 -115682503 -113032605 -113374953 -119672371
4359 -119672371 -122239016 -110519703 -87674749 -69685889 -67871515 -75254243 -74155420 -57720355
$$ packed form
4417i3027574l6687502k1142386j3256454j8319678k5351614j8104846L705062K4412080
4409a97772912K8536286J9809520J5717278K5481591M0017462M1756137K6505984P628153
4401G679499J541381Q625118J3898832N949469j0687104j8612165j0984382L573143
4393I83791Q942577J796684o162021k860646R525548J7672206J3864801L189654j584146
4384D5368448L015368R775044R018796J016890m593099k886622K714626L887364j300044
4375F6016771o512067p497132n421083p158851j3913108k0719402j9987690j6017651
4367c1210213j5953375k1044897k4298427j7913314n262277K649898l42348o297418
4359a19672371k566645J1719313K2844954J7988860J814374p382728J098823J6435065
$$ plain form
4351 -57720355 -40495599 -40455798 -58829821 -74701833 -68684978 -45970681 -30881432 -38718998
4343 -38718998 -55780555 -55256715 -28297502 2838249 10061864 -9366360 -27407892 -18525052
4335 -18525052 9599737 24954067 7218807 -25970885 -38908553 -18098451 10453737 12644111
4327 12644111 -15121669 -40586965 -32762386 1034882 22403435 6386191 -29617544 -45849872
4319 -45849872 -25660087 4867997 7590794 -22681120 -51257716 -44141851 -5635720 25300143
4311 25300143 21239822 -3669097 -9904341 19605494 59998505 72639258 48781603 18824756
4303 18824756 16833013 41096375 57229615 39670609 822059 -23389596 -14018996 10064901
4295 10064901 15961358 -5496342 -30185446 -29655647 -3813627 19315355 16931880 -4103804
$$ packed form
4351e7720355J7224756L9801j8374023j5872012O016855K2714297J5089249p837566
4343c8718998j7061557N23840K6959213L1135751P223615j9428224j8041532Q882840
4335a8525052K8124789J5354330j7735260l3189692j2937668K0810102K8552188K190374
4327A2644111k7765780k5465296P824579L3797268K1368553j6017244l6003735j6232328
4319d5849872K0189785L0528084K722797l0271914k8576596P115865L8506131L0935863
4311B5300143m060321k4908919o235244K9509835M0393011J2640753k3857655k9956847
4303A8824756j991743K4263362J6133240j7559006l8848550k4211655R370600K4083897
4295A0064901N896457k1457700k4689104N29799K5842020K3128982k383475k1035684
$$ plain form
4287 -4103804 -16837314 -6499763 14401165 21044138 6127184 -13851417 -18110403 -5055097
4279 -5055097 8161235 6147056 -6674226 -14406688 -7715382 6044570 12905306 8326163 937552
4270 937552 -189972 4921435 8761171 5997890 -774049 -6460350 -9517144 -12395236 -16956749
4261 -16956749 -21269402 -23150883 -24210065 -27318259 -31597653 -31705691 -25263145 -16241249 -12471925
4252 -12471925 -15017201 -16959773 -10119524 2618574 10100685 4374067 -9473535 -17071552 -13176561
4243 -13176561 -7342601 -13800594 -34098647 -53092932 -55692121 -44114592 -34637476 -39798027
4235 -39798027 -51802224 -51610549 -31101315 -2209320 14658514 14316824 11907501 25268526
4227 25268526 53449614 77149598 79933339 67181542 59074463 67426236 82641543 84490415
$$ packed form
4287d103804j2733510J0337551K0900928O642973j4916954j9978601m258986J3055306
4279e055097J3216332k014179j2821282p732462O691306J3759952O860736m579143p388611
4270I37552j127524N111407L839736k763281o771939n686301l056794k878092m561513
4261a6956749m312653j881481j059182l108194m279394j08038O442546R021896L769324
4252a2471925k545276j942572O840249J2738098P482111n726618j3847602p598017L894991
4243a3176561N833960o457993k0298053j8994285k599189J1577529R477116n160551
4235c9798027j2004197J91675K0509234K8891995J6867834l41690k409323J3361025
4227B5268526K8181088K3699984K783741j2751797q107079Q351773J5215307J848872
$$ plain form
4219 84490415 65898523 39961199 26238085 28437987 31747322 20273989 -4421605 -25013071
4211 -25013071 -27225687 -14779344 -4014836 -4926547 -10720372 -6476288 14247276 42324839
4203 42324839 62365947 67982188 67360505 72457603 85202526 96639957 94905882 79152243
4195 79152243 59176152 46575245 44137771 43626362 35956591 21397904 9407789 10399939
4187 10399939 24291722 40061834 46468615 42597292 39032093 46032045 61057265 70330813
4179 70330813 63645993 45300659 31628721 33466373 44161809 47533026 35318095 18982052
4171 18982052 16157080 31849381 51001389 54170263 39350011 23706602 25005799 39416872
4163 39416872 46635747 32278952 6074042 -9571196 -2386280 14511863 18826464 4474904
$$ packed form
4219H4490415j8591892k5937324j3723114K199902L309335j1473333k4695594k0591466
4211b5013071k212616J2446343J0764508r11711n793825M244084K0723564K8077563
4203D2324839K0041108N616241o21683N097098J2744923J1437431j734075j5753639
4195G9152243j9976091j2600907k437474n11409p669771j4558687j1990115R92150
4187A0399939J3891783J5770112O406781l871323l565199O999952J5025220R273548
4179G0330813o684820j8345334j3671938J837652J0695436L371217j2214931j6336043
4171A8982052k824972J5692301J9152008L168874j4820252j5643409J299197J4411073
4163C9416872P218875j4356795k6204910j5645238P184916J6898143M314601j4351560
$$ plain form
4155 4474904 -11446818 -8257231 13036065 30705397 25750649 3843596 -12606861 -10408562
4147 -10408562 349785 -1113533 -21538950 -43736240 -46429248 -27428408 -4358190 6328400
4139 6328400 8023357 17933007 45581625 79987350 101687581 103687711 96202268 93191908 94943120
4130 94943120 89625584 68381683 37424927 10648508 -4789218 -14598685 -26999357 -40898888
4122 -40898888 -48310908 -44389136 -34459956 -26954498 -23996228 -20003374 -10931334 -3131597 -4039873
4113 -4039873 -13129889 -21254776 -20768607 -16388187 -19151040 -31428193 -41599301 -37503533 -22335925
4104 -22335925 -12818327 -20229148 -36549947 -42472022 -31587354 -19792917 -26970585 -51990273
4096 -51990273 -71699725 -66069157 -41223824 -23766466 -28448305 -40025508 -30555364 6775555
$$ packed form
4155D474904j5921722L189587K1293296J7669332m954748k1907053j6450457K198299
4147a0408562J0758347j463318k0425417k2197290k693008J9000840K3070218J0686590
4139F328400J694957R909650K7648618L4405725K1700231K000130p485443l010360J751212
4130I4943120n317536k1243901l0956756k6776419j5437726r809467j2400672j3899531
4122d0898888p412020L921772R929180P505458K958270L992854R072040P799737r08276
4113d039873r090016q124887M86169M380420k762853j2277153j0171108M095768J5167608
4104b2335925R517598p410821j6320799n922075J0884668J1794437p177668k5019688
4096e1990273j9709452N630568K4845333J7457358m681839j1577203R470144L7330919
$$ plain form
4088 6775555 45818995 56551102 37364270 17684320 22294547 41893752 43051003 8523769
4080 8523769 -40030258 -63964560 -50233622 -24416315 -20136513 -37613935 -43453218 -9722381
4072 -9722381 51473912 98931676 107495667 93814496 94047234 119555402 142235331 126535902
4064 126535902 71578498 13201354 -14951626 -18368184 -30637971 -71518273 -122393050 -146994035
4056 -146994035 -131852755 -102559643 -92331462 -106624659 -118699442 -103398361 -67495117 -41009177
4048 -41009177 -43146287 -60759613 -64588692 -43140077 -13181822 1338550 -2340012 -4269216
4040 -4269216 13579629 45800827 71585376 77554000 71551670 70086699 78496200 86778361 83527427
4031 83527427 70025371 58465453 57802342 65445564 73626188 80734603 90690472 105899278
$$ packed form
4088F775555L9043440J0732107j9186832j9679950M610227J9599205J157251l4527234
4080H523769m8554027k3934302J3730938K5817307M279802j7477422n839283L3730837
4072i722381O1196293M7457764Q563991j3681171K32738K5508168K2679929j5699429
4064A26535902n4957404n8377144k8152980l416558j2269787m0880302n0874777k4600985
4056a46994035J5141280K9293112J0228181j4293197j2074783J5301081L5903244K6485940
4048d1009177k137110j7613326l829079K1448615K9958255J4520372l678562j929204
4040d269216J7848845L2221198K5784549N968624o002330j464971Q409501Q282161l250934
4031H3527427j3502056j1559918o63111P643222Q180624P108415R955869J5208806
$$ plain form
4023 105899278 122127889 133145011 137579806 138078225 135378203 123330782 97433653 62158830
4015 62158830 28918794 3986681 -18892785 -48366671 -81520355 -103309222 -102312866 -85237722
4007 -85237722 -71441552 -70865059 -73148593 -60143213 -30597202 -5263262 -5076533 -26178282
3999 -26178282 -43715244 -39307052 -23100606 -21234918 -44220019 -71973152 -75280308 -50490324
3991 -50490324 -25041072 -26509108 -51675751 -70053592 -61136058 -39379361 -38424105 -70893583
3983 -70893583 -112757304 -127601088 -108965237 -84340364 -82021652 -95828056 -91712135 -47951238
3975 -47951238 18718246 69612199 86759943 90751625 112021380 152981785 183128104 172344061
3967 172344061 127569580 84562858 66912828 63082975 43196620 -2105623 -47667410 -61810716
$$ packed form
4023A05899278J6228611J1017122M434795M98419k700022j2047421k5897129l5274823
4015F2158830l3240036k4932113k2879466k9473886l3153684k1788867R96356J7075144
4007h5237722J3796170N76493k283534J3005380K9546011K5333940J86729k1101749
3999b6178282j7536962M408192J6206446J865688k2985101k7753133l307156K4789984
3991e0490324K5449252j468036k5166643j8377841Q917534K1756697R55256l2469478
3983g0893583m1863721j4843784J8635851K4624873K318712j3806404M115921M3760897
3975d7951238O6669484N0893953J7147744L991682K1269755M0960405L0146319j0784043
3967A72344061m4774481m3006722j7650030l829853j9886355m5302243m5561787j4143306
$$ plain form
3959 -61810716 -41053877 -13354114 -4355693 -8900428 -325753 35775375 82012336 108599309
3951 108599309 106302823 94929301 98406624 115809196 123202259 103877189 68188123 41056856
3943 41056856 32698389 27485731 4403813 -37641425 -78351207 -100664709 -109709822 -125779068
3935 -125779068 -157004378 -188750138 -199938877 -187898149 -169453863 -160054531 -155309304 -136714245
3927 -136714245 -97578206 -52473355 -23262899 -15399423 -13404772 -3379556 9592917 6129145
3919 6129145 -22873090 -63184278 -92014953 -101365044 -105366479 -118886606 -138013022 -141578748
3911 -141578748 -116123777 -72544344 -35187072 -15341498 -1029204 24993446 61532194 87501259
3903 87501259 84531446 57179003 29135084 15055822 6557976 -14851535 -54250945 -93687936
$$ packed form
3959f1810716K0756839K7699763Q998421m544735Q574675L6101128M6236961K6586973
3951A08599309k296486j1373522L477323J7402572P393063j9325070l5689066k7131267
3943D1056856q358467n212658k3081918m2045238m0709782k2313502r045113j6069246
3935a25779068l1225310l1745760j1188739J2040728J8444286R399332M745227J8595059
3927a36714245L9136039M5104851K9210456P863476J994651J0025216J2972473l463772
3919F129145k9002235m0311188k8830675r350091m001435j3520127j9126416l565726
3911a41578748K5454971M3579433L7357272J9845574J4312294K6022650L6538748K5969065
3903H7501259k969813k7352443k8043919j4079262q497846k1409511l9399410l9436991
$$ plain form
3895 -93687936 -110444050 -101439704 -86289679 -82712512 -87574795 -81912273 -54102486 -15359985
3887 -15359985 12365709 19473346 17971558 27033754 50005398 71113409 74165569 60915007
3879 60915007 48352233 49830788 60343646 62663909 46944121 22115583 3877583 -794501
3871 -794501 -1808051 -12302610 -33631071 -53371252 -58171627 -48154952 -34171663 -26555387
3863 -26555387 -24124507 -16809778 1516293 24941162 41656082 43893880 35428743 25919995
3855 25919995 20104783 13512539 -842002 -24517512 -49627693 -66043690 -69713070 -65852478
3847 -65852478 -61898689 -59290277 -53045149 -37295493 -13711813 9322806 23157670 27064847 27051817
3838 27051817 29040877 31984739 29494611 17274844 -716933 -15602810 -22058081 -22955621 -24688918
$$ packed form
3895i3687936j6756114R004346J5150025L577167m862283N662522K7809787L8742501
3887a5359985K7725694P107637j501788R062196K2971644K1108011L052160j3250562
3879F0915007j2562774J478555J0512858K320263j5719788k4828538j8238000m672084
3871g94501j013550j0494559k1328461j9740181m800375J0016675J3983289P616276
3863b6555387K430880P314729J8326071K3424869J6714920K237798q465137r508748
3855B5919995n815212o592244j4354541k3675510k5110181j6415997l669380L860592
3847f5852478L953789K608412O245128J5749656K3583680K3034619J3834864L907177j3030
3838B7051817J989060K943862k490128j2219767j7991777j4885877o455271q97540j733297
$$ plain form
3829 -24688918 -31675185 -39604008 -42347404 -39111379 -35154657 -37821426 -47683045 -59829718 -68269059
3820 -68269059 -72331391 -75449278 -81149767 -87670276 -89902227 -83932634 -71021372 -55216909
3812 -55216909 -40563439 -27032681 -13537794 1519012 16531120 29167009 36645342 37604531
3804 37604531 34921136 32651264 33753354 36752964 37328977 33321145 28166884 28567391 36130958
3795 36130958 45421237 47576700 40182868 29986681 26575422 30415267 31819125 21550899
3787 21550899 2557435 -11201343 -9611568 2195472 8738951 2151345 -8468895 -6453954
3779 -6453954 11754923 31526161 34779807 19552086 4365973 6403920 21905698 29522975
3771 29522975 15877278 -8017702 -17223978 -1433521 23421850 32386210 20352719 7945386
$$ packed form
3829b4688918o986267p928823k743396L236025L956722k666769r861619j2146673q439341
3820f8269059m062332l117887n700489o520509k231951N969593J2911262J5804463
3812e5216909J4653470J3530758J3494887J5056806J5012108J2635889P478333R59189
3804C7604531k683395k269872J102090K999610N76013m007832n154261M00507P563567
3795C6130958R290279K155463p393832j0196187l411259L839845J403858j0268226
3787B1550899j8993464j3758778J589775J1807040O543479o587606j0620240K014941
3779f453954J8208877J9771238L253646j5227721j5186113K037947J5501778P617277
3771B9522975j3645697k3894980r206276J5790457K4855371Q964360j2033491j2407333
$$ plain form
3763 7945386 17114100 45586985 66668161 59865462 34407747 18748716 28250428 48033874
3755 48033874 50603473 28050858 3263483 3707509 30257636 56035734 56511517 37438727
3747 37438727 26644258 41031420 65705807 69935367 43134488 5255155 -14272822 -10920973
3739 -10920973 -7508952 -26869351 -62821883 -86965503 -80480380 -54362247 -35844915 -37641656
3731 -37641656 -43798253 -30699998 4716748 39651868 51855348 43572969 36897244 47540499
3723 47540499 66558412 72766849 57229189 34254103 24144736 30140689 36629898 28263078
3715 28263078 7210086 -10033442 -12167622 -7222650 -10460010 -26661316 -44877390 -52543511
3707 -52543511 -49133386 -45393073 -49666230 -57153809 -57575667 -48147934 -36693678 -31984888 -34105279
$$ packed form
3763G945386R168714K8472885K1081176o802699k5457715j5659031R501712J9783446
3755D8033874K569599k2552615k4787375M44026K6550127K5778098M75783j9072790
3747C7438727j0794469J4387162K4674387M229560k6800879l7879333j9527977L351849
3739a0920973L412021j9360399l5952532k4143620O485123K6118133J8517332j796741
3731c7641656o156597J3098255L5416746L4935120J2203480q282379o675725J0643255
3723D7540499J9017913O208437j5537660k2975086j0109367N995953O489209q366820
3715B8263078k1052992j7243528k134180M944972l237360j6201306j8216074p666121
3707e2543511L410125L740313m273157p487579m21858R427733J1454256M708790k120391
$$ plain form
3698 -34105279 -35820961 -32529981 -29352258 -33854735 -45812266 -56910602 -61210161 -60801554 -62893308
3689 -62893308 -68908411 -70648168 -60731138 -42042911 -25167241 -16018945 -9665482 3277275
3681 3277275 22813784 38006961 39648351 30123016 22440641 24854801 32060200 30847773 19081341
3672 19081341 8596556 13004995 31505521 49689313 55618881 52922201 56279769 72152815
3664 72152815 89270653 91498509 75206619 53906447 42844092 41486957 35367460 14507265
3656 14507265 -13231015 -30109620 -27727701 -16984240 -13432367 -20124411 -24248181 -13846623
3648 -13846623 7925681 25193522 27084430 20175058 18740337 28410408 39338612 39137697
3640 39137697 27063363 15363589 14177314 20377705 22180279 12869873 -1044055 -9051553 -8417111
$$ packed form
3698c4105279j715682L290980L177723m502477j1957531j1098336m299559M08607k091754
3689f2893308o015103j739757R917030J8688227J6875670R148296O353463J2942757
3681C277275J9536509J5193177J641390r525335p682375K414160P205399j212427j1766432
3672A9081341j0484785M408439J8500526J8183792N929568k696680L357568J5873046
3664G2152815J7117838K227856j6291890k1300172j1062355j357135o119497k0860195
3656A4507265k7738280j6878605K381919J0743461L551873o692044m123770J0401558
3648a3846623K1772304J7267841J890908o909372j434721R670071J0928204k00915
3640C9137697j2074334j1699774j186275O200391J802574r310406j3913928q007498O34442
$$ plain form
3631 -8417111 -7882460 -15532705 -29401255 -39289502 -39917822 -35563865 -34207368 -36747872 -36426519
3622 -36426519 -27774444 -14365841 -4642798 -2113540 -2470940 800747 5876044 4613510 -7062701
3613 -7062701 -23848123 -35384739 -39622523 -43644701 -53842884 -66374082 -69835441 -58435655
3605 -58435655 -40188245 -27487919 -23196064 -17467380 -649881 23473020 39549248 37859210
3597 37859210 25825152 19967429 26210983 32835196 24863358 2752778 -15962727 -16489631
3589 -16489631 -3105595 4728896 -4636329 -21200999 -25128077 -10675640 5597821 3375982
3581 3375982 -18553348 -40787912 -45055316 -35531150 -34427293 -55115479 -85285326 -100815018
3573 -100815018 -92683352 -76567189 -75726600 -93277375 -108229900 -99920247 -72692007 -50846278
$$ packed form
3631h417111N34651p650245j3868550r888247o28320M353957J356497k540504L21353
3622c6426519Q652075J3408603R723043K529258l57400L271687N075297j262534j1676211
3613g062701j6785422j1536616m237784m022178j0198183j2531198l461359J1399786
3605e8435655J8247410J2700326M291855N728684J6817499K4122901J6076228j690038
3597C7859210j2034058n857723O243554O624213p971838k2110580j8715505n26904
3589a6489631J3384036P834491r365225j6564670l927078J4452437J6273461k221839
3581C375982k1929330k2234564m267404R524166J103857k0688186l0169847j5529692
3573a00815018Q131666J6116163Q40589j7550775j4952525Q309653K7228240K1845729
$$ plain form
3565 -50846278 -50941446 -63543548 -63406426 -39594391 -7782716 7227109 -275665 -10856194 -2764095
3556 -2764095 22209222 40468032 32887816 6361705 -14519633 -15509310 -9313922 -19127769
3548 -19127769 -51666931 -88442255 -105705828 -100123920 -91052332 -97320219 -114868298 -121498338
3540 -121498338 -102798792 -68764071 -43102553 -37419148 -39045119 -28247495 -943451 25086989
3532 25086989 30395204 15667247 488726 764471 10573543 12118407 -5624366 -31872797
3524 -31872797 -47054260 -44640701 -37123230 -41716042 -59782300 -76202287 -76379034 -62994847
3516 -62994847 -52066721 -54435937 -64023950 -64836951 -49611085 -28637251 -16675514 -17548108 -20244015
3507 -20244015 -12690330 4228196 17487084 16771108 6321892 -853093 2929028 10855638 11507021
$$ packed form
3565e0846278r5168j2602102J37122K3812035L1811675J5009825p502774j0580529Q092099
3556b764095K4973317J8258810p580216k6526111k0881338r89677O195388r813847
3548a9127769l2539162l6775324j7263573N581908R071588o267887j7548079o630040
3540a21498338J8699546L4034721K5661518N683405j625971J0797624K7304044K6030440
3532B5086989N308215j4727957j5178521K75745R809072J544864j7742773k6248431
3524c1872797j5181463K413559P517471m592812j8066258j6419987j76747J3384187
3516f2994847J0928126k369216r588013q13001J5225866K0973834J1961737q72594k695907
3507b0244015P553685J6918526J3258888p15976j0449216p174985L782121P926610O51383
$$ plain form
3498 11507021 2405048 -7156018 -6551208 4641460 16292544 20055233 18108101 20731294 32154934
3489 32154934 46661741 54321409 52452703 48087152 49173117 55831093 60264801 57337617 49999100
3480 49999100 46575582 50887297 58158425 60540052 57164069 54301383 56953509 63135372 65658631
3471 65658631 60883112 52634440 48001248 47773332 47064398 40489757 30399552 23345935 22997667
3462 22997667 25844395 24623610 18569880 13753306 15120168 21553306 25344121 23051185 18815769
3453 18815769 20651207 29916799 39706536 43568089 42546809 45096758 55571786 68375186 73991761
3444 73991761 69189933 60818580 57847247 59293558 55008138 39168270 16524556 -495698
3436 -495698 -6193559 -7416194 -14501591 -28169047 -37072994 -30840251 -12786847 2884695 7037310
$$ packed form
3498A1507021r101973r561066O04810J1192668J1651084L762689j947132K623193J1423640
3489C2154934J4506807P659668j868706m365551J085965O657976M433708k927184p338517
3480D9999100l423518M311715P271128K381627l375983k862686K652126O181863K523259
3471F5658631m775519q248672m633192k27916p08934o574641j0090205p053617l48268
3462B2997667K846728j220785o053730m816574J366862O433138L790815k292936m235416
3453A8815769J835438R265592R789737L861553j021280K549949J0475028J2803400N616575
3444G3991761m801828q371353k971333J446311m285420j5839868k2643714j7020254
3436d95698n697861j222635p085397j3667456q903947O232743J8053404J5671542M152615
$$ plain form
3427 7037310 5896002 12689709 30698817 48460914 51157885 38676169 25858784 25755744 33851063
3418 33851063 34361694 18614289 -2511860 -10716048 -1658900 10299238 8054134 -7867214
3410 -7867214 -19209451 -12437206 6111694 15334074 5077732 -11545243 -13311792 4450771
3402 4450771 24502403 27291271 14201277 6258513 19436457 44635820 57574812 46412781
3394 46412781 24861316 16932521 27729191 37349580 24752968 -7294055 -33830539 -35978401
3386 -35978401 -21399283 -16135908 -32281042 -54238666 -56872554 -34935579 -10737140 -8803109
3378 -8803109 -29455105 -47103872 -42897901 -26038134 -23232308 -47310678 -81337336 -96783995
3370 -96783995 -86274131 -69927400 -72224000 -91255828 -101754857 -84675353 -48954997 -23325887
$$ packed form
3427G037310j141308O793707J8009108J7762097K696971j2481716j2817385j03040Q095319
3418C3851063N10631j5747405k1126149q204188R057148J1958138k245104j5921348
3410g867214j1342237O772245J8548900R222380j0256342j6622975j766549J7762563
3402D450771K0051632K788868j3089994p942764J3177944K5199363J2938992j1162031
3394D6412781k1551465p928795J0796670R620389j2596612l2047023k6536484k147862
3386c5978401J4579118N263375j6145134k1957624k633888K1936975K4198439J934031
3378h803109k0651996j7648767M205971J6859767K805826k4078370l4026658j5446659
3370i6783995J0509864J6346731k296600j9031828j0499029J7079504L5720356K5629110
$$ plain form
3362 -23325887 -22724058 -32626914 -27508979 -1338580 25268245 28659682 9995865 -6192681
3354 -6192681 169502 21818140 34450338 24966489 7546698 6003369 26043153 48788967
3346 48788967 52272756 36840711 22862814 26677475 41837839 46920295 31840117 8714665
3338 8714665 -843026 7788394 20189282 19052406 5591881 -3830647 2508704 17868801 24934066
3329 24934066 15490146 -751351 -8715861 -6324409 -4742883 -14266675 -31411849 -42613683
3321 -42613683 -39911228 -29334691 -21667549 -19752647 -16516270 -4085825 14735196 29228044
3313 29228044 33563078 31549487 30889567 32483537 29915284 18636253 2665065 -9454611 -14109882
3304 -14109882 -15626179 -19677327 -24239793 -22426979 -10317348 6043349 17500665 22071400
$$ packed form
3362b3325887O01829r902856N117935K6170399K6606825L391437j8663817j6188546
3354f192681O362183K1648638J2632198r483849j7419791j543329K0039784K2745814
3346D8788967L483789j5432045j3977897L814661J5160364N082456j5080178k3125452
3338H714665r557691Q631420J2400888j136876j3460525r422528O339351J5360097P065265
3329B4934066r443920j6241497p964510K391452J581526r523792j7145174j1201834
3321d2613683K702455J0576537P667142J914902L236377J2430445J8821021J4492848
3313B9228044M335034k013591o59920J593970k568253j1279031j5971188j2119676m655271
3304a4109882j516297m051148m562466J812814J2109631J6360697J1457316M570735
$$ plain form
3296 22071400 26806387 37202104 49876501 55244625 48636892 37420790 32600263 35804994
3288 35804994 38182639 31029402 17746884 10802920 17074485 28442719 31286305 22626270 13080562
3279 13080562 14439523 24319496 29799588 21638656 6534904 -126371 8371101 21092910 24586810
3270 24586810 17489344 13721249 24491996 45081313 59159621 57228898 47411171 45110475
3262 45110475 54062784 62017159 55260906 35730250 19479490 17783765 25035461 25864124 13938556
3253 13938556 158763 -1580714 9439262 18431100 13125582 -2561552 -13725989 -12745993
3245 -12745993 -8377910 -14472614 -32275253 -48049332 -48411564 -36090605 -25668280 -25028767 -25984436
3236 -25984436 -14338217 11410204 37346720 48481233 46908418 47179660 57548537 69125856
$$ packed form
3296B2071400M734987J0395717J2674397N368124o607733j1216102m820527L204731
3288C5804994K377645p153237j3282518o943964O271565J1368234K843586q660035r545708
3279A3080562J358961R879973N480092q160932j5103752o661275Q497472J2721809L493900
3270B4586810p097466l768095J0770747K0589317J4078308j930723r817727k300696
3262D5110475Q952309P954375o756253j9530656j6250760j695725P251696Q28663j1925568
3253A3938556j3779793j739477J1019976Q991838n305518j5687134j1164437R79996
3245a2745993M368083o094704j7802639j5774079l62232J2320959J0422325O39513r55669
3236b5984436J1646219K5748421K5936516J1134513j572815K71242J0368877J1577319
$$ plain form
3228 69125856 65640363 44264960 19252881 6883504 6178579 961754 -19080308 -44281515
3220 -44281515 -56035679 -47495867 -33863520 -33173544 -45938959 -53960223 -42534545 -19443452
3212 -19443452 -6418805 -13722810 -28318596 -28092743 -8787255 10024630 8415905 -10745317
3204 -10745317 -24377973 -16753586 1532563 5737345 -15090552 -42770520 -52837590 -41043289
3196 -41043289 -29380042 -38661695 -64101019 -78818118 -65379567 -35798192 -17495108 -22022799
3188 -22022799 -31884192 -21505165 11202108 41561537 46181135 28427791 14410137 22182483
3180 22182483 41059141 44412392 21628822 -9381477 -21509806 -9610448 4770760 -599193
3172 -599193 -22761086 -38548189 -29872550 -6556139 6643338 -2710129 -20597962 -24077334
$$ packed form
3228F9125856l485493k1375403k5012079j2369377p04925n216825k0042062k5201207
3220d4281515j1754164Q539812J3632347O89976j2765415q021264J1425678K3091093
3212a9443452J3024647p304005j4595786K25853J9305488J8811885j608725j9161222
3204a0745317j3632656P624387J8286149M204782k0827897k7679968j0067070J1794301
3196d1043289J1663247r281653k5439324j4717099J3438551K9581375J8303084m527691
3188b2022799r861393J0379027L2707273L0359429M619598j7753344j4017654P772346
3180B2182483J8876658L353251k2783570l1010299j2128329J1899358J4381208n369953
3172e99193k2161893j5787103Q675639K3316411J3199477r353467j7887833l479372
$$ plain form
3164 -24077334 -6687129 13582988 16927361 3710190 -6370895 2579281 25308675 41103037
3156 41103037 38350847 25640941 21230291 31030759 42762954 40233208 21924453 1993422
3148 1993422 -5764544 -2461604 -49016 -7371093 -19912751 -24719979 -15561818 909309 13107476
3139 13107476 16697128 17187370 22651141 33546909 42664610 43252231 35418020 25987099 20328280
3130 20328280 18323985 15734423 9460254 1212324 -4774797 -5991554 -3303754 -906251 -957688
3121 -957688 -4115329 -8292181 -11080770 -12493863 -14981735 -20674026 -29436183 -37845299 -42685559
3112 -42685559 -43235271 -42273927 -42961672 -45792032 -47637876 -45037433 -39792902 -35547602 -35249060
3103 -35249060 -37997140 -39024748 -34771633 -26964022 -19288890 -13161932 -5633496 6441474 23579859
$$ packed form
3164b4077334J7390205K0270117L344373j3217171j0081085Q950176K2729394J5794362
3156D1103037k752190j2709906m410650R800468J1732195k529746j8308755j9931031
3148A993422p757966L302940K412588p322077j2541658m807228R158161J6471127J2198167
3139A3107476L589652M90242N463771J0895768R117701N87621p834211r430921n658819
3130B0328280k004295k589562o274169q247930n987121j216757K687800K397503n1437
3121i57688l157641m176852k788589j413093k487872n692291q762157q409116m840260
3112d2685559n49712R61344o87745k830360j845844K600443N244531M245300K98542
3103c5249060k748080j027608M253115P807611P675132O126958P528436J2074970J7138385
$$ plain form
3094 23579859 42453470 57949437 68120007 74070157 77497796 78451418 73914454 62036054
3086 62036054 42893641 20599593 -1176169 -18983433 -32712920 -43745386 -51645291 -55141267
3078 -55141267 -50812621 -37885994 -19320049 -1211030 11388098 18948525 26113846 34103889
3070 34103889 38425978 32467975 15107042 -6176901 -21689641 -28915195 -34437516 -45261329
3062 -45261329 -58340925 -62517307 -50485510 -26867962 -6586142 3184809 9496538 24895979
3054 24895979 51989119 78235256 88123726 82303812 75773555 82380513 97977408 105255709
3046 105255709 94228513 73994521 63415837 68210126 72547232 57111243 20725065 -17458652
3038 -17458652 -38767118 -44404880 -52273202 -72389141 -92658035 -89874109 -57486308 -12979530
$$ packed form
3094B3579859J8873611J5495967J0170570N950150L427639R53622m536964j1878400
3086F2036054j9142413k2294048k1775762j7807264j3729487j1032466p899905l495976
3078e5141267M328646J2926627J8565945J8109019J2599128P560427P165321P990043
3070C4103889M322089n958003j7360933k1283943j5512740p225554n522321j0823813
3062d5261329j3079596m176382J2031797K3617548K0281820R770951O311729J5399441
3054B4895979K7093140K6246137R888470n819914o530257O606958J5596895P278301
3046A05255709j1027196k0233992j0578684M794289M337106j5435989l6386178l8183717
3038a7458652k1308466n637762p868322k0115939k0268894K783926L2387801M4506778
$$ plain form
3030 -12979530 20899248 41045865 66594619 113371649 173494582 221371768 241414977 243274850
3022 243274850 249909821 269163824 285037896 278599456 251940256 226381194 218754106 220808049
3014 220808049 207312536 166355898 110677615 61938119 27280322 -7301534 -55641279 -109983179
3006 -109983179 -148347842 -160207103 -158966385 -167093950 -188536396 -202650579 -186841085 -142554833
2998 -142554833 -90804182 -46911924 -2445869 61545121 149036615 240119515 310026994 357268799
2990 357268799 400741223 452829811 500326857 516162324 489319118 438904167 390502793 349291706
2982 349291706 299192359 228662594 153637285 105417990 95550356 103126967 95602015 65725293
2974 65725293 37571133 37332960 60406148 75959796 64913987 42053563 40231876 71416211
$$ packed form
3030a2979530L3878778K0146617K5548754M6777030O0122933M7877186K0043209J859873
3022B43274850O634971J9254003J5874072o438440k6659200k5559062p627088K053943
3014B20808049j3495513m0956638n5678283m8739496l4657797l4581856m8339745n4341900
3006a09983179l8364663j1859261J240718q127565k1442446j4114183J5809494M4286252
2998a42554833N1750651M3892258M4466055O3990990Q7491494R1082900O9907479M7241805
2990C57268799M3472424N2088588M7497046J5835467k6843206n0414951m8401374m1211087
2982C49291706n0099347p0529765p5025309m8219295r867634P576611p524952k9876722
2974F5725293k8154160k38173K3073188J5553648j1045809k2860424j821687L1184335
$$ plain form
2966 71416211 111869423 129970953 122780771 119959446 147645234 194675206 223763399 213840782
2958 213840782 181901744 164539627 173546993 185206845 170433152 133667019 111103104 133021663
2950 133021663 189315494 242179528 269580642 288167064 330532768 404029899 478483077 518556006
2942 518556006 520230744 513501527 523019539 540190488 532897530 484798586 414405216 356099379
2934 356099379 321288309 290430841 237099535 160928851 87510728 37855547 5244516 -36275461
2926 -36275461 -101096210 -176677770 -240256958 -282685593 -317464834 -361244159 -412522811 -453981417
2918 -453981417 -470687193 -466023461 -453928387 -443082782 -428661468 -402432336 -364319729 -322797973
2910 -322797973 -287268287 -258686003 -233506432 -209668315 -187854907 -167122362 -144449431 -116590211
$$ packed form
2966G1416211M0453212J8101530p190182k821325K7685788M7029972K9088193r922617
2958B13840782l1939038j7362117R007366J1659852j4773693l6766133k2563915K1918559
2950A33021663N6293831N2864034K7401114J8586422M2365704P3497131P4453178M0072929
2942E18556006J674738o729217R518012J7170949p292958m8098944p0393370n8305837
2934C56099379l4811070l0857468n3331306p6170684p3418123m9655181l2611031m1519977
2926c6275461o4820749p5581560o3579188m2428635l4779241m3779325n1278652m1458606
2918d53981417j6705776M663732J2095074J0845605J4421314K6229132L8112607M1521756
2910c22797973L5529686K8582284K5179571K3838117K1813408K0732545K2672931K7859220
$$ plain form
2902 -116590211 -84779813 -50531270 -11314676 40505909 107404087 180080705 245046346 297626251
2894 297626251 346515576 400329953 453091980 485644976 485731484 462456355 438272321 422752108
2886 422752108 402482856 356512767 285827445 215473322 171163879 149563130 123162858 73478610
2878 73478610 15036265 -19337258 -15801772 3562502 4940299 -17450089 -32823099 -9609848
2870 -9609848 46407338 97847028 116282449 114960065 130844942 180714429 237298225 257475274
2862 257475274 231206831 191162749 174665842 180148026 170176099 116594944 36654156 -23865962
2854 -23865962 -39706086 -31917314 -40125367 -74625406 -103413423 -90152804 -36864045 15948520
2846 15948520 34100893 25544600 26927064 57900339 96719023 105220289 72747520 27886301
$$ packed form
2902a16590211L1810398L4248543L9216594N1820585O6898178P2676618O4965641N2579905
2894B97626251M8889325N3814377N2762027L2552996Q6508k3275129k4184034j5520213
2886D22752108k0269252m5970089p0685322p0354123m4309443k1600749k6400272m9684248
2878G3478610n8442345l4373523L535486J9364274J377797k2390388j5373010K3213251
2870i609848N6017186N1439690J8435421j322384J5884877M9869487N6583796K0177049
2862B57475274k6268443m0044082j6496907N482184r971927n3581155p9940788o0520118
2854b3865962j5840124P788772q208053l4500039k8788017J3260619N3288759N2812565
2846A5948520J8152373q556293J382464L0973275L8818684Q501266l2472769m4861219
$$ plain form
2838 27886301 6527378 12185915 16280803 -5954087 -44560306 -66894018 -54801110 -24332385
2830 -24332385 -6730327 -12678277 -23498175 -15499137 10657126 31218050 27828926 6997118
2822 6997118 -8894271 -7077879 1734783 -444198 -16306594 -31826268 -32748658 -21075626 -11450746
2813 -11450746 -12814755 -19118266 -19220218 -11513819 -4938996 -6491904 -12745300 -14177962 -8120519
2804 -8120519 -205402 3067685 4890951 13118040 30293170 47385319 55427996 54886147 56195007
2795 56195007 64226238 71250113 65030602 44445230 22671571 12468817 12733223 9253417
2787 9253417 -6597764 -25290491 -29368743 -12992947 9069215 18721043 13977239 11073853
2779 11073853 24876899 48807666 62429637 53287952 32426007 21676292 29446890 41082962
$$ packed form
2838B7886301k1358923N658537M094888k2234890l8606219k2333712J2092908L0468725
2830b4332385J7602058n947950j0819898P999038K6156263K0560924l389124k0831808
2822F997118j5891389J816392Q812662k178981j5862396j5519674r22390J1673032R624880
2813a1450746j364009o303511j01952P706399O574823j552908o253396j432662O057443
2804h120519P915117L273087J823266Q227089J7175130J7092149Q042677n41849J308860
2795E6195007Q031231P023875o219511k0585372k1773659j0202754K64406l479806
2787I253417j5851181j8692727m078252J6375796K2062162R651828m743804k903386
2779A1073853J3803046K3930767J3621971r141685k0861945j0749715P770598J1636072
$$ plain form
2771 41082962 37305845 17349355 382539 4160961 25335974 42327056 39841380 25885201
2763 25885201 20520143 32676978 49473446 50920091 31963772 8591866 -685010 5703161
2755 5703161 11932384 3714124 -14693214 -26689291 -20415948 -2784046 10059113 8130428
2747 8130428 -771520 -2431143 7849779 20801895 23204993 11814688 -2910348 -8444770
2739 -8444770 -2626112 6216685 7798460 1283646 -3510060 2657019 19693246 37099807 44016183
2730 44016183 40009861 34899762 37476375 46335579 50815779 41103459 21046090 3100878 -2171356
2721 -2171356 1772526 1838510 -9956656 -26698608 -33448319 -22828720 -5173991 3114199 -3229489
2712 -3229489 -11601798 -7251306 11388247 28452620 28555784 14870146 5156931 12237073 29415464
$$ packed form
2771D1082962l777117j9956490j6966816L778422K1175013J6991082k485676j3956179
2763B5885201n365058J2156835J6796468J446645j8956319k3371906r276876O388171
2755E703161O229223q218260j8407338j1996077O273343J7631902J2843159j928685
2747H130428q901948j659623J0280922J2952116K403098j1390305j4725036n534422
2739h444770N818658Q842797J581775o514814m793706O167079J7036227J7406561O916376
2730D4016183m006322n110099K576613Q859204M480200r712320k0057369j7945212n272234
2721b171356L943882O5984j1795166j6741952o749711J0619599J7654729Q288190o343688
2712c229489q372309M350492J8639553J7064373J03164j3685638r713215P080142J7178391
$$ plain form
2703 29415464 38296673 29468797 13780765 10631479 24329507 41465450 44171970 31332006
2695 31332006 19485740 23422703 39319906 49065116 42022473 25995393 17960425 24333840
2687 24333840 34798470 33729104 19045196 3233183 -1010259 3900563 5938941 -3166144
2679 -3166144 -18228520 -27223297 -26047391 -21325580 -21374435 -26752230 -30491548 -27331187 -20175577
2670 -20175577 -14523057 -12451030 -10983561 -7233762 -3813970 -4328617 -8007019 -10507595 -10293249
2661 -10293249 -11706031 -19655643 -31858974 -38808994 -36138026 -29459026 -29700467 -38166319 -43157895
2652 -43157895 -33223316 -11256642 5810906 6481455 -1257254 1500188 21215164 42043273 42408168
2643 42408168 19427926 -5137699 -10495352 -1088830 -2621832 -31763089 -74747454 -100361236
$$ packed form
2703B9415464Q881209q827876j5688032l149286J3698028J7135943K706520j2839964
2695C1332006j1846266L936963J5897203R745210p042643j6027080q034968O373415
2687B4333840J0464630j069366j4683908j5812013m243442M910822K038378r105085
2679c166144j5062376q994777J175906M721811m8855n377795l739318L160361P155610
2670b0175577N652520K072027J467469L749799L419792n14647l678402k500576K14346
2661a0293249j412782p949612j2203331o950020K670968O679000k41441q465852m991576
2652d3157895R934579K1966674J7067548O70549p738709K757442J9714976K0828109L64895
2643D2408168k2980242k4565625n357653R406522j533002k9141257m2984365k5613782
$$ plain form
2635 -100361236 -95206982 -79134969 -82280925 -109218837 -131012361 -118865711 -77680486 -42371828
2627 -42371828 -38704752 -53802230 -51328242 -15068712 30955493 47714640 26627686 -1093428
2619 -1093428 198836 29066907 49098555 30913176 -12215788 -38529320 -25494868 5218046
2611 5218046 12846223 -14423967 -46093839 -44735673 -8498529 26220191 26184697 97856
2603 97856 -12680265 11572415 54717285 77026461 63280211 39081991 40712478 72946836
2595 72946836 104517481 104230320 75951951 53733279 61113295 85248466 93527468 70284349
2587 70284349 35447035 20698869 33121039 49920134 45778915 20801111 769512 5322943
2579 5322943 26645047 40253823 31392918 11765671 3468319 13086875 26185999 24777594
$$ packed form
2635a00361236N154254J6072013l145956k6937912k1793524J2146650M1185225L5308658
2627d2371828L667076j5097478K473988L6259530M6024205J6759147k1086954k7721114
2619a093428J292264K8868071K0031648j8185379m3128964k6313532J3034452L0712914
2611E218046P628177k7270190l1669872J358166L6237144L4718720l5494k6086841
2603I7856j2778121K4252680M3144870K2309176j3746250k4198220J630487L2234358
2595G2946836L1570645k87161k8278369k2218672P380016K4135171Q279002k3243119
2587G0284349l4837314j4748166J2422170J6799095m141219k4977804k0031599M553431
2579E322943K1322104J3608776q860905j9627247q297352R618556J3099124j408405
$$ plain form
2571 24777594 7172218 -10744034 -14351839 -5245135 2471798 -226298 -7930306 -8867588 2380291
2562 2380291 19270734 31233458 35091546 35996604 40066725 47625798 53457422 53346290 47420846
2553 47420846 39219137 31550838 25595320 21068545 16812803 11110490 3747996 -2416095 -4162170
2544 -4162170 -1042518 3417489 4317370 1463138 -897461 3212491 12514220 20511170 21495709
2535 21495709 18392774 19069664 27922512 39029687 43291764 37099358 27382055 22725513 23223019
2526 23223019 19881801 4050750 -20473961 -42201826 -53953590 -60211494 -70863068 -88175853
2518 -88175853 -102404629 -102714494 -89865727 -73594125 -63182579 -55750868 -41554390 -16819806
2510 -16819806 10423741 28186120 33989738 35895369 42459970 51650052 53343014 42098899
$$ packed form
2571B4777594j7605376j7916252l607805R106704P716933k698096p704008r37282J1247879
2562B380291J6890443J1962724L858088R05058M070121P559073N831624j11132n925444
2553D7420846q201709p668299n955518m526775m255742n702313p362494o164091j746075
2544d162170L119652M460007Q99881k854232k360599M109952R301729P996950R84539
2535B1495709l102935O76890Q852848J1107175M262077o192406r717303m656542M97506
2526B3223019l341218j5831051k4524711k1727865j1751764o257904j0651574j7312785
2518h8175853j4228776l09865J2848767J6271602J0411546P431711J4196478K4734584
2510a6819806K7243547J7762379N803618J905631O564601R190082J692962j1244115
$$ plain form
2502 42098899 24147732 10412898 4627241 -1078650 -14665496 -34228791 -49748696 -54744525
2494 -54744525 -54036433 -58056883 -69216639 -79447927 -79647034 -70394718 -62359483 -62910450 -66763168
2485 -66763168 -62677096 -46990412 -29065976 -20404300 -21332700 -21214423 -11352431 3791931 11048435
2476 11048435 3331702 -10539424 -16531393 -11129786 -5799878 -12429359 -29257812 -40222465
2468 -40222465 -35170810 -19467307 -9890188 -13397022 -21029224 -16857263 1538500 20303547
2460 20303547 23485305 11733384 358543 3036515 14238103 16768703 633933 -24309343
2452 -24309343 -38894032 -36975430 -30798257 -38031518 -60189105 -81560869 -85374121 -74054144
2444 -74054144 -64869061 -71244849 -86528412 -91762753 -76242766 -50415768 -33471940 -32323430
$$ packed form
2502D2098899j7951167j3734834n785657n705891j3586846j9563295j5519905m995829
2494e4744525P08092m020450j1159756j0231288j99107R252316Q035235n50967l852718
2485f6763168M086072J5686684J7924436Q661676r28400J18277R861992J5144362P256504
2476A1048435p716733j3871126n991969N401607N329908o629481j6828453j0964653
2468d0222465N051655J5703503R577119l506834p632202M171961J8395763J8765047
2460B0303547L181758j1751921j1374841K677972J1201588K530600j6134770k4943276
2452b4309343j4584689J918602O177173p233261k2157587k1371764l813252J1319977
2444g4054144R185083o375788j5283563n234341J5519987K5826998J6943828J148510
$$ plain form
2436 -32323430 -34350079 -22138678 6300244 34119870 43480498 34757490 25249095 29170379
2428 29170379 41817494 44079944 25076975 -5778756 -27109842 -29757445 -24554065 -29608640
2420 -29608640 -48776445 -66772489 -65542795 -44236273 -21232279 -12730703 -17305713 -16937025
2412 -16937025 907122 28025462 44407726 39460791 23944686 16873634 25697420 36652323
2404 36652323 32111961 10650119 -10220673 -14288358 -2658251 7272026 2012081 -12324847
2396 -12324847 -17436245 -3424812 19070132 32392921 29764321 23303651 28280456 46398197
2388 46398197 62271890 61916568 47295702 33464356 31042256 34921200 30812387 13168683
2380 13168683 -9211386 -22147857 -21358616 -15651764 -15139599 -19076183 -17685760 -3456378 19736156
$$ packed form
2436c2323430k026649J2211401K8438922K7819626R360628q723008r508395L921284
2428B9170379J2647115K262450j9002969l0855731k1331086k647603N203380n054575
2420b9608640j9167805j7996044J229694K1306522K3003994Q501576m575010L68688
2412a6937025J7844147K7118340J6382264m946935j5516105p071052Q823786J0954903
2404C6652323m540362k1461842k0870792m067685J1630107R930277n259945j4336928
2396a2324847n111398J4011433K2494944J3322789k628600o460670M976805J8117741
2388D6398197J5873693l55322j4620866j3831346k422100L878944m108813j7643704
2380A3168683k2380069j2936471P89241N706852N12165l936584J390423J4229382K3192534
$$ plain form
2371 19736156 41702685 56844828 67462334 79689337 93856008 103741972 104316332 95855817
2363 95855817 83020825 68209571 50857123 30210928 8447721 -11278736 -27079808 -40978096
2355 -40978096 -53198936 -60115733 -58418610 -49999522 -41075905 -35846621 -31579176 -21154494
2347 -21154494 -3751128 11487309 15565885 9685328 4773148 9154837 18260631 18421314 3377902
2338 3377902 -16579807 -25145591 -18714937 -11068949 -18320126 -38200591 -51739409 -44767276
2330 -44767276 -23692831 -10704378 -16034571 -27533634 -21853068 6603343 38080718 49442301
2322 49442301 40498466 33894431 49327030 78755247 95133710 82666077 55889057 43775965
2314 43775965 55749830 71805259 65173068 34797254 6918705 6445906 27342917 39688901
$$ packed form
2371A9736156K1966529J5142143J0617506J2227003J4166671R885964N74360q460515
2363I5855817j2834992j4811254j7352448k0646195k1763207j9726457j5801072j3898288
2355d0978096j2220840o916797J697123Q419088Q923617N229284M267445J0424682
2347b1154494J7403366J5238437M078576n880557m912180M381689R105794J60683j5043412
2338C377902j9957709q565784O430654P645988p251177j9880465j3538818O972133
2330d4767276K1074445J2988453n330193j1499063N680566K8456411L1477375J1361583
2322D9442301q943835o604035J5432599K9428217J6378463j2467633k6777020j2113092
2314D3775965J1973865J6055429o632191l0375814k7878549m72799K0897011J2345984
$$ plain form
2306 39688901 25268604 -3004172 -14915052 1093813 24150269 25242324 354475 -24754057
2298 -24754057 -23596490 -103241 17838303 10515331 -10558584 -15311805 8968782 43942678
2290 43942678 60414028 51843919 40149274 48492718 74236216 90966202 79845449 49516750
2282 49516750 27118005 25300514 31160044 21784112 -7594065 -37028559 -44886841 -31445911
2274 -31445911 -16647112 -17380718 -27360004 -26828162 -6303500 22377153 38847386 37274897 30898711
2265 30898711 35484566 49965783 59915424 52487291 33699122 18783139 15665732 16826786
2257 16826786 9575558 -9007258 -28667956 -38215551 -37639523 -37593748 -45193262 -56156743 -60880212
2248 -60880212 -54381051 -41906469 -33076090 -29031714 -23159160 -10178178 8718752 25341891
$$ packed form
2306C9688901j4420297k8272776j1910880J6008865K3056456J092055k4887849k5108532
2298b4754057J157567K3493249J7941544p322972k1073915m753221K4280587L4973896
2290D3942678J6471350q570109j1694645Q343444K5743498J6729986j1120753l0328699
2282D9516750k2398745j817491N859530r375932k9378177k9434494p858282J3440930
2274c1445911J4798799p33606r979286N31842K0524662K8680653J6470233j572489o376186
2265C0898711M585855J4481217R949641p428133j8788169j4915983l117407J161054
2257A6826786p251228j8582816j9660698r547595N76028M5775p599514j0963481m723469
2248f0880212O499161J2474582Q830379M044376N872554J2980982J8896930J6623139
$$ plain form
2240 25341891 33866740 36974638 40512759 46116257 49796589 45782667 34270611 20836492 10971208
2231 10971208 4730095 -1976549 -12061790 -22535206 -27440691 -24359638 -17269317 -11226024 -8559626
2222 -8559626 -5215423 2518636 14088219 24154141 27773301 26077371 24473047 27625901 33567360
2213 33567360 36099850 31592557 24014619 20668767 24611280 29772594 27774356 17336814 5419949
2204 5419949 1202432 3215937 2567606 -8646638 -26651299 -38127568 -36377264 -26787593 -22752126
2195 -22752126 -28799518 -34557827 -26193411 -3099401 20350262 29451225 26433474 26405934 41419190
2186 41419190 63379526 72638865 60328691 38676545 28937857 36013602 42570789 29905250
2178 29905250 -559530 -26849252 -30793584 -19396672 -17234927 -37554503 -66546758 -78141700
$$ packed form
2240B5341891Q524849L107898L538121N603498L680332m013922j1512056j3434119r865284
2231A0971208o241113o706644j0085241j0473416m905485L081053P090321O043293K666398
2222h559626L344203P734059J1569583J0065922L619160j695930j604324L152854N941459
2213C3567360K532490m507293p577938l345852L942513N161314j998238j0437542j1916865
2204E419949m217517K013505o48331j1214244j8004661j1476269J750304R589671M035467
2195b2752126o047392n758309Q364416K3094010K3449663R100963l017751k7540J5013256
2186D1419190K1960336R259339j2310174k1652146r738688P075745O557187j2665539
2178B9905250l0464780k6289722l944332J1396912K161745k0319576k8992255j1594942
$$ plain form
2170 -78141700 -64488974 -45475023 -46355371 -67959850 -85288067 -76086479 -47136750 -26802307
2162 -26802307 -32987904 -52285575 -54463836 -29812064 871094 8743154 -9603378 -28212142
2154 -28212142 -21005621 6745855 25923966 16724232 -7810779 -16633430 3901017 34487239
2146 34487239 44886236 29512593 13166644 21901028 52771226 77082042 73374185 51743024
2138 51743024 41374553 57013378 81386671 86592975 66193199 41578719 37443131 54250653
2130 54250653 67554810 57333084 30376879 12389083 17054200 32605168 34959700 16566980
2122 16566980 -6519285 -13158985 -326918 13488501 11303454 -3508121 -12846715 -4151742
2114 -4151742 15179269 28262869 25810514 17611828 18369419 31825068 47956955 53433838 47604597
$$ packed form
2170g8141700J3652726J9013951q80348k1604479j7328217R201588K8949729K0334443
2162b6802307o185597j9297671k178261K4651772L0683158P872060j8346532j8608764
2154b8212142P206521K7751476J9178111r199734k4535011q822651K0534447L0586222
2146C4487239J0398997j5373643j6345949Q734384L0870198K4310816l707857k1631161
2138E1743024j0368471J5638825K4373293N206304k0399776k4614480m135588J6807522
2130E4250653J3304157j0221726k6956205j7987796M665117J5550968K354532j8392720
2122A6566980k3086265o639700J2832067J3815419k185047j4811575r338594Q694973
2114d151742J9331011J3083600k452355q198686P57591J3455649J6131887N476883n829241
$$ plain form
2105 47604597 40696913 42769336 52314686 60533446 59967548 51842760 44674132 43745652 47596551
2096 47596551 49179613 42902670 30819932 19107144 13933125 14158948 13722883 7164381 -4846909
2087 -4846909 -13864142 -13306965 -4842250 2504594 913039 -6568882 -9333932 -470723 14151765
2078 14151765 21529297 14984714 4262667 3870519 16805889 31498061 32915871 20907133
2070 20907133 11489711 18946622 38119276 49356666 40960070 22146698 14125966 24030113
2062 24030113 37504477 32693502 8424139 -14977213 -16815853 -692412 9865136 -439551
2054 -439551 -21186294 -26578113 -6299910 21622295 30992796 17206003 2349974 9016896
2046 9016896 33669336 49390976 37941853 11034949 -2263204 10238668 32026649 35877487
$$ packed form
2105D7604597o907684K072423R545350Q218760n65898q124788p168628r28480L850899
2096D7596551J583062o276943j2082738j1712788n174019K25823m36065o558502j2011290
2087d846909r017233N57177Q464715P346844j591555p481921k765050Q863209J4622488
2078A4151765P377532o544583j0722047l92148J2935370J4692172J417810j2008738
2070B0907133r417422P456911J9172654J1237390q396596j8813372q020732R904147
2062B4030113J3474364m810975k4269363k3401352j838640J6123441J0557548j0304687
2054d39551k0746743n391819K0278203K7922205R370501j3786793j4856029O666922
2046I016896K4652440J5721640j1449123k6906904j3298153J2501872K1787981L850838
$$ plain form
2038 35877487 17334633 -798980 5823187 34047035 55689925 51052822 29974990 19715776
2030 19715776 33231564 52359151 50691941 23834486 -4914036 -11960190 682675 9141523
2022 9141523 -3566803 -27714726 -38199161 -23964144 -758585 7221125 -4355106 -17654001
2014 -17654001 -13426049 5625962 18610894 12128299 -5598017 -14341376 -5070002 10746451
2006 10746451 16141782 8312350 1151222 7617020 25011114 38116024 37468668 28170844 23180631
1997 23180631 26217609 29704470 24684641 11868409 477853 -2915648 -495769 1499861 987220
1988 987220 2242011 8421106 17479225 24534545 27364559 28804695 30397992 28974346 20674761
1979 20674761 6828847 -6273252 -13942115 -19260836 -29184607 -43484009 -53642483 -51009442
$$ packed form
2038C5877487j8542854j8133613O622167K8223848K1642890m637103k1077832j0259214
2030A9715776J3515788J9127587j667210k6857455k8748522p046154J2642865Q458848
2022I141523j2708326k4147923j0484435J4235017K3205559P979710j1576231j3298895
2014a7654001M227952J9052011J2984932o482595j7726316q743359R271374J5816453
2006A0746451N395331p829432p161128O465798J7394094J3104910o47356r297824m990213
1997B3180631L036978L486861n019829j2816232j1390556l393501K419879J995630n12641
1988I87220J254791O179095R058119P055320K830014J440136J593297j423646q299585
1979B0674761j3845914j3102099p668863n318721r923771j4299402j0158474K633041
$$ plain form
1971 -51009442 -38968747 -29869143 -31468239 -37556589 -35255306 -21669272 -9251528 -12806301
1963 -12806301 -30942111 -47310151 -46800794 -34547166 -29424382 -40813337 -55781065 -53451589
1955 -53451589 -27632771 2201051 14390228 7913717 3161774 18808085 46394211 59757991
1947 59757991 44640819 14678527 -1688010 5900266 18407280 10859706 -18184196 -43344832
1939 -43344832 -39818777 -12803577 7834462 1672153 -20140576 -27906291 -8235687 19288704
1931 19288704 23861293 -1465561 -31134850 -35637398 -14944160 3248246 -5215927 -31831565
1923 -31831565 -45306143 -26852123 7712477 25956340 13316778 -9904982 -13598690 8114017
1915 8114017 29478559 22797881 -10396823 -39578967 -39432577 -16164527 -881727 -12267168
$$ packed form
1971e1009442J2040695R099604j599096o088350K301283J3586034J2417744l554773
1963a2806301j8135810j6368040N09357J2253628N122784j1388955j4967728K329476
1955e3451589K5818818K9833822J2189177o476511m751943J5646311K7586126J3363780
1947E9757991j5117172k9962292j6366537P588276J2507014p547574k9043902k5160636
1939d3344832L526055K7015200K0638039o162309k1812729p765715J9670604K7524391
1931A9288704M572589k5326854k9669289m502548K0693238J8192406q464173k6615638
1923c1831565j3474578J8454020L4564600J8243863j2639562k3221760l693708K1712707
1915H114017K1364542o680678l3194704k9182144J46390K3268050J5282800j1385441
$$ plain form
1907 -12267168 -36040625 -40970469 -14539226 22077746 36581731 20515243 -2210539 -3553419
1899 -3553419 16350944 29868161 12428234 -28070813 -59582050 -59849933 -40706198 -32631824
1891 -32631824 -50265758 -74954595 -75392240 -44132102 -6588509 6296691 -8315138 -23002025
1883 -23002025 -12245893 18226349 37381186 24600814 -7050439 -23090156 -7208879 21924327
1875 21924327 31971511 14655499 -4886141 2930492 37518426 67850011 66193043 39730383
1867 39730383 21193147 30649313 52559546 53874324 22940467 -16137563 -30108040 -13864081
1859 -13864081 4706655 -2660505 -31562222 -50021140 -36597313 -5613332 7848735 -11275324
1851 -11275324 -41888306 -51742313 -34468754 -17864555 -28770246 -62713034 -86375999 -76583435
$$ packed form
1907a2267168k3773457m929844K6431243L6616972J4503985j6066488k2725782j342880
1899c553419J9904363J3517217j7439927m0499047l1511237k67883J9143735Q074374
1891c2631824j7633934k4688837m37645L1260138L7543593J2885200j4611829j4686887
1883b3002025J0756132L0472242J9154837j2780372l1651253j6039717J5881277K9133206
1875B1924327J0047184j7316012j9541640P816633L4587934L0331585j656968k6462660
1867C9730383j8537236R456166K1910233J314778l0933857l9078030j3970477J6243959
1859a3864081J8570736p367160k8901717j8458918J3423827L0983981J3462067j9124059
1851a1275324l0612982r854007J7273559J6604199j0905691l3942788k3662965R792564
$$ plain form
1843 -76583435 -46531666 -29300403 -39441586 -55439277 -47015883 -11361060 22363640 26418535
1835 26418535 5203678 -9472549 2702380 26670805 30993392 5393237 -25666479 -30552974
1827 -30552974 -7824580 14256310 10280082 -11028880 -18597714 4333390 38155494 50040822
1819 50040822 30805333 6149450 4473582 24386695 35170849 14580789 -23469299 -45634656
1811 -45634656 -35795775 -14533674 -14214579 -39811199 -63710343 -58196200 -28766303 -8293196
1803 -8293196 -19709492 -48711022 -60989958 -43249660 -17906010 -17077234 -44424150 -69433835
1795 -69433835 -64003905 -33479385 -11297950 -19382999 -43496982 -49892368 -25601946 5924267
1787 5924267 12360467 -10751526 -35269013 -32219622 -5485395 13997225 4731679 -20216806
$$ packed form
1843g6583435L0051769J7231263j0141183j5997691Q423394L5654823L3724700M054895
1835B6418535k1214857j4676227J2174929K3968425M322587k5600155l1059716m886495
1827c0552974K2728394K2080890l976228k1308962p568834K2931104L3822104J1885328
1819E0040822j9235489k4655883j675868J9913113J0784154k0590060l8050088k2165357
1811d5634656R838881K1262101L19095k5596620k3899144N514143K9429897K0473107
1803h293196j1416296k9001530j2278936J7740298K5343650Q28776k7346916k5009685
1795f9433835N429930L0524520K2181435q085049k4113983o395386K4290422L1526213
1787E924267O436200k3111993k4517487L049391K6734227J9482620r265546k4948485
$$ plain form
1779 -20216806 -28085559 -4040466 32116190 48515504 36985673 20716522 26943413 54416120
1771 54416120 74469945 64446049 31652058 5361003 3824949 15143221 12031962 -15903280
1763 -15903280 -49781209 -62735626 -48601531 -28344033 -26357487 -43276188 -57073189 -48636291
1755 -48636291 -23160039 -5505918 -12085462 -34012570 -47876497 -40594034 -23657082 -20207614
1747 -20207614 -38031126 -61843508 -68587910 -53385910 -34378201 -31947806 -48046707 -62212792
1739 -62212792 -55773928 -32227422 -12145702 -12931602 -27460339 -32871888 -15079772 14930425
1731 14930425 33666026 29404320 16800987 18961793 42289352 66802549 68828544 47165938
1723 47165938 24477858 22509830 37205959 44278523 27438614 -3045166 -20139968 -10046972
$$ packed form
1779b0216806p868753K4045093L6156656J6399314j1529831j6269151O226891K7472707
1771E4416120K0053825j0023896l2793991k6291055j536054J1318272l111259k7935242
1763a5903280l3877929j2954417J4134095K0257498J986546j6918701j3797001Q436898
1755d8636291K5476252J7654121o579544k1927108j3863927P282463J6936952L449468
1747b0207614j7823512k3812382o744402J5202000J9007709K430395j6098901j4166085
1739f2212792O438864K3546506K0081720p85900j4528737n411549J7792116L0010197
1731A4930425J8735601m261706j2603333K160806K3327559K4513197K025995k1662606
1723D7165938k2688080j968028J4696129P072564j6839909l0483780j7094802J0092996
$$ plain form
1715 -10046972 12354971 20422371 5671186 -12438229 -9570340 15101383 37351246 34085430
1707 34085430 9735323 -8432779 -2580579 17301800 24239796 7964917 -14435971 -16345818
1699 -16345818 7746369 36489546 45932510 37480233 33482608 50675569 79925640 96632280
1691 96632280 87958208 66272146 54352189 59189929 65809754 55945471 29332583 5310803
1683 5310803 -248571 9136837 15148567 6455160 -9088862 -15353495 -6076507 6931345 9753981
1674 9753981 639309 -8675428 -7339612 3609093 13438195 15283555 13136398 15705534 25713216
1665 25713216 38260708 46236687 47410619 43852792 38925390 33469896 26524040 17001219 4180904
1656 4180904 -11014753 -25547658 -34883198 -36015346 -30817344 -24296630 -20267803 -15710188 -3832154
$$ packed form
1715a0046972K2401943Q067400j4751185j8109415K867889K4671723K2249863l265816
1707C4085430k4350107j8168102N852200J9882379O937996j6274879k2400888j909847
1699a6345818K4092187K8743177R442964q452277l997625J7192961K9250071J6706640
1691I6632280q674072k1686062j1919957M837740O619825r864283k6612888k4021780
1683E310803n559374R385408O011730q693407j5544022o264633R276988J3007852K822636
1674I753981r114672r314737J335816J0948705R829102J845360k147157K569136J0007682
1665B5713216J2547492P975979J173932l557827m927402n455494o945856r522821j2820315
1656D180904j5195657j4532905r335540j132148N198002O520714M028827M557615J1878034
$$ plain form
1647 -3832154 15634773 34300790 41310041 35149915 26229647 23932945 26251751 20216609 -1724277
1638 -1724277 -29871594 -46438767 -44029280 -35036011 -37119738 -51799752 -60864272 -49232023
$$ packed form
1647c832154J9466927J8666017P009251o160126q920268k296702K318806o035142k1940886
1638a724277k8147317j6567173K409487Q993269k083727j4680014r064520J1632249
$$ [...]
-2730D478248  $$ checkpoint
##END NTUPLES=
##END=
