##TITLE= S#497941
##JCAMP-DX= 5.00 $$ JEOL NMR v1.10
##DATA TYPE= NMR SPECTRUM
##DATA CLASS= NTUPLES
##NUM DIM= 1
##ORIGIN= DELTA_NMR
##OWNER= NMR
##SPECTROMETER/DATA SYSTEM= DELTA_NMR
##.OBSERVE FREQUENCY= 3.00529655924288E+02
##.OBSERVE NUCLEUS= ^1H
##.DELAY= (2.195E+02,2.195E+02)
##.ACQUISITION MODE= SIMULTANEOUS
##.FIELD= 7.0586013
##.FILTER WIDTH= 1.81675738660864
##.ACQUISITION TIME= 3.6339712
##.SPINNING RATE= 17
##.OBSERVE 90= 9.2
$$ ------------------------
$$ JEOL SPECIFIC PARAMETERS
##$FILENAME= C:\NMR/eb-7.jdf
##$TITLE= S#497941
##$AUTHOR= NMR
##$CREATION=  1-FEB-2018 13:43:57
##$REVISION=  1-FEB-2018 13:51:09
##$CONTENT= PROTON NMR EXPERIMENT
##$INSTRUMENT= DELTA_NMR
##$SITE= Center College ECP+ 300
##$NODENAME= nmr2
##$DIMENSIONS= 1
##$STORAGE= FLOAT
##$X_FORMAT= COMPLEX
##$X_CURR_POINTS= 16384
##$X_START= 12.50103 $$ppm
##$X_STOP= -2.50012 $$ppm
##$X_TITLE= 1H                             
##$X_ZERO_POINT= 0.33329
##$X_FREQ_FLIP= FALSE
##$X_POINTS= 16384
##$X_PRESCANS= 0
##$X_DOMAIN= 1H
##$X_OFFSET= 5 $$ppm
##$X_FREQ= 300.52966 $$MHz
##$X_SWEEP= 4.50857 $$kHz
##$X_RESOLUTION= 0.27518 $$Hz
##$SOLVENT= CHLOROFORM-D
##$TEMP_GET= 20.5 $$dC
##$ACQ_DELAY= 0.2195 $$ms
##$DIGITAL_FILTER= FALSE
##$FILTER_FACTOR= 1
##$FILTER_WIDTH= 2.254 $$kHz
##$FILTER_MODE= BUTTERWORTH
##$TRANSITION_RATIO= 0.9
##$ORDERS
##$FACTORS
##$LOCK_STRENGTH= 875
##$LOCK_LEVEL= 200
##$LOCK_GAIN= 27
##$LOCK_OSC_OFFSET= 25.6519 $$kHz
##$LOCK_PHASE= 187 $$deg
##$LOCK_OSC_STATE= 2H OSC ON
##$X_ANGLE= 45 $$deg
##$X90= 9.2 $$us
##$X90_HI= 10 $$us
##$X90_LO= 50 $$us
##$X_90_WIDTH= 9.2 $$us
##$X_PULSE= 4.6 $$us
##$RELAXATION_DELAY= 4 $$s
##$SCANS= 8
##$PROBE_ID= 1412
##$ITERATIONS= 1
##$FIELD_STRENGTH= 7.0586 $$T
##$TEMP_SET= 25 $$dC
##$SPIN_SET= 15 $$Hz
##$SPIN_GET= 17 $$Hz
##$HE_LEVEL= 75 $$%
##$N2_LEVEL= 82 $$%
##$CHANGER_SAMPLE= 0
##$ADC_CARD= 16/1MHz/20
##$EXPERIMENT= single_pulse.exp
##$OBS_NOISE= WAUGH
##$IRR_NOISE= WALTZ
##$TRI_NOISE= WALTZ
##$QUA_NOISE= WAUGH
##$OBS_PWIDTH= 1 $$us
##$IRR_PWIDTH= 1 $$us
##$TRI_PWIDTH= 1 $$us
##$QUA_PWIDTH= 1 $$us
##$RECVR_GAIN= 4
##$IRR90= 10 $$us
##$TRI90= 10 $$us
##$QUA90= 10 $$us
##$IRR90_HI= 10 $$us
##$QUA90_HI= 10 $$us
##$IRR90_LO= 10 $$us
##$TRI90_LO= 10 $$us
##$QUA90_LO= 10 $$us
##$MOD_RETURN= 1
##$TOTAL_SCANS= 8
##$X_ACQ_DURATION= 3.63397 $$s
##$DELAY_OF_START= 1 $$s
##$ACTUAL_START_TIME= 886340570
##$CLIPPED= FALSE
##$DC_BALANCED= FALSE
##$TRI90_HI= 10 $$us
##$SPIN_LOCK_90= 100 $$us
##$SPIN_LOCK_ATTN= 24.4 $$dB
##$DEUT_GRAD_SHIM_90= 213 $$us
##$DEUT_GRAD_SHIM_ATTN= 9 $$dB
##$IRR_CODE= 146
##$LOCK_STATE= LOCK ON
##$AUTOLOCK_LEVEL= 200
##$SAWTOOTH_RANGE= 5
##$LOCK_STATUS= IDLE
##$LOCK_SETTLE_POINT= 4096
##$LOCK_ACHIEVE_POINT= 0
##$SPIN_ACTION= SPIN ON
##$SPIN_STATE= SPIN ON
##$SPIN_STATUS= SPIN ON
##$SPIN_GAS_SOURCE= AIR
##$TEMP_ACTION= TEMP OFF
##$TEMP_STATE= TEMP OFF
##$TEMP_STATUS= TEMP OFF
##$TEMP_COMP= 0
##$TEMP_DELAY= 0 $$s
##$TEMP_LIMIT_HI= 150 $$dC
##$TEMP_LIMIT_LO= -100 $$dC
##$TEMP_MELTING= -63 $$dC
$$ [...]
##$VT_PID_STD_WB_H_CBL= 10
##$VT_PID_STD_WB_H_CBH= 0
##$VT_PID_STD_WB_H_HC= 2.4
##$VT_PID_STD_WB_H_HL= 70
##$VT_PID_STD_WB_M_PB= 1.5
##$VT_PID_STD_WB_M_TI= 30
##$VT_PID_STD_WB_M_TD= 5
##$VT_PID_STD_WB_M_CBL= 9.9
##$VT_PID_STD_WB_M_CBH= 2.3
##$VT_PID_STD_WB_M_HC= 2.5
##$VT_PID_STD_WB_M_HL= 70
##$VT_PID_STD_WB_L_PB= 1.3
##$VT_PID_STD_WB_L_TI= 29
##$VT_PID_STD_WB_L_TD= 5
##$VT_PID_STD_WB_L_CBL= 20
##$VT_PID_STD_WB_L_CBH= 20
##$VT_PID_STD_WB_L_HC= 0.6
##$VT_PID_STD_WB_L_HL= 100
##$VT_PID_LONG_0_H_PB= 1.5
##$VT_PID_LONG_0_H_TI= 30
##$VT_PID_LONG_0_H_TD= 5
##$VT_PID_LONG_0_H_CBL= 9.9
##$VT_PID_LONG_0_H_CBH= 2.3
##$VT_PID_LONG_0_H_HC= 2.5
##$VT_PID_LONG_0_H_HL= 70
##$VT_PID_LONG_0_M_PB= 1.5
##$VT_PID_LONG_0_M_TI= 30
##$VT_PID_LONG_0_M_TD= 5
##$VT_PID_LONG_0_M_CBL= 9.9
##$VT_PID_LONG_0_M_CBH= 2.3
##$VT_PID_LONG_0_M_HC= 2.5
##$VT_PID_LONG_0_M_HL= 70
##$VT_PID_LONG_40_H_PB= 1.5
##$VT_PID_LONG_40_H_TI= 30
##$VT_PID_LONG_40_H_TD= 5
##$VT_PID_LONG_40_H_CBL= 9.9
##$VT_PID_LONG_40_H_CBH= 2.3
##$VT_PID_LONG_40_H_HC= 2.5
##$VT_PID_LONG_40_H_HL= 70
##$VT_PID_LONG_40_M_PB= 1.5
##$VT_PID_LONG_40_M_TI= 30
##$VT_PID_LONG_40_M_TD= 5
##$VT_PID_LONG_40_M_CBL= 9.9
##$VT_PID_LONG_40_M_CBH= 2.3
##$VT_PID_LONG_40_M_HC= 2.5
##$VT_PID_LONG_40_M_HL= 70
##$SAMPLE_ACTION= LOADED
##$SAMPLE_STATE= LOAD
##$SAMPLE_STATUS= LOADED
##$AUTOSHIM_MODE= AUTOSHIM OFF
##$AUTOSHIM_DELAY= 3600 $$s
##$AUTOSHIM_TRACK= AUTOSHIM OFF
##$SHIM_MAX_RECALL= MAX FOUND
##$SHIM_NAMES= SHIM_Z0
##$SHIM_Z0= 9198
##$SHIM_Z1= 5125
##$SHIM_Z2= -64
##$SHIM_Z3= -2829
##$SHIM_Z4= -240
##$SHIM_Z5= 46
##$SHIM_Z6= -33
##$SHIM_X= -14
##$SHIM_XZ= 16
##$SHIM_XZ2= 0
##$SHIM_XZ3= 0
##$SHIM_X2= -7
##$SHIM_X2Z= -40
##$SHIM_X3= 0
##$SHIM_Y= 1608
##$SHIM_YZ= 13
##$SHIM_YZ2= 10
##$SHIM_YZ3= 0
##$SHIM_Y2= -11
##$SHIM_Y2Z= -20
##$SHIM_Y3= 0
##$NUM_SCANS= 1
##$END_TIME= 886340637
##$LOCAL_TIME= 886340636
##$PROBE_ATN= 0
##$PROBE_TUNE= 0
##$PROBE_MATCH= 2077
##$PROBE_COARSE= A
##$LF_TUNE_DIAL= 0
##$LF_MATCH_DIAL= 0
##$HF_TUNE_DIAL= 0
##$HF_MATCH_DIAL= 0
##$PASS_RIPPLE= 0.01 $$dB
##$STOP_RIPPLE= 60 $$dB
##$PROBE_RECOVERY= 0 $$us
##$AF_DELAY_RATIO= 0
##$VERSION= 4.3.3
##$X_ACQ_TIME= 3.63397 $$s
##$DEAD_TIME= 0 $$us
##$DELAY= 0 $$us
##$PHASE_PRESET= 3 $$us
##$UNBLANK_TIME= 2 $$us
##$INITIAL_WAIT= 1 $$s
##$NORMALIZED= TRUE
$$ END OF JEOL SPECIFIC PARAMETERS
$$ -------------------------------
##NTUPLES= NMR SPECTRUM
##VAR NAME= FREQUENCY,    SPECTRUM/REAL, SPECTRUM/IMAG, PAGE NUMBER
##SYMBOL=   X,            R,             I,             N
##VAR TYPE= INDEPENDENT,  DEPENDENT,     DEPENDENT,     PAGE
##VAR FORM= AFFN,         ASDF,          ASDF,          AFFN
##VAR DIM=  16384, 16384, 16384, 2
##UNITS= PPM,     ARBITRARY UNITS, ARBITRARY UNITS, 
##FIRST=  1.2501033903057E+01, -2.09068736679355E+02, -9.0811368992002E+02, 1
##LAST=  -2.50011824950436, 4.95139733970453E+02, -4.46979442442055E+02, 2
##FACTOR=  9.1565355261926E-04, 6.89257778835501E-03, 6.89257778835501E-03, 1
##PAGE= N=1
##DATA TABLE=(X++(R..R)), XYDATA
$$ [...]
##PAGE= N=2
##DATA TABLE=(X++(I..I)), XYDATA
11832 -2829494 -6822661 -7656352 2653855 6143337 5143066 4457887 -4106384 -13516016 -13257189
11823 -13257189 -800540 7375619 332537 -9760620 -18353029 -18499576 -6757859 984728
11815 984728 -871351 -8297384 -12569148 -11416317 -10679848 -4595685 -431450 -5377696 -6474270
11806 -6474270 -2387674 -813475 -8085359 -12706399 -1951204 3447627 -2343428 -6569998 -9689164
11797 -9689164 -12097762 -13138114 -2226787 8652395 -548231 -8121240 -3446419 6254608 13085273
11788 13085273 12941917 16649411 15926772 12815956 14575370 12514174 14263974 11697694 5167733
11779 5167733 7025112 6613055 1184813 -9197018 -5737095 9932169 4977325 -2416655 1048674
11770 1048674 2880333 -234978 -1193583 11729957 8740835 -8872289 -6901415 -281121 -1039783
11761 -1039783 -10034310 -12842560 -5998469 -9206605 -8107177 -5145051 -6756976 -6914592 -12237711
11752 -12237711 -6658811 1206140 -3048950 -10162561 -15820101 -9314660 -10636735 -18455534 -10385266
11743 -10385266 -5558442 -6767435 -8919365 -5440580 953356 -3187766 4387714 16360572 16408675
11734 16408675 10885129 -402383 -1543119 1779418 2467703 3871797 -2156828 -6797423 -17581533
11725 -17581533 -26204831 -15796276 -7589353 -5574548 -6619856 -7473824 -11798554 -22209637 -13578516
11716 -13578516 1304578 4434493 2938642 -5549973 -12712924 -14943588 -5614865 7676121
11708 7676121 9818488 13574337 10822875 2339989 6963874 17534096 22776491 20776817 26415348
11699 26415348 27488661 8010163 -54583 7558050 11118724 9552419 9686459 7614364 -8374827
11690 -8374827 -12910125 1740908 9013066 9700682 7321213 3361541 2160383 8244583 14901353
11681 14901353 5832186 1751941 8353456 5441301 3025156 6982122 3407252 -11922058 -11763668
11672 -11763668 7500681 4541721 -10367919 -8375174 -4434372 -10928151 -14073406 -5598737
11664 -5598737 -9982055 -19997695 -8178417 1945581 -5885148 -15359338 -13888744 -4991478
11656 -4991478 6923481 22841104 20114750 835017 -2099820 8254618 18078929 25903829
11648 25903829 27572827 12770974 -6782112 -832508 12350898 7454459 3062947 6898533
11640 6898533 4838376 -3601236 -1511770 3644126 -3746201 -1922144 12218817 13244216 607835
11631 607835 -6738816 -5440627 -4465711 3817967 14566502 5693736 -9263326 -6899222 3360387
11622 3360387 6310372 8807744 13429319 5713412 -3406922 5780724 15484629 7776349 -1781315
11613 -1781315 -481911 -1870048 -7682573 -3090785 2470908 -5488130 -13864032 -10339646 -5481712
11604 -5481712 -2987111 4666932 10042320 5049598 696040 4334004 7344217 10796313 19298622
11595 19298622 19332165 8213080 4214846 9079741 8207923 5998973 15614608 21242987 11717990
11586 11717990 7309284 12276391 10501538 6603246 16974246 26893515 14924534 -673580
11578 -673580 -3307906 -3708527 -4913538 -425447 945751 -14033754 -28139517 -24834407 -18143262
11569 -18143262 -17518914 -18337434 -19156997 -22943385 -22518557 -12819743 -10139889 -17293166 -19077835
11560 -19077835 -11828684 -4589557 -3846958 -3123498 -5156555 -10962578 -7144204 5474926 13689146
11551 13689146 8372602 2134579 5230680 6074537 6304310 9374060 11165086 7931154 796629
11542 796629 143909 -2897205 -8615060 -6576054 -3843951 -1197343 -3961844 -11066637 -16221807
11533 -16221807 -14767651 855542 6511055 -1027006 -3194787 -7809672 -12685738 -8861552
11525 -8861552 9396001 15317069 -6573011 -13646115 -6852421 -7473972 -4902692 8523948
11517 8523948 20103837 2073022 -13374063 -1117742 7318134 13267804 20432377 25553605
11509 25553605 16823055 -3790364 182983 14328459 23333166 24814381 13200293 8165707
11501 8165707 -1818955 -8606337 1733301 10697365 13940507 16715 -7731170 -4501285 -13460184
11492 -13460184 -8607867 5262693 13730975 10675335 -1554144 962265 133077 5130056
11484 5130056 21548919 22499000 19501864 10138355 4153926 8440364 12403614 20475455 11110190
11475 11110190 4329662 11629045 7042901 6670232 10064264 11645785 6752507 4484564 21573516
11466 21573516 19651959 6380066 8199088 7391108 4728050 4943280 14826755 10925251 -8562067
11457 -8562067 -5751831 -1645899 -6346044 -3131131 5980194 8015620 -4317227 656064 13824292
11448 13824292 10752134 11721975 20850142 27642811 19741041 14258157 22856204 18637201 7764867
11439 7764867 4839510 10067573 5526644 -13462116 -16223815 -14107561 -20991445 -25510812 -18394077
11430 -18394077 -9207718 -21728873 -22757448 -4005463 3029016 3079447 4553532 15222751 14878383
11421 14878383 12397329 26049924 20430094 10092705 5721397 2533736 4882558 -1755823
11413 -1755823 -3316935 -17955516 -28412998 -11116955 -16195568 -23212835 -21195908 -20262008 -21578111
11404 -21578111 -26096656 1650898 1035547 -29037732 -17917789 -2639060 3351676 -2263223
11396 -2263223 8748948 21670774 -13131593 -7564108 22572808 22630619 18443654 14374527
11388 14374527 30015028 7264974 -16868774 13620790 15696205 11813474 7819786 3611505
11380 3611505 -1754269 -34030180 -9474311 17192996 7475908 8994196 -9060097 -9450968
11372 -9450968 -19017076 -19299980 10158209 -9224348 -13829356 -19263429 -35603056 -25439985
11364 -25439985 -34972621 -17316433 -11671632 -12280472 13923047 -6947067 1146101 22626829
11356 22626829 27467901 44021447 32950204 49261181 36247189 9690409 39093650 23249479
11348 23249479 -875388 -19985802 -22543196 -4148658 -39617430 -38162494 -42202783 -82052530
11340 -82052530 -72834614 -56972294 -20679679 -28807467 -61918123 -43470602 -54339515 -34604760
11332 -34604760 613975 17371143 35935407 2934446 10737819 28976982 24094139 55684060
11324 55684060 60403297 71992049 55727751 19703812 29826141 8938477 18695176 41425261
11316 41425261 29523227 20628309 -20306133 -18512148 -7739528 -6944051 40044336 36571750
11308 36571750 20760823 12403866 5662770 27672336 18357225 40396007 50000580 9154147
11300 9154147 4433848 -10536393 -14294774 -14132332 -17908996 238662 -28806355 -34784920
11292 -34784920 -24261741 -41050052 -24834379 -19967823 -13127968 -14070853 -20754550 1991934
11284 1991934 -18331785 -20256447 7096795 6325237 14381547 13331971 27523544 27975167 11823239
11275 11823239 44958138 53311759 41185759 34191337 26921147 38588834 17628969 5157941
11267 5157941 6787159 -19245867 -33514710 -44689403 -32658695 -29530678 -60889979 -54633665
11259 -54633665 -42683377 -41723903 -37982795 -24070705 6884017 -2290249 -7253478 15564937
11251 15564937 10630153 6092039 15798696 37286713 36187172 6022575 2381039 -5906339
11243 -5906339 -13099003 4190969 7856072 -2571593 -23553884 -30567746 -27629978 -31478414
11235 -31478414 -13194969 -8698837 -21675644 -13679177 -4287121 -6493602 -15626696 -630007
11227 -630007 23372325 18148653 24734345 34469328 14933212 -1135420 11996296 35607138
11219 35607138 23268807 3751552 11394282 598957 -16499479 -7041201 4412952 -7590442
11211 -7590442 -19320345 7604105 22239385 -4490510 -11153263 1753580 3697835 8056931
11203 8056931 31919216 40541556 -1971227 -27463437 -4204086 8969352 7389901 11342759
11195 11342759 10407877 -14911735 -33743583 -9858906 6908203 986713 3982796 7139460
11187 7139460 4345813 -1133897 2638038 8587734 7984726 19342994 20413281 9723782 10285075
11178 10285075 4925114 -3210472 -4903 15771470 16690548 -6186209 -4030974 5785252
11170 5785252 -6134904 -9916506 1695905 8299710 -9368434 -16801594 1294517 -3129888
11162 -3129888 -19780512 -23889287 -17869947 -15156953 -24815940 -16284469 -7468754 -23156031
11154 -23156031 -36430645 -29339851 -2116621 5709041 -3615768 4093285 1102044 -10848393
11146 -10848393 -6287722 16575435 28322670 5110270 -3570163 3888828 -3622333 -6621351
11138 -6621351 -4429625 -544641 -7925479 -15471557 -5483823 -9158151 -16069051 -19054678 -21719448
11129 -21719448 -9535162 -6054566 -9107943 -13025303 -16627782 -12122815 -15833203 -4037117
11121 -4037117 13327213 7898933 7851084 11764243 13517579 8480488 6910305 23433243 19963869
11112 19963869 8125206 2849645 -12759904 -21164515 -25318988 -20065113 -15341846 -23953261 -24713709
11103 -24713709 -30636155 -27838910 -14336151 -11938180 2003994 13448181 12834559 7339993
11095 7339993 3692068 14157555 9284926 9021172 24711473 12917084 -5035182 -5909215
11087 -5909215 6163580 8017340 -1807144 12046726 12591254 -2419984 7733357 18383769
11079 18383769 12212397 -6197713 -4732676 10289854 2246994 2300790 4732972 -6803736 -10829737
11070 -10829737 -2400490 20939298 27617441 20241114 23035679 20662748 26025691 33515268 33214826
11061 33214826 31750273 18853170 12677990 8272918 1403886 2245855 -6922275 -11755987 -7699696
11052 -7699696 -4880938 -2841954 -8986084 -3789453 2640248 -4655339 -1547462 6231491 4750454
11043 4750454 -7728634 -12573714 -2130841 -9358513 -18768979 -5271779 4204004 -2027374
11035 -2027374 -4550292 11128016 18870288 7878499 13942652 29529409 25247350 14773369
11027 14773369 13360529 11602149 -2379186 -12428175 -2218445 2035987 -9950211 -18006109
11019 -18006109 -18108834 -11673758 -6926038 -1446022 8034633 646890 -9565495 -5935092 1584484
11010 1584484 3127188 -13634464 -24180336 -25370400 -31089066 -22521980 -20592477 -29219512 -37186350
11001 -37186350 -42571785 -26589173 -15356205 -7271536 -5349834 -24445999 -20728372 -14601112
10993 -14601112 -15852058 -9433518 -10254933 -7643719 -25300714 -29409285 -11429194 -27239124 -26789572
10984 -26789572 -10486682 -4427383 -12613165 -34142617 -20533328 -26965781 -42346149 -17884861
10976 -17884861 -18145448 -31099654 -50388487 -48364591 -27174278 -41946354 -24413713 -5838131
10968 -5838131 -13070890 -5411231 -7436479 13851857 10989088 -2346059 23953546 17791722
10960 17791722 15077600 4575571 -10289121 -3436786 -27816268 -11095621 7391708 -7228796
10952 -7228796 -978976 -14177712 -1284552 3776879 4971988 42139624 26565162 23536537
10944 23536537 22772792 -979351 4710683 -8541410 4352040 -5357532 -38031433 -26804232
10936 -26804232 -60755505 -68584719 -47081534 -46280127 -38492951 -61596692 -39618863 -32001071
10928 -32001071 -53754928 -6451068 2399367 -4339383 -612970 12947865 46032928 16794663
10920 16794663 33837813 61321805 30220561 43547550 55098635 70778206 54031089 25875880
10912 25875880 56226744 28738354 17042446 37499992 26258975 23969431 -10923118 -6168424
10904 -6168424 -1719942 -30200918 -282948 1847070 1822390 -3353183 -26371925 -4075085 -13749787
10895 -13749787 2123504 27025586 8268060 10257654 -19822019 -21611017 -4378226 -10066536
10887 -10066536 11774929 -12717978 -26542776 -26667780 -46203567 -19945431 -14504152 -6948750
10879 -6948750 -11693971 -35395270 -7504550 -13096845 -13283391 8832574 7731547 13144506
10871 13144506 -8569270 8283845 27383147 -657260 12851729 21119332 20271695 7027855
10863 7027855 -6913100 17912684 -2854646 -17243341 -5069626 -18012713 -29341174 -54912477
10855 -54912477 -43713025 -29919019 -53687257 -50738063 -53507006 -49719724 -45221637 -38612734
10847 -38612734 -694937 -2815670 -10607967 3969156 17608418 34578465 27107081 39778123
10839 39778123 48253815 26955779 28104748 23471538 15548697 2455355 -4222249 10231201
10831 10231201 -4370241 -18274439 -28785113 -41924805 -29347009 -19975896 -11079747 -17821070
10823 -17821070 -33405356 -34741171 -38630114 -16710784 881602 -9461719 -13604085 -11573731
10815 -11573731 -1489674 -3666813 2968437 23333804 14639885 13360488 27343115 30131838
10807 30131838 14207918 1120678 22285020 26206368 10325990 11484783 10051115 94472
10799 94472 -10494518 8085021 25251982 2546660 -4587607 12545090 23197031 11399658
10791 11399658 350273 10779773 -3371610 -17713786 1261635 11199573 -10618206 -42017090
10783 -42017090 -34888033 -17819235 -18942988 -1444025 11475423 2512346 -9079028 -1011566
10775 -1011566 24624504 33832848 42048188 43306972 27294923 22957063 17104784 10474277 14706964
10766 14706964 23834759 18278804 -7868838 -7092992 919206 -17520711 -14591058 13981294
10758 13981294 20868621 -4980551 -9901383 9727219 -4127507 -14460314 12131520 23592609
10750 23592609 15737 -16049107 -751222 2893070 -6894616 5337150 15143673 7096702
10742 7096702 946815 8239225 15726176 8983212 2140012 1424852 7366736 14524487 7121881
10733 7121881 -5123423 -10378595 -12343948 -10400929 2636487 13581091 -342153 -18852877
10725 -18852877 -15175948 -2290591 1341443 2425468 4376559 -4732242 -12365975 -6432170 140349
10716 140349 890077 80067 4284085 6480119 6715958 8773511 4852326 8764317 18564418
10707 18564418 17210511 8792107 1028252 1671378 538375 1896297 9293036 -2854715 -17856588
10698 -17856588 -13701963 1624139 11232749 5714304 5055069 1345461 -4038821 11468662
10690 11468662 24671159 22870096 10731550 4477557 8509091 2658164 6616732 14384132
10682 14384132 8098466 5594748 6041713 7293294 498187 1148462 20882427 20747517 12033295
10673 12033295 11021872 4248393 -2402077 41377 17260089 12303040 -13586428 -11202597
10665 -11202597 -2957216 -4896524 -1951479 6498141 7585096 -5136614 6704210 27570636
10657 27570636 20017523 13929748 16593726 18424971 16857178 15949837 16584213 696763 -8303318
10648 -8303318 -6187304 -16320153 -18336644 -15503037 -21767881 -28099549 -24055927 -16710567 -28251761
10639 -28251761 -26047146 1152617 3598285 -8671986 -5442529 3175706 -109978 -11595 20904205
10630 20904205 20714794 -5223139 -8653786 3976117 9963027 7309899 5176763 5632601 -1122223
10621 -1122223 947384 12331147 18752133 21793619 13639614 10570708 22474198 25460830 19757298
10612 19757298 18339734 25539048 22364013 5869942 10098305 17513327 8616518 7509359 13383852
10603 13383852 12096314 -2471076 -6333454 8760563 11400455 9587889 6581281 -2962528
10595 -2962528 -3996782 -3397458 2903444 9172765 5765995 -1926198 -15450358 -8371190 6885769
10586 6885769 2101543 1661749 2784754 -3755114 -12407692 -7303667 13451084 6589969 -8512876
10577 -8512876 -4647597 -6447820 -7768987 -3311489 7005154 4056305 -14541711 -9027512 -355526
10568 -355526 -1357375 2046896 -35187 -994389 -6870821 -4367260 6250205 293594 1382586
10559 1382586 5155334 5111219 9656197 7902589 11850652 11329875 12113339 22813085 16009583
10550 16009583 9671100 9252360 8950535 12454405 7601296 8293214 778162 -10536171 3153013
10541 3153013 12546852 9609766 2574582 384156 7623211 6641857 19836949 31704229 13888570
10532 13888570 1450630 3143355 12006078 13227968 10884253 17760291 2502229 -13195773
10524 -13195773 -4455136 2934876 8259690 9471572 12222653 5293764 -13491476 -7521669 2402895
10515 2402895 4270212 7743888 -1404057 -13200011 -24219858 -18492037 -1666649 -2639287 400759
10506 400759 1827172 -3148204 3032284 11092736 21781488 20037546 17396992 28726024 22786078
10497 22786078 13300108 9506367 6080535 5582701 -1336376 2850173 -800162 -18932700 -15205965
10488 -15205965 -5255968 -946016 -5239606 -6573375 5475537 3467186 9080627 20960347
10480 20960347 10010867 -754355 1115622 18454790 24620902 12533308 9792928 -4157845
10472 -4157845 -11665372 4820805 17974489 20311728 6822487 -364966 -2327961 -5716026
10464 -5716026 12179363 19379266 12324598 10142330 3548530 -1989268 -7165776 3763141 13194400
10455 13194400 378266 277122 -1166100 -14104798 -17530825 -9495991 2037249 -5775240
10447 -5775240 -8539842 1026904 -6109240 -8030207 6686 10982749 18575808 17094864 20356025
10438 20356025 14540511 8853291 14932600 17628865 22517716 15097592 -1927257 -8063690 -3859040
10429 -3859040 4881309 -1566557 -9544173 -7958209 -10916833 -3040265 12087201 15206324 1953314
10420 1953314 -8556757 5919358 19058747 17114642 9994280 -3215454 -12458966 -12874017
10412 -12874017 -4202150 -1817186 -15642372 -24848089 -22934983 -14109868 -7683323 -11385319 -16379388
10403 -16379388 -15134436 -1759583 10458744 6912587 -3748337 -11035772 -7331324 3177145
10395 3177145 12282681 8941711 -11097775 -22326387 -12556347 1519494 2548041 -4146967
10387 -4146967 -6533071 -10995545 -8039095 6244227 9488161 -756995 -4498325 7970470
10379 7970470 12770806 6491870 9033659 5575389 -2979935 3533840 16729233 11155191 -8177080
10370 -8177080 -3971376 6221452 -1665409 -951541 6572745 2210843 -7170469 3368913 20431010
10361 20431010 10005459 2905970 13059869 16478600 17596134 22062262 25229598 14961647
10353 14961647 8316792 16088168 12023352 11470072 20038489 14207535 2389346 890612 9846992
10344 9846992 5122433 3502348 24499323 22236884 -1139760 -5204408 9009033 12845643
10336 12845643 2971978 11176373 13380781 -10303782 -18403949 -5918296 3978788 -1505944
10328 -1505944 -5506020 2153859 -2076710 -7835937 -6293001 -310065 12883004 14924946 7439215
10319 7439215 293602 -3125375 -3036308 -4122071 11648882 23680866 2235528 -19207456 -12071878
10310 -12071878 8064179 9985692 6037177 15709115 8923127 -9353667 -5235934 14329857
10302 14329857 19277288 3406756 -1173763 6469796 1992126 -7832348 -10389316 -1309055 5233992
10293 5233992 -2834217 -8512020 -5945357 -7067900 -15709937 -11468318 12346589 14093923 -11746797
10284 -11746797 -17358672 1276148 5962551 -4380964 4492611 18411019 2521095 -12676365
10276 -12676365 2144385 15086914 5327243 -1978113 9366909 14567736 3014839 -3275087
10268 -3275087 151151 6006087 8697413 6034531 7774489 10345426 1757634 -9817634 -2321649
10259 -2321649 19233615 16027690 -2901657 389318 6703693 -6460675 -12076113 11176504
10251 11176504 23627979 -196149 -11877375 1936519 4492334 -2516395 5704427 21542523
10243 21542523 12641499 -5973935 -2412225 7019770 9686428 8419946 9072210 11051330 4174818
10234 4174818 -2835233 -3479170 5501455 15992717 9128645 2392021 4444874 1361555 -4707270
10225 -4707270 1127841 20949431 19689800 -1491549 -3947807 6179957 10895958 11582368 19964428
10216 19964428 23979155 7757043 1736123 14255840 23715069 22454526 15480829 15622090 13265823
10207 13265823 8071334 9279241 10914393 14949040 11988512 5696914 6588496 5256642 2803063
10198 2803063 2000513 9748937 15321177 3993788 -1465556 1059004 1878880 2780100 5595712
10189 5595712 9296240 607639 -4817401 1314831 659787 258430 2005992 3446003 862557
10180 862557 -3142914 -459495 -6105666 -9258047 -1928629 -35130 -832648 -3990806 -5337416
10171 -5337416 -7390609 -6579006 5258739 7024721 5734775 8765733 3169010 -2475262 -1401047
10162 -1401047 8060076 7953778 1551879 7306255 -927148 -16348214 -12757574 3373797 10903049
10153 10903049 1913240 2658354 2519353 -9543519 -4153560 11404484 17963593 7056856
10145 7056856 -5129346 -4012110 -8859604 -10727644 -7570460 -6520904 -3905952 -11227583 -15108906
10136 -15108906 -12644683 -9713987 -2872795 1971219 14570059 17336383 3416531 1677449
10128 1677449 10554649 21766680 21943421 17200675 17829448 7945297 3644608 10203645 15816419
10119 15816419 14592845 1835839 1363424 8156377 5665466 95481 -6031277 -2939740 -3554921
10110 -3554921 -6727853 1012141 -237770 -8824050 -11883206 -1680997 12211162 11425078 13747373
10101 13747373 17477029 15132513 17140854 20403359 24633269 21659736 16117338 14036649 5175244
10092 5175244 -494772 -4895801 -10013321 -9401251 -9811612 -10670369 -14860203 -16315934 -11250052
10083 -11250052 -8621656 -2275513 2831670 3638844 5502275 5792815 6883038 6888171 9991349
10074 9991349 13155478 9930624 11003605 13164247 11033167 9786267 13130990 17323185 13950773
10065 13950773 13773317 19953470 21182025 17041282 11103478 9152292 10883204 15398306 20593905
10056 20593905 19054527 12809924 3241707 297776 13043330 27107501 26497563 13950363
10048 13950363 8057139 7694452 4652636 11856189 22413360 18736825 4407080 746335 9520032
10039 9520032 8963200 7961933 17868733 25006168 23985939 19690374 21167367 20849157 19099457
10030 19099457 26569099 30045750 25271986 13939532 1441027 -1189559 1211128 6056596
10022 6056596 2145286 -8169423 -10078419 -12864542 -12872830 -6874334 -1816470 -2919632 -11295268
10013 -11295268 -7319179 240383 -2802544 -2690521 -265781 1598480 -914607 1047282 12026309
10004 12026309 12036296 10440587 13104366 13052725 14736595 16864211 22208633 18963230 8732002
9995 8732002 5659037 -1142178 -5572537 -4195250 -5881113 -12730414 -22938678 -21116522 -17343910
9986 -17343910 -20120991 -15642754 -10327707 -6668192 -4330342 -385382 5547380 1488885 -457199
9977 -457199 5146408 9892209 10720408 1298010 -7421227 -10613733 -11643940 -8046267 -7117908
9968 -7117908 -9113845 -15443611 -21514514 -15468006 -7330150 -4020823 -4918211 -5854565 -304680
9959 -304680 5343506 8893461 10369084 10232014 11654457 12043101 16592829 24434034 20746505
9950 20746505 8544344 5064062 11357175 11126748 4046493 3475908 660376 -13049733 -18063631
9941 -18063631 -10077242 -10326811 -19635372 -20574470 -13897793 -14141124 -15310543 -9084887 -9433237
9932 -9433237 -12183124 -3847675 6541859 9489160 6067924 2664542 -2183999 -2971223 10470723
9923 10470723 16786929 8108913 -518221 -6976257 -9346956 -7997921 219236 2904890 -11134093
9914 -11134093 -18878849 -19106664 -19907794 -19888275 -23050678 -22714045 -25475596 -26388821 -22580651 -27611626
9904 -27611626 -29686947 -28108958 -21409084 -8650797 -6124838 -6507790 -12297084 -15847386 -4079835
9895 -4079835 6416850 12640842 6439618 -1887868 622470 -3317185 823935 9959920 6979438
9886 6979438 -645224 -4269361 8208641 7522855 -6378006 -46790 4105697 455454 -382319
9877 -382319 3110336 235218 -20006032 -18753474 -4939755 -8084125 -9390265 -12518660 -15368980
9868 -15368980 -17442344 -14201188 -996330 -2464202 -273051 5109774 -1854049 2894125 7959232
9859 7959232 6446476 2256697 3578582 13372112 1338291 -5739425 4579252 -271063 -5831033
9850 -5831033 -3775167 4549061 2504423 -8019697 2538180 3368466 -6937794 -5335271 -2041598
9841 -2041598 4405786 231480 -4401586 -4312206 -13436383 -10203618 -5081133 -1101367 3462413
9832 3462413 -7669693 -10349347 -7738663 -6204921 -1368079 -2475110 4864287 3219304 -3938535
9823 -3938535 1733236 -1746587 -91285 9581095 19444378 25817910 14578066 10869746 11039119
9814 11039119 13005184 31866987 36473432 27558812 12826995 437444 5172681 8796967
9806 8796967 17719560 16841476 -1435692 -5484763 -6906659 -3204331 5300737 7845743 11791468
9797 11791468 5408870 7562284 13402107 4801523 9524153 17235632 20767564 19494424 10590634
9788 10590634 10192763 1887244 1562974 16366388 15737888 8179603 -4857352 -9662289 -4478497
9779 -4478497 -7767143 -2685781 -3902600 -14174775 -18949543 -22389709 -12065233 -9189137 -13232579
9770 -13232579 -5890533 -4981212 -3154722 -1824089 2483434 11101771 5011569 6068570 8127636
9761 8127636 743892 2581 -3332170 -3678477 -8318220 -15025585 -10345447 -12479297 -8198193
9752 -8198193 -1411755 -4926037 -723274 5418633 15805178 22151725 22438185 29962748 25552471
9743 25552471 23348392 32185863 32432000 29481745 22563858 22185462 21460569 10831582 11488376
9734 11488376 10225428 4998862 5448274 2327932 -526154 -10680904 -15217076 -6980963 -5527092
9725 -5527092 -2914829 -5126506 -11868345 -10635759 -4759082 11723941 20529528 17469164 19246715
9716 19246715 17864399 21232065 29298717 35665423 37805363 25164242 19467752 20796764 13868128
9707 13868128 13221058 16431538 18099675 11057546 2920843 9950320 10063684 9045201 20360866
9698 20360866 24176822 18350214 9420975 11470236 16249697 10166208 13771959 14316177 3658975
9689 3658975 -318609 -170426 3093325 1813578 4104436 11899083 6488489 6023754 9725163
9680 9725163 6606718 10120448 15539939 19185798 11643009 2698301 7645298 4850255 4743230
9671 4743230 12133775 8209138 27671 -4832559 3291348 6366434 -3619839 -1311525 -2551492
9662 -2551492 -8986881 -6485531 -3024732 -3759382 -16223023 -16261670 -2219667 -1238542 1679987
9653 1679987 4473008 1805950 93531 1980676 16948631 19502707 10091871 8813743 3413224
9644 3413224 876046 -740193 -725216 2621025 -4745726 -5465457 -4330080 -7661253 -4285300 -4458240
9634 -4458240 2405523 9513340 7076395 4713346 -4089926 -5102792 -3213471 -5841371 139089
9625 139089 -4358011 -15313974 -22642901 -23600964 -12023915 -8924353 -4437506 3998227 1300432
9616 1300432 3124483 8061812 20335230 31802858 29972464 35727229 38620334 36173964 35454038
9607 35454038 33115336 39658322 36801138 30142209 33879911 28858729 20023642 9521878 6616572
9598 6616572 9331163 -538823 -1700553 -2609511 -15090584 -23200920 -26764104 -18714410 -13560258
9589 -13560258 -11419588 -1585382 -4059553 -3360981 5435255 14426877 29963202 37984713 44505626
9580 44505626 45631586 40970202 45492510 41925538 41855483 47676645 43686735 39271311 27875172
9571 27875172 16952733 7350849 77797 11536411 14878355 8085687 641057 -13989524
9563 -13989524 -17245666 -10076830 6995168 18827223 10140742 6357148 1826885 861013 13876132
9554 13876132 21846843 25698142 19378075 13250888 12525537 2443676 496047 -503935 -1930987
9545 -1930987 4849806 990367 -6512023 -16468856 -21147755 -11554291 -1699865 15122990 19001030
9536 19001030 5148195 3177695 8127925 19422573 29327512 34657950 36306943 21087332
9528 21087332 14722620 17564187 12275828 11255610 8164462 5313797 -1760144 -12652488 -15788925
9519 -15788925 -25278882 -27100492 -19420640 -18202755 -14065265 -15260942 -17627110 -17258907 -13957441
9510 -13957441 2250289 12908859 20267519 25167643 18224767 19129457 23477633 29661313 38375746
9501 38375746 38597002 34183711 21531361 19223894 27229569 19548945 14637246 16606521 15703724
9492 15703724 13988867 14458836 18970884 5450339 -7280019 7183729 21237409 25921066
9484 25921066 19895522 5547689 -5347686 -5430945 13052039 22707899 16775775 9773450 -8442071
9475 -8442071 -15902829 -2040828 6438827 -2784437 -10151514 5170025 6477776 -10719317 -3717358
9466 -3717358 7881203 7212163 19933034 52277607 61400841 29781334 21233853 46834650
9458 46834650 63445584 73357119 76535517 60180637 27867405 14098381 30712439 37045721
9450 37045721 27974564 11125608 -11295644 -16899116 -10843814 -9428492 -15383326 -14380935 -4567561
9441 -4567561 -8991549 -7809826 4364470 -2704092 -14369758 -3121933 20810897 18856285
9433 18856285 169814 3075133 7617110 4591081 12486388 25501210 26261475 12709418 13735202
9424 13735202 26033865 24910396 17953539 10885393 10364248 11641957 5957828 383107 -10030485
9415 -10030485 -21471939 -28720400 -27473938 -15543366 -16017171 -26733945 -31833391 -31388866 -25313566
9406 -25313566 -18495682 -7267765 -1338698 -6793817 -7074326 -4838949 321129 8526448 13155303
9397 13155303 15876966 13840851 14645592 14620709 9908149 12067372 10943724 5417066 2498583
9388 2498583 415952 -4383305 -17605492 -24492554 -24872961 -28116462 -24229290 -20839835 -23612730
9379 -23612730 -29031222 -29023352 -20616096 -16502804 -8765452 1465531 106634 -2433804 -609257
9370 -609257 2936522 1078775 1563663 14673649 18504010 11396274 7686762 6631557 6975009
9361 6975009 9093335 21029364 28505032 16568045 4416062 899120 3326688 5366039 4304844
9352 4304844 4255446 -3060163 -10790458 -10419650 -7930093 -4033326 -3731991 -2453711 2903962 6004148
9342 6004148 7355629 1675097 -3878859 -2696598 -3253998 -5582536 -9150643 -13282249 -21810861
9333 -21810861 -35144357 -35790814 -28329231 -26291379 -23678296 -14932315 -6256065 -10787202 -13991700
9324 -13991700 1940185 18942299 28000406 36292301 40531530 31346376 16339345 20680060
9316 20680060 36842666 40833529 36498999 26286191 9985769 -3832424 -5494056 4014046
9308 4014046 7089537 3139727 -5347482 -21908151 -30190706 -25812924 -19192315 -14137835 -9400876
9299 -9400876 -5981668 -15650110 -23226155 -10533119 2158660 8634817 17583530 26207078 23036340
9290 23036340 11401263 17669889 30689904 31506775 33090202 34728305 29346611 16977043 12686726
9281 12686726 20852600 19433550 15902645 17121124 13231226 8669770 6249252 10526615 10995208
9272 10995208 7347407 15059450 18770337 16348739 15910934 15653664 16064553 13686274 21632283
9263 21632283 30187522 22196598 16381556 14997628 13957653 12472837 13504149 19261135 11981278
9254 11981278 5122646 8793733 6483272 4503307 6441969 11226308 11366750 9590946 16275699
9245 16275699 11131919 2362537 9366697 14363917 9998401 5055115 8085335 2293849 -14188999
9236 -14188999 -9520190 -1002940 -9196906 -14304790 -7663618 -4347855 -14845915 -12986929 3115253
9227 3115253 5651130 6640623 15102079 19567891 16624904 16122810 25019425 27395033 24738366
9218 24738366 24475258 18546404 13817671 12536476 8056552 1216203 -438628 3933154 267056
9209 267056 -6092863 -3437890 -2745571 -5583166 63308 12461653 13874757 4278063 3847440
9200 3847440 12320385 14240033 11289110 12366000 11974122 5046655 854267 5117425 6132876
9191 6132876 -3207154 -7242617 -451742 2653235 -1447081 -6107294 -7385116 -8588927 -6132536
9182 -6132536 3199614 2383495 -7589204 -12451981 -11547181 -5643092 693470 5559960 318312
9173 318312 -9584206 -3663139 3905580 5807651 10838882 13138274 9104376 93447 3111899
9164 3111899 9154984 3180539 5350506 7758814 -147709 -8488720 -10558900 -4670968 -5718738
9155 -5718738 -2365218 3965646 -6555988 -11581591 -7396356 -2086868 2381759 4627684 11442520
9146 11442520 3873973 -4944962 1870931 5286836 10971810 13487128 11812824 6788385 -6200618
9137 -6200618 -4329936 2139883 6271083 6984051 -8571710 -15537060 -15217774 -12154460 -2921036
9128 -2921036 -2504695 -3000756 -10867515 -11143303 7565459 13936544 14286284 10583734 8042895
9119 8042895 16096601 17814384 21106174 16771298 8233451 8328841 1586870 6240668 11432722
9110 11432722 1221217 -2859775 2228312 13543471 6178191 -3398116 13772726 19852550
9102 19852550 17244188 21411888 21807281 13231014 1041988 17603591 34689905 22845308
9094 22845308 11571801 1082633 -302318 8147471 14880247 18958887 7827559 964490
9086 964490 -3472149 -8532468 8785838 14028177 -658359 -5917244 2037573 4780516 -11864987
9077 -11864987 -5534258 14639431 2105728 -7388835 2926963 8022286 -5248636 -12308761
9069 -12308761 6045999 4497333 -9850943 -4528509 -266980 -331228 -3916682 -2990200 3859840
9060 3859840 7596896 16795655 13725667 11227676 22219125 14039776 5288633 15841443 24795671
9051 24795671 10112806 -8539068 5875170 5556845 -22727227 -17831614 6095234 7154325
9043 7154325 -7931329 -2840957 8100001 -8523973 -2604936 30974531 38478697 22894165
9035 22894165 7559241 6634251 9126334 16203327 29301779 18821074 5210614 893345
9027 893345 -8176911 -2045912 13323684 15775309 1712567 1719365 21305583 9433043 -7136861
9018 -7136861 11583423 24418744 14780208 10698734 23492043 12684435 -15042910 111440
9010 111440 23406539 13553356 -894804 -2523620 -3906239 -16514243 -12917105 1561974 -5961960
9001 -5961960 -12785379 -10516508 -7990635 -4287171 -3437541 990390 5625104 15799649 25446286
8992 25446286 19069935 18681205 21556571 14884512 14027523 21656256 24860722 8622412 -6434800
8983 -6434800 -5007918 -10642843 -14637471 -4170753 4100940 -2667462 -16805504 -13918463 -2523652
8974 -2523652 1449432 7710376 11255697 6178780 -4913957 -9103586 1489271 3536844 -6698911
8965 -6698911 -10096415 -5392716 -2610992 -7235852 -5978378 988314 56184 5825137 20739031
8956 20739031 24830947 15131260 7553995 16417216 27038232 26882785 22687505 13306085 6940616
8947 6940616 9218535 13349966 16793048 9784353 -2212340 -3582150 7503264 18991179 9514945
8938 9514945 -4268142 -1653730 2809158 9079952 17198984 16995679 3862697 -7422000 6863785
8929 6863785 21087106 16387321 10197679 3837210 1874360 2931331 4532305 3766164 -7098445
8920 -7098445 -10608449 -9189460 -8492652 -3199118 -9760692 -15735136 -7611072 4957871 10257102
8911 10257102 4357879 10176488 15652349 10867205 20208605 27388324 19254616 8885185 12497431
8902 12497431 22528573 12243227 4906456 7091346 980979 2338417 10127680 14846278 8066919
8893 8066919 -122953 6931273 9721885 13963291 21171739 16365143 12557804 10589540 11623632
8884 11623632 12736404 13746585 22162222 18752817 12787876 14303790 10702609 10575058 15869495
8875 15869495 24041604 22934613 10354393 8532227 9710745 10475435 15943539 18258242 17001521
8866 17001521 7817752 3550299 10501175 13451806 13031814 10364337 9921800 9207884 2761590
8857 2761590 4298757 9055501 6570158 3600941 5980539 11677314 10429099 8679771 15361178
8848 15361178 18903099 18571962 21746752 25788718 27006461 24103935 21659140 21613145 21126709 20646976
8838 20646976 17990240 15275725 15710357 10248276 4583281 8004491 11109814 8727925 5409139
8829 5409139 8455851 8189822 -2241985 -1764149 5958703 7247505 6073814 4136368 4646237
8820 4646237 -461783 -1415086 11927650 20392663 21987903 14866605 7576668 12057298 14208449
8811 14208449 19609185 23263851 17622025 7009758 -7576830 -2552976 6257301 1436724 1274604
8802 1274604 -363602 -1873832 -6158872 -3922267 10436105 8937006 10295128 18905609 19161193
8793 19161193 18444436 13347132 19777922 26726717 27304768 35615059 29582929 22196755 20126338
8784 20126338 19125564 29424917 29492509 26736214 18659050 6112180 9352360 6150218 6367490
8775 6367490 9768708 3399447 2503793 -1410858 3926271 7748799 2492956 14098104 20022226
8766 20022226 20553626 20420152 16432561 19359598 12105116 14683389 23902000 14884550 7007740
8757 7007740 -678010 1214816 4185779 -323672 8640010 8739058 3968463 5166777 6712675
8748 6712675 14785485 10092971 7651444 13202753 8320692 4684214 -1597860 -935895 1647867
8739 1647867 -6743536 -5000321 -3502225 -4297226 -2482369 -845232 7773634 4318986 -1289792
8730 -1289792 4696172 8862655 13270814 9884350 4097110 943303 -3744617 1568385 6030766
8721 6030766 6506510 6093192 -505227 998764 8841201 13819457 13747633 12326356 19476813 21646263
8711 21646263 16838440 17939362 16613209 11861415 13899351 23054165 25484747 14925517 8925525
8702 8925525 10440851 11890137 20423979 28521377 23744675 16780608 17651066 20116047 17689224
8693 17689224 20656955 28466427 23369944 18612037 24618816 20184862 6645163 4526869 17434336
8684 17434336 23391516 15595572 11272099 1312945 -11512018 -7613613 6271589 18344422
8676 18344422 15290862 2354268 -6217639 -5107519 11385772 23139106 28380409 35871488
8668 35871488 26847661 12494423 13670038 29448442 37288343 28705687 30318322 26724097
8660 26724097 5895709 -1429610 8509150 21107152 18097515 10422346 9695045 1549350 -627676
8651 -627676 7112066 19103783 29293990 19182346 7317394 7735829 12723212 14186247 11706661
8642 11706661 20206486 16616761 -4374540 -7120084 2608497 5298873 1060428 4279648 8445200
8633 8445200 -3822956 -6530459 4750525 11720282 16942503 17124830 11658341 6012684 9360570
8624 9360570 16287287 14673561 18454213 18439752 2158915 -3674899 9781648 15758900 5747421
8615 5747421 6346369 16159530 11094427 9063365 22629543 25193172 14531310 18806624 32021838
8606 32021838 29521790 22236348 20026813 10891563 3187495 15366442 24838053 9747274
8598 9747274 -1469387 521474 -3796280 -4794141 10773049 21505766 5343299 -5116577
8590 -5116577 7014152 7363597 -997932 2186551 12028394 11030960 -238224 -23987 -1836166
8581 -1836166 -7300524 864968 13748856 25323850 19327138 3514978 375742 8581472
8573 8581472 27539347 32454817 24063076 17350660 2262442 -2400605 5840651 20241267 25097871
8564 25097871 5143340 -2316529 3470956 7188799 10047320 12138631 25745169 19046593
8556 19046593 -1173721 3421986 13951340 16031757 5920134 9818434 18820031 -2976182
8548 -2976182 -9377405 10964733 24297593 16414416 3069408 13850158 11603295 757909
8540 757909 13632411 21042775 13703883 -4690946 -8669106 -818106 -6297695 -76483 4215423
8531 4215423 1986744 3557150 -2680649 -89152 7936568 24393057 32356622 16281659 15430308
8522 15430308 13909894 4194083 10451584 28204049 33480285 1291006 -11881955 9490082
8514 9490082 12909471 13870209 24701106 30574680 10271680 -3737566 25049983 33542526
8506 33542526 17250862 13680426 14307738 6844348 -6906195 4910979 10725348 -6191432
8498 -6191432 -2296071 2226604 -1824583 -6316003 -713774 10028081 538813 4624288 6154080
8489 6154080 -10609519 -9493543 -1443975 6521094 -1399636 -6657657 1165329 -8887079 2191855
8480 2191855 22675654 24449904 21757975 15774945 26490473 23966839 21800525 38241588
8472 38241588 25618555 12069257 6242214 6816187 8409835 -4941675 8653305 8550599
8464 8550599 -10140936 -4059233 4341839 17398928 9056519 7390712 22502741 4511166 4820261
8455 4820261 18004325 22290956 15380890 -6739394 8310502 12195735 3519060 17650029
8447 17650029 14747453 15750724 6813903 8476876 26816026 14919435 19111423 16015977 9271044
8438 9271044 18292322 1739038 2207908 4132043 7487763 14766290 -5158405 5830383 6014366
8429 6014366 -8373886 9663555 18423879 22460819 -1226300 -7969907 19947056 8352028
8421 8352028 10449366 18082864 12514938 10513792 356657 28465395 35060253 15229856 21822182
8412 21822182 18545759 30291885 28786609 21132510 31284846 11111339 9290704 12875742 13593507
8403 13593507 24698449 5122285 7949782 13186996 6922624 17888952 12338773 24194216
8395 24194216 23774912 7956176 16564514 9176930 13334089 12668558 7648133 22421486 5768353
8386 5768353 1050270 10890824 15520172 26633582 18621842 31976711 35522984 16769139
8378 16769139 31439506 38889483 39972762 34783851 30775148 39069071 19129919 23060059
8370 23060059 41612920 32577940 31306756 26634871 28365877 27561636 27293741 44878213 30896038
8361 30896038 19829504 24337160 16158229 22293326 25850110 24064732 13013614 5583394
8353 5583394 24751533 21666400 19683532 34735851 26452323 17582223 22346169 36276572 29682253
8344 29682253 9558761 20601388 17633216 37377 5847174 10683249 3776262 -7792834
8336 -7792834 -44692 9938135 -818221 5855746 15511011 12171543 13664657 13021961 13773525
8327 13773525 12919562 16037689 20695437 12925426 13320463 11337619 1785140 9996116 19580806
8318 19580806 17767590 11334205 10765320 12157043 3106291 8194338 21658337 16114787 9601705
8309 9601705 9235691 8926055 10177132 17511261 30734159 30713174 26126832 29586368 30554541 37965508
8299 37965508 44790148 38371434 30465545 26196818 25949174 23322370 22144002 21565878 4395916
8290 4395916 -2698580 13566136 21986030 19447036 18746535 22457024 18169409 15312476 35522157
8281 35522157 44406609 30525543 24359607 25260606 22309343 11711983 12628194 24178782 19118391
8272 19118391 12880841 11955395 9911736 9193615 7471118 21175963 33465999 24787964 13270687
8263 13270687 8532843 17803102 20674354 15263090 24375997 25189894 15524813 11968583 20549831
8254 20549831 32132595 22217068 21211710 38995692 41920973 32369823 23510697 32406838 36625300
8245 36625300 22143742 27642457 38573293 32586199 18428739 16040484 30473528 21392331
8237 21392331 10765914 29269945 42829891 35089850 13981375 13162807 26205537 24755708
8229 24755708 33484393 44711565 39509648 18604304 3718531 28394013 47937876 34989625
8221 34989625 22131811 24092815 30125940 14816864 12456523 32969698 21727564 1639647
8213 1639647 13571682 39593312 32719106 4884937 17649133 35951980 28638179 32505838
8205 32505838 47732160 48845316 26652987 21515100 38144126 33625630 26522191 32472864
8197 32472864 42243087 42433495 25253473 18079931 23207628 36027722 50913498 53103619 50801390
8188 50801390 31589257 7433013 12024614 34190023 45388260 29923294 15835337 14590894
8180 14590894 4035503 4541756 26781263 47208316 44924524 35021219 44525222 46039741
8172 46039741 32273195 35985718 53465672 52852254 28777324 20440207 24780062 8660340
8164 8660340 -1818308 12524808 19962968 4650499 4987806 31266673 29853545 7066998
8156 7066998 10552126 25208807 21852886 21639187 40386687 33378665 -4933164 -15374075
8148 -15374075 6666952 22054041 27082284 38943499 42333177 22531543 13550971 33445654
8140 33445654 60165621 71316445 66203512 58225751 47863661 34197064 29792833 46628391
8132 46628391 65303155 55736610 39150936 44179476 51594469 42573312 41536470 60827022
8124 60827022 64856688 50846725 48756195 52514036 39810901 18770790 21757596 43001512
8116 43001512 53628513 49011357 45611791 63275393 73834194 62261834 71361063 102410954
8108 102410954 108318757 83810060 88877597 100542004 42024654 -5810288 36250196 84531209
8100 84531209 65392858 44524469 67843019 43640436 9828548 87727132 184706053 172951630
8092 172951630 102126173 88765665 97981809 74115554 95299795 119193322 66563427 5319423
8084 5319423 -7500844 6390039 -9550658 -8120899 29031798 46116480 84585084 124499822
8076 124499822 135498813 149972934 180158826 229993273 247161459 260492737 262474544 183860871
8068 183860871 135252389 141850474 113454565 27980250 -34487816 -4825645 -35172300 -113713920
8060 -113713920 -115495972 -119562398 -141079554 -136504339 -58096989 4137976 -46739255 -52621184
8052 -52621184 -16145981 -2979189 36598893 114764439 194255631 139739675 72924926 123842949
8044 123842949 148552898 169437762 214944282 243630126 167617042 10295135 -13386296 -22581371
8036 -22581371 -86101477 -85713818 -91604440 -127426323 -204176605 -222595535 -170550216 -173394095
8028 -173394095 -144628803 -131775422 -161874838 -171005627 -198863908 -190632974 -196664540 -196042515
8020 -196042515 -173809337 -226468578 -227977801 -209983547 -215915464 -180545088 -139261149 -68022121
8012 -68022121 -66864353 -65859546 27194836 50800973 63840809 90964730 119413298 133168125
8004 133168125 89845757 143884599 186879414 145337546 150985823 179865174 245750883 264657378
7996 264657378 291241436 384454620 378787972 366412210 389376911 407492716 410360141 333174505
7988 333174505 317636311 286283960 136544364 87884937 -13657661 -63682330 -138634818
7981 -138634818 -194352409 -182186308 -223839420 -223302795 -186070756 -178579670 -146225497 -153905236
7973 -153905236 -139539020 -123084330 -118260574 -81104489 -98700663 -82452470 -47957938 -60366811
7965 -60366811 -40429645 -53463334 -40192443 -74084916 -84539002 -41414596 -61842186 -84451386
7957 -84451386 -104496843 -112079038 -108570695 -146731192 -112684994 -103627224 -146476299 -119884753
7949 -119884753 -97022789 -79945548 -87853313 -91903665 -54792643 -80515003 -106441530 -113992496
7941 -113992496 -151723426 -173835878 -205628792 -189753825 -183628354 -228725694 -230759800 -226270063
7933 -226270063 -205529484 -187299271 -169871269 -120717922 -116115839 -94619260 -39198105 -13268791
7925 -13268791 -13651563 -48028153 -52587637 -52181318 -75741230 -69178961 -89569397 -128985090
7917 -128985090 -155732121 -164637300 -137499833 -124892240 -103997034 -88667059 -90933012 -70866916
7909 -70866916 -57904958 -46424578 -28602568 -20963712 -25855075 -57529697 -70969451 -75402854
7901 -75402854 -100582164 -104846053 -93676979 -94225247 -112984785 -115961000 -90820604 -88605675
7893 -88605675 -90199759 -63974596 -45034288 -54304221 -64902061 -51061576 -48648751 -66817181
7885 -66817181 -61503541 -43411159 -49546676 -61713897 -48479645 -35528838 -44970022 -44978819 -25918067
7876 -25918067 -19326843 -26901227 -19229501 -16490839 -38729963 -51033700 -42574272 -34444952 -37386953
7867 -37386953 -36385811 -34775702 -51392768 -52126681 -33174904 -22707681 -17237693 -17118149 -20160015
7858 -20160015 -33472675 -40605584 -30764769 -35758500 -37005478 -31582770 -38983049 -45012619 -44206185
7849 -44206185 -29188505 -22678220 -20919844 -2551455 -2808379 -9198476 -6665298 -5631199 -8025160
7840 -8025160 -25075910 -28237955 -26506909 -37416812 -40552552 -48443671 -47925846 -45241481 -45465440
7831 -45465440 -24427086 -10771381 -8813553 -12462900 -9846333 6897900 -691584 -5221604
7823 -5221604 4362217 -4585410 -18614932 -28743142 -23771167 -29304416 -45807362 -32886745
7815 -32886745 -24254924 -26563670 -25317991 -25310322 -19194053 -21893733 -16229864 -7549248 -12590729
7806 -12590729 -10157204 -19403400 -29873176 -28300291 -31511933 -31495692 -32900009 -24147648 -20545695
7797 -20545695 -38117195 -38079884 -31043543 -28591425 -23452801 -17522232 -7824186 -20685113 -37135660
7788 -37135660 -32327906 -25316458 -16060855 -13506744 -9495000 -9279244 -31499402 -38051459 -22275873
7779 -22275873 -7099975 -6394041 -17353299 -18913948 -33285793 -48191760 -31912003 -17335229
7771 -17335229 -21424584 -33172792 -32846147 -27649995 -33478629 -22429100 -10749770 -16581859 -14173995
7762 -14173995 -6325893 -2674116 -9144982 -11688337 -7029964 -14193320 -8883799 1722805 -7063656
7753 -7063656 -15611387 -15749496 -11316312 -14970390 -15322049 -3471440 -8950612 -14651185 -8912601
7744 -8912601 -12609648 -21542354 -25177512 -12698959 -5519861 -11411372 -9964933 -19160225 -31791595
7735 -31791595 -27321446 -11362890 778198 -10590417 -21755999 -26215090 -36987820 -34098851
7727 -34098851 -21289623 -13303627 -25396745 -43607887 -36987340 -33950817 -38815404 -30141754
7719 -30141754 -18722753 -19953783 -34495205 -27703058 -13777541 -26050794 -28822088 -16139640
7711 -16139640 -11609701 -19733315 -22492740 -11855334 -20910732 -29078186 -15464723 -10212754 -10540231
7702 -10540231 -11608581 -12866050 -18239892 -22978346 -12743597 -14090681 -16305621 -5156801 -11531235
7693 -11531235 -24182604 -22862511 -11337608 -11305648 -14911741 7421496 9763684 -17250850 -20634276
7684 -20634276 -6170113 -1490707 -8378684 527612 3905968 -30762408 -46133114 -28356253
7676 -28356253 -17314887 -20030900 -25238155 -24621844 -40436748 -51638688 -31232060 -15519214
7668 -15519214 -11782192 -15943650 -23009778 -23776775 -25007375 -13705040 -3091745 -928070 2997565
7659 2997565 -7849513 -14339842 -7569414 -1776557 3079317 1638883 7466200 3076776 -15220095
7650 -15220095 -9328279 3392066 6688605 4748810 6096671 13227058 1609162 1927826 23715598
7641 23715598 28470841 23613617 19082230 24385316 24718549 13865178 21804211 20874936 6062696
7632 6062696 466231 -1002809 4159377 -3524435 -10894556 -9894908 -18829735 -13542019 -8138358
7623 -8138358 -8118408 -5708750 -16395869 -19734358 -21924865 -18060018 -8368981 -18845858 -19113951
7614 -19113951 -19964878 -30296114 -28316352 -23260782 -8824371 -10906127 -17928436 -7726510 -16523431
7605 -16523431 -19682054 -10625132 -2486202 549666 -14720004 -11035293 -9948030 -21099037
7597 -21099037 -9707830 -2440024 1682448 -2584429 -3561145 10708731 2400700 5946270 18065477
7588 18065477 14821177 14720393 7078191 11132210 7035452 -5991843 2238705 -5860544 -12507553
7579 -12507553 -13094396 -16849962 -11224537 -22653364 -25662315 -28504827 -36990513 -22388592 -21877464
7570 -21877464 -23844096 -27144518 -38968973 -36082572 -33455514 -9510092 4745012 -11324204
7562 -11324204 -9118343 -7556675 -3829051 3595992 15453311 30206038 4549674 -11243348
7554 -11243348 -3779727 -11623149 -17874701 -20811672 -9317264 -16619554 -40440886 -30776259 -25803144
7545 -25803144 -25376513 -16238452 -2876074 10024313 -7155803 -12281132 -723741 1532897
7537 1532897 8652024 4763114 3369158 -3733485 -17801660 -9432172 -2832887 3943146 1699755
7528 1699755 -7032250 3897492 7930046 11455927 14568487 12657425 12474190 -1535822 625100
7519 625100 11593203 4746704 -6872582 -19557648 -16929073 -16866008 -19256889 -4592095 -3761798
7510 -3761798 -16103582 -27326691 -22856381 -9523917 -14535614 -13417231 -11217099 -23974743
7502 -23974743 -36302794 -37417473 -22106469 -19644250 -22806818 -12130963 -11339638 -16758180 -16604621
7493 -16604621 -508746 13847554 8703407 10255791 8678116 -4935572 -15483339 -12814692
7485 -12814692 -550367 -10190635 -25489859 -27970483 -32286759 -34182119 -30620529 -15113814
7477 -15113814 -9988056 -23786151 -22783788 -13416226 -6545798 -6951457 -7033943 -25051 -9011603
7468 -9011603 -15753727 -8501862 -132551 2128881 -9613150 -10181798 -3069091 -2818600 -462833
7459 -462833 392468 4093034 -7619724 -26238292 -18641928 -7366780 -11674996 -28529652 -31417236
7450 -31417236 -23335980 -36518346 -35743682 -11172896 -2300601 -16985257 -23590716 -610189
7442 -610189 2873794 -13285174 -1621575 13375916 3347656 -16679934 -13672471 -5447221
7434 -5447221 -20251234 -17793848 1533550 3273612 -10461597 -17378296 -3276901 7569095
7426 7569095 14506804 22931380 16780075 7129105 -1579852 -3043592 4561295 6037688 -2703477
7417 -2703477 -21097384 -27193044 -23491910 -30705831 -30679416 -20352630 -17156096 -27476827 -30390954
7408 -30390954 -17911986 -20193130 -25870317 -14291164 -4802159 -12598522 -22391092 -14375384 -11210128
7399 -11210128 -18648513 -10816673 1965639 1645536 -6588927 -3606675 1412980 -6526856 -3590502
7390 -3590502 8473137 7415469 -7811888 -19464924 -17843281 -22109646 -23275831 -14223339 -16332605
7381 -16332605 -28665160 -36913985 -26484934 -15469106 -16473827 -11010289 -7850882 -7671687 -6217014
7372 -6217014 -2839580 3592854 287359 1411889 6433731 6674540 8603885 -221743 -4898256
7363 -4898256 2339838 10110509 11212496 -683780 -1126369 -821200 -9141512 -508013 7372223
7354 7372223 -1170206 -19539584 -19406162 -1137547 -6519739 -11697769 -4581299 -8047409 -14033011
7345 -14033011 -10965194 7281177 7600312 -6956737 -1830411 -52350 -2751446 -3524310 -2504242
7336 -2504242 -590528 -10856587 -11842324 -11048981 -16548886 -12705024 -13958283 -11804289 -8468569
7327 -8468569 -9801186 -8253908 -11952610 -5769392 -1815860 -5346537 2223366 2704619 -1762520
7318 -1762520 -7372126 -8582615 -1650436 -4646054 -1232750 1371974 -9707709 -15460209 -15742707
7309 -15742707 -7602242 -6268991 -11951847 -9652212 -15995641 -20589124 -18407767 -16660515 -15138045
7300 -15138045 -20321541 -14194872 -7038955 -13293396 -16633458 -16853816 -8786882 244608 5978546
7291 5978546 10694877 -122176 -8739266 -3820957 5792011 14762193 9737247 35823 -7905431
7282 -7905431 -11083505 -5155686 -6171243 -7829671 -8050473 -13161147 -13918435 -12948527 -11954570 -16013695
7272 -16013695 -16356413 -1589305 4153869 -2660937 -7151045 -6426944 -554998 4740618 13138218
7263 13138218 15439562 5344230 1970705 5388967 10496657 12262459 6314615 3688552 4297170
7254 4297170 5591707 495489 -10615444 -11146028 -9737088 -10811010 -7965230 -10498756 -21220005
7245 -21220005 -33712314 -28765321 -12790511 -12412503 -18120267 -21142726 -21801249 -19564092 -17367144
7236 -17367144 -8230050 -4316181 -7962070 -7758298 -6709432 -3409651 -8219975 -12907169 -2072997
7227 -2072997 4223771 -544365 -11875544 -15933519 -11538026 -13251625 -4544026 3738366 -6099620
7218 -6099620 -17904643 -20059950 -6070987 114402 -3626263 -982788 -5791845 -8431618 -7831540
7209 -7831540 -4719976 3024854 -1741331 -2474566 -560494 -1489121 -485549 -7328339 -460348
7200 -460348 7819477 2666424 842505 -4049782 -3088203 -6468713 -8345444 2879591 -5358160
7191 -5358160 -16104159 -18824465 -18565133 -14204237 -21187311 -15591157 -12486264 -23460528 -21078689
7182 -21078689 -17984286 -9603880 -8855997 -11621561 -575164 -6983028 -9700512 -2950732 1382415
7173 1382415 7193452 -2239035 669897 3798255 -4342729 2399643 1895946 2941113 571805
7164 571805 -6224897 137755 -7433280 -8546380 -7725941 -13157678 -4344664 -10904847 -16866901
7155 -16866901 -17140538 -17573626 -7675391 -11944320 -5755856 -2894624 -18025907 -11253415 -2682286
7146 -2682286 2770010 -2091576 -10055396 -1630172 -10800614 -9998501 551687 -7359818 -9866767
7137 -9866767 -12257482 -4389454 -2208826 -9891080 -1136110 -7358368 -8838347 1004948 -1861141
7128 -1861141 -3420382 -11844244 -8618080 -5540110 -14922065 -8916583 -11260535 -12159023 -7304896
7119 -7304896 -9694390 -3926674 -9237552 -10601192 -1900017 3201187 9520672 -5740229 -15426872
7110 -15426872 -9172335 -13271798 -11940226 -9461007 -8785991 -21150962 -37719921 -25020489 -16657646
7101 -16657646 -19305699 -13805643 -7847041 -5214000 -18401727 -23349023 -10745685 -2671720 3648882
7092 3648882 -439946 -6741950 -14353315 -30919452 -24570174 1108216 13197801 -2573825
7084 -2573825 -20656432 -12224567 -8518048 -11262601 7990301 24185573 11339272 -11004577
7076 -11004577 -8087096 3378854 -6136824 -8741014 5493512 8905536 -6673312 -23540210
7068 -23540210 -22719346 -14434011 -10172413 -2604846 4486703 -2033345 -24047573 -34589689 -12668238
7059 -12668238 8162639 2150389 -7134592 -7020399 -12188689 -20536509 -8513454 12630497 8181351
7050 8181351 -6337716 -4580202 323215 -3304599 -8328036 -5147137 -1263047 -5600602 -9854816
7041 -9854816 -12703507 -12478298 -13019759 -18398216 -11734360 1081952 70639 -8016445 -6432282
7032 -6432282 1732459 -3573624 -6931969 6198380 7200541 -5485780 -9663758 -5587861 -7618534
7023 -7618534 -12637437 -4102072 1443718 -3904341 -1105117 3678967 2733579 1579034 5990135
7014 5990135 11235265 10280333 11575570 7675787 -7106651 -13858876 -8704125 -1206469 -417650
7005 -417650 -6222185 -13669621 -21705374 -17990127 -948513 11468657 10151636 -212132 -5276457
6996 -5276457 240522 8021903 13643466 11493646 823464 -7951928 -8213711 -3485249 -2936273
6987 -2936273 -8145755 -12247219 -14232207 -10884206 -3808414 -5212190 -9627337 -5441395 1572030
6978 1572030 3374384 2566036 5703751 2071102 -3534219 8778032 17247678 5060002 -6279310
6969 -6279310 -3739291 145503 -4242194 1098544 3501368 -17470467 -27241222 -15073424 -6516919
6960 -6516919 -10417295 -13404857 -10228889 -19463087 -20811849 -3039371 1868097 -3187084 -6405007
6951 -6405007 -5377183 -4859398 -7408405 -2599395 -6786879 -13899382 -11414775 -14851438 -13726103
6942 -13726103 -9958897 -11697101 -14530753 -13106487 895276 2439445 -2261039 7087195 6343071
6933 6343071 -1342953 -2673959 5294468 7427910 -8181402 -10228702 -6778767 -14853877 -19693072
6924 -19693072 -17893772 -7443479 -8181569 -13093982 -1259795 5050477 2102792 -178444 11085645
6915 11085645 26321471 20209288 17776071 22235819 13699033 3559116 5332805 19519125
6907 19519125 17496416 2326842 -1732307 -7950629 -12342337 -8506480 -1829988 2950152 -2943737
6898 -2943737 -9084044 -12139780 -8822198 670863 636363 4468710 15799172 14894921 4988528
6889 4988528 3504313 11720841 10593101 9575852 23570801 23517669 1005265 -13135055 -8568665
6880 -8568665 -4429937 -3627050 3842958 2621474 -15656827 -28191552 -21301465 -9553835 -4069147
6871 -4069147 -2036149 -4807677 -10933025 -17819159 -19633449 -12580438 -7565378 -7202066 -7691779
6862 -7691779 -5719868 -7710723 -18238725 -14445436 -1208652 3129754 7031469 9587179 5356133
6853 5356133 -8055463 -11466786 292429 -279689 -1497676 -1150511 -11475304 -19884580 -23795424
6844 -23795424 -19170776 -15375738 -8928659 2596385 -5676418 -8970072 -3406684 -8208672 -4286179
6835 -4286179 9049277 19490988 6795850 -7464067 -537211 -12287786 -20025939 -2979540
6827 -2979540 4040027 -5951984 -20229587 -16377835 -20249535 -30467783 -8882760 1672659
6819 1672659 -7156936 -12731517 -17511103 -17432405 -18511916 -1204377 10881924 -1873291 38597
6810 38597 -1387544 -3929571 6151107 14241590 19297908 7820639 6248425 10238441 -932448
6801 -932448 4185978 4565944 -3599230 -6013831 -10573519 -7693351 -13244570 -11122069 -4075772
6792 -4075772 -14627768 -9807609 -4653653 -6377781 -2657245 -2041789 4107029 -4800518 -10903263
6783 -10903263 -566238 -2958047 -1220122 -1634992 -2910667 -1158617 -11953932 -7737145 1157420
6774 1157420 3259272 4553417 -1933648 3824706 172513 -9595740 3392848 12280894 12380826
6765 12380826 5057447 3119964 10745689 5063617 11718165 23075938 20462291 17482044 9637591
6756 9637591 12172891 16299061 9861768 5934454 522947 5678385 3820063 -9651094 -4790204
6747 -4790204 -3947600 -11492090 -8338193 6048732 13277500 -4985451 -8224268 6201184 3691370
6738 3691370 3261588 8720202 7809282 -2979837 -9571743 743445 676609 -3265690 1138765
6729 1138765 -1196651 1184398 5511956 4572902 2232004 2663997 9418928 4255923 -2984502
6720 -2984502 -472759 -8669156 -17173401 -16048972 -15465563 -22207369 -31148214 -27490952 -23444904
6711 -23444904 -23860078 -19060758 -20541277 -22025809 -15604738 -9230848 -5340954 -4373453 -3045622
6702 -3045622 -7445204 -13893100 -8180996 -4227576 -8710587 -11588168 -13451930 -17017077 -24334511
6693 -24334511 -27894978 -22543841 -17967501 -19381706 -26888968 -30454500 -25930304 -26673698 -24224352
6684 -24224352 -10184704 -5764499 -16765519 -20171608 -4954383 3426725 -5667007 -4083931
6676 -4083931 2911043 -3980778 -9866973 -5918208 -3220600 -13258257 -22187811 -15473361 -9302227
6667 -9302227 -8570467 -12066068 -14606480 -5246494 -800736 -2413816 2995482 9897611 8262902
6658 8262902 -2117964 2180960 8707876 -9066676 -18913503 -9176083 -2550061 -10222802 -20019873
6649 -20019873 -16421424 -19092652 -19115049 -891422 10862595 11320914 1627560 -4100514 5387675
6640 5387675 12973831 17282986 11811272 5632199 3960176 -8819564 -9806349 -1838621 -5074778
6631 -5074778 -10414342 -9935555 1326318 -1553675 -12782345 -6203453 -2139766 2326892 9460659
6622 9460659 10439823 5506410 -9218734 -10107786 -2477689 790357 5859642 -3417170 -13442224
6613 -13442224 -16412557 -17839763 -12051401 -12571560 -11890967 -13076088 -19219060 -16327166 -18693312
6604 -18693312 -19853028 -16942651 -15742291 -5728730 -2240577 -6126026 -11993272 -14919768 -5113964
6595 -5113964 -710152 2972701 5044178 -8856033 -19372264 -19476019 -12709775 -9970669 -14269674
6586 -14269674 -15057172 -23345724 -27339159 -18391471 -15928317 -16579110 -14230215 -12113420 -16077727
6577 -16077727 -19404416 -13736663 -19184352 -28602548 -22198042 -18333067 -26958795 -31716378 -26478085
6568 -26478085 -26337433 -28798494 -16605544 -6923997 -12105149 -11165302 -1817268 -607602 -1478173
6559 -1478173 3821468 2093950 -9335500 -13342203 -11504731 -20247731 -28319329 -25745158 -31533356
6550 -31533356 -42368470 -40827662 -33364599 -32034973 -32045271 -21543792 -16494562 -20834524 -12570907
6541 -12570907 867804 10488516 15289083 17199733 20883607 18114628 21089604 29193190 30421090
6532 30421090 30900091 22497212 14315412 9970837 2337971 -118212 -8262586 -13087168 -14331032
6523 -14331032 -26067850 -34061911 -40047295 -36423354 -27842192 -24131610 -9255222 -8075229
6515 -8075229 -19026200 -14625596 3306633 24374519 24219337 23072173 24190712 4325927 1281665
6506 1281665 15311086 18964282 5066236 -12830953 -11032805 -20472134 -29866799 -18715211
6498 -18715211 -22311739 -28655102 -26882074 -19759095 -18675987 -29645053 -21218374 -15725379 -14053842
6489 -14053842 2716573 1076906 -9750519 -14339461 -6634402 5373193 3550427 10932072
6481 10932072 3297942 -18558568 -12702631 -4214652 -5822647 -15072886 -20058390 -21938186 -39119374
6472 -39119374 -33598719 -20973285 -31445422 -35091768 -30289557 -21503318 -22285932 -21573599 -4192980
6463 -4192980 -4154875 -4439139 5587431 9695787 13679386 9288646 13601225 20990041 15191010
6454 15191010 13872555 9813157 10299155 8907442 -1070632 4419145 3178192 -9192097 -17347370
6445 -17347370 -21167080 -17307347 -22377585 -21716997 -15813692 -27696330 -31961967 -24262344 -10071822
6436 -10071822 6211485 11030178 14257972 12359148 18970379 38359406 45888969 53929862 55051443
6427 55051443 40984126 33277702 36632466 43596796 32210730 19934572 25982572 17548091
6419 17548091 5297768 9218109 14053658 11343997 9315121 25271873 30373468 14299886
6411 14299886 15693974 24630658 26587747 27987818 29900581 26418651 9674543 7765153 18909059
6402 18909059 14872465 11786719 13404939 11886162 7958730 8669822 19715171 17557718 13013243
6393 13013243 23622293 26733886 21636723 18512975 24203641 28470263 21249824 23058024 24869594
6384 24869594 17812297 17232112 19681024 20026130 10977472 3718270 8606670 10525085 13314382
6375 13314382 11494627 1320656 148656 8010477 18817861 21500708 20185519 22511432 16594726
6366 16594726 18618319 33398134 34991064 20008833 9720492 18811155 20289995 4735873
6358 4735873 446790 -45399 -9936200 -12865653 1912783 10858423 -7176576 -17612936 -967925
6349 -967925 12894568 13852340 14978637 17439206 8622920 -578824 9318324 18874752 11332015
6340 11332015 412565 -1844460 860278 1365845 1628486 1986664 2384246 6513344 9693301
6331 9693301 10578716 13543972 11717564 1326723 -926017 10537779 11151045 -4463100 -11311357
6322 -11311357 -8299902 -16425509 -22394615 -6607670 1227254 -15644558 -23727134 -10408470
6314 -10408470 -3801098 -9316875 -3252551 1981280 -12172733 -17942653 -5340848 432775 -8733275
6305 -8733275 -16101809 -14901844 -14550758 -7365993 1974231 -3823298 -10194801 -8517840 -4555396
6296 -4555396 2555957 10881342 9675406 -6484264 -7822110 8132264 6586427 -1083787 3068700
6287 3068700 4605754 -3764566 -2708235 11155040 2011519 -16759075 -8810487 1500557 -4558889
6278 -4558889 -13026118 -14815757 -21410993 -30671128 -18910787 -7371705 -13613481 -16861388 -15751843
6269 -15751843 -12688397 -6817173 1868418 5304695 -821623 1986169 2235859 -9503282 -10900727
6260 -10900727 -8343655 -15077700 -24034106 -22138501 -19831462 -33266366 -33976422 -19575028 -19506546
6251 -19506546 -23408370 -15308801 -3428143 -5010948 -9665241 -2133649 -1720905 -5560135 356977
6242 356977 3514440 -2531304 -13071922 -15963830 -12234622 -8905375 -4735948 -10507356 -19107185
6233 -19107185 -16154309 -12681308 -13044410 -13638642 -14098862 -19768339 -25982696 -17359995 -11540859
6224 -11540859 -22737435 -28557186 -21135110 -13770643 -12743431 -9782442 -5056669 -9924216 -10573907
6215 -10573907 -464895 2986363 -822859 -4589361 -5556960 -4728930 -4251837 -5035505 -12005964
6206 -12005964 -13859130 -4254953 -1572411 -2780717 1343275 1582386 -3710765 -1777629 12420006
6197 12420006 15443351 4543916 6439362 9985379 2455740 -574824 7175262 14503301 10993306
6188 10993306 11510536 14982813 7235157 6629160 15361464 21040382 21989170 15819759 7345935
6179 7345935 -2776124 -3072621 4276827 -1575923 -5593110 -4728251 -10902403 -15785153 -13296288
6170 -13296288 -3872223 -4057698 -5765421 6623805 7956185 -574895 -4223276 -1721217 4662665
6161 4662665 3765928 5913172 4968229 -7529290 -12799557 -11827017 -2168877 4835615 -1377559
6152 -1377559 -3968666 -7884222 -9694146 -6839946 -3773394 2855572 -3616328 -10589847 -7586828
6143 -7586828 -8700522 -6354057 -6087154 -5616748 -2865540 -3385414 2080414 -662520 -5445451
6134 -5445451 -3186142 -7772184 -5811911 -1998707 -6802263 -18457108 -28534420 -19767296 -15901276
6125 -15901276 -19455549 -13091122 -15304104 -20600205 -15839551 -10337 9548802 -251454 759284
6116 759284 7274391 5134895 9459636 11398029 5692642 -5658254 -7823468 1109708 -4315344
6107 -4315344 -10766330 -12257208 -18837459 -19315983 -16261092 -13792433 -20531161 -28867816 -22797631
6098 -22797631 -21661562 -24212532 -22138452 -23422915 -23574213 -21368509 -11754040 -4918663 -8667516
6089 -8667516 -3463102 4004773 6089216 9607121 12080772 13371684 8583071 6642814 7656135
6080 7656135 -2582445 -8879479 -6391361 -8581394 -14602985 -18951763 -17839109 -20922980 -21910295
6071 -21910295 -9382260 -6209961 -13048983 -10030276 -1751851 948734 -2326950 2367141 8380563
6062 8380563 4436837 8623943 13736785 7253316 2172421 5137954 14760533 17218948 12254907
6053 12254907 6038714 -5166074 -3484045 6091202 5909702 3407477 -3349575 -9515009 -10705583
6044 -10705583 -3614049 9411639 6399939 4383614 12452481 12445778 11149485 10177403 13831767
6035 13831767 16187338 11144600 10133842 -1349332 -14898148 -18394412 -20917217 -14692096 -16218984
6026 -16218984 -27630335 -34421004 -34742122 -24286881 -22625599 -19837398 -8805243 -12810949 -13676128
6017 -13676128 -8142043 -6254346 -7690852 -8084959 6594499 8418254 -1617342 -1600822 -6597913
6008 -6597913 -3710994 7858100 14641777 10830016 -1899190 917850 1387765 -3144690 6071850
5999 6071850 3562618 -5614698 -6208511 172250 7021 -14369211 -9465336 3120320 4376726
5990 4376726 11706085 12183008 3549462 -4390802 1626193 17886185 16048155 10593750 4517514
5981 4517514 -8690381 -9502251 -4185520 -814222 -5007522 -8514534 -2040425 -6542394 -11614089
5972 -11614089 -5895900 -739682 2882338 4080075 10620682 11258955 -1443516 -1591911 9827345
5963 9827345 14414576 8536825 6628698 14808644 10025925 -862772 2214723 5306577 989457
5954 989457 636096 5359322 -866930 -17467024 -22531438 -18615654 -15225575 -7629365 -8649573
5945 -8649573 -20437932 -17915695 -4384757 -4181745 -8342325 8614921 24213665 12398513 12858590
5936 12858590 30137750 14855688 -9309461 9628813 41781654 27823853 -3940166 -2142366
5928 -2142366 -3826198 -16444526 965438 25576178 18603215 -8931188 -13037370 1730350
5920 1730350 6250771 13349467 13603268 11175082 18970955 10571752 -6475729 -7597209 10691709
5911 10691709 17337519 7043126 22745140 21296837 -19412237 -24272285 19751352 49102452
5903 49102452 23976387 6238410 19370137 4131054 -4767413 24231284 49301789 36689117
5895 36689117 5441813 11518000 23484456 14708318 16249496 27322262 47007473 40379012
5887 40379012 9268474 2073552 11441889 26180570 29616408 36908330 44266066 380191
5879 380191 -33671588 -4951416 38357138 38708717 3572469 4804 -5516407 -33745585
5871 -33745585 -20106796 14783151 20591541 -12800676 -31485382 -15674469 -23481822 -29953608
5863 -29953608 -12590033 7714018 18917309 38780 -16243543 -15490226 -1722589 22452440
5855 22452440 31920079 45253116 33088364 -18491594 -32091855 5299563 37209904 15926850
5847 15926850 -10933445 -8664210 -37753574 -59459973 -25209910 7319784 -8468250 -38651560
5839 -38651560 -24513984 -13918543 -29475102 -15857365 4171628 7293249 4442218 3935084
5831 3935084 488924 -13982346 -9306881 -3554310 -7258029 5315267 -2330060 -34467203
5823 -34467203 -46047928 -25535969 -15306492 -34137695 -27110794 -15552817 -39545826 -46470606
5815 -46470606 -20541437 -6754128 -24434389 -26175304 -324185 1672914 -4066660 3219463
5807 3219463 3805445 30293 3785878 18639861 22204716 12740266 3196952 -11122503 -9071137
5798 -9071137 4675008 3761951 -4928925 -10096730 -11585919 -19981483 -20421029 -4910000 -1592313
5789 -1592313 -4770789 108430 4453518 1142745 -5744379 -1740379 6776113 12406005 13956007
5780 13956007 3824335 -5299461 -7965168 -8338436 -2050994 5953049 5471169 -5823994 -9963871
5771 -9963871 -1790483 -716854 -978873 6830674 11249846 9143303 9730863 12334986 6355032
5762 6355032 3552268 16763925 25765787 21137845 16735778 14118347 8046249 7972568 19897439
5753 19897439 24319731 9792770 -1774100 -393278 -152866 -4740026 -7590631 -8269987 -13606154
5744 -13606154 -19301015 -14809417 -10492975 -14992814 -20115764 -17507947 -8543429 -6486167 -10102221
5735 -10102221 -11256272 -11576857 -8492080 -7762644 -9738939 -9289158 -10180161 -9752068 -7368918 153444
5725 153444 2824458 -10082029 -10602257 7046049 16676264 11506895 6943438 11068146 2206162
5716 2206162 -5675170 11449796 20882063 7668602 -7846021 -8397147 -5813032 -13575789 -8108612
5707 -8108612 153985 -6454927 -14672513 -20922055 -18218071 -14621642 -13120280 -8580979 -10652040
5698 -10652040 -10320595 -15249379 -21337096 -10500385 -3029752 -2110669 -3660940 -3388841 -1382795
5689 -1382795 -9389333 -5979903 2436616 409835 -1025535 -7653721 -9836028 -10758962 -13770798
5680 -13770798 -9071620 -8542144 -5590540 -8418618 -15500278 -6091741 -1422202 -1255972 1499797
5671 1499797 3195182 4289100 -2841148 2175392 8429541 506937 1830500 2182834 -533626
5662 -533626 -966989 378091 4565370 -1720205 1830628 9332014 969506 964500 4872483 4398829
5652 4398829 509152 -802748 5500248 -3804204 -11771745 -6725359 -8519623 -8314987 -8865069
5643 -8865069 -8653782 -9308166 -15621743 -12737814 -11040293 -6437030 751969 -5720784 -8599462
5634 -8599462 -9108970 -9060529 -3935275 498338 7915627 2459747 -7824749 -6181753 -3739854
5625 -3739854 3384080 5271592 942723 -330419 -7737770 -12071743 -11168362 -4659428 769077
5616 769077 -8151383 -7538270 -1156467 -6448907 -7419203 1914084 14373827 12955994 7823939
5607 7823939 12212455 6461736 2223814 9384031 13026404 10888981 2568531 -3703089 -8300117
5598 -8300117 -6513515 4568074 2180940 -2390299 3345796 3110258 745574 6661716 17963009
5589 17963009 14673189 4380439 12556465 17670720 10219151 8005109 9830396 8005560 1934809
5580 1934809 4152474 8599589 4273677 2308923 -367232 -2735061 248830 696297 -1926733
5571 -1926733 -3513251 -1702385 -4956205 -13112003 -10722592 -5597224 -5791003 -4686291 -1970128
5562 -1970128 -3245430 -8918542 -9023788 -2373488 4855001 7890460 1775457 -5465836 -5966450
5553 -5966450 -4033284 -3311699 1802660 8269187 1294674 -7876750 -4384896 2088307 2178916 1894995
5543 1894995 8487560 8139412 185823 -2582774 -4585156 -2565992 2135224 3786461 3076118
5534 3076118 -1271621 -2816388 -6344557 -1926217 15358910 15502187 4575321 343797 3370425
5525 3370425 4318024 -3525819 446131 -293954 -15802825 -20432182 -17914551 -12218197 -17778496
5516 -17778496 -25441477 -14665979 -8168122 -3291500 -1517834 985698 11257005 6947488 10630432
5507 10630432 20390073 17710411 13170802 3755752 9160763 10753948 -1983396 -3697922 -9031776
5498 -9031776 -4792102 -1522853 -9793816 -6805081 -11227093 -12534452 -11414168 -5982647 10553481
5489 10553481 -4468647 -16592758 -6698090 -3127867 -258877 -3280423 8998721 9392128
5481 9392128 -9748131 471945 7247218 7276722 7608966 4143820 10260838 -1488396 -5167541
5472 -5167541 -1440471 -8055988 1656335 -4204759 -10431761 -5861780 -8561128 -3774988 -10223262
5463 -10223262 -3242915 6295289 -7718225 -3208428 -1799702 -3715467 -5497781 -13779069 -1522287
5454 -1522287 -4051085 -10718104 -7868661 -10619737 1061904 -3730642 -5757136 7256277 1775488
5445 1775488 1965772 1512767 7404696 7634773 -12703276 -6905911 -4560014 -10546975 -6696156
5436 -6696156 -13539127 -14121831 -19374545 -15969270 -4433406 -7880139 5364599 5227923 -6611599
5427 -6611599 4153172 11027819 11666319 4095052 11512148 21391984 -745423 465394 14746701
5418 14746701 8224284 3478918 7619623 21390338 13962984 5745573 18602060 12789718 10577248
5409 10577248 16837915 16219436 16299723 7804859 4395999 -2158848 -2812520 11786717 3763449
5400 3763449 -2995680 2652330 -402066 -2358598 -1011350 10022144 7109554 -6361221 3242781
5391 3242781 6471451 -579109 -5850646 -10566138 -5647504 -5151196 -1930699 -412311 -9879647
5382 -9879647 -10767672 -11621331 -4192551 9697829 5479602 -1964837 -6164322 -2322602 2404459
5373 2404459 -2698081 83152 -2657144 -8136523 -3499418 -5205037 -8155124 -12951828 -13746865
5364 -13746865 -5750955 -3039448 577133 -6868768 -17604623 -9886635 -1772971 3509186 2907596
5355 2907596 -229797 1865799 -209084 5956047 12893842 10699574 9992797 7751325 15107082
5346 15107082 19643964 7368671 -1288563 -847190 6227274 5318811 -13553 2530730 -7345855
5337 -7345855 -15733696 -5097255 7142714 8819999 2471703 6453961 12029804 10239803 14448811
5328 14448811 13742240 11913915 16526372 16208960 9558718 1085790 -2667082 -9891495 -12998746
5319 -12998746 1992679 3395929 -16605976 -24192254 -13773466 -8603211 -9911074 1995495
5311 1995495 7811247 -7477899 -11034142 4124400 10109444 3242759 3200009 6058640 -23491
5302 -23491 -1548390 3408639 992037 -6303352 -5957483 -2403938 -2799900 -1061180 -1352529 -6000729
5292 -6000729 -7244722 -2936434 3510028 3304879 1195661 -176426 -1381695 2399234 1732628 1727673
5282 1727673 3204880 -1223183 -1071447 2413739 6137892 760871 -7663865 11323 5506087
5273 5506087 7817055 9500248 3606363 1415923 209924 7758648 15793100 14186401 12445781
5264 12445781 -478165 52642 16071981 14725074 6280657 1286325 7412380 4197784 -4221981
5255 -4221981 11824851 8631183 -11581232 -11966651 2093306 10809590 -5439335 -7672781 -840504
5246 -840504 -11476789 -7553966 -495803 4959873 617590 -13148480 -7661934 -7271768 -6322535
5237 -6322535 -6307548 -11743540 -35386 -7186537 -18677729 -15514828 -12917110 -4668874 -8516599
5228 -8516599 -988502 3138807 -15645782 -12163943 -5102624 3818609 9329905 -60409 -274041
5219 -274041 -11025547 -9239045 -211440 -3567355 8081978 573335 -11143688 -8946979 -5902141
5210 -5902141 5988983 84038 4034468 8425653 -8966802 -2861991 1785223 4074194 5390667
5201 5390667 -2564260 1011242 -9288021 -4053487 7177445 -4788207 1977656 3282844 -724972
5192 -724972 -1698070 1006125 18148826 4842228 -789018 12159232 4430424 4196506 5662251
5183 5662251 17546530 18232060 -1592221 5608020 8881464 12734058 18854476 12385267 17157468
5174 17157468 3094806 -5477833 5699532 9893415 13611490 -6522882 -13854346 -6676085
5166 -6676085 -16715830 -10340556 -5884818 -4667636 -9249299 -20490540 -7302911 -7365500 -9177105
5157 -9177105 -917204 -2875768 3947257 -4146129 -10990284 -4830544 -4059240 7170832 4555422
5148 4555422 3061401 5688975 -5843512 4622125 15944250 17823890 16749619 9463255 15495568
5139 15495568 10006076 9900524 20242491 7230303 2376379 6102519 7478811 2599884 -7839041
5130 -7839041 2052131 -1068689 -10876392 1617414 6385616 2306447 -9022951 -9447199 2504910
5121 2504910 -3121971 -1601491 6014529 6850045 249601 -17185687 -6178389 15305705 11135294
5112 11135294 3133296 3154537 8892713 -5406701 -14871847 13637036 17545723 -9613238 -17550922
5103 -17550922 -1429008 4877137 -19157958 -18662549 5438648 3027149 -2358050 1834919 10115019
5094 10115019 5055854 -9058041 11292937 35412783 30244542 5788093 -9474693 14070900
5086 14070900 21224155 2210271 5412588 13667929 5335404 -16917900 -6790371 17004880
5078 17004880 -15076044 -36442316 -4788378 21770234 -234617 -42684542 -34436977 -19217115
5070 -19217115 -22576151 1172658 15416181 -4985902 -45270075 -47505562 2429659 23550744
5062 23550744 17266519 -520833 -17042616 -11123810 -17753408 -15684545 -1681736 2018436
5054 2018436 -5051750 -31833208 -29197253 -25985336 -53024446 -36309873 12999803 31139001
5046 31139001 -18384874 -62619025 -33802731 -13447277 2485102 36120362 30286626 -20686293
5038 -20686293 -67223412 -34337788 18309214 19895743 14090002 -8047673 -25891316 -20413293
5030 -20413293 -10909537 7437166 15255386 27301416 19482870 -7326209 7584782 7534287
5022 7534287 -13052763 6841772 47561131 41639222 -25997298 -40017530 -4391770 -9362730
5014 -9362730 -3182621 21607302 9027777 -44726529 -62951989 -11763258 6730683 -7562622
5006 -7562622 -7132758 -14991697 -17854859 -12331654 3318264 15350897 15712731 23943664 14596250
4997 14596250 16127407 35854229 20222576 3010229 17613018 34253471 10600855 -18695779
4989 -18695779 707467 1972376 -24959937 -13637845 9959870 70809 -22467880 -4024888
4981 -4024888 24208054 14012395 13619199 29905382 29737242 23289861 27073348 38225135 32694472
4972 32694472 19859025 15293971 8770230 11489061 16404274 9340491 2721718 -994921 -3796648
4963 -3796648 -3619626 6658753 18868863 10708082 1117392 8323172 13498630 14227848 19321189
4954 19321189 25283464 22974115 16953086 23228276 26727477 18248361 19575222 26798618 26613441
4945 26613441 17937389 9649550 7058684 -2267492 -3117329 8462498 3719555 -13774351 -24525887
4936 -24525887 -16192755 -6236039 -8720629 -1511413 859378 -9770318 -10177837 2947850 17718237
4927 17718237 11298995 3617211 10615715 7550830 4584583 5787929 9464003 12670051 5164131
4918 5164131 4328851 2072629 -1111961 2969956 2049115 8983618 7950374 -8398452 -16773693
4909 -16773693 -14120058 -1641778 -5630526 -15240793 -11477852 -20374413 -25957709 -15870781
4901 -15870781 -1224024 1634270 -10555949 -2944191 6056876 1300806 5655322 12098911 16928324
4892 16928324 10378342 5000851 9076300 946944 -1278855 2216386 1276010 -1872230 -12358822
4883 -12358822 -12689268 -11899430 -13043224 -9319630 -15695861 -20451885 -22536424 -20917307 -15689247
4874 -15689247 -20672748 -21519127 -21657296 -23093192 -17186298 -12264867 -5774065 -6794030 -8777409
4865 -8777409 -1851155 46961 2487730 5186493 8033544 8792730 342598 -3217571 -3418559
4856 -3418559 -2270415 348319 -2210786 -3696277 -8965174 -14292156 -11706019 -5692959 -1604641
4847 -1604641 -8729820 -15190026 -14016353 -16184226 -20831845 -23746018 -22043704 -25301576 -32514580
4838 -32514580 -31378220 -29423014 -31606232 -32613057 -23558695 -11432188 -11514822 -12276292 -5003968
4829 -5003968 5396016 10411071 11911819 19902611 20960085 15622730 18165521 25152699 23795172
4820 23795172 10760869 8978235 15972335 11847156 6445602 4304126 1660994 -5345346 -5781488
4811 -5781488 4515195 1200160 -6760597 -5414036 -1159502 3172671 4045851 9102423 9974846
4802 9974846 8087605 16117020 18269328 16501807 14999069 13287285 14014525 9658219 7474097
4793 7474097 176354 -9278726 -6451934 -7328977 -11151817 -14824538 -16978989 -14755627 -13774030
4784 -13774030 -3331739 1947808 -3671161 -140422 5938440 11319247 11942510 13229217 17580045
4775 17580045 11225851 10678701 14230207 10967126 8116536 7170254 13901957 12785179 3900209
4766 3900209 3342710 2320684 3389175 3874435 3515915 1400032 -11597183 -15936975 -11044477
4757 -11044477 -10780409 -14464840 -18799974 -14442584 -14701630 -18260661 -11111365 -7800465 -8422798
4748 -8422798 -5144003 4283260 8665415 -1314523 -3219379 2348520 3409673 5033343 5529808
4739 5529808 2917804 -5474215 -8818482 -1801210 655372 105256 -2197973 -5065210 -3089216
4730 -3089216 -2517433 -4508648 -6509485 -4315065 -2742494 -7760592 -5971080 -834451 -6884094
4721 -6884094 -11374220 -973247 8993304 2913446 -611831 9686697 10028522 516850 4659706
4712 4659706 13457999 5709303 -5552754 -2090222 1351636 -7980856 -12745406 -7252165 -6992277
4703 -6992277 -10717586 -9809531 -4865861 -755053 -1958249 -5031971 -4489392 1755378 3859848
4694 3859848 -3175186 -930234 3368756 -8161639 -15971272 -3287059 8848048 -2368413
4686 -2368413 -9264194 5149875 5188077 -5403882 2871522 17285036 11322451 -3618522 2683483
4677 2683483 8139173 -4288716 -8239985 -3356292 -986683 -5681231 -10110469 -8057445 -7958221
4668 -7958221 -3997280 -2964288 -3365697 5046668 395615 -11793529 -9487771 1184390 -2476975
4659 -2476975 -20842223 -16981533 -8218146 -21488518 -24162275 -10404755 -5627513 -20046780
4651 -20046780 -23577214 -4562395 -2095935 -8873184 -6798282 -6065881 -11176534 -23076624 -21457740
4642 -21457740 -10759729 -11168035 -19781919 -30309520 -23469883 -15471931 -19713290 -6280743
4634 -6280743 12422414 9525050 -6333908 -915728 22458607 18743521 11936266 23351361
4626 23351361 18640180 -413796 -6403495 6676005 7918458 -3902745 -1659742 -4504374
4618 -4504374 -11477968 -7986473 -7021822 -6048798 -2606241 -2177047 -14464661 -21298332 -5183693
4609 -5183693 -8119321 -24255871 -13075816 -3880900 -22051019 -30814953 -3195541 8129098
4601 8129098 -16558727 -11530858 8314750 -6236192 -16948683 6433973 19498617 -6667643
4593 -6667643 -17443782 -608224 -7337589 -12483647 9092943 15502808 -4121920 -12682066
4585 -12682066 1170287 3519306 4085312 20956295 10431998 -19526879 -24465885 -15914493
4577 -15914493 -18748796 -24460965 -17933221 -30512453 -57648239 -46249980 -20640610 -15877547
4569 -15877547 -13197822 -777510 5413537 -2042618 12857765 40298804 40008196 35450661 37558315
4560 37558315 32040801 18217700 11313794 19441430 12932445 -1319285 -6886771 -21812439
4552 -21812439 -35679285 -37381433 -25423130 -17480588 -29239430 -34379796 -36666886 -38440213
4544 -38440213 -25817629 -6760137 7933635 -1080898 -8979609 6859711 17600435 25886931
4536 25886931 38580423 47990628 39549080 22716072 34647466 43143365 27469313 20431287
4528 20431287 19580122 7973541 -12784245 -10213220 1343596 -16297304 -25066349 -14589761
4520 -14589761 -12395704 -13203676 -358767 17817204 7797907 -1382534 14941723 21363631
4512 21363631 23227215 31871637 30937165 10522498 -3780465 10670772 14983173 8948884 14999164
4503 14999164 9300665 -8152094 -11613851 4565972 6823551 -4050482 6773144 10217960
4495 10217960 -7456435 -15067054 -8845537 -10381113 -18143077 -2076180 8390091 -14361540
4487 -14361540 -28815224 -19995925 -7629604 -3432427 7623136 15841100 -4992988 -17710477
4479 -17710477 -3698811 11278360 10219718 995039 3560597 -1082440 -8533423 -2463417 -897463
4470 -897463 -5928310 -14655504 -6415290 8653944 44721 -11480591 -18993453 -17286029 -9697790
4461 -9697790 -3850949 7046202 -7053396 -27987171 -28111271 -18460020 -2114585 -682645 -2228807
4452 -2228807 -7593348 -19504031 -7328811 2887679 10389468 16124330 9030593 9123398 6240448
4443 6240448 15680722 22187587 13437572 23899747 21997825 12635642 13511921 18140965 25634774
4434 25634774 11575254 15872314 26016500 6736336 5759060 15845640 25296972 18092446
4426 18092446 7616584 21133467 7014730 -1298778 18010641 25641061 21876009 -1309126
4418 -1309126 -4812783 -4440918 -16612078 17280 3621427 -8069695 -28728318 -47570088
4410 -47570088 -33221563 -29376163 -20995426 -13809387 -26389187 -27781646 -36820775 -22891858
4402 -22891858 572912 2209576 9550768 2201951 4808843 8339459 1736649 17753343 15866227
4393 15866227 10542454 4858791 -6497367 -930644 -15336937 -19879946 -15618880 -24555861 -23303071
4384 -23303071 -32388750 -26388902 -23138365 -37278778 -27838588 -23181707 -15972530 -12978348 -16225001
4375 -16225001 -6735920 -20980265 -22770371 -9600977 -9544379 -8023685 -19646687 -17650522 -18119688
4366 -18119688 -27439614 -13891664 -11155440 -8206013 -5698863 -5544396 5079268 -2420195 624204
4357 624204 10262843 12256483 17116730 4316061 -103480 -3440559 -10735460 -2897483 -4894926
4348 -4894926 -9322213 -22753510 -29827476 -13506592 -10990911 -11059776 -13934776 -18869257 -16943886
4339 -16943886 -17288246 -1808736 1001132 -15426334 -23553026 -25819580 -15303614 -12179126 -11048316
4330 -11048316 -4998503 -12356564 -12590183 -5964236 8932953 23324340 23757089 32660722 35681570
4321 35681570 31897141 31271931 33883410 44724063 40360244 32435186 27067793 14674151 10971300
4312 10971300 8117153 9859072 8365714 763914 1540057 -3077817 -1526247 -838040 -7706618
4303 -7706618 -2885969 2918042 7809010 1056297 -7473520 -5668159 -13446559 -9116172 896060
4294 896060 -3598331 -15128050 -26187501 -21561302 -25065262 -30726598 -24024548 -30376715 -33016366
4285 -33016366 -28943102 -26859759 -30861064 -36281021 -16831989 -2571546 2968869 14133637
4277 14133637 8829763 3413196 10043969 33300513 47277897 31292871 21745273 11366214
4269 11366214 5437512 15431304 17808875 11713796 -7681599 -15591082 -7516032 -2560562 8996765
4260 8996765 2921610 -7783877 -812301 7246172 14675259 10963884 10226968 5563660 -8069931
4251 -8069931 1366028 6302661 -2814073 -7849131 -5672693 2864597 -2388943 -385263 7298880
4242 7298880 6406833 19558282 27123979 22550640 14112288 8062757 12507089 11629643 17876900
4233 17876900 13511951 -14379048 -22177337 -11223003 -1265329 -3156406 -4959608 -433487
4225 -433487 -11262667 -5662067 18617228 24174946 14676021 5293620 10421771 11919238 8502800
4216 8502800 12848741 3577478 -5406679 -6952474 -8760530 -7076895 -6228006 268013 221600 433712
4206 433712 8585457 346095 -5698647 6485989 22478331 20467843 585481 -5984506 -9782829
4197 -9782829 -13736450 -367277 10839974 3043623 -22770446 -30942928 -13214114 -3145870
4189 -3145870 -1168719 -5179383 -9348470 -12917675 -17107355 -6416353 -529447 -8109381 -14102406
4180 -14102406 -9035224 5449882 1378364 -9000551 -5982355 -670652 5312356 7752185 11282269
4171 11282269 6275357 -7882876 -4861443 3050500 3521649 -2606495 -8104976 -2052052 784886
4162 784886 2182249 1197733 -3197662 3929133 12508389 21442288 25309067 15664931 4718300
4153 4718300 -327536 12171319 22711319 14206527 7230245 50296 -6520512 -6313590 3647051
4144 3647051 14346942 7155917 5735173 12905542 7243643 1248998 4184311 11395705 7011856
4135 7011856 -30339 2770580 -7928883 -20393470 -17132877 -8591079 -6388730 -9604544 -1957239
4126 -1957239 4348160 2106235 7743628 13735091 19943704 25324781 26382824 27140385 19513374
4117 19513374 9503073 3041244 6724381 16930075 8135914 -3559298 -692844 1370145
4109 1370145 -123723 5598723 20922548 19509408 9039753 20770000 28660124 17449050
4101 17449050 10186366 15017578 15386744 4264308 3519378 2058438 -11128046 -10992827 -4561236
4092 -4561236 -5285771 -7596157 -5194047 -1639285 -271211 11700081 13717681 -4342179 -4573922
4083 -4573922 9031145 10419547 5351435 7017210 -553577 -26067353 -23821384 997412 -699951
4074 -699951 -11714403 -8280191 -8236601 -22739822 -20068244 5344532 7135943 -379135 9626873
4065 9626873 9484728 -5299604 -8209418 10197515 18887052 13126608 16496928 8394101 -8352125
4056 -8352125 -8243730 3724827 12747948 8011906 3203159 -2217087 -9778487 -2719192 4109339
4047 4109339 9264422 16091858 15573297 15250048 15084395 20814164 23936617 21569875 30215724 29698302
4037 29698302 20100290 16149379 14228337 13796629 5245615 2909169 6274321 2011978 3718606
4028 3718606 3318198 3490196 3612488 -568958 9717153 19459620 19779270 12165790 4328536
4019 4328536 9302345 3190937 -1937947 4438987 -2056825 -14111217 -21128522 -14841957 -16064529
4010 -16064529 -29889295 -21221893 -11057635 -11461301 -10045082 -8688536 -5956468 -11904519 -5354918
4001 -5354918 10566601 7849178 1770178 -6499048 -7301398 -2302717 -6108580 -3867046 -4862536
3992 -4862536 -6753658 -6811662 -6901781 4152000 -282675 -8797417 2473667 13480220 16172386
3983 16172386 7634785 6293772 5064129 -7115364 1897514 13566011 7944841 -4384708
3975 -4384708 -13747126 -9770392 -10483357 -7618199 1112760 -2175988 -2586206 -6089748 -8430808
3966 -8430808 -1718027 -818156 -1252801 -2940466 2794516 3654426 -14035124 -15034475 -6318862
3957 -6318862 -8422226 -8865882 -570413 6126220 -9472385 -16463870 2635120 10308772 9277419
3948 9277419 13680266 17670349 11317804 1950672 11686324 19138847 13076089 10873269 9189996
3939 9189996 8015908 4187166 555045 2478930 2458986 5250502 6615494 4899370 5927996
3930 5927996 1524032 -129054 6956597 13379887 14729065 9544058 7596391 7896391 5150105
3921 5150105 8430926 11321418 8895906 5140440 -358171 -2708530 -5931727 -8978912 -7586528
3912 -7586528 -9252968 -10475035 -12826324 -16558597 -14266360 -12505820 -7823703 -2477804 -2555979
3903 -2555979 -261753 1012230 3921491 4759225 1394720 5598301 5041612 763149 114898
3894 114898 -3782683 -7263112 -12999287 -8374649 1289896 -3874345 -6902915 -6295306 -3038986
3885 -3038986 1652882 2507682 10639599 8467187 -505050 56600 1612873 5605850 -626614
3876 -626614 -5753697 269213 -2823968 -4390163 -4628783 -877548 4089130 -1542937 5209883
3867 5209883 10062265 3194603 -578705 -2083393 6075959 2533058 -6435814 -3867752 -8297948
3858 -8297948 -9555810 -9298571 -4708891 4225581 -1250658 663445 6378056 9213865 14084043
3849 14084043 11730554 19430257 20661915 10140410 7966612 7077635 12128231 8252691 2221878
3840 2221878 6574249 -1303666 -4785613 1291402 8724298 10943872 -999985 1425398 7489147
3831 7489147 4113740 5771491 4584605 5278404 188489 -2742069 6047230 2996492 -987736
3822 -987736 -336204 4465284 13087703 7871928 3688294 2848559 2486501 7377304 6665447 7734674
3812 7734674 -256449 -14818782 -11417562 -449541 4979610 -2228605 -8228276 -3508213 -4697392
3803 -4697392 616366 13001558 13341214 3177805 -4289516 3515943 8781416 3243318 1371208
3794 1371208 -1116498 -3279201 -2661792 438234 5908647 6548873 6270524 9008324 15386870
3785 15386870 20237361 13692972 8590674 15341945 18252548 9418749 1839701 520659 -5739601
3776 -5739601 -11689715 -2309857 6939140 -4206443 -16742671 -11653013 -332861 6343108 9698466
3767 9698466 10329198 2126675 -7657404 -4384465 5083946 10864368 5835502 -7050836 -9834775
3758 -9834775 -5955561 -3991424 -2445689 3482062 9676036 1162289 -3955264 3189521 1787727
3749 1787727 -2580918 1135867 9413231 4155385 -11528947 -12075746 -7857566 -2306127 7941406
3740 7941406 10257626 7745631 2596257 4597140 13571359 20979484 28240628 18279939 5646546
3731 5646546 8688726 8621374 2585131 -2733927 -93097 -3603565 -16700379 -11499986 -6485348
3722 -6485348 -14341299 -15277808 -7119179 -298220 -8815676 -13473321 -8506834 -11948830 -10017088
3713 -10017088 -6522921 -9149493 -13871106 -17364075 -10722950 -6699466 -3033430 2507737 -927900
3704 -927900 1791043 9140909 13375998 13376082 10685588 14906064 13374493 8061331 9141522 6919035
3694 6919035 2786077 -211231 3871633 8550248 1696329 -1688612 1461239 2975591 3398855
3685 3398855 5378996 9237771 2862364 -6409130 -4810596 -3633741 -6004461 -3872369 -412702
3676 -412702 -6014851 -14438979 -10119397 -2289035 -1499079 3755957 9873103 2753336 -5657793
3667 -5657793 -78412 6892437 3371374 972647 5090204 -171199 -7986602 -2563961 1706487
3658 1706487 622104 5172248 14233641 16599304 12781303 18197620 22367468 23341081 35160265
3649 35160265 39314478 30397451 23704456 27384192 30910278 23955717 27380289 27871889 11119366
3640 11119366 7362517 16218900 19079620 6481855 -2071244 4392678 -1769422 -3660192 5179106
3631 5179106 3263235 -4304050 -11803031 -3947832 4149775 3616244 10449053 8010753 7296827
3622 7296827 9708410 6592030 12298291 15081865 18856468 15039130 5334055 8627060 -663825
3613 -663825 -6220958 3529718 9124586 7871912 -6166569 -6020731 -1839825 -7156015 6362069
3604 6362069 16415869 15656963 6576764 -2183061 5955081 4662365 7770129 13913655 4690328
3595 4690328 -1104722 -11624079 -12273033 -7150794 -9291031 -4450185 -10740327 -11811660 -7333085
3586 -7333085 -11356889 -4599591 -2284467 1643718 3948158 -404695 6838547 2446425 -1293395
3577 -1293395 2451083 491467 2913127 -4163881 -3568275 2301145 -1684876 3031888 2618913
3568 2618913 4080706 8362802 11700051 26431049 25961722 20642447 21151446 19367567 25797078
3559 25797078 28258176 32673216 28411407 12469593 13983044 15300887 13667279 15960550 17909638
3550 17909638 18934010 7802324 8209501 13400898 4298726 5897409 13793164 14856299 4310724
3541 4310724 -4047939 -946822 -7759062 -6126165 6348689 4160589 -2972739 -3626820 3462020
3532 3462020 3602348 4631637 16815344 15861976 13914602 23699660 26600487 17916039 12903214
3523 12903214 23100226 26422938 24567742 33204124 29722609 13980115 8311322 16963650 21245827
3514 21245827 16049468 18210089 13721022 -979815 -7169782 -5368897 -1386839 2286363 10335433
3505 10335433 13281666 6162467 4858640 7858484 18333799 36256878 47656273 46503064
3497 46503064 34855718 27409350 24800418 26888669 36593635 35427310 24287713 11394193
3489 11394193 -138266 -3933755 -1590060 6843452 9364167 7896102 9719944 51595 -7623763
3480 -7623763 -1006746 7918958 10371274 9616253 12065433 -1681501 -18906958 -9423309 3822341
3471 3822341 6164241 8222322 13301490 8345353 -3395787 7467373 22080211 20649742 22284182
3462 22284182 24351429 17852724 6293294 4041839 6696486 2130824 7682141 13690535 4921449
3453 4921449 -2485130 -3917579 -1489528 4064131 18015465 26882537 13085839 2377764 4662959
3444 4662959 7260906 12373911 19890309 22807373 12543480 4849239 12852316 20992312 25895028
3435 25895028 29796887 33033421 36124652 33008568 29289839 29256383 29877917 27227661 23546817
3426 23546817 25163300 18937814 3308956 1341482 12531089 16728238 13846752 17595532 20104286
3417 20104286 14859374 20239355 34566007 35021119 26920726 28519584 30767600 26148328 27140617
3408 27140617 28802735 20640261 15857064 23480965 25381721 17870065 20258078 22067644 11955902
3399 11955902 10056253 17490052 13583808 423980 1101102 4434241 -9955462 -15634232 -5221904
3390 -5221904 -2689987 -6293153 -1760776 5900973 45586 -922785 16324873 23332185 19592035
3381 19592035 18319723 18048815 15161301 11535712 18238483 19864439 12703146 13967327 15584971
3372 15584971 16180922 15059172 16149539 23514199 24103560 25727691 24560830 15349107 10561220
3363 10561220 8369275 13052292 12738419 2776974 -1433929 -6898471 -5691577 2864781 7816895
3354 7816895 9398927 3934681 9028740 16788446 13960439 18029363 18106232 11981187 8300889
3345 8300889 11102896 15813181 2521222 -2467285 7840775 5982770 4092954 8475963 13939033
3336 13939033 9213475 4273967 18738067 19290030 6939637 7147563 9675172 9479491 3789540
3327 3789540 5418809 7608472 -1359315 3911505 12662718 15447319 19619046 19235978 21497947 21500896
3317 21500896 25682900 31871592 25158757 26813532 28976944 20620722 16751296 19165824 26681386
3308 26681386 22727217 20097508 31067470 26610687 17995125 21758695 30053657 28862850 15213249
3299 15213249 16189710 16667391 1575181 -2603653 1191197 1575379 -6243410 -7989072 2531732
3290 2531732 -445484 -2959015 5094675 9338075 13245283 14954299 17518276 15001904 9640574
3281 9640574 14912098 13707476 11958778 17012828 13004414 7262305 9191829 19142825 19430031
3272 19430031 10256369 17172104 21304741 13078201 14035081 19448422 14147763 -1507 2634404
3263 2634404 15718767 10544695 6239752 11456463 11463916 10807882 18209245 29842385 27079074
3254 27079074 18837030 23050890 23305170 19183137 17458885 10793288 2249033 -1279908 4253423
3245 4253423 4472309 -4749203 -4521189 -1555666 611662 11300927 19917499 17657575 9168167
3236 9168167 11179188 20020759 16480785 13444726 13529881 6243405 1275203 2547123 5528288
3227 5528288 -938848 -7268627 2466115 8110118 7326365 8701356 6064229 3113790 2788021
3218 2788021 12066946 18812062 10895549 8448966 8370740 7579378 11536001 14351095 19645838 19700847
3208 19700847 19362526 21321388 14076890 12465499 11734727 8672778 11638847 7874425 -155673
3199 -155673 -11770837 -15818447 -8804295 -11368239 -7232179 1115939 -1710072 -5256604 -7110392
3190 -7110392 737403 4323768 5162859 17375703 15324953 5177287 -636187 -910259 10293273
3181 10293273 16457966 22489935 22457247 14672705 18339473 19460015 25710151 35728364 32200700
3172 32200700 26963062 20593694 19768104 13021105 61129 8361052 12883992 6056726 3280227
3163 3280227 1896044 2778045 -557656 11780084 28595252 20333733 14012716 15437440 18115251
3154 18115251 18966094 15649745 18734791 11270007 5500929 14096376 15250434 14423824 12216632
3145 12216632 14440462 22449584 24080613 28930265 26186309 19944529 22671746 19930379 16586543
3136 16586543 10827082 6195019 7640571 5286104 7151555 2970121 -6629548 -2301686 8446389
3127 8446389 17204222 13557447 4822476 2488850 -2541840 2180342 13613841 11257654 -925220
3118 -925220 -6777239 4418846 12430046 10857612 19421189 26809073 25880321 30496452 41290071
3109 41290071 41742952 27108431 24161076 32854038 27101371 14947254 8231768 1359079 -5248236
3100 -5248236 -3687422 3328173 910029 -3722127 3696641 12507876 19209450 24595379 20360107
3091 20360107 14329131 19283411 30068239 30355518 22021567 19413125 12699938 5685251 17908693
3082 17908693 32927320 33045535 28760105 32082581 35708192 33029642 42661617 56366207 54211417
3073 54211417 50317769 47670763 42075830 39733345 46193995 56502188 55483752 55768791 59980267
3064 59980267 54456002 55439331 62536768 63358366 60173947 58534561 60039043 49286602 38722637
3055 38722637 39601860 37189696 44160680 58193046 63432340 63187224 61281557 62039639 54342410
3046 54342410 50557715 59799966 54164805 47569605 52451564 47637498 29101359 15771607
3038 15771607 28059553 39806169 42673392 57732984 63362521 60854610 77209563 119176357
3030 119176357 169839225 200041629 216408535 220510577 216977156 232185865 250663138 258971876
3022 258971876 246731777 191448251 109955070 28561414 -24833754 -55748454 -79888740 -84379171
3014 -84379171 -97908170 -132870580 -156348891 -154706117 -132630661 -108382921 -78462895 -52711048
3006 -52711048 -51485187 -45535983 -21881630 17121622 69157684 110702470 133079314 132878624
2998 132878624 127198825 131968455 137795627 150894288 139943204 77991138 -2481104 -79061689
2990 -79061689 -135943508 -168900048 -177752858 -175077924 -192267697 -205609588 -202168506 -199741256
2982 -199741256 -187445889 -163053388 -136357446 -121032552 -110398924 -96575429 -102079411 -105602599
2974 -105602599 -85877481 -69244394 -64368453 -66234709 -67289103 -73322062 -78455064 -60972789
2966 -60972789 -48996568 -56344333 -66016497 -76148444 -80457134 -84713083 -86827475 -83836670 -83092336
2957 -83092336 -78704870 -82194688 -91391034 -94477102 -102619317 -104345550 -91491468 -76208287 -72783675
2948 -72783675 -80914369 -76137269 -66548973 -65291949 -59635122 -53815359 -52180767 -56460310 -61873512
2939 -61873512 -60621041 -64057086 -69267210 -67906801 -58339492 -45967629 -50766893 -59415480 -52975573
2930 -52975573 -45908849 -43496961 -37728641 -28437503 -32520934 -48081171 -45662346 -37883851 -44139366
2921 -44139366 -47396652 -41161426 -36571020 -39851215 -40356207 -36600115 -40316443 -38869271 -30630287
2912 -30630287 -30538425 -34462047 -41298468 -50237451 -54844244 -53249068 -49309076 -53429485 -55144036
2903 -55144036 -49709293 -50208386 -45136683 -33216170 -26561269 -21892900 -15402673 -6191700 -4432047
2894 -4432047 -3868504 2786686 -2228940 -7210421 -1553101 1337356 1410867 -269269 -130189 -6004870
2884 -6004870 -12500921 -2183169 4340115 2631079 -1100563 -13214404 -21527290 -24917291 -23544552
2875 -23544552 -24014119 -30167363 -30363460 -39456713 -45673226 -34077297 -29736581 -28903134 -20708650
2866 -20708650 -5900988 -2105904 -12775931 -5665934 482310 -5165758 1010785 5959562 -614955
2857 -614955 -18402017 -26299531 -20686095 -25262071 -22942860 -20760362 -28588646 -28841234 -28765333
2848 -28765333 -25726220 -24433825 -21849879 -13685186 -17653526 -13170422 -5737706 -12778175 -14994764
2839 -14994764 -12073638 -1549181 4063613 3724055 11161170 4982934 -2172503 348888 5607033
2830 5607033 17271418 15898063 8453676 -317044 -12169476 -10398400 -7460218 -29895 4244853
2821 4244853 -9514391 -18882913 -23102709 -17101642 -7916609 -10142813 -8004043 -11834748 -18840157
2812 -18840157 -21632778 -23116412 -13741697 -14619722 -19135834 -11392105 -9933071 -14041726 -19008333
2803 -19008333 -8557480 7578184 4638585 6295443 10581601 7234392 5150106 7468457
2795 7468457 18066442 14355660 971576 -1200800 -1553694 1404975 -2720995 -11104037 -11129457
2786 -11129457 -15009132 -15989646 -11444577 -3994440 -2893487 -16937695 -16628052 -3550413 872012
2777 872012 4366326 8851012 11042730 1796994 -3673477 9209632 16591731 16215346 12890141
2768 12890141 5026302 -1022842 -6430837 -5388474 -2966037 -5017319 -10351202 -22097691 -25032921
2759 -25032921 -20884423 -23645084 -23618345 -16682289 -11041113 -14732428 -15659550 -7956128 -8560816 -7807534
2749 -7807534 4104126 9811818 2377242 -4441166 -1677746 -1266309 -889063 5920456 3612087
2740 3612087 -6778689 -9382526 -3263287 -295956 -1205845 474011 -2660299 -5917356 -1611484
2731 -1611484 1793687 -18307 -3796698 -5036888 -8022963 -9412886 -5706404 -10153626 -16231574
2722 -16231574 -15689323 -15543890 -18982419 -21666804 -15898435 -14914559 -19240600 -14733475 -12845597
2713 -12845597 -14779095 -14798119 -9339437 -2335126 -6786574 -8755523 -7450169 -8194457 -5709468
2704 -5709468 -7157649 -4997200 -5537887 -11150387 -8930471 -8824994 -6727982 -6147799 -6988659 -734033
2694 -734033 -2473509 -1738430 32746 -1728668 5971507 8123180 8396584 5944445 1574254
2685 1574254 5453439 2386835 7538697 13836400 3194162 -2964781 -6276484 -1747337 2098250
2676 2098250 988615 5588937 -6278438 -13795274 -7927070 -6788687 1700241 3284424 -848133
2667 -848133 -9132169 -14334473 -775858 -2131041 -3380996 6469684 -691570 -8503566 -9973448
2658 -9973448 -480733 919190 -8292117 6111160 9851495 478187 935388 298786 6737249
2649 6737249 10915025 20289431 24973985 10177078 8592681 4604419 4943945 21798447 20316316
2640 20316316 6465469 -8395422 -5995937 3436 -9745556 665235 3365700 -14866962
2632 -14866962 -17101587 -7305346 2382152 -7812939 -12676031 -1288782 -5695731 -2442722 3301428
2623 3301428 -367206 -728580 -5121255 1014775 7571596 11151214 14175090 2530763 7059826
2614 7059826 15504359 8663561 10559337 15040133 16814527 6466851 -322544 8115578 -804590
2605 -804590 -7371799 -1949789 -2270916 -3331859 -11366419 -13692719 -13885686 -17228004 -11379966 -11192114
2595 -11192114 -7469084 -6435900 -21646117 -24862454 -18499108 -12789986 -11650647 -13152658 -10655997
2586 -10655997 -24086478 -31053499 -16467688 -11114897 -12487228 -15342804 -17253828 -19022137 -22264903
2577 -22264903 -14674442 -15084728 -19824373 -13263310 -13358926 -13306689 -10908994 -12617043 -13987740 -11719476
2567 -11719476 2685055 6690477 -1503844 399421 -3128045 -6777663 -136801 6189959 5050673
2558 5050673 -5609884 -7112726 -7815848 -14170900 -5735987 -404879 -3521573 -3284134 -1884852
2549 -1884852 905466 -458754 5892281 12900372 8009927 11334294 14020915 11174822 11377170
2540 11377170 7699255 4956066 3375248 9112957 12563102 1268779 -1047837 -1922236 -7141561
2531 -7141561 918005 11579703 10410835 -4325964 -7217082 4680486 4942442 7333380 11165750
2522 11165750 3796992 -1771554 503101 8556437 6167219 -2002095 -3368224 -6438292 -956440
2513 -956440 4176689 -5643476 -12952798 -9545002 -1640485 -574826 973461 6186114 -2734255
2504 -2734255 -5290920 12038449 22436051 15496503 6343645 10127587 14582485 13937646 18865334
2495 18865334 16923586 6323929 -86207 779869 7273497 9551533 4883269 -1620128 -3471561
2486 -3471561 487477 -256537 102963 8696338 10042547 2137382 -197881 3735877 3808314 2182220
2476 2182220 7899524 10686309 2790970 -1262907 482377 807978 2235969 3809717 4538035
2467 4538035 5901631 7136413 4176494 -2316117 1988045 10859160 12092397 15193791 15132123
2458 15132123 4652552 -2847334 5706737 19468423 15910763 9031561 8323929 1318213 359290
2449 359290 7979503 10316584 3356134 883340 11093112 10961339 4200322 3857276 -802761
2440 -802761 312897 11979909 21025399 12425609 -6679110 -9802000 -6474473 -80205 11595121
2431 11595121 7926295 -5080464 -13473041 -10162277 -2929399 -155052 8331116 8064434 2004200
2422 2004200 5878726 4366905 -2096660 -3438843 6838525 14298080 4815014 -2213823 -11918543
2413 -11918543 -23206000 -17204145 -4528397 842134 -9051602 -19769667 -22573937 -23616735
2405 -23616735 -11818999 -1986311 -3580407 -4005151 -5391625 -7155228 -9341018 -3384426 5252508
2396 5252508 3144675 6066213 7909673 -602914 -6159056 -2298695 7247882 7987847 5683472
2387 5683472 3767780 -4463509 -4439106 801571 1499442 830701 723542 701841 -4214359 -2456273
2377 -2456273 2853837 -3037667 -5264400 2063776 6214614 231509 -3862386 2200031 3266642
2368 3266642 2049576 5824957 8572502 8462039 7081112 11267998 16448218 15644150 10315647
2359 10315647 6808885 15146363 20747948 12346908 3993791 1737382 -611065 -6048286 -1426681
2350 -1426681 5176267 -6340427 -17975443 -14251358 -4351033 -2056727 -4495213 -779708 1537452
2341 1537452 4615633 9432628 10382442 13386550 13042154 11735739 16066512 21695808 17657478
2332 17657478 474128 -932690 11397170 8581327 -577412 -3415021 -4136942 -11294500 -10093526
2323 -10093526 4700599 1704569 -10091256 -7302209 3881499 12740039 13072767 11997557 6404477
2314 6404477 5302203 18940085 22828669 16515828 10311056 3406035 -904294 13816 8785561
2305 8785561 3571022 -12658497 -11148236 -3787264 -3601181 -9436697 -10541396 -4038069 -2465052
2296 -2465052 1377345 1666961 -5505136 -8357392 -8100426 1304683 9054435 2728755 -10334943
2287 -10334943 -15638698 442752 12592100 6971146 3440988 5132688 9688787 13511840 21747958
2278 21747958 28210270 16711371 8752312 18724568 32742902 30477339 11327770 6680651
2270 6680651 16380354 19717500 14655224 10069382 10885210 2926938 -1919565 11149504 14266965
2261 14266965 -4595856 -18762948 -3107262 15868231 6596428 -7153982 -8736204 -5876707
2253 -5876707 394884 14018490 25330557 13697023 -4604235 -2261013 14189354 25398085
2245 25398085 18445848 4043651 -1480570 1703052 4264702 -125135 -1356076 260078 -4454968
2236 -4454968 -3150707 8654462 11161365 -4230264 -9041100 10782850 22103037 13046022
2228 13046022 6900669 7743647 1426466 -2252026 11129880 20711940 11964178 4237109 7226131
2219 7226131 9617003 11114596 18733517 21955278 17853737 17278824 15721520 7774319 5070249
2210 5070249 11596502 8676111 -2780638 -527665 4874891 -3028781 -9769829 -2236462 5420634
2201 5420634 3104956 9095483 19058277 12226640 508435 1348031 14422126 22107264 17931683
2192 17931683 8877791 -3286059 -5110883 3524406 12243470 18077835 12236387 2709354 573584
2183 573584 11598634 27106586 24793539 15915739 13050415 14946078 18279930 14462759 14224743
2174 14224743 13343995 5757894 4614194 9145708 14073812 4946984 -3884206 8881600 16184996
2165 16184996 10070955 3834953 4653611 5669792 290198 9160653 16442725 4867323 -3671711
2156 -3671711 -5003082 1906671 9864916 14529262 11820883 -3520103 -4978848 1062439 1397521
2147 1397521 10911349 15385615 2348275 -17700281 -14262461 7812325 8661112 5567800 9357774
2138 9357774 3671799 -2955300 2573664 21724053 25039321 11838379 8683972 9940501 13465194
2129 13465194 10044346 1121858 2595248 4549980 3723662 175649 -1211922 -2170525 -11375972
2120 -11375972 -4227646 15066406 15555809 1566688 -7106513 714618 10942866 16883884 19776085
2111 19776085 10556112 2792497 4583641 10590071 21232190 24696025 12079175 -2358487
2103 -2358487 3425664 16714731 10971233 4523706 9435421 1876859 -12447350 -5620109 9957715
2094 9957715 7466672 1894480 8420427 7376245 -245490 9870652 24752175 23759052 21341642
2085 21341642 18583681 5689486 -985759 10554054 17636657 3530731 -4584538 -3815110
2077 -3815110 -15317759 -20328186 -10298239 -2498810 -6235517 -9430354 -3147444 -6562519 -12653522
2068 -12653522 -9754259 -2359191 14160350 16902556 2046103 -7923890 -6766093 1801148 6391271
2059 6391271 21041006 27773396 -376181 -17300367 -7389666 5951382 7302282 1499057
2051 1499057 3255909 -9065592 -19522279 -13159471 -8604009 3730821 7214411 2837828 9498534
2042 9498534 16538505 14958833 -55760 11843464 36941884 22589136 11719278 17840565
2034 17840565 7455773 -18179723 -17627696 19617565 21110734 722097 3416710 -1236140
2026 -1236140 -6539724 4722650 31790187 42447076 23717854 12645925 -1286497 -2720705
2018 -2720705 15680506 11770923 276868 -5984532 -9784899 -19879770 -22933752 2196867
2010 2196867 3233548 -8980039 7673288 19601100 12904733 1720868 8866826 15290157
2002 15290157 8561942 18228662 12816691 -7062623 -10666966 -9105011 -2985564 4249495 13319243
1993 13319243 4565227 -10409118 10736243 26595675 20606871 20697133 21296229 13845691 6070456
1984 6070456 23259115 32198267 10622968 -952009 -5278650 -2227755 15305646 28888599
1976 28888599 20250345 -3330284 -3946054 1109270 3367662 26509279 31328426 1424335
1968 1424335 -23627298 -11335847 7254280 597952 6967695 14367559 1765189 -2315819
1960 -2315819 8857045 22625640 16571703 10708149 18809044 22896692 25136504 5620704
1952 5620704 -13349912 -3251208 6793567 9929642 10308906 14198442 -162106 -17593532
1944 -17593532 18074826 48622428 36453034 23169705 23637521 27071965 19833535 33192308
1936 33192308 38000134 4725287 -3360601 4382280 8567157 16582597 14662754 -692124
1928 -692124 -20859621 5323254 34652735 18456206 24641448 25921517 -11009364 -28694998
1920 -28694998 7528468 36437820 -6980407 -22830153 -3251583 -38279070 -50809260 -3101020
1912 -3101020 24334111 -10913318 -25785530 16601682 2640424 -20571485 16326030 26734301
1904 26734301 6770356 7520670 29031578 4733141 -35458252 -4944873 14998604 15675063
1896 15675063 39942183 24598936 -21085687 -25786178 35192765 64513511 39480288 50521840
1888 50521840 27169056 -26382382 5856414 73090871 63645809 -5244359 -1796662 28971238
1880 28971238 -5145344 4475624 43592922 18773520 -22218914 -2081860 46161734 16689851
1872 16689851 -20679348 -353040 5659314 13935382 23944110 9145721 -15056759 -21686735
1864 -21686735 8204964 16774974 15773466 16659119 -26851568 -35126701 12711738 31559789
1856 31559789 -5720781 -35552910 -5058988 -1451469 -20158993 10835213 18279959 -17015902
1848 -17015902 -29783548 11748422 43682989 10024017 -5244301 7781628 8114482 12331690
1840 12331690 11685977 16224738 9927914 -7106556 -4851020 -89449 11657027 6675716 -6773694
1831 -6773694 13770866 18960944 1406945 -4058769 13966583 33710519 16365462 10762465
1823 10762465 21825295 12840704 11162803 16533525 26110665 24663686 12165296 19706231 22435019
1814 22435019 20247436 14564287 6989915 27096551 36211026 21011362 6386879 4100329
1806 4100329 19176943 21874052 27707128 33070053 10456437 2490462 17471195 34626335
1798 34626335 32863717 10710821 3979330 4067588 15688070 28537104 7568338 -12248505 -11873076
1789 -11873076 336768 9780314 9002236 11761696 -7055190 -22477091 1451871 20228637
1781 20228637 12214200 -5230323 -373411 11999015 -240655 -2643687 4820714 6931898
1773 6931898 11964521 15887582 21613943 12462959 -117747 5328851 15200671 28096241 21185070
1764 21185070 -2478770 -9836687 -8128829 -9246176 -18552815 -12485007 6515811 -3592330
1756 -3592330 -19973995 -17456503 -8438034 -2199007 8708312 34152503 30935144 -4972529
1748 -4972529 -15711362 6193776 30118820 26630526 9322139 2537306 -1128936 7618041
1740 7618041 21884806 26503484 22522033 13231589 22715244 43872120 46643001 25715804
1732 25715804 454771 8095700 30821126 29876110 11283444 -8264825 -13263719 -9033544
1724 -9033544 2754003 20697041 16678876 5486 1670516 26072019 46537629 31482070
1716 31482070 10554290 14071745 27358037 33437610 23003036 9460797 -3974594 -16108857
1708 -16108857 -6260673 11245626 15685110 2056093 -15879303 -11752375 -1123094 1422130
1700 1422130 2794606 8247762 16027761 -367456 -21260155 -13288001 7190030 21376072
1692 21376072 19715427 16186730 13727684 2168331 11286689 35556095 43655649 26077754
1684 26077754 -1923204 3808203 24997678 23069778 6507821 -2387729 16092898 28023541
1676 28023541 27644037 43308180 46537709 35903386 38766118 68661160 87958586 51530571
1668 51530571 21495547 29865662 40847589 35970115 10331796 -980694 -1072603 -1557084 13566116
1659 13566116 22844378 26240048 14291857 8261035 48238904 73594155 53800337 21026595
1651 21026595 16935538 36202589 22111776 10908008 16416012 2424677 -11588129 -15775277
1643 -15775277 3331909 18966778 15702872 27958900 36891515 41914123 31435560 15256103
1635 15256103 44872999 67905822 45377544 5544266 -5984852 18406943 23213793 33586571
1627 33586571 46849863 19983840 5105995 30001037 72097041 80968072 49151844 24043993
1619 24043993 10229426 34903669 60259939 19126867 -22866172 -20340725 -6338441 -9950727
1611 -9950727 3104568 37043589 11203711 -16455649 34178259 75603234 47927681 15013809
1603 15013809 40780688 63531150 32750905 3213590 -10229729 -11815288 -893193 6263375
1595 6263375 14130103 13053432 -11711169 -28519121 17348932 84360228 66011102 9248611
1587 9248611 21710820 47103660 8155820 -16413000 23389319 40088423 5439711 -10033459
1579 -10033459 4648400 1825281 3901828 48078427 91216185 93214922 42242149 -3842992
1571 -3842992 41232891 107450279 82563023 -10226 -18370622 14411146 4603967 28754417
1563 28754417 74895735 17206695 -52360884 10561044 145163150 161279885 82918407 46804867
1555 46804867 15592233 34300371 112963037 122143376 52838498 -17333431 -14925220 -3261891
1547 -3261891 14989297 94355828 98916086 73070217 121852333 168919241 154078362 92504116
1539 92504116 130886038 210396509 186965418 120068065 24005275 -17368603 -24056098 -57527552
1531 -57527552 -12683168 21371392 -27497444 -98279842 -57716938 87832273 62121995 19748902
1523 19748902 145861663 220854248 173676746 95593904 129409888 165848947 122154623 145666792
1515 145666792 119835461 90886747 110183983 74473494 120791807 184864001 116136688
1508 116136688 -11364559 140634320 536778179 453010613 76675213 96929174 262670804
1501 262670804 275724612 432227351 806491681 550201587 -310996953 -323164829 213072528
1494 213072528 333131611 167011673 112400036 7241749 -303571218 -261344431 64716113
1487 64716113 55446958 -9186095 54622194 78636671 97619842 110095258 62235701 93558256
1479 93558256 643590289 1145248702 775938210 333781944 400533032 481077456 561684329
1472 561684329 1081397635 1419155713 281249088 -901988034 -575206466 -82406710
1466 -82406710 -186453914 -309703146 -291691469 -678219886 -1098278126 -708902896 -236274610
1459 -236274610 -334752426 -422035970 -287773587 -178020127 -208569329 -230348735 -242950616
1452 -242950616 -184429995 181410207 310167106 10458599 -148074833 -191521249 -266127891
1445 -266127891 -91474062 408317541 427775853 -396326968 -674766884 -276046931 -147872176
1438 -147872176 -234882896 -153924009 -110857900 -424499095 -529507886 -156945880 -35923174
1431 -35923174 -232534496 -301929659 -174961431 -72343447 -126071102 -131359564 -127765865 -152768742
1423 -152768742 -130363936 -154213104 -115337237 -98208831 -217390342 -277711692 -219391843
1416 -219391843 -132081111 -188385071 -227941982 -80176243 -38150067 -106171281 -119713060
1409 -119713060 -68831318 -7745831 -24877683 -7537755 28371 -72064571 -125561336 -164055034
1401 -164055034 -120011700 -85074060 -150015702 -157759436 -110158282 -87968307 -137546094 -146018492
1393 -146018492 -36362986 769982 -1307465 20872960 -25947701 -86515115 -80743753 -3135837
1385 -3135837 13733515 -46949434 -67808036 -108604391 -112658592 -21318458 18413144 -33750049
1377 -33750049 -74445682 -13660873 33821278 316922 7575065 2780759 -57295389 -74031546
1369 -74031546 -27655536 7445760 -45297672 -103888420 -94583464 -67124879 -39392919 -35693322
1361 -35693322 -28500216 960548 -15564080 -49810430 -39813959 -4705689 -6817923 -41883395
1353 -41883395 -31671561 -28653457 -82330361 -95623487 -45952287 -4857155 -19059333 -46490884
1345 -46490884 -28043651 2282028 14806833 9007865 1387833 15077742 1537328 -27837583
1337 -27837583 -14198746 -9120167 -57104404 -94786460 -50634028 -6142487 -51975164 -81649104
1329 -81649104 -46429500 -25168712 -24937347 -15562476 -4417765 -25793793 -42363085 -14012243
1321 -14012243 -723454 -12651773 -38699383 -67716428 -47695661 -7464438 -3539837 -36627194
1313 -36627194 -49422954 -24087609 -27428340 -27568546 -53853 -10801299 -45226370 -56799119
1305 -56799119 -37498319 -31697516 -49298630 -43532906 -38737449 -33479082 -23523974 -34749907
1297 -34749907 -22137802 13896989 26306127 3852085 -9460271 15751698 8344664 -11540092
1289 -11540092 8379847 -197314 -44867100 -62553507 -28097210 -7937838 -41898130 -57610535
1281 -57610535 -52783054 -42468226 -18407802 -17804626 -30304239 -39260949 -38445724 -31237180 -24470654
1272 -24470654 -6147244 -28343660 -67225088 -40504284 -1417394 -9231285 -38343073 -30891683
1264 -30891683 -5870843 -16233221 -13418910 -959305 -15348122 -27717599 -25888106 -8615620
1256 -8615620 -8485444 -33810507 -49934176 -45805074 -14571534 -9852088 -40653854 -39087230
1248 -39087230 -25029550 -28413553 -33139254 -16816372 -4147879 -32917196 -40600661 -16724663
1240 -16724663 -16389748 -25016914 -25494725 -7936704 2216386 -10237401 -18235259 -18048419 5517346
1231 5517346 19070337 -6436378 -17573147 -17669505 -29128251 -35197822 -19735750 -9795931
1223 -9795931 -51690087 -75505952 -38665819 -13511332 -18891621 -32583508 -31481880 -23969524
1215 -23969524 -21957790 -4291068 2603595 -6284181 -19905362 -38378523 -22965336 -3655096
1207 -3655096 -17158616 -32821515 -23172424 65331 -13142958 -25569509 1476972 7991595
1199 7991595 -773683 4415699 12679805 5032887 -17401885 -14203868 -8312369 -13463330 -10066961
1190 -10066961 -23094836 -28158948 -19510905 -26924055 -34759764 -24962382 3503348 -4376361
1182 -4376361 -37132182 -26527983 -19698509 -31031453 -26224106 -16414544 -22991766 -49879332
1174 -49879332 -40408128 -11333594 -15864029 -22624809 -34251170 -30513292 1162818 15169158
1166 15169158 5175674 -26338820 -38574246 -29103197 -23387132 9613619 12333226 -33085234
1158 -33085234 -59363330 -48993172 -5591021 13691935 8713483 6255848 -9738200 -3508095
1150 -3508095 -3255063 -4857312 22684674 12642074 -14859355 -20415984 -8928962 -20499245
1142 -20499245 -63324371 -29410261 11981941 -24659110 -39146906 -20533750 -12327864 -37490696
1134 -37490696 -34187647 10394039 -12565529 -32073596 -20355394 -36353148 -37235877 -35138659
1126 -35138659 -25666343 -23903047 -21337217 -2870639 -38032674 -22482183 40363194 16504783
1118 16504783 -18524640 -6298792 33519615 22647424 377482 45440610 882674 -73249638
1110 -73249638 -33183689 34871312 51926134 -9304816 -39823676 -41451041 -57319532 7293363
1102 7293363 47907823 25919360 -13714069 -63634870 -40340464 -9619606 9574136 5693467
1094 5693467 -36404501 -13642825 -18291405 -43137986 -27512284 -34526571 -12966663 -481548
1086 -481548 9648659 1799871 -64066480 -54207021 -24773361 9155122 53125553 2000567
1078 2000567 -43400283 -52266970 -16400681 28039857 11796537 31657202 -5349250 -64057736
1070 -64057736 -22276078 -3164852 -12855990 -42276619 -36978285 -19208130 -65628763 -32672683
1062 -32672683 -12949526 -45352826 -3566753 29933891 34165035 6446478 29426387 78690906
1054 78690906 32505564 60409110 96061624 31824926 4095263 28378593 62616658 2104743
1046 2104743 -38388291 14560288 -21450151 -39873545 -7711671 -10575294 -27968219 -48260851
1038 -48260851 5969291 20703011 -14197772 -1222738 -23023497 -515992 41795404 33863623
1030 33863623 20523103 -14025154 -648673 6771885 15895117 68999368 25144871 -28834601
1022 -28834601 -27088323 -6581354 17834137 -8002187 -295759 -4257547 -40171192 -23171442
1014 -23171442 -20022323 -3881731 -286526 -14033305 21077486 23196635 696610 -32295861
1006 -32295861 -29872177 24101349 9217777 -1541463 292299 -53690620 -88354360 -61164366
998 -61164366 14737403 14742102 -36668689 -28000312 -43298264 -46450994 8703631 50514710 35644287
989 35644287 -15423529 -9659237 -1898270 -13345673 20289169 18536169 -15706934 -24429512
981 -24429512 -9571689 -2469734 -14740647 10128655 15482512 -11350478 10542297 27221003
973 27221003 7910474 -4511592 12109578 12120258 -22503722 -12368630 1584522 -26638008
965 -26638008 -28817557 -4441456 -3442850 -27490091 -16531877 11099960 1320116 3550773
957 3550773 21245523 13620991 -10002477 -16422100 -2487848 -4100697 -7481303 -10666462 -29836818
948 -29836818 -43442124 -46568794 -30340356 -7846120 -937480 -14002758 -37576323 -32052684
940 -32052684 -14350550 -1907354 12141514 2875845 -19964165 -35127766 -19731096 6767876
932 6767876 4407379 -1537447 -10714093 -13114302 2975105 11713649 16922669 6159851 -4339883
923 -4339883 -341078 3629198 14487663 -1201589 -22134539 -16163661 -11463495 -3494679 -2705766
914 -2705766 -3506881 -8524869 -17364513 6694978 17242372 5669180 3970791 179440 1622080
905 1622080 -3944681 -2332834 -2405597 -22288365 -17325240 -11203329 -14776762 -13040443 -17923993
896 -17923993 -11730771 -8398483 -838431 5835150 -6907990 -3181291 -4814038 -11446252 -2935759
887 -2935759 -3829632 -9732337 -23607304 -24084436 -15972071 -23014304 -9794398 890628 -8629181
878 -8629181 -16480643 -18739828 -4057396 3835123 6758198 5636244 -16804218 -26425258 -24229414
869 -24229414 -16711551 -5279718 -14697348 -31358209 -43655712 -37448034 -21155772 -20803525 -17190799
860 -17190799 -18402701 -27440452 -23386246 -15321623 -9323907 -11788593 -11724606 -5214117 -7096201
851 -7096201 -5468742 -7079476 -13384974 -3744529 8326597 7106882 -2023919 -3417242 -1134282
842 -1134282 -5530300 4752933 19298479 7894889 -8104610 -4978106 4064939 3511146 3585300
833 3585300 9118152 1823857 -10028468 -8554066 -5261179 -4276774 -2954189 -6718636 -12842653
824 -12842653 -15403202 -13892967 -13407228 -9230972 1691796 -1813589 -11748016 -5419919 2687398
815 2687398 1885116 562193 7205465 9375492 -1580 659942 5248624 1509235 311703
806 311703 4087098 11224810 8791533 -978528 -2912626 -156050 6936738 7984355 2980697
797 2980697 -1047676 -11806695 -14002109 -4845077 -310656 -4359415 -12584570 -10558668 -6960773
788 -6960773 -4195778 5154630 4201494 -996201 7857 1978198 905792 -4499211 -4050722
779 -4050722 -7469047 -15938347 -16427385 -20780748 -25389064 -21549744 -15150249 -12861841 -17101378
770 -17101378 -18052324 -18354921 -13155534 3136847 5861849 -5179954 -10977481 -11545266 -13186518
761 -13186518 -9404756 4330086 3224120 -12040496 -11498571 -3396061 -3292187 454552 13419237
752 13419237 16748189 6493446 2120354 438848 -4255004 -1181946 4326692 189003 -7819141
743 -7819141 -12437321 -18536301 -17461030 -2700464 4053345 -1287058 1384800 7885980 413460
734 413460 -4746532 6169841 6459785 -4351296 -3278060 -2720359 -17556871 -26533412 -15258059
725 -15258059 -9811922 -13014300 -4388250 -853202 -6443785 -458502 12082531 12432103 7228020
716 7228020 13689178 12857976 3094760 5197357 499576 -14744622 -15953983 -4299069 -3358569
707 -3358569 -11044266 -6081949 -9356427 -20461579 -4209887 15032485 8565751 -2331978 1299810
698 1299810 -767649 -12329405 1188007 13978921 -4394087 -15167442 -5455694 398972
690 398972 -2411144 4030250 7131996 -9809740 -9974595 4969149 2355566 -6646984 -13857919
681 -13857919 -26370784 -37529489 -25884646 -12517895 -30431510 -41729297 -30574657 -26406337
673 -26406337 -24065971 -10250288 -2163880 -14888982 -12002400 15988916 19491967 -19622
665 -19622 -11185804 -9432278 1667436 17458215 22018085 -3720518 -29600080 -22439799 -23323
656 -23323 23465572 32408177 9110116 -23614374 -20861324 14743976 26773208 10079833
648 10079833 -1055905 -9222837 -15473423 -6808869 6974074 -2714458 -22767771 -11962686
640 -11962686 14887750 19967086 1115292 -17273421 -12226189 11428095 31154470 26395039
632 26395039 1705935 -18085794 -21232948 -1377214 26401133 24556347 -9348098 -29469916
624 -29469916 -7051996 18442609 13686273 2705038 2072053 543087 -1201717 10363884 17450497
615 17450497 -4544221 -22954866 -4571708 20000061 10513647 -14492650 -15849466 -3168314
607 -3168314 4355995 11273670 12974207 -3263 -13397896 -4502221 13511002 13733823 -897054
598 -897054 -15016817 -15278952 -2380146 3583809 -8281587 -18764050 -11586352 -7305375 -13620297
589 -13620297 -8632169 -1932448 -13731654 -19093647 1466682 9075145 -14274797 -19837316
581 -19837316 1792055 7807216 -1312365 2407367 4691748 -9234725 -7874596 9171063 5939753
572 5939753 -7583469 -6459739 -5134533 -15114623 -15511984 -9366584 -17507280 -17388257 -1751265
563 -1751265 -5248474 -24133149 -21011620 -810178 1735777 -1287523 5317368 -3096564 -16762429
554 -16762429 -7585472 9069510 4716483 -8693096 -6928867 -3097043 -1070204 4696535 326105
545 326105 -5530758 3494178 18222171 17578785 6382691 2940247 -2880124 -2957538 14213180
536 14213180 17746032 -5811284 -28578150 -23975728 -10893834 -12070930 -14342353 -21036184
528 -21036184 -31836206 -32180416 -23295531 -14535630 -19045789 -26562564 -23689138 -13772442 -4022729
519 -4022729 -11177925 -20717065 -13378077 -2453377 4393973 5526914 2594028 -8540409 -18020183
510 -18020183 -4419136 9335773 4072371 -8467862 -18183083 -20220363 -19054791 -10217128 -1167647
501 -1167647 -3813463 -6841226 -9541619 -7984691 751404 8312549 13748505 12956331 8693176
492 8693176 1925426 -4799916 -2274600 -1722540 -4535492 -5895120 -10869592 -16493803 -20136389
483 -20136389 -19399273 -18862763 -14688587 -882155 2261734 -8912462 -17746332 -19771869 -15714638
474 -15714638 -5142986 7169235 -159683 -24269561 -34733279 -28213990 -15093142 -1761743
466 -1761743 1365177 -10495049 -22034140 -16245886 -7541825 -4824705 769197 773148 -9475400
457 -9475400 -14885167 -12401926 -21631383 -35537612 -26582308 -11371651 -14009917 -22127040 -24805742
448 -24805742 -30262163 -30978504 -7476448 17432359 15378543 2661528 -2649492 -1466042 5285039
439 5285039 20439830 30524099 20917133 7227991 74836 -2305859 1535356 6531997 7920325
430 7920325 2350809 -4605286 -8400128 -10971667 -7651911 -4349223 -2031189 3579536 5210856
421 5210856 2860602 706870 1509946 3613233 7149928 16590545 16679440 4604026 -4399915
412 -4399915 -8868316 -9440773 -6884696 -4786632 -11180072 -21346193 -19962813 -17120107 -16616945
403 -16616945 -8873210 -3127781 -3769580 3179307 19529393 19419557 3870541 6335324 17639288
394 17639288 15365560 14286442 19153421 5599058 -21457839 -22546393 -5529505 -5906321 -13298381
385 -13298381 -10939704 -13778889 -25116012 -23164125 -9399846 -3478096 -756305 3564700 -289686
376 -289686 -10025865 -13498213 -10605598 -5175208 5248495 5881319 -11138619 -23515403 -19142238
367 -19142238 -10810788 -7158701 307141 4605263 -7030466 -14357037 -6078775 3216259 3439004
358 3439004 2931839 10799469 10279051 -494666 -5534874 -3754875 1926896 2231540 2381159 1930645
348 1930645 -10290671 -18736877 -15108622 -4305179 228765 -6597994 -7287771 -8112796 -8619326
339 -8619326 -2041162 1147994 3603966 2021466 1671738 2870859 -1962056 -1072294 -4101321
330 -4101321 -7473735 -2824259 -5350760 -10353392 -15247932 -12953361 -8072279 -12189308 -7706572
321 -7706572 -6009759 -9772446 -6201307 -4055664 -547797 -3777413 -5454936 -1136499 -4610364
312 -4610364 -2389593 -3219136 -6034995 -1842429 -4195695 -4259870 -4814858 -3654348 807899 -921402
302 -921402 4300378 673510 -9190828 -3912997 720129 3375961 858788 -1955364 -5283358
293 -5283358 -14498875 -5186983 4274968 -843226 -1732926 -4104816 -6425451 -9002846 -3961713
284 -3961713 3268382 -5203062 -5373073 -4722832 -14689088 -14823108 -9933079 -8528832 -15340263 -16267425
274 -16267425 -12446540 -23730628 -22534716 -10920301 -14514677 -21018174 -19061219 -11183506 -14063539
265 -14063539 -16038877 -6072503 -8494287 -11358952 -5007379 -1820774 -1865332 -4288987 -2681051 -2663719
255 -2663719 -3878927 -2624830 -10153270 -9921315 -427931 -1629366 -7652807 -9904977 -7899598
246 -7899598 -6887551 1703508 17129670 11694888 -3639683 -4716570 2358426 11127433 16415719
237 16415719 12177996 -3469823 -14607941 -10040706 -6817091 -4376568 930504 -7332961 -19544968
228 -19544968 -14785508 -3661415 -6953045 -9141083 5205320 6973502 -7145295 -6421971 799787
219 799787 -4283906 -5093476 7225186 7197983 -8276858 -9336637 -885724 -1875605 700072 7257695
209 7257695 2115352 -5241231 843870 4759269 -4995825 -5695848 3141209 -1060067 -7110403
200 -7110403 -495792 1463196 -8155272 -6771710 7424819 7896776 -326112 3715977 10091139
191 10091139 5292184 -1811125 -1635768 -1478287 -3371670 -436109 -186301 -10095874 -21510607
182 -21510607 -21223394 -9611814 1565485 4703738 -3196958 -14789459 -14879295 -1191149 11203424
173 11203424 10711435 6036534 2768523 -3153401 -2248904 9523338 15451441 7364108 5361467
164 5361467 17355697 15659639 2563131 3869209 11911648 9186253 3364658 5549432 -3037787
155 -3037787 -22373713 -21051577 -10038464 -11919839 -18461899 -18272218 -15417107 -15399790 -5042578
146 -5042578 3674307 -2760547 450591 13038335 18154624 14971703 11952379 9445049 -748301
137 -748301 2589269 16226995 11341075 -56510 -6025221 -6335079 -7218817 -6936113 1140643
128 1140643 -1806732 -8343008 -10491154 -20246394 -25753964 -25920936 -21292151 -18488563 -22544597
119 -22544597 -23346789 -32711706 -35851231 -18694988 -2617191 5672603 2293721 2367629 7835546
110 7835546 6581535 14754888 22823425 22421518 14864770 4696140 9815349 8903273 -756046
101 -756046 146844 5623827 10201556 2779483 1172790 9934652 4620566 852357 3744539
92 3744539 7213406 4496599 -7323307 -7043326 -8137084 -17935216 -23195983 -22874099 -11011637
83 -11011637 -8518668 -15822172 -13271720 -10531383 -8205049 -4746909 8663115 22070100 11278532
74 11278532 2570934 6864079 8699175 7359939 7537375 15660983 12374635 -834213 -3820837
65 -3820837 -5203718 -4671455 -3016945 -2113528 51031 -5692516 -13501141 -18252098 -14804615
56 -14804615 -4497081 -3164651 -1100686 5961818 4708632 293681 4313838 16238769 20636957
47 20636957 18821431 22170062 17353882 3377945 -2313922 -1946151 -5261556 -9461232 -9073391
38 -9073391 -11736243 -21116915 -22974662 -17543766 -14552901 -5749175 8815845 14888975 9086851
29 9086851 1405466 2058128 6003678 9294332 13155730 6178905 -10547605 -27729982 -35297466
20 -35297466 -27706747 -23573994 -27763294 -31525361 -33060340 -31646027 -31801130 -22348879 -8458192
11 -8458192 -7166696 -3225400 5276470 9921824 6991262 2026360 9914600 15578684 15898967 16294171
1 16294171 7843367 2129760 -4370987 -9182205 -4587812 -3677210 -6950718 -18174230 -22300479
-8 -22300479 -16698919 -25395338 -26450147 -14069908 -8519280 -12184600 -16448861 -7760907 -11715341
-17 -11715341 -22080794 -7998396 1100865 -4642477 -13281465 -17286115 -20988581 -32609029
-25 -32609029 -22179628 -5607470 -9998877 -14447001 -19897414 -21769113 -18148229 -6018902
-33 -6018902 11882170 4874604 -8469345 -16045664 -26623875 -24428471 -22025963 -25568558 -39829447
-42 -39829447 -60666922 -67537177 -76361194 -77586339 -69329183 -73361647 -74706189 -74576988 -72117380
-51 -72117380 -68079968 -62022861 -37905471 -25244121 -24063511 -14206033 -10538113 -6415914 2288543
-60 2288543 21557595 34193933 18295630 9757322 8878917 1792713 -374731 -2651610 -4700942
-69 -4700942 -23802533 -46258724 -47423562 -50523199 -50582725 -45662710 -40940753 -34441657 -39560777
-78 -39560777 -34349369 -16908760 -86463 20661576 29028216 35475569 38944229 34910460
-86 34910460 46093113 58140888 64969782 61519868 49984993 50697316 43866973 37604110 42612749
-95 42612749 41765618 40388875 31433147 25518430 20738818 5518775 7069976 14004347 14636766
-104 14636766 10683007 -3128115 -7424522 -10628653 -6681985 10194858 13434381 11033488 2994965
-113 2994965 -768959 8122730 9572506 16169395 19578415 13717276 9450607 680938 4779373
-122 4779373 9204951 6648750 13506489 15335537 15319733 10276403 7405598 19158447 18963164
-131 18963164 17132313 20849363 19560122 14440950 358663 1863039 9287267 2612407 3688986
-140 3688986 6931370 5399250 -4558524 -8309890 10816602 16634796 10161618 10127316 8364538
-149 8364538 6048139 1520370 8227297 12949829 -1279888 -6533160 -3964270 -1038717 -817412
-158 -817412 -7617529 -9468957 -10996284 -6938960 -1341730 -8157833 -12345594 -17679263 -24247496
-167 -24247496 -19967422 -13021243 -14161032 -29433448 -33836818 -20121554 -17208492 -18514268 -12935650
-176 -12935650 -10799031 -16482049 -16546564 -1618128 -565886 -17756272 -22817672 -19228805 -21328748
-185 -21328748 -25177901 -24381535 -28714324 -41472507 -39386728 -24911390 -20599488 -20167168 -15322044
-194 -15322044 -14490555 -16413116 -7013304 6442194 2364208 -7462185 -3729116 -3567188 -13674762
-203 -13674762 -13488392 -7996865 -17204388 -29325922 -22240804 -12675955 -21787881 -25721005 -16179486
-212 -16179486 -15456991 -17209213 -7903107 902147 -5978444 -11318039 716020 6268803 4506970
-221 4506970 8657059 6218416 -1345143 -408966 10091414 8832234 -5424899 -6806338 -9434653
-230 -9434653 -18380178 -12869169 -4712569 -11492775 -27342346 -23449849 -7179403 -7222201 -810004
-239 -810004 13103292 11871874 4934012 9635654 27418072 28462352 19197039 23268987 17104174
-248 17104174 2526012 -4097705 -2258044 -3446366 -17200275 -18658749 -17145797 -28029753 -28060509
-257 -28060509 -21281517 -14967433 -13488975 -9133149 2570762 -2871905 -4708626 7745489 12407151
-266 12407151 16076829 20268013 24350013 16399411 6649993 21272761 26892430 19155878 18988043
-275 18988043 14294241 4339831 -3287006 6577416 9683113 -12716918 -17577193 -13460218 -19172819
-284 -19172819 -18299547 -11315495 -9916293 -24812693 -22388700 -106566 -427371 -1363488 6233365
-293 6233365 4373471 -1556896 456066 15603866 13051411 3622272 12106414 7953472 -302242
-302 -302242 3430040 10464948 14549902 12132700 18905447 15887582 2875148 10995427 18210985
-311 18210985 17878314 16773076 12184817 5842303 -6696619 -4175279 2618780 -5007944 -5726466
-320 -5726466 -8664507 -15551805 -19871494 -22588231 -16222996 -14655537 -12144093 -10585694 -20802243
-329 -20802243 -19653113 -13596444 -6521950 5063529 7398239 6238374 1944508 9210489 26337497
-338 26337497 27279595 26519000 23828171 17193572 19232583 21853983 22712882 10615941 -3288703
-347 -3288703 -2394640 -4985601 -3620187 -2474734 -12436211 -18256455 -16882828 -6246545 -3501288
-356 -3501288 -8906038 -2665246 -3278892 -5945757 296626 4006706 2908882 -3467754 3084406
-365 3084406 11856211 3242836 1395315 5388290 8786366 12633904 13830862 17298050 9702370
-374 9702370 5046568 13655560 14550714 13608917 9342616 1630799 -2115573 -3852650 2724746
-383 2724746 -1020278 -10179077 -5867494 -8589141 -14586998 -12788132 -5087342 -2834867 -13600249
-392 -13600249 -10273739 -4642653 -14373995 -12990841 -1377846 3953378 -7108935 -15848641 -6335700
-401 -6335700 -4999373 -4697157 1901962 -1806139 -10819589 -18227038 -11913421 -4096708 -9343481
-410 -9343481 -14406359 -23804080 -26893896 -19415839 -18309836 -19794885 -24328659 -26000225 -25400698
-419 -25400698 -25410829 -14649034 -12582554 -21831306 -22224227 -16186390 -10861403 -15886930 -17476808
-428 -17476808 -10032614 -12847881 -16014007 -14334762 -14237502 -17574590 -20876411 -10369594 -3842608
-437 -3842608 -13475130 -21151155 -21854523 -15767157 -9596213 -4675925 -3739408 -18496769 -30465626
-446 -30465626 -26629422 -18910840 -14815222 -20269903 -32497542 -47847759 -55867275 -47390536 -41472379
-455 -41472379 -44362381 -47055640 -51244093 -52887609 -45563131 -29070780 -15365786 -10036255
-463 -10036255 910769 13671508 20193024 30395396 42861472 52006049 58482670 63828138
-471 63828138 63007836 50662428 43267967 44461788 38988006 32415810 25302826 8611300 -12411393
-480 -12411393 -20427923 -10503990 -8168103 -15627873 -15210592 -15380471 -15707884 -4659878 19142953
-489 19142953 39995786 44125653 50339626 61780347 69175823 79738923 90890450 100908218
-497 100908218 100833269 88611042 77206292 65697803 60994342 58511760 49273516 41977638
-505 41977638 28596560 10618296 -1816518 -1039345 12159564 13494921 10533847 14368278
-513 14368278 10369751 2491529 3670689 22941512 37778837 30989527 26650945 20687291
-521 20687291 8041620 4865105 18480138 36289608 30013962 13306369 4650280 -1991273
-529 -1991273 3603458 16052179 22904137 18993525 7746822 1714910 -3411017 615064 11406385
-538 11406385 7636783 2209714 4861350 3265485 -9709075 -16806211 -4533111 -1178399 -8572202
-547 -8572202 -5347214 -6241832 -20605223 -27673340 -12743297 -632267 -5790554 -5311643 -113151
-556 -113151 11719 6395068 19428084 23914301 20101049 25444062 33315874 31771911 31417423
-565 31417423 29219314 14408199 2256153 10001391 15479728 1925857 -9254964 -12878662
-573 -12878662 -22435462 -29614257 -17737071 -4086449 -10325137 -15564457 -11906587 -12699579 -13469601
-582 -13469601 -5847799 6335817 7892159 5186386 4227118 -5582529 -7444819 1506916 7778200
-591 7778200 9093603 5898774 3888093 -7670588 -13067740 1459771 6004190 568401 -3458780
-600 -3458780 -2516293 -4190492 -14729175 -8216514 -675030 -6263573 -6295319 -4552483 -1177115
-609 -1177115 -8858248 -15010185 -5789836 -5756479 -4467405 -4283209 -7942004 -6156902 -10481555
-618 -10481555 -6507789 -4888299 -5682189 3805690 3152894 7708930 11665814 4975612 947833
-627 947833 -2092436 14209825 21854548 8364454 1593501 -11656436 -19132269 -17137969 -7040978
-636 -7040978 3429767 -16088442 -29257709 -27875033 -26139518 -13663817 -7666666 389480 135220
-645 135220 -5332139 4455552 4383025 10895288 21171293 22789655 29718202 25027379 19951759
-654 19951759 11470092 6484448 23486902 24870523 16751641 6717977 -6277581 -6220563 -6575829
-663 -6575829 5637429 12359859 -2052520 -8578972 -10652419 892037 11656657 9043328
-671 9043328 13305805 8664862 5352720 7565476 11364235 21006938 12217820 5063470 7533613
-680 7533613 3482324 3918752 2551442 6526999 6648058 -1849931 326912 -2012256 -1551908
-689 -1551908 3840466 1703278 2828741 1254233 -493123 -5586949 -8712016 3809717 5181627
-698 5181627 -282716 3476468 2898554 -3689082 -5974138 10247805 20351387 9480225 6625643
-707 6625643 7975204 3618634 5585532 16199626 20496601 7733415 1750236 6904936 5571992
-716 5571992 5265425 6742761 1316610 -6787287 -5734635 -1355359 -9550595 -19458520 -19786119 -19780164
-726 -19780164 -20270242 -15857552 -13246327 -19474352 -22892354 -14111281 -2904412 251787 -614024
-735 -614024 1422140 3362019 3942977 2713250 -403985 -3853438 -9659796 -10835525 -9418029
-744 -9418029 -15013328 -24557117 -31056770 -26631645 -18555150 -13998043 -10721227 -15282704 -16822006
-753 -16822006 -10559304 -6257856 -2521492 -235895 376392 -7487954 -14588262 -8041071 -11596710
-762 -11596710 -21135831 -15409780 -6215228 -10757924 -22730757 -16106270 -8343596 -15476855 -7531584
-771 -7531584 6332948 2681844 -8818227 -6592531 5401544 388488 -1349308 9132121
-779 9132121 7686223 2972377 3374470 7201231 5611233 2539163 11155656 11789159 6664269
-788 6664269 6216244 1224096 -1090394 -329975 4370092 6260059 1217503 4692544 4723698 562749
-798 562749 3848431 8006148 12142433 8959447 6667481 5988683 -6100993 -11818431 -8927510
-807 -8927510 -7570642 -11482729 -17808208 -14569557 -17467394 -22652521 -10619060 1843877 5896980
-816 5896980 8711438 17986757 21110930 9268550 13947659 28518677 25467533 16824128 12212491
-825 12212491 4125524 -13979633 -18643139 -4734005 -8433364 -21886715 -24263277 -25489748
-833 -25489748 -28977084 -27212439 -15769781 -12559088 -16902965 -10266514 -7558582 -10279976 -6377862
-842 -6377862 -723844 4202276 8378761 15018639 13173764 3354525 8336239 16319781 15028090
-851 15028090 13175895 10924054 5299822 -5063882 -6420524 -1490520 -8392018 -15921702 -16399328
-860 -16399328 -12503159 -9645721 -13063008 -12423044 -10357759 -9340873 -4157086 2010626 5948043
-869 5948043 -1894978 -12500207 -10829970 -9346884 -10214236 -9701110 -10734620 -16531561 -24712427
-878 -24712427 -21963498 -16637272 -14408348 -4823659 548899 -3496035 -6091449 -2776014 -405664
-887 -405664 -1683776 8146363 15254868 2765837 -7267005 -6019809 -6304513 -8832495 -924415
-896 -924415 10216913 520666 -13489818 -11143669 -5176210 -825891 6107588 12102671 6942541
-905 6942541 -3412485 -1455374 5307945 9849862 13874048 11973167 7471866 5863397 6079758
-914 6079758 2587448 -2372374 753169 2720527 -3296949 -7316427 -9977879 -16133325 -19771836
-923 -19771836 -10233922 3235538 294169 -8887507 -6896179 651920 6183634 10732156 15926650
-932 15926650 13021346 2545279 2073044 7880678 5901161 -2365667 -8327290 -7243657 -6981428
-941 -6981428 -9821678 -12218712 -15474954 -13588450 -8830229 -5399485 -2559319 -6754080 -12912438
-950 -12912438 -12964172 -5530190 -112850 -7955103 -15111898 -16469540 -18166767 -15446667 -11680774
-959 -11680774 -10250608 -13412816 -14683783 -8890200 -7210059 -3792469 848748 -8203 3018674
-968 3018674 6177966 4406142 -1847038 -2127148 5136372 496339 -3553226 -1172476 -8128799
-977 -8128799 -15949241 -15055925 -7733644 -9789925 -13926843 -5591312 -7080245 -11642298 -4506099
-986 -4506099 2918407 7936787 13341640 23324279 20036093 9719413 18013496 22960443 19690064
-995 19690064 20542845 18771699 7221348 -9001247 -6449192 -3376478 -13982719 -13391888 -10922364
-1004 -10922364 -14553182 -19518589 -18953487 -12181101 -12116613 -3389583 5333585 55242 -3069348
-1013 -3069348 -7723165 -7621838 -2342539 2358269 3997703 -7866400 -11318160 -8655899 -10609848
-1022 -10609848 -3732436 679577 3212032 2011656 378226 5544809 2151110 3028359 6176374
-1031 6176374 5274963 8129742 301218 -5857839 -6192031 -6651596 -4519667 -8077107 -3932296
-1040 -3932296 -4310165 -11281908 -4014748 -1899841 -4739705 -4608694 1601689 9168962 2764243
-1049 2764243 4092962 4554441 -3630355 2657025 9399090 9080033 385198 -6098826 -5425046
-1058 -5425046 -14162152 -12160359 -9454776 -20213687 -23950459 -25251106 -24451713 -27282677 -26946957
-1067 -26946957 -18794885 -20099738 -11920028 -3788374 -9679898 -8289852 -2929109 2709923 754195
-1076 754195 -791930 -437903 -16914025 -20584293 -11358438 -14441696 -20721660 -24299267 -20717199
-1085 -20717199 -22350151 -20193721 -4972646 -3499074 -3808526 624459 1470308 5464820 7600642
-1094 7600642 11105247 9096061 6248973 7025089 -4503204 -5524489 5676646 5092026 516422
-1103 516422 1065985 4343682 -3300748 -4585591 12470974 11465518 -174022 1371423 4578547
-1112 4578547 -271889 -5448717 1793389 3357696 -2343035 5565572 9306799 4031315 3999977
-1121 3999977 8222483 12497615 15010476 18977584 12198647 -1027411 2637341 6553857 -172323
-1130 -172323 -1804419 -496190 -6148175 -11272252 -546420 6661853 -6816103 -10426916 1619888
-1139 1619888 5508399 3447456 4299428 222791 -16720028 -22836631 -6640096 386566 -6265973
-1148 -6265973 -10478117 -13853979 -17162700 -14480506 1739734 14447322 11652276 10257874 8693271
-1157 8693271 3389583 612168 2755286 10884380 10773255 5560413 -935664 -14393629 -17788106
-1166 -17788106 -9220420 4272630 14813608 14220742 9708471 -1743702 -4869511 11429338
-1174 11429338 22519095 24409374 20069451 11452583 -2664444 -14686098 -1055689 11828504
-1182 11828504 6701947 4118573 1019340 -7889397 -18258188 -8352386 9508974 1741768
-1190 1741768 -6321430 -6452588 -13770937 -21278297 -19246584 -7001436 -9862834 -15325867 -4406642
-1199 -4406642 -1679776 -3306040 -829550 5526181 12347035 14186126 21892180 17924544 3826175
-1208 3826175 67690 -2160611 -1325491 -2943334 -8747568 -16627666 -26138142 -19788855 -13283228
-1217 -13283228 -16221991 -16419206 -15922401 -10243204 -5342216 -434477 252221 -13223060 -17338419
-1226 -17338419 -8116304 1549378 1953300 -6998924 -9579008 -11307301 -8151766 6384323 15194796
-1235 15194796 12104666 4874168 10997332 20756044 15117370 9039844 8373898 8187303 6236200
-1244 6236200 6809313 5885682 -10899566 -23572639 -15238557 77380 5182726 -2902993 -10305638
-1253 -10305638 -16325646 -14849468 -2245856 6263697 6028698 -3032017 -9499029 -8090300 -4333355
-1262 -4333355 1140914 -99234 3232987 11927997 10958506 6277169 3122322 10047860 16466438
-1271 16466438 18127582 24827063 16946625 1172343 -4799634 3972792 16947291 8544884
-1279 8544884 -378331 -2202467 -5222400 -1352891 1724401 9086350 5001620 -7053463 15457
-1288 15457 6130245 6099894 -2857099 -8394488 889944 -3010688 -3271142 925019 -1671244 -2528135
-1298 -2528135 -7375819 3101239 7135718 -3008625 1469851 3589255 6351716 77457 -9228228
-1307 -9228228 -4809636 -8884703 -1593826 4174534 -4879081 -9572183 -18484286 -9576327 2881055
-1316 2881055 7044622 9865955 -7917691 -11090818 -3364558 -1156413 7382111 3974420 2630550
-1325 2630550 -6412456 -11052136 6188955 3963574 3320127 10131004 12010204 12789209 3827750
-1334 3827750 12663555 13861538 4168063 14928149 12147263 1035714 -9403288 -10160425 -3198873
-1343 -3198873 -15347169 -13011315 -11655346 -25253757 -22842022 -18108535 -12896550 -20321087 -25399082
-1352 -25399082 -13671725 -16385494 -11527709 -6469947 -14237014 -16629794 -18451550 -7150692
-1360 -7150692 -1729259 -4896922 -4579303 -16532595 -15817246 -9589550 -9930353 -6068110 -8672906
-1369 -8672906 -9784639 -16493813 -18399103 -8784066 -10981889 -5293261 5182978 5591825 1075031
-1378 1075031 -2871322 5917532 10436051 13720354 21782253 13876346 2439198 -2388855 749330
-1387 749330 4377500 1075966 -136270 -6543629 -10728227 -7800417 -8236945 -7337071 -7439980 -7889464
-1397 -7889464 -8875950 -6965135 -5810276 -18444890 -25055912 -20204357 -19969242 -25249065 -25771155
-1406 -25771155 -21627174 -32045798 -38153850 -24973786 -17850576 -19498992 -17257363 -5292766
-1414 -5292766 -5678071 -18263797 -12609653 -3666268 -486291 -819980 -2525251 -2825118 -15321843
-1423 -15321843 -17455452 -5008128 4772549 7004871 -6460192 -6135171 3026351 2017420 6462911
-1432 6462911 9787876 12408062 1196002 -7360211 7864196 4725163 -7542571 -10825966
-1440 -10825966 -7705619 -4201496 -16607898 -13422147 -8333200 -16516316 -13385842 -13254650 -8092909
-1449 -8092909 -9916308 -16135880 -4443176 -769914 2087382 -4391254 -10262681 6764156 10165332
-1458 10165332 14179679 19927823 16009899 11192289 1460475 19268539 31194664 15257626
-1466 15257626 10153793 3017169 -730005 -6277652 -6317162 3185798 -14200970 -21211198 -15570147
-1475 -15570147 -18197045 -16356379 -22538397 -18225428 -17739146 -20413426 -7138901 -11741982 -17054242
-1484 -17054242 -21194752 -24967859 -13506809 -12292933 -7279828 -9021818 -20730464 -20534758 -22953826
-1493 -22953826 -8448883 3641657 -1144765 709086 -4997349 -6647792 -7580822 -653480
-1501 -653480 18777687 12975921 6998038 7743157 1286362 -819431 1728765 22295019 28803730
-1510 28803730 13788051 8835008 1576581 1567132 8076975 17249905 24804631 6214482 -12453735
-1519 -12453735 -19162422 -14164727 -289542 -2528224 -5388009 -10992370 -23241215 -23202499 -10808222
-1528 -10808222 11172810 13663296 2545860 4938921 4296571 3841957 10229528 22413655 24374916
-1537 24374916 2951758 -10664402 -12861605 -13202071 -10563375 -11242498 -12469973 -25321214
-1545 -25321214 -39782343 -35750064 -21453737 -9239467 -12081332 -13759384 -8440264 -13011740
-1553 -13011740 -12547086 -621055 8527654 2619269 -2942719 5443207 -975735 -13696600 -6995412
-1562 -6995412 2829750 1139481 -1387697 6106229 -417584 -14212508 -1151569 12752748
-1570 12752748 6780694 2553235 8808474 6045729 -6601231 1891266 9387818 -4673479
-1578 -4673479 -5985512 6158549 6528453 -5524183 -8253559 -7727205 -18442189 -10771507 4169695
-1587 4169695 -4469367 -16345691 -18567990 -20464771 -24439384 -8291390 13360159 3452827
-1595 3452827 -1727539 13034475 14054772 8996025 24704963 48549247 38481831 20362912
-1603 20362912 28282082 21249212 -783126 -3575073 5990690 -1854076 -25171138 -26457589
-1611 -26457589 -24463948 -38515366 -40248496 -28578032 -13934442 -8954581 -9164800 -3862231
-1619 -3862231 -6943097 -7402246 79614 11679912 22931784 11894066 -2864437 -7639866
-1627 -7639866 -9741360 -7017512 -5480229 1203851 245442 -12058905 -13716427 -14708111 -12562354
-1636 -12562354 -7876295 -7370863 -3068804 -6860329 -14588730 -22668079 -24253421 -10836426 -11212788
-1645 -11212788 -15942157 -9649030 -8870931 -13291255 -16042580 -4395587 -498520 -12097645 -3665080
-1654 -3665080 5730099 -1219444 -10654694 -11467282 -3696135 -6590185 -1834022 9595531 5778345
-1663 5778345 5964797 8097282 8125351 5903807 3630674 11655078 10810172 7049394 -1232483
-1672 -1232483 -28743111 -45120053 -38288160 -18186231 -12165652 -28576416 -38832812 -48333953
-1680 -48333953 -46086897 -17453540 12203517 18428534 -5582172 -15281621 1355061 6245874
-1688 6245874 3976426 3079285 2462876 -8958082 -21779601 -12399365 -15213716 -34438321 -33469094
-1697 -33469094 -10973380 7472486 -2298464 -14171887 -13282393 -10886323 4207802 17571426
-1705 17571426 16479192 2847416 -14328749 -14113172 -3980451 4904006 -3723270 -23288346
-1713 -23288346 -15497664 2165129 1788764 -5156061 -2794331 239714 -8615345 3961279
-1721 3961279 30372433 20045227 -9065034 -12430981 5783770 8483198 2012955 10877570
-1729 10877570 9024553 -7710389 -10692489 1870081 8460911 237816 -2121810 2407385
-1737 2407385 1215542 -4215521 -11234728 -10759483 -5408145 -4737728 -5880233 -3220501 1138864
-1746 1138864 -4811774 -9617550 1309263 12014196 10917166 8843120 14595137 13569715
-1754 13569715 2962488 3179705 13664833 19583161 15335189 11809391 13093401 11045215 11105249
-1763 11105249 15110911 21380892 22822862 14492643 9583237 8400286 6877169 955361 -6167697
-1772 -6167697 -3931774 -6865495 -15785747 -20750303 -19994063 -15195916 -19135348 -18655797 -11898357
-1781 -11898357 -13454721 -16739726 -19131887 -12440458 -12419880 -26904034 -31390677 -33324710 -36644067
-1790 -36644067 -43614532 -47374782 -41822456 -52254336 -61198154 -54963199 -44564980 -32717802
-1798 -32717802 -31347273 -23568604 -19260370 -24422952 -13351047 1530703 17609933 19419171
-1806 19419171 7647539 7124175 4159700 10514539 16891818 14704490 15018879 -629395 -6819200
-1815 -6819200 -1975943 -728470 -314214 -12763873 -8214054 -2815669 -11489470 -7903848 -9464949
-1824 -9464949 -10102778 -14148382 -9402542 9895197 -360564 -7754544 -2772055 -3219740 -911974
-1833 -911974 -2394217 12978947 12487472 -2323536 7878649 6890482 1531509 -265106 8158781
-1842 8158781 21333654 5770471 3232921 2446186 -11822980 -9012680 -3881287 8867499
-1850 8867499 2652015 -13441528 -11165012 -20005496 -12207733 1328988 6238155 13490006
-1858 13490006 993685 -1467149 -2274824 2133820 21923727 15592772 11528680 7195074 -2607321
-1867 -2607321 -1005533 -2883413 11962277 8751952 -8893846 947271 7032489 12262659 9056535
-1876 9056535 11861198 24119925 11559794 19732651 36225744 31619901 21655518 11643802
-1884 11643802 24264217 20990465 9505147 20300243 12362351 1461475 -4822568 -4331392
-1892 -4331392 -4650039 -20478641 -10480167 -5482741 -19172128 -21704141 -28920337 -32432003 -35592405
-1901 -35592405 -23092819 -8637565 -28211103 -34729980 -30565863 -31393658 -24529879 -14402325
-1909 -14402325 -596168 -12266516 -21538783 -6536267 -3297601 1658806 8035590 15075201
-1917 15075201 18643746 13156095 22148688 24211066 23934291 30940108 28395962 31580490 31991650
-1926 31991650 29611688 23056201 13428053 20042675 17121690 10902738 15321440 15159390 9138041
-1935 9138041 -3367863 3014877 15762772 9998179 8656830 12654569 14727297 3432972
-1943 3432972 -4568479 9142738 7550398 -4631275 -4012740 3145555 -2829721 -21764373 -13294890
-1952 -13294890 2271637 -1650406 179203 7322209 7309101 -3201106 3552499 23395722 18771815
-1961 18771815 12041912 10857932 5830030 3797403 5807457 9304838 -2896787 -8879866 -611802
-1970 -611802 -4424909 -3323692 1734732 -485370 -3875301 1321811 14377606 6960188 2319364
-1979 2319364 13135712 9751796 7246005 10890905 8624798 -2826617 -2146059 17998738 12025683
-1988 12025683 -2502250 3541751 2784426 -1116983 9310036 27758692 18892406 -3986236
-1996 -3986236 4564149 12700502 7342156 9091645 9846563 2125384 -11830893 -13410421 -14179960
-2005 -14179960 -21200046 -17271401 -21736202 -26965003 -19301263 -21953984 -33201874 -27337874
-2013 -27337874 -152445 4046591 -10364620 5515535 18334698 3986590 6201865 33058534
-2021 33058534 36181325 9303971 10134713 26347972 12390140 -843023 7510740 9256994
-2029 9256994 -5163706 -10344493 -2310432 -2794957 -3201409 713213 -1858963 -452307 6744247
-2038 6744247 8339336 11054488 21817035 20016586 232878 -1963979 17833729 22295626
-2046 22295626 11598811 10480673 6432478 -8911768 -9040373 9482600 17683382 5953904
-2054 5953904 -3800865 -4365597 -4954795 -3038549 -2652648 -1380421 3404835 -2130161 -14597216
-2063 -14597216 -22849769 -23329068 -23405578 -20815841 -6242544 -10605316 -37497789 -48000656 -36641785
-2072 -36641785 -17862623 -5680960 -1025537 -10270681 -27626546 -16257684 6276921 15946064
-2080 15946064 23801367 22866208 12626969 6245621 21193558 31233895 11715291 11062488
-2088 11062488 27082358 21433043 6947681 4875934 10723479 2702939 9945271 37346343
-2096 37346343 31174503 8723284 4741123 16618362 28648126 31661795 33871220 16189307
-2104 16189307 -2743632 3680077 5503639 1270439 -2951119 -9431685 -18158325 -24094320
-2112 -24094320 -13155653 -17876407 -35800976 -26992980 -9834559 -6465778 -18650280 -26132217
-2120 -26132217 -25458321 -30472973 -16828284 2151897 -3395913 -24471558 -40785979 -30482431
-2128 -30482431 -13871763 -8211891 -8906171 -21056168 -30975883 -35579531 -32765533 -21465743 -22172598
-2137 -22172598 -30201107 -38039027 -41910588 -40950010 -45888453 -45089442 -36493360 -28436557 -26370412
-2146 -26370412 -37238767 -42545400 -33960595 -23558857 -14644266 -7385793 -5905223 -21554917
-2154 -21554917 -35250919 -16516134 7947992 5230973 -5093912 -1189210 977400 -5929060
-2162 -5929060 6119849 31947271 29679215 12749123 17993096 30094597 26705476 22652700
-2170 22652700 31318295 32385801 19998782 18899375 21777587 16904455 17171897 18588779 15753923
-2179 15753923 12253961 13958252 13379737 6740917 15533128 19340086 1208946 -4105440 6429253
-2188 6429253 8436962 -4272133 -5087086 1631334 -19034890 -28636160 -10507713 -6166741
-2196 -6166741 -19924597 -29154620 -22774908 -30464779 -41789421 -24736328 -17993800 -26048024
-2204 -26048024 -28779536 -26777842 -24576532 -28401771 -12529477 3065829 -612129 1626785
-2212 1626785 -3004868 -5633823 -836721 6858799 17281447 6690929 -2818742 -10183677
-2220 -10183677 -20302233 -11852778 -9092564 -8801545 -11638707 -19436512 -16004296 -19789635 -12591719
-2229 -12591719 -1781282 -3108990 3724988 1304191 935820 -437045 -5754562 6452483 7998948
-2238 7998948 6610171 3917494 -1857547 5737506 1279520 6969131 20386330 16817532 17903483
-2247 17903483 19504467 31039361 31033220 18850082 31446140 33281506 27859475 27609026 23534025
-2256 23534025 19761087 2482593 4820624 13383186 1885481 664106 -5392719 -8992510 -8855619
-2265 -8855619 -11547415 -4534799 -9594109 -4025486 4306644 -5199972 -2716491 -4487268 -5452467
-2274 -5452467 -998359 4551116 13916559 -4858176 -17908747 -11423859 -11442355 -5551235 -5738036
-2283 -5738036 -6170885 -14075729 -26737859 -12868137 -3897205 -1693787 1182440 -627431 7091845
-2292 7091845 5123453 6960680 14324433 11494095 16384205 15268326 13745372 11148179 -1470
-2301 -1470 2985715 4264483 6077370 8071437 -2596152 -5057016 -4735586 1128361 7485739
-2310 7485739 2976724 5533577 546476 -3736050 6045395 9265622 6067819 -2649908 -2083814
-2319 -2083814 2670862 -3592443 3085493 7799958 -2134068 -5840572 -141454 8879735 5493193
-2328 5493193 4532651 11679916 2869470 -1746951 5617603 8225008 4200984 -3191386 -3069030
-2337 -3069030 -6800958 -13677853 -10492715 -12280786 -14360028 -14269412 -18725146 -17631603 -15284224
-2346 -15284224 -13338423 -12174931 -7705137 3547784 -852228 -7555019 2093919 8584191 9704247
-2355 9704247 11357892 15398563 10367595 -3423542 3230248 16072260 14731738 7963193 -378740
-2364 -378740 -10419 1933646 3133413 9793960 8681756 2493167 -5979377 -5141326 7948385
-2373 7948385 1862532 -11265192 -10160622 -6534509 -9289114 -16783762 -12535143 -12790551 -23557483
-2382 -23557483 -14315151 -2188892 -3299723 -8502050 -9241182 -219196 4690757 10032477 10984944
-2391 10984944 1845651 6159012 9198782 3924757 4568078 2933188 -3437252 -9237239 1505680
-2400 1505680 9382762 -10172832 -16436412 -4393473 316800 3079001 7933896 9013254
-2408 9013254 -4014094 -5040246 16241061 20606190 16182063 15911438 10210690 9650535 17222748
-2417 17222748 26803970 19884476 8589963 16212877 15903549 12017231 19013774 17392437 8916722
-2426 8916722 4018404 12542715 16939016 6698690 9781834 12260257 6401566 6077858 2192432
-2435 2192432 1875851 1906565 4198897 8361891 -2229094 -8046115 -11467599 -10252045 7749287
-2444 7749287 13312616 10095456 2269101 -6383155 1545863 12299752 27799936 26267578
-2452 26267578 7323149 6030503 -1713277 -5914056 5473925 8611701 -611753 -20558507
-2460 -20558507 -13559080 -4297263 -20500175 -10002543 5144614 3787702 1135112 6146713
-2468 6146713 20275942 7949078 8127840 26015759 16117472 14454213 12024852 2755306 1986277
-2477 1986277 4352495 8210503 -19631875 -22544533 9031741 -2186238 -6724307 11671225
-2485 11671225 6928879 -28910398 -31587813 38848104 48871351 1450313 5169416 7738259
-2493 7738259 -16847812 -20122302 37348208 64927476 -529939 -23626194 -5637544 -11609007
-2501 -11609007 -7898723 10494245 31940228 11324508 -13435966 -13211366 -29992154 -8154638
-2509 -8154638 20773111 19120144 30782533 26485872 -9400035 -52782939 -13985191 68276291
-2517 68276291 44737732 6676795 14024570 -14658837 -60244904 -34389648 58508335 45895774
-2525 45895774 -39285432 -30133923 -7175441 -26857252 -27692764 19722350 46875442 80137
-2533 80137 -8525546 14022876 1032560 -3169931 3313890 29091544 39279652 9294375
-2541 9294375 -20221236 -35940526 -4359614 14518882 -4188145 11686155 9739120 -27367128
-2549 -27367128 -39712951 1578409 37856751 -4963473 -21439422 14947895 10904707 -10303813
-2557 -10303813 -9465470 14580717 10180478 -12231475 13447329 28774359 11648267 -5745177
-2565 -5745177 -3860030 26656378 25102763 7065479 11389955 15518346 10836456 -9545866
-2573 -9545866 -3048838 14326875 -5713193 -8384363 8782019 8999611 -11762510 -25542855
-2581 -25542855 -1486998 10273590 7622202 11529411 -3221084 -12487341 -11604222 -5187866
-2589 -5187866 5662325 3743564 -471474 -16921290 -21597651 -2419011 -6870412 -12213191
-2597 -12213191 -735795 5472634 -1129565 -11108373 921377 3611109 -4729903 10419072
-2605 10419072 14304032 3531028 -2661681 -969757 6384695 5155233 12938871 13039006 -822198
-2614 -822198 6550478 13270208 12013297 12983130 14238463 16234101 5814149 8548303 19593612
-2623 19593612 13557457 11432188 7490747 5838531 7636965 5266770 13132822 13670506 8054194
-2632 8054194 665925 -6546538 7253498 12588195 6408257 4286999 -3029668 -5649232 -7509366
-2641 -7509366 1247104 8794911 -3892561 -6690782 -5969772 -3826414 2285196 -2257064 -3327072
-2650 -3327072 -3843959 1560831 4462875 -6446772 -3709932 -4210962 -9132087 -1171787 4126490
-2659 4126490 730674 -15074186 -13809415 2330400 1007704 1262680 -613732 -4273230 -2387322
-2668 -2387322 -435390 8145976 4982428 -412177 -767782 -4023402 6928596 8881864 -1553182
-2677 -1553182 -4968609 -1001010 8510098 3541831 4373565 12235713 3716424 2199459 8774918
-2686 8774918 16810101 14528518 3561498 7995057 7172902 2778490 2316834 499734 4286541
-2695 4286541 -4908511 -12811624 -9395966 -7683941 -4083484 -9461534 -9540894 -9130638 -17259853
-2704 -17259853 -11005600 -4155873 -1151904 -6377730 -16264762 -11231100 -7844961 -2732625 -274672
-2713 -274672 -4270936 6252 -3561838 -2352232 5946527 7805780 9047227 5282881 10778099
-2722 10778099 9538386 -3402058 -597122 1785171 3072068 3039705 -2603764 -9408582
-2730i408582  $$ checkpoint
##END NTUPLES=
##END=
