##TITLE= S#498118
##JCAMP-DX= 5.00 $$ JEOL NMR v1.10
##DATA TYPE= NMR SPECTRUM
##DATA CLASS= NTUPLES
##NUM DIM= 1
##ORIGIN= DELTA_NMR
##OWNER= NMR
##SPECTROMETER/DATA SYSTEM= DELTA_NMR
##.OBSERVE FREQUENCY= 7.5568234259928E+01
##.OBSERVE NUCLEUS= ^13C
##.DELAY= (5.14E+01,5.14E+01)
##.ACQUISITION MODE= SIMULTANEOUS
##.FIELD= 7.0586013
##.FILTER WIDTH= 8.6618213122048E-01
##.ACQUISITION TIME= 1.7334272
##.SPINNING RATE= 17
##.OBSERVE 90= 9.5
$$ ------------------------
$$ JEOL SPECIFIC PARAMETERS
##$FILENAME= C:\NMR/eb-8.jdf
##$TITLE= S#498118
##$AUTHOR= NMR
##$CREATION=  1-FEB-2018 13:46:16
##$REVISION=  1-FEB-2018 13:53:29
##$CONTENT= CARBON NMR EXPERIMENTn
##$INSTRUMENT= DELTA_NMR
##$SITE= Center College ECP+ 300
##$NODENAME= nmr2
##$DIMENSIONS= 1
##$STORAGE= FLOAT
##$X_FORMAT= COMPLEX
##$X_CURR_POINTS= 32768
##$X_START= 225.07631 $$ppm
##$X_STOP= -25.06868 $$ppm
##$X_TITLE= 13C                            
##$X_ZERO_POINT= 0.39976
##$X_FREQ_FLIP= FALSE
##$X_POINTS= 32768
##$X_PRESCANS= 4
##$X_DOMAIN= 13C
##$X_OFFSET= 100 $$ppm
##$X_FREQ= 75.56823 $$MHz
##$X_SWEEP= 18.90359 $$kHz
##$X_RESOLUTION= 0.57689 $$Hz
##$SOLVENT= CHLOROFORM-D
##$TEMP_GET= 21.5 $$dC
##$ACQ_DELAY= 51.4 $$us
##$DIGITAL_FILTER= FALSE
##$FILTER_FACTOR= 1
##$FILTER_WIDTH= 9.446 $$kHz
##$FILTER_MODE= BUTTERWORTH
##$TRANSITION_RATIO= 0.9
##$ORDERS
##$FACTORS
##$LOCK_STRENGTH= 878
##$LOCK_LEVEL= 200
##$LOCK_GAIN= 27
##$LOCK_OSC_OFFSET= 25.6519 $$kHz
##$LOCK_PHASE= 187 $$deg
##$LOCK_OSC_STATE= 2H OSC ON
##$X_ANGLE= 30 $$deg
##$X90= 9.5 $$us
##$X90_HI= 9 $$us
##$X90_LO= 35 $$us
##$X_90_WIDTH= 9.5 $$us
##$X_PULSE= 3.16667 $$us
##$RELAXATION_DELAY= 1 $$s
##$SCANS= 40
##$PROBE_ID= 1412
##$ITERATIONS= 1
##$FIELD_STRENGTH= 7.0586 $$T
##$TEMP_SET= 25 $$dC
##$SPIN_SET= 15 $$Hz
##$SPIN_GET= 17 $$Hz
##$HE_LEVEL= 75 $$%
##$N2_LEVEL= 82 $$%
##$CHANGER_SAMPLE= 0
##$ADC_CARD= 16/1MHz/20
##$EXPERIMENT= single_pulse_dec
##$OBS_NOISE= WAUGH
##$IRR_NOISE= WALTZ
##$TRI_NOISE= WALTZ
##$QUA_NOISE= WAUGH
##$OBS_PWIDTH= 1 $$us
##$IRR_PWIDTH= 50 $$us
##$TRI_PWIDTH= 1 $$us
##$QUA_PWIDTH= 1 $$us
##$IRR_DOMAIN= 1H
##$IRR_FREQ= 300.52966 $$MHz
##$RECVR_GAIN= 15
##$IRR90= 9.2 $$us
##$TRI90= 10 $$us
##$QUA90= 10 $$us
##$IRR90_HI= 10 $$us
##$QUA90_HI= 10 $$us
##$IRR90_LO= 50 $$us
##$TRI90_LO= 10 $$us
##$QUA90_LO= 10 $$us
##$IRR_OFFSET= 5 $$ppm
##$MOD_RETURN= 1
##$TOTAL_SCANS= 40
##$X_ACQ_DURATION= 1.73343 $$s
##$DELAY_OF_START= 1 $$s
##$ACTUAL_START_TIME= 886340649.0
##$CLIPPED= FALSE
##$DC_BALANCED= FALSE
##$TRI90_HI= 10 $$us
##$SPIN_LOCK_90= 100 $$us
##$SPIN_LOCK_ATTN= 24.4 $$dB
##$DEUT_GRAD_SHIM_90= 213 $$us
##$DEUT_GRAD_SHIM_ATTN= 9 $$dB
##$IRR_CODE= 146
##$LOCK_STATE= LOCK ON
##$AUTOLOCK_LEVEL= 200
##$SAWTOOTH_RANGE= 5
##$LOCK_STATUS= IDLE
##$LOCK_SETTLE_POINT= 4096
##$LOCK_ACHIEVE_POINT= 0
##$SPIN_ACTION= SPIN ON
##$SPIN_STATE= SPIN ON
##$SPIN_STATUS= SPIN ON
##$SPIN_GAS_SOURCE= AIR
##$TEMP_ACTION= TEMP OFF
##$TEMP_STATE= TEMP OFF
##$TEMP_STATUS= TEMP OFF
##$TEMP_COMP= 0
##$TEMP_DELAY= 0 $$s
$$ [...]
##$VT_PID_STD_WB_H_CBL= 10
##$VT_PID_STD_WB_H_CBH= 0
##$VT_PID_STD_WB_H_HC= 2.4
##$VT_PID_STD_WB_H_HL= 70
##$VT_PID_STD_WB_M_PB= 1.5
##$VT_PID_STD_WB_M_TI= 30
##$VT_PID_STD_WB_M_TD= 5
##$VT_PID_STD_WB_M_CBL= 9.9
##$VT_PID_STD_WB_M_CBH= 2.3
##$VT_PID_STD_WB_M_HC= 2.5
##$VT_PID_STD_WB_M_HL= 70
##$VT_PID_STD_WB_L_PB= 1.3
##$VT_PID_STD_WB_L_TI= 29
##$VT_PID_STD_WB_L_TD= 5
##$VT_PID_STD_WB_L_CBL= 20
##$VT_PID_STD_WB_L_CBH= 20
##$VT_PID_STD_WB_L_HC= 0.6
##$VT_PID_STD_WB_L_HL= 100
##$VT_PID_LONG_0_H_PB= 1.5
##$VT_PID_LONG_0_H_TI= 30
##$VT_PID_LONG_0_H_TD= 5
##$VT_PID_LONG_0_H_CBL= 9.9
##$VT_PID_LONG_0_H_CBH= 2.3
##$VT_PID_LONG_0_H_HC= 2.5
##$VT_PID_LONG_0_H_HL= 70
##$VT_PID_LONG_0_M_PB= 1.5
##$VT_PID_LONG_0_M_TI= 30
##$VT_PID_LONG_0_M_TD= 5
##$VT_PID_LONG_0_M_CBL= 9.9
##$VT_PID_LONG_0_M_CBH= 2.3
##$VT_PID_LONG_0_M_HC= 2.5
##$VT_PID_LONG_0_M_HL= 70
##$VT_PID_LONG_40_H_PB= 1.5
##$VT_PID_LONG_40_H_TI= 30
##$VT_PID_LONG_40_H_TD= 5
##$VT_PID_LONG_40_H_CBL= 9.9
##$VT_PID_LONG_40_H_CBH= 2.3
##$VT_PID_LONG_40_H_HC= 2.5
##$VT_PID_LONG_40_H_HL= 70
##$VT_PID_LONG_40_M_PB= 1.5
##$VT_PID_LONG_40_M_TI= 30
##$VT_PID_LONG_40_M_TD= 5
##$VT_PID_LONG_40_M_CBL= 9.9
##$VT_PID_LONG_40_M_CBH= 2.3
##$VT_PID_LONG_40_M_HC= 2.5
##$VT_PID_LONG_40_M_HL= 70
##$SAMPLE_ACTION= LOADED
##$SAMPLE_STATE= LOAD
##$SAMPLE_STATUS= LOADED
##$AUTOSHIM_MODE= AUTOSHIM OFF
##$AUTOSHIM_DELAY= 3600 $$s
##$AUTOSHIM_TRACK= AUTOSHIM OFF
##$SHIM_MAX_RECALL= MAX FOUND
##$SHIM_NAMES= SHIM_Z0
##$SHIM_Z0= 9198
##$SHIM_Z1= 5125
##$SHIM_Z2= -64
##$SHIM_Z3= -2829
##$SHIM_Z4= -240
##$SHIM_Z5= 46
##$SHIM_Z6= -33
##$SHIM_X= -14
##$SHIM_XZ= 16
##$SHIM_XZ2= 0
##$SHIM_XZ3= 0
##$SHIM_X2= -7
##$SHIM_X2Z= -40
##$SHIM_X3= 0
##$SHIM_Y= 1608
##$SHIM_YZ= 13
##$SHIM_YZ2= 10
##$SHIM_YZ3= 0
##$SHIM_Y2= -11
##$SHIM_Y2Z= -20
##$SHIM_Y3= 0
##$NUM_SCANS= 61
##$END_TIME= 886340939.0
##$LOCAL_TIME= 886340775
##$PROBE_ATN= 0
##$PROBE_TUNE= 3853
##$PROBE_MATCH= 5069
##$PROBE_COARSE= NONE
##$LF_TUNE_DIAL= 0
##$LF_MATCH_DIAL= 0
##$HF_TUNE_DIAL= 0
##$HF_MATCH_DIAL= 0
##$PASS_RIPPLE= 0.01 $$dB
##$STOP_RIPPLE= 60 $$dB
##$PROBE_RECOVERY= 0 $$us
##$AF_DELAY_RATIO= 0
##$VERSION= 4.3.3
##$X_ACQ_TIME= 1.73343 $$s
##$DEAD_TIME= 0 $$us
##$DELAY= 0 $$us
##$PHASE_PRESET= 3 $$us
##$UNBLANK_TIME= 2 $$us
##$INITIAL_WAIT= 1 $$s
##$NORMALIZED= TRUE
$$ END OF JEOL SPECIFIC PARAMETERS
$$ -------------------------------
##NTUPLES= NMR SPECTRUM
##VAR NAME= FREQUENCY,    SPECTRUM/REAL, SPECTRUM/IMAG, PAGE NUMBER
##SYMBOL=   X,            R,             I,             N
##VAR TYPE= INDEPENDENT,  DEPENDENT,     DEPENDENT,     PAGE
##VAR FORM= AFFN,         ASDF,          ASDF,          AFFN
##VAR DIM=  32768, 32768, 32768, 2
##UNITS= PPM,     ARBITRARY UNITS, ARBITRARY UNITS, 
##FIRST=  2.25076309295504E+02, 9.06879365289929E+01, 7.39430330751262E+01, 1
##LAST=  -2.50686752434227E+01, -7.68357045933308E+01, -5.20264163429122, 2
##FACTOR=  7.63405208102439E-03, 7.18115717064524E-04, 7.18115717064524E-04, 1
##PAGE= N=1
##DATA TABLE=(X++(R..R)), XYDATA
$$ [...]
##PAGE= N=2
##DATA TABLE=(X++(I..I)), XYDATA
20161d252422N9745983j98537954K44180027j05001027j5904803K6733884K12823639
20154B19787327k28948245J20475037J01400009j27551726o98980j83330616N7867821
20147d0999373m5581205L384222K5913856L43261471l61668086N7119122K0308643
20140A738650N2504506J05897981j41132271n3387326J34510605j44928368J04724768
20133E9928545k17515463l3478999J64619878J12749535o8866261R7971595j489294
20126A13919536o3029173L5267186j26288141K1802824p1816442L444773J24821692
20119C8122255j65126039J87751659j79906706j1334756J51330326M00326444m94670305
20112g3507122L55660066n07589179J75198683K52945668k52343681L9199214K0320128
$$ plain form
20161 -4252422 55493561 -143044393 101135634 -3865393 -19770196 6963688 219787327
20154 219787327 -9160918 111314119 212714128 85162402 84463422 -98867194 -40999373
20147 -40999373 -86580578 -83196356 -57282500 285978971 -75689115 -18569993 1738650
20140 1738650 54243156 160141137 19008866 -34378460 100132145 -44796223 59928545
20133 59928545 -157586918 -191065917 -26446039 86303496 17437235 115408830 113919536
20126 113919536 50890363 86157549 -40130592 -18327768 -90144210 -86699437 38122255
20119 38122255 -127003784 60747875 -119158831 -130493587 20836739 421163183 -73507122
20112 -73507122 282152944 -225436235 -50237552 202708116 -49635565 -10436351 9883777
20105I883777J38667652m13421821K02276823k4487048n4063967J98001489J22888581
20098A79745486l30531928l1805986O4025544j855222J80554765j4049759p8652354
20091c2569454Q2388911j26847749j16435551J45459695J61450446k92127732J10851073
20084f7830361j186530J8391947J7132353j7100842J70609864p9578813l1174229L3383820
20076D2647209J49425137j36120498k85331580K19390778M1792813j54577218J34920111
20069A2146752M5235702o0784264J32593900N949128p2610970l4062825p7025361L1336220
20061a7221718Q9166275L3116187l03736404K90250952N0641206k01087257Q470923
20054e0399836j1859121p661153J44352209N3271636o8598779k26689221L8664065o002324
$$ plain form
20105 9883777 148551429 -264870392 -62593569 -87080617 -141144584 56856905 179745486
20098 179745486 -150786442 -182592428 -118566884 -120422106 60132659 46082900 -32569454
20091 -32569454 49819457 -77028292 -193463843 -48004148 113446298 -178681434 -67830361
20084 -67830361 -69016891 -50624944 -33492591 -50593433 120016431 40437618 9263389 42647209
20076 42647209 192072346 55951848 -229379732 -9988954 31803859 -122773359 12146752
20069 12146752 57382454 -3401810 129192090 135141218 62530248 28467423 -48557938 -17221718
20061 -17221718 71944557 105060744 -198675660 91575292 142216498 -58870759 -50399836
20054 -50399836 -62258957 -69920110 74432099 127703735 59104956 -167584265 -128920200 -134922524
20046a34922524L5556410k27146602K72789479J49452322k8137184N7647867l50174697
20039b24934929J59312292m0110914J81017477j93162357k0429707J20681959l5515324
20032e3141503j36918478K92864640J244115P7817910m0370519m790029m16844359
20025b80138223K94187146q8832948J06498468O2053219O1931309l43642025L30004520
20018A42061466m2868115p2696596K91684420k54209687j01961814m892301L2239105
20011a0643522r3626100O1731971J8532871J01402023j75601584K06136668p2358715
20004C5573612J21624771k65533047J39388783J03309868k69449224L0381416J49198994
19997D4495173o8964779J02012205J14004698j45659212M4317252k0145520o5221757
$$ plain form
20046 -134922524 -99366114 -326512716 -53723237 95729085 67591901 125239768 -224934929
20039 -224934929 -65622637 -105733551 75283926 -117878431 -138308138 -17626179 -53141503
20032 -53141503 -190059981 102804659 104048774 181866684 141496165 136706136 -280138223
20025 -280138223 14048923 -74784025 31714443 93767662 155698971 -187943054 142061466
20018 142061466 99193351 26496755 318181175 63971488 -37990326 -42882627 -10643522
20011 -10643522 -104269622 -42537651 -24004780 77397243 -98204341 107932327 35573612
20004 35573612 157198383 -108334664 31054119 134363987 -135085237 -104703821 44495173
19997 44495173 -24469606 77542599 191547297 45888085 90205337 70059817 4838060
19990D838060O6062844k4338618q6116077p596240J12950714l31916961J89859152
19983g6257126L02714458j79154893p7906209Q8454054r6720088K5107074k36529942
19976b50292672K04523287P4751015j12572535K22737955l20562916K74731628j09111619
19969a5795857k66129709J54669231L22523968m34813491o5475655K57491495J50233362
19962A02703344l14459707K71800200m1385654p8153533k1558241r1850986J32285672
19955d0618905M0500620k5715865k11315665N13170319k07010719k73304536J12488835
19948i1805916Q9691170k9644810P3722870k1309590k35222817J90093410K30782031
19941B06306348N7533620j82261958J51403643k50082747J14510091K20800306k22806117
$$ plain form
19990 4838060 70900904 46562286 -39553791 -47150031 65800683 -266116278 -76257126
19983 -76257126 226457332 47302439 -30603770 57850284 -38869804 -13762730 -250292672
19976 -250292672 -45769385 28981630 -83590905 139147050 -181415866 93315762 -15795857
19969 -15795857 -281925566 -127256335 195267633 -239545858 -305021513 -47530018 102703344
19962 102703344 -211756363 60043837 18658183 -59495350 -81053591 -172904577 -40618905
19955 -40618905 -118285 -25834150 -237149815 276020504 69009785 -204294751 -91805916
19948 -91805916 -2114746 -31759556 41963314 20653724 -214569093 -24475683 206306348
19941 206306348 263839968 81578010 232981653 -17101094 97408997 318209303 95403186
19934I5403186k10197504J56044323q2936633J88977387k4286472J1903287k3658966
19927A11248608j05949028J68083791j70438774J17775597m6167214j00895689k7674217
19920e4016926P2878183Q714602k74022896K61521332J20311590j27432278l2576765
19913b4623158O3845066p9427550K6061389L5096580J24534914k71192832j51791091
19906b77496682J26554465L4056912R4818054j77969249j68650571N53823636n4699048
19899A30437517j75183217n5898505L1103473M1255383l230288P073230k10941818
19892b35384225l4228151K24714583M8877011n3686785J45065176J46379126l78135313
19885a36398578K69134984j19118286k3113042r1902687p7163122J49662988p7749031
$$ plain form
19934 95403186 -114794318 41250005 -41686628 147290759 123004287 134907574 111248608
19927 111248608 5299580 173383371 2944597 120720194 74552980 -26342709 -54016926
19920 -54016926 18861257 27575859 -246447037 15074295 135385885 7953607 -24623158
19913 -24623158 39221908 -40205642 -14144253 20952327 145487241 -125705591 -277496682
19906 -277496682 -150942217 -116885305 -22067251 -200036500 -368687071 185136565 130437517
19899 130437517 -44745700 -100644205 -69540732 -28285349 -31515637 -24442407 -235384225
19892 -235384225 -269612376 -44897793 3979218 -49707567 95357609 241736735 -136398578
19885 -136398578 132736406 13618120 -9494922 -101397609 -178560731 -28897743 -106646774
19878a06646774J91599256j372421j646845k3432162K03157827k94404005J02496866
19871F9751742k03734349K28902936P2717037j46498679p6203642j59020448Q3581822
19864a30503581K43165195r4305899J23866293k64232770q5864240J26223825L14639712
19857B32988535m38742128J23937790J09040109n8614854m8781041j2907004J65034771
19850G1956178l08145849K17308703K02606524j50195548k35678544j52481949M68482983
19843A13852498J15983083j98336911o5326471R8726648J6706196n7628546Q1799016
19836A05775513o9099613r7373008j06669174M14513450j16316832j19917356j89057880
19829a78144900J94291212M5303653m2358051J9180544m2794745R7050671l1180626
$$ plain form
19878 -106646774 84952482 83580061 81933216 58501054 261658881 -32745124 69751742
19871 69751742 -133982607 94920329 167637366 21138687 -55064955 -214085403 -130503581
19864 -130503581 112661614 18355715 142222008 -122010762 -207875002 -81651177 232988535
19857 232988535 -205753593 -81815803 27224306 -31390548 -80171589 -93078593 71956178
19850 71956178 -236189671 -18880968 183725556 33530008 -202148536 -354630485 113852498
19843 113852498 229835581 31498670 -33827801 64898847 81605043 23976497 105775513
19836 105775513 36675900 -60697108 -167366282 247147168 130830336 10912980 -178144900
19829 -178144900 16146312 61449965 19091914 38272458 -4522287 92528384 61347758
19822F1347758O1092547k12735609L45714970k55926669J6482738P3859432j09072015
19815a9236848k94080069J36917607O6111551K22751027K1670770p7885500N3678897
19808A09927435m0104751k95726428L98368225j11611650K569348m8705173l11686144
19801b96969138K52239295O0214812r0667702M9611451N886972J41767531j75876596
19794e3793375k963694J38607666n6579381O1295797J20802144k65069141K26330250
19787A68630266k28090014J11541351j08421084Q3735561n0684141q5546785K19928964
19780A11094118j44961633N8164044K37858440p8588788j38614464J16457172l1881996
19773A29526893P4714805m1086515k74819250K9259455r4098891L50730434m18447717
$$ plain form
19822 61347758 122440305 -90295304 255419666 -507003 15975735 89835167 -19236848
19815 -19236848 -313316917 -176399310 -110287759 112463268 134134038 56248538 109927435
19808 109927435 69822684 -225903744 172464481 60852831 63422179 14717006 -296969138
19801 -296969138 -44729843 15484969 -75182733 -25571282 -19684310 122083221 -53793375
19794 -53793375 -56757069 81850597 25271216 86567013 207369157 -57699984 168630266
19787 168630266 -59459748 52081603 -56339481 27396080 -23288061 -108834846 111094118
19780 111094118 -33867515 24296529 262154969 183566181 44951717 161408889 129526893
19773 129526893 204241698 163155183 -111664067 -82404612 -176503503 174226931 -244220786
19766b44220786K49268614j23555567j9361724J90588257j02185986p8179232K33074195
19759A05427771q7248508J85132418j36301572k92626780J49851847K04458196l03364045
19752a74670673l5060215R7989576r8653782K81268555n4956778k0788273l169314
19745h040904J26663145l582483j25303985k13005106K83281542j07938291J30308664
19738H2382582j85699660l40001791L85339856K41259579j49452232J2209323k09593222
19731a63555565K28942348j38668573L4328316Q6380356k38158725l898931j81710617
19724c76341391L38393671N5056504n32007340M51363392J23131716k27672979k406037
19717a70482464o386956J7231971j54331140L72440796J4787221r5793902k07726110
$$ plain form
19766 -244220786 5047828 -118507739 -137869463 52718794 -49467192 -127646424 105427771
19759 105427771 18179263 203311681 67010109 -225616671 -75764824 128693372 -174670673
19752 -174670673 -209730888 -111741312 -210395094 70873461 15916683 -4871590 -8040904
19745 -8040904 118622241 115039758 -10264227 -223269333 60012209 -47926082 82382582
19738 82382582 -103317078 -443318869 -57979013 183280566 33828334 46037657 -163555565
19731 -163555565 65386783 -73281790 -38953474 47426882 -190731843 -194630774 -376341391
19724 -376341391 -37947720 17108784 -514898556 -63535164 59596552 -168076427 -170482464
19717 -170482464 -176869420 -159637449 -313968589 58472207 73259428 -22534474 -230260584
19710b30260584P066453J79529982R6979001j07617185k42798876L15901917r2947444
19703g4146736J29227406P0675009q8639128J4007025K6305742N2549952j82924409
19696e2945139n5566578k7083743L61650248O6537623l33458104J42559157M6672081
19689A48365545k1652159L5482946k2934023j81528861j03554229K65945296k9752094
19682I0372421P2748068j44475042K15586809k29678659J65281677l52688706K78063288
19675I5209856o3540637j79503560J16529531k6907738J70943111n8308289K6096666
19668H0518940j7878600q7303973J5556276J84747538j64714557J40462169k27849211
19661g6461418J73091921Q6525011k79316619Q8087852K72155853j23802948N4116382
$$ plain form
19710 -230260584 -223194131 -43664149 53314852 -54302333 -297101209 18800708 -74146736
19703 -74146736 55080670 125755679 37116551 51123576 77429318 129979270 -52945139
19696 -52945139 -108511717 -135595460 226054788 292592411 -40865693 101693464 148365545
19689 148365545 126713386 162196332 139262309 -42266552 -145820781 120124515 90372421
19682 90372421 163120489 18645447 234232256 4553597 169835274 -182853432 95209856
19675 95209856 31669219 -147834341 -31304810 -58212548 112730563 54422274 80518940
19668 80518940 62640340 -24663633 -9107357 175640181 10925624 151387793 -76461418
19661 -76461418 96630503 183155514 -96161105 -8073253 264082600 140279652 194396034
19654A94396034k23198763J32421615q6668738j37455665K40140119R1181619n2718409
19647A58097812O8273006j30454308o331924k02291209J52559452J10924881M9272244
19640B00049954j23556381j26564365J04418011k05717698J89423027N4007795J58072633
19633B50132976j25201124j65604453m8992930j5284769M8230997j2488170J51127461
19626H1919988N0411315J28057365j61784632l70248855J30757074q6085274N21045431
19619B94072412p6767092j35478365k26874955R0923274K67011767l83598551L60074161
19612A89362651j78011320K32248909r0233621p3499027n2982109N3331076J4602532
19605I4819091K39585126j60601519J5762050k73761034L32537078j75960298j9780230
$$ plain form
19654 194396034 -28802729 103618886 16950148 -120505517 119634602 210816221 158097812
19647 158097812 226370818 95916510 89584586 -112706623 39852829 150777710 200049954
19640 200049954 76493573 -50070792 54347219 -151370479 38052548 92060343 250132976
19633 250132976 124931852 -40672601 -89665531 -104950300 -56719303 -69207473 81919988
19626 81919988 132331303 260388668 98604036 -271644819 -140887745 -226973019 294072412
19619 294072412 217305320 81826955 -145048000 -54124726 212887041 -170711510 189362651
19612 189362651 11351331 243600240 153366619 79867592 26885483 80216559 94819091
19605 94819091 334404217 173802698 189564748 -84196286 248340792 72380494 52600264
19598E2600264K5095485q9635299J48227225K2798807k68176369K9150071M2209237
19591c7730579O535301J39751983j51466847R4544402J12789187j44120671j35847469
19584a15544693j18300181J3549775J82875704j93030835K61841312j39995951r0307216
19577a98912085J34235818K87742993n6435898k47074817J97025563q3990687j49724367
19570a17133480J00043335K8997779j82053270L05610066Q8428975j85584971J62220064
19563B00528498M3753732m2395924r4720349J61212198k90928180q7622030K89187172
19556A79015117j33049059N946946j0349172J39660214o4543336k64735973J34869572
19549a3185691J42750228K5245131Q6175253k11142449l2101437j86436687J27007881
$$ plain form
19598 52600264 77695749 -11939550 136287675 159086482 -109089887 -79939816 -37730579
19591 -37730579 -31195278 108556705 -42910142 51634260 164423447 20302776 -115544693
19584 -115544693 -233844874 -220295099 -37419395 -230450230 31391082 -108604869 -198912085
19577 -198912085 -64676267 223066726 166630828 -80443989 116581574 32590887 -117133480
19570 -117133480 -17090145 11907634 -170145636 135464430 223893405 38308434 200528498
19563 200528498 244282230 201886306 107165957 268378155 -22550025 -110172055 179015117
19556 179015117 45966058 51913004 41563832 181224046 116680710 -148055263 -13185691
19549 -13185691 129564537 154809668 240984921 29842472 -2258965 -188695652 -61687771
19542f1687771M5580554K40283154q6302390k03450289J45559365l09550891L19903078
19535I0334810k20886608n5768287K73108263M7231757j54099533M5087755n9555683
19528c4547526J10656121J6136691j04626571p4374171l0716448K58162265J7082297
19521A57772658j45687068K45934899l95785557J54139733j35871560Q4822126o15467
19514c5290236j835866J9732742R6732374r0582215j57226349M1168260J18736740
19507h564550N5042761j16338927L402444J42945750m41788269L35509551m4201837
19500g3993077r772492j34526834L51377791r0599226k39768808l9357339K10936824
19493b5703161l9195885J68174955j99954126j30463280K97833715n5120740j51628615
$$ plain form
19542 -61687771 -16107217 224175937 137873547 -65576742 79982623 -229568268 90334810
19535 90334810 -130551798 -186320085 86788178 134019935 -20079598 25008157 -34547526
19528 -34547526 76108595 92245286 -12381285 -86755456 -117471904 140690361 157772658
19521 157772658 12085590 258020489 -137765068 16374665 -119496895 -34674769 -35290236
19514 -35290236 -37126102 -17393360 79339014 -11243201 -168469550 -127301290 -8564550
19507 -8564550 46478211 -69860716 -66458272 76487478 -365300791 -29791240 -73993077
19500 -73993077 -83765569 -218292403 133085388 42486162 -197282646 -236639985 -25703161
19493 -25703161 -64899046 103275909 -96678217 -227141497 70692218 15571478 -136057137
19486a36057137K16440140L6775104j90356753K59265005M3233710n44077837k2950635
19479c37728403M11926497j0551270J74678285l91081404J42871970m173964M9585934
19472C5527645Q562148M4737482J09227095k22396815J14148380k7269971j89362625
19465a26826661N6573112L53349879j91365627j20825870J35646963k74591450K49227525
19458H1187871l9861267N5046695O336633M6580335j72176461J6465293n0376150o7160999
19450a23958050L15976088r9845110L0494184k62157242L24920405l30639646R719815
19443a35489556J81387626K1434605p5690173L8886083k1003126j28852839J62116106
19436D2788726j00204760O0271022j48805246L33186119k28263450O075525m9312960
$$ plain form
19486 -136057137 80383003 117158107 -73198646 186066359 229300069 -314777768 -337728403
19479 -337728403 74198094 63646824 238325109 -152756295 -9884325 -14058289 35527645
19472 35527645 44089793 88827275 198054370 -24342445 89805935 62535964 -126826661
19465 -126826661 -70253549 283096330 91730703 -29095167 106551796 -168039654 81187871
19458 81187871 41326604 96373299 102709932 149290267 -22886194 -6420901 -56797051 -123958050
19450 -123958050 192018038 92172928 122667112 -139490130 185430275 -145209371 -135489556
19443 -135489556 45898070 67332675 -8357498 30528585 9525459 -119327380 42788726
19436 42788726 -57416034 2854988 -145950258 187235861 -41027589 -34952064 -84265024
19429h4265024k4459252R7844577O3902941J40597210k50020860K4600388m7836324
19422g9636344N4195599K69348172k09811805j04886830K17847203j74632119J42668714
19415A15092590l5673821p3707943N4534657k20085634K16234679j26338957R099736
19408f0844693m5609382J72930675J35597792k36662842J03776172l9434829J9822846
19401D9575739p5824920Q7583524l7141413j21476008j39862768J99076467K4537722
19394a3531657M4905780N2555940K07168733j95429510m9803820O0874050r2929701
19387A3809815N6553598p7002468j61384020J22685386p6442127j36350893L09796474
19380E1665765K14588226k23847513J78189116l00207801R7689497l7182859J9563920
$$ plain form
19429 -84265024 -108724276 -10879699 53023242 193620452 -56400408 -31800020 -79636344
19422 -79636344 -25440745 243907427 34095622 -70791208 147055995 -27576124 115092590
19415 115092590 79418769 5710826 60245483 -159840151 56394528 -69944429 -60844693
19408 -60844693 -106454075 66476600 202074392 -34588450 69187722 29752893 49575739
19401 49575739 -26249181 61334343 24192930 -97283078 -237145846 -38069379 -13531657
19394 -13531657 31374123 83930063 291098796 95669286 45865466 106739516 13809815
19387 13809815 70363413 -6639055 -168023075 -45337689 -121779816 -258130709 51665765
19380 51665765 266253991 42406478 220595594 -79612207 18077290 -19105569 458351
19373D58351n9787027J18031311j53851386j92963444K05338015L07469982k28272921
19366c577119k8773270N1750080N7377373r7768978K5764171j32881108K07917876
19359G9809025K9986635j68320128P372928K66610582l29765561p6549709L21882759
19352A31026531r3119650j9353094N9944415k52375766K61643014j45244853Q6736274
19345B9256871J49825139j97468117o0157673O2969059Q2104071L22556748j58888715
19338B30197383l51549130M43301186k34591657O3740776k44811442K64849727p2446281
19331I8690562O5371842j09565852J15041433r7293771K51237929j95859949O4113129
19324A91735323J88530955m95752104P8841001J16474064l82836404M21800362k38360178
$$ plain form
19373 458351 -59328676 58702635 -95148751 -288112195 -82774180 224695802 -3577119
19366 -3577119 -32350389 19399691 76777064 -20991914 4772257 -128108851 79809025
19359 79809025 109795660 -58524468 -51151540 215459042 -114306519 -190856228 131026531
19352 131026531 37906881 18553787 78498202 -173877564 87765450 -57479403 29256871
19345 29256871 179082010 -18386107 -78543780 -15574721 66529350 389086098 230197383
19338 230197383 -121351747 321949439 87357782 151098558 -93712884 171136843 98690562
19331 98690562 164062404 54496552 169537985 72244214 323482143 127622194 191735323
19324 191735323 380266278 -115485826 -36644825 79829239 -303007165 118793197 -119566981
19317a19566981J53286608O6852772Q0458121l08873345K78710649k45648078q8840750
19310a83621004J82463231j7658588n5009272j74362790n7991969J32733712j9804380
19303a93251060Q247110j8301517J49449206K02672883k34288276j8340458k51715814
19296c55527926J43547262M38027098p7957373k83584812r83300L6498336p776145
19289a07756860J52618924Q18048k14807820L27902431M6474830p0938810m06506980
19282b72196237M55594494k22038729J27968167J30986727l59477202J35458553K78378174
19275B74673947o0781560l80467462K38886445k5136113J43344032P4415177m03980955
19268a39046489K5625066J65151308J25116625j00753908K7866222o0620465K19884892
$$ plain form
19317 -119566981 33719627 100572399 181030520 -127842825 150867824 -94780254 -183621004
19310 -183621004 -1157773 -18816361 -73825633 -248188423 -306180392 -173446680 -193251060
19303 -193251060 -185003950 -203305467 -53856261 148816622 -85471654 -103812112 -355527926
19296 -355527926 -211980664 226046434 148089061 -135495751 -136479051 -99980715 -107756860
19289 -107756860 44862064 45680112 -169127708 158774723 205249553 134310743 -272196237
19282 -272196237 183398257 -38640472 89327695 220314422 -139162780 -3704227 274673947
19275 274673947 213892387 -166575075 72311370 47175257 190519289 264934466 -139046489
19268 -139046489 -113421423 51729885 176846510 76092602 103958824 43338359 263223251
19261B63223251j86777949k05231316L08042641J433749J2937253j5675053j43224159
19254C4728417j6022547j01279711n064845L92738007k65554834J03809933j24432220
19247A8922200J5116448K1344140n1494832J705417K7698233j38819796l848295K16060867
19239A06684382k35769315m8206031L952970J76516437j64596443K98825521k02108704
19232f4701183q079742m0490556J15733415J56711103j86999794K8563082j40032603
19225a39296278J26757783l2057555k07344893J38768930K30345465J6522292N8489904
19218A92185648k23919555j37421499J07706863J87703274j25810072J59388831j82906772
19211b3073282k09553397M37217364l39670423P4793015L1884199k27247540M23181023
$$ plain form
19261 263223251 76445302 -128786014 179256627 180690376 193627629 177952576 34728417
19254 34728417 18705870 -82573841 -87638686 305099321 39544487 143354420 18922200
19247 18922200 34038648 55382788 3887956 5593373 33291606 -105528190 -109376485 106684382
19239 106684382 -129084933 -177290964 -173337994 3178443 -161418000 137407521 -64701183
19232 -64701183 -72780925 -113271481 2461934 159173037 -27826757 736325 -139296278
19225 -139296278 -12538495 -44596050 -251940943 -113172013 117173452 133695744 192185648
19218 192185648 -31733907 -169155406 -61448543 126254731 444659 159833490 -23073282
19211 -23073282 -232626679 204590685 -135079738 -60286723 -28402524 -255650064 167530959
19204A67530959o7724830j98104990K65211379j79565673J49649676L6950200j45325008
19197B8621713J33941389l69442660N6738080J19166592j9434636k1069294q4353838
19190a55832654K61216252J06243339j21693333k1487037n9971842j52861081K69897842
19183A25511486j98325039J36285846j17913747l3448187L36473109j75307136l1417003
19176D1859329p0616680K05879751k16245513J37120782O4857o5082703l19003733
19169b86023910L48116843j09961748J25945565J44668089p8369113O0035015l23941351
19162a19530610L9980395K98365764j61414236k02521928O8448074o4097696N7064224
19155h3706013j4907676K80035968k8020017r9919464P76519R5222155k72706273L6839773
$$ plain form
19204 167530959 99806129 -98298861 166912518 -12653155 136996521 173946721 28621713
19197 28621713 162563102 -206879558 -150141478 -30974886 -50409522 -71478816 -155832654
19190 -155832654 105383598 211626937 89933604 68446567 8474725 -144386356 125511486
19183 125511486 -72813553 63472293 -54441454 -87889641 248583468 73276332 41859329
19176 41859329 -28757351 177122400 -39123113 97997669 98062526 32979823 -286023910
19169 -286023910 62092933 -47868815 78076750 222744839 144375726 204410741 -119530610
19162 -119530610 -79550215 218815549 57401313 -145120615 -76672541 -140770237 -83706013
19155 -83706013 -98613689 181422279 153402262 53482798 54259317 149481472 -123224801 -86385028
19147h6385028J43961685k9803423k04565907J55429307q0598463J50527416j23671275
19140g5105688J37289296p8405021m2304169J04202353l8753425j5082037M2747749
19133C4589058l2006247l6227748J33112787j77243107j18655850N75997267l32747878
19126D6818282J04924322k69852040O4561426j10868954J47671123L1455289K1895672
19119C6605120L6430526p0394447n2223863o863424j04554540K94421116n0532444
19112H2888044r7359698p4085916J68576147j80152106K15649958j65439012J56127655
19105A06205072j96562047J50357527j30116016P4847018O5407365o3662114R7962659
19098A04439464k01425394j81563670L90136484j15461746o4417259J39758061O8626724
$$ plain form
19147 -86385028 57576657 27773234 -176792673 -21363366 -101961829 48565587 -75105688
19140 -75105688 62183608 -16221413 -58525582 45676771 6923346 -8158691 34589058
19133 34589058 2582811 -33644937 99467850 -77775257 -196431107 379566160 46818282
19126 46818282 151742604 -118109436 -53548010 -164416964 -16745841 14709448 36605120
19119 36605120 73035646 2641199 -49582664 -56446088 -161000628 133420488 82888044
19112 82888044 -14471654 -88557570 80018577 -100133529 115516429 -49922583 106205072
19105 106205072 -90356975 60000552 -70115464 4731554 70138919 6476805 104439464
19098 104439464 -96985930 -278549600 111586884 -3874862 -68292121 71465940 140092664
19091A40092664j34741721P4700541r394721r6306328R2673591l0729857j17812426
19084h1518257L921291R4117170j94470264L42860268k67874617o4748771J3750448
19077a53962732r0773436L09597290K4282415j57393197P0162970j06557252N8663389
19070d5980553o1161073J06272521o455375N3028944J8290590j12487164l983315
19063e2475425K74878610m54051605K49305511K74299467k58419319J79623037j57223646
19056E5936630k76826920L84557142l41199690K39726659L6360999o7688266j81237447
19049a50370893K08493190J15053363k20586979m7324025L49221077j12676870k7351057
19042A14457806j71282008n3524383J86643437j04065024K15574831M6403335k37265102
$$ plain form
19091 140092664 5350943 80051484 70656763 -25649565 67024026 36294169 -81518257
19084 -81518257 -77596966 16520204 -177950060 164910208 -102964409 -167713180 -153962732
19077 -153962732 -244736168 64861122 89143537 -68249660 1913310 -104643942 -45980553
19070 -45980553 -107141626 -869105 -7324480 45704464 63995054 -48492110 -52475425
19063 -52475425 222403185 -231648420 17657091 291956558 33537239 213160276 55936630
19056 55936630 -220890290 163666852 -177532838 62193821 98554820 30866554 -150370893
19049 -150370893 58122297 173175660 -47411319 -94735344 254485733 141808863 114457806
19042 114457806 -56824202 -110348585 76294852 -27770172 187804659 234207994 -3057108
19035c057108n327028n83395K31179851q9357134k72093528L71947129k80156631R9497315
19027E2049471R6030902j04703089j39949928K31030154L2408315P0620785l24613704
19020h7127094j9944586N1648851n1400499m880350o976455P4725496J13258463r7756315
19012b8452489L08003370m87354482J20008066P283152K25599814k47455784P6694053
19005b5674300j55160206J0895616K83289163P1314243l01188859K16726956p6250289
18998B3952324r594776j26514740J76996534q6209807o0932035K74343492P1859732
18991B63900724j60248686k24427371J38014293m7817114m5398205j44984797K86256110
18984F5294954j9738907r9029954J2762548j34670820L89017989k99862478P9761508
$$ plain form
19035 -3057108 -8384136 -8967531 222212320 132855186 -139238342 232708787 -47447844 52049471
19027 52049471 148080373 43377284 -96572644 134457510 166865825 237486610 -87127094
19020 -87127094 -107071680 -55422829 -106823328 -111703678 -118680133 -43954637 69303826 -28452489
19012 -28452489 279550881 -207803601 -87795535 -80512383 145087431 -102368353 -25674300
19005 -25674300 -180834506 -169938890 113350273 184664516 -116524343 100202613 23952324
18998 23952324 14357548 -112157192 64839342 -21370465 -82302500 192040992 263900724
18991 263900724 103652038 -120775333 17238960 -30578154 -75976359 -220961156 65294954
18984 65294954 45556047 -53473907 -40711359 -175382179 213635810 -86226668 -6465160
18977f465160J08901130j49965807l2685215r6654748J24126545j53383295P5762737
18970a30363813K23742977J00487849m2555825k88402480L97210393k33037737k02432852
18963a75351488J35040133k6049441J78991227j28034498o198398J39723434k21647444
18956a03526475L1659627K29100753K4875871k88855873M1354970J2105473k38388017
18949b91673671K87333564N1156381J21139439J3220303O682719o4969517k18639783
18942i5750565k1020749k382925J89683010n1516682J41514923o2038891p2379449
18935B6108672k2371635K43321692j52357716J83182658j57244631k44360226J56725635
18928C3004449q9340531L7983712Q9404401R3895066j35654261J60522883j14580190
$$ plain form
18977 -6465160 102435970 -47529837 -80215052 -176869800 -52743255 -206126550 -130363813
18970 -130363813 93379164 193867013 151311188 -137091292 260119101 27081364 -175351488
18963 -175351488 -40311355 -66360796 112630431 -15404067 -21602465 118120969 -103526475
18956 -103526475 -71866848 157233905 182109776 -106746097 -65391127 -53285654 -291673671
18949 -291673671 -4340107 46816274 167955713 181176016 187858735 122889218 -95750565
18942 -95750565 -116771314 -119154239 70528771 19012089 160527012 98488121 26108672
18935 26108672 3737037 247058729 94701013 277883671 120639040 -123721186 33004449
18928 33004449 -56336082 -18352370 71052031 164947097 29292836 189815719 75235529
18921G5235529p8882157j72282420K0453311K60653383l61325382J89146532k80564516
18914c47565720J28197527J45058114j90335964L34136563m6520698J22662687j68324782
18907b2692273j82457537p363088J3899398l3320123R6508347j11033806N66110135
18900C19651053l6504067l14541507O9449053m4747770J85649851j67690398O6434456
18893G7700671k3872302l2416013j71867497K76845373j04879441q7995430K39732470
18886A73247831r9334277O777134j77273501K78282609q6060595l2092009j0171973r93418
18878E2381801k29584132J78326964p4788291N8302188J56191267j81348240j8463272
18871e8981715J40367972j78777081J63737722j53166901K0189112J69515347j59643988
$$ plain form
18921 75235529 -3646628 -175929048 -155475737 105177646 -256147736 -67001204 -347565720
18914 -347565720 -219368193 -74310079 -264646043 69490520 22969822 145632509 -22692273
18907 -22692273 -205149810 -212512898 -198613500 -231933623 -135425276 -246459082 319651053
18900 319651053 283146986 -31394521 38054532 -6693238 178956613 11266215 77700671
18893 77700671 53828369 21412356 -150455141 126390232 21510791 -66484639 173247831
18886 173247831 73913554 80690688 -96582813 181699796 95639201 63547192 53375219 52381801
18878 52381801 -177202331 1124633 -73663658 -15361470 140829797 -40518443 -58981715
18871 -58981715 81386257 -97390824 66346898 -86820003 -66630891 102884456 -56759532
18864e6759532Q6285936j35138446J27098644n9221329J36689177j92675826Q0757604
18857a2963772n6412613N8028255j42666588P6068293J07180695K024848j2270944
18850A8988174Q6177185j81762972J49834814j38006942k4679639K22606485j07834758
18843B5322347k1439333k3651823j0766172j62778996k3403945M76285884k08613697
18836E0954265K28948366k13219550M811304K67306605k82380167k12217658L46318998
18829A90522163p423060P7026966l44747472J15083622J4502263J63884274J71277283
18822C80126039k66586052J29468560n4677051j22239095J5045128k42014592J27078304
18815c3798759j2043807O3046166n847148j96074334K13881501j5081076N5208969
$$ plain form
18864 -56759532 29526404 -105612042 21486602 -37734727 98954450 -93721376 -12963772
18857 -12963772 -69376385 -11348130 -154014718 -77946425 29234270 31259118 18988174
18850 18988174 105165359 -76597613 73237201 -64769741 -89449380 133157105 25322347
18843 25322347 3883014 -19768809 -30534981 -193313977 -216717922 259567962 50954265
18836 50954265 279902631 66683081 71494385 338800990 56420823 -155796835 190522163
18829 190522163 183099103 260126069 -84621403 30462219 44964482 208848756 380126039
18822 380126039 113539987 243008547 188331496 66092401 81137529 -160877063 -33798759
18815 -33798759 -45842566 17203600 11356452 -184717882 29163619 14082543 69291512
18808F9291512J45639183k18949074K03587284j03192600k46279350J93205242R8333938
18801A41636135k11342813j28051532L93445016j18728633o8832127j3407757K6670986
18794B1389275r221339K10623511j56875049J90622572l05683920K1465289J59235179
18787A31555518k06340271J28646327j36664132K98583313k61143290R4386842j48637527
18780i9613220N16691474l22473569j90285684K05655541l7501147j15171907k51206179
18773b93904691L70034804j77894676j72801804L69614981Q7447799j84930890R4805943
18766I2371466m7860357J23245993N2839256n28066704K65651551J30061016k25093970
18759a36851749J4003921M5759441q9192567J59076885P2528780J82513886l01052704
$$ plain form
18808 69291512 214930695 -4018379 199568905 96376305 -149903045 43302197 141636135
18801 141636135 -69706678 -197758210 195686806 76958173 8126046 -5281711 21389275
18794 21389275 12167936 222791447 65916398 256538970 -49144950 -27679661 131555518
18787 131555518 -74784753 53861574 -82802558 215780755 -45362535 49024307 -99613220
18780 -99613220 417078254 94604685 -95680999 109974542 72473395 -42698512 -293904691
18773 -293904691 76130113 -101764563 -274566367 95048614 182496413 -2434477 92371466
18766 92371466 44511109 167757102 220596358 -307470346 -41818795 88242221 -136851749
18759 -136851749 -122847828 -77088387 -166280954 -7204069 65324711 247838597 -53214107
18752e3214107O4665876J4083780Q700522N5895023k00762527o7119872O9548853Q7774039
18744b0428413k5023067J48792560p9638855J39106010j21818297k4981781k4149015
18737h140858j72284077o2437065K89770633j45380408p4789435R1667155R11237M2371518
18729c8311300K05626261q4252398k23571825j2020306j39702206K92024286k9053994
18722b9261482j8234440N6715776P3591766j2774881k06823710R1724357J4365374
18715c0697240K13523494p4348963p2774254k82266150J48834799P543259K19874794
18708A29689739K48303592j58623648r3475500N9319276j4432130j85922125J49936723
18701A34795927j09847697N9474212J2676276J1722717j90244732n04185M3671454
$$ plain form
18752 -53214107 11451769 25535549 34236071 90131094 -110631433 -177751305 -108202452 -20428413
18744 -20428413 -45451480 103341080 23702225 162808235 40989938 16008157 -8140858
18737 -8140858 -180424935 -242862000 46908633 -98471775 -173261210 -81594055 -80682818 -38311300
18729 -38311300 167314961 83062563 -140509262 -152529568 -292231774 -207488 -29261482
18722 -29261482 -47495922 9219854 82811620 70036739 -136786971 -45062614 -30697240
18715 -30697240 182826254 108477291 35703037 -246563113 -97728314 -90185055 129689739
18708 129689739 377993331 219369683 125894183 185213459 170781329 -15140796 134795927
18701 134795927 24948230 84422442 97098718 108821435 -81423297 -81927482 -38256028
18694c8256028J05848231p5771735L28521443l69892783l5845154K18200726M3744606
18687A76549306r6692502p3366643q0786892J09213405q2345329J76085584l02796830
18680a74139901K11744666j39910541K7644939J08165501K42560367j67191532l558246
18673A05315253m2642474J58267751k68283138j6937640j55022991L94973195k29033975
18666e3364019J83213315j54447039j61857405R8669579J93768405J52828306l55830729
18659i7019587Q6593859J40706957k16706917O4680755k52513659K03576357J90557661
18652A19875426P5404126p6686898n9784185k12426544j3170646K81867856L2471860
18645A47550995q2959089R1421566m2161854j27197208J50378235k02629106M4282346
$$ plain form
18694 -38256028 67592203 -8179532 320341911 -49550872 -85396026 132804700 176549306
18687 176549306 79856804 6490161 -74296731 34916674 -47428655 128656929 -174139901
18680 -174139901 37604765 -102305776 -74660837 33504664 276065031 108873499 105315253
18673 105315253 62672779 220940530 -47342608 -64280248 -219303239 175669956 -53364019
18666 -53364019 129849296 -24597743 -186455148 -87785569 105982836 258811142 -97019587
18659 -97019587 -10425728 130281229 -86425688 -21744933 -274258592 -70682235 119875426
18652 119875426 195279552 118592654 58808469 -153618075 -166788721 115079135 147550995
18645 147550995 64591906 156013472 113851618 -13345590 137032645 -65596461 -21314115
18638b1314115J19394386N715534o665014l9270471k00006416N2798141m3425903P1829298
18630f0944560K81538886j55493460p7953236l8211923J46915585n7834366l2103105
18623E913821k2846030J4622776k7078462k71694139K78347718k77937738K55601408
18616d5070646J89892434m6072512j42576371K3803471M9156753o9690907j3458626
18609e4016404J4305676J91836810l27226573J62640758r4148093K13830973q7955101
18602A9268046P4497976n7081385O2063662R396449m3956474N2270102j18280054
18595a821678l51827822M39073721k81894801j21535463K92013775J10077641j00060474
18588a5975101J52861601j67861879p0827539O4877344L4334186L9340096n4004469
$$ plain form
18638 -21314115 98080271 103795805 97130791 57860320 -142146096 -89347955 -132773858 -60944560
18630 -60944560 220594326 65100866 -12852370 -51064293 95851292 38016926 5913821
18623 5913821 -16932209 -2309433 -29387895 -301082034 -22734316 -300672054 -45070646
18616 -45070646 144821788 98749276 -43827095 -20023624 29133129 -40557778 -54016404
18609 -54016404 -39710728 152126082 -175100491 -12459733 -106607826 107223147 19268046
18602 19268046 93766022 36684637 98748299 108144748 64188274 116458376 -1821678
18595 -1821678 -353649500 85424221 -196470580 -318006043 -25992268 84085373 -15975101
18588 -15975101 136886500 -30975379 -101802918 -36925574 -2591388 36748708 -17255761
18581a7255761L0316291n267580J49166589l02936806q036076J58031181p1718744
18574f7700906J52327115j24389779o3947794J000502R5674401j91278191K48755198
18567E0440546j21675175r9252969K15028963R8121089j25343815k01846707J09375244
18560g5152824O3667113j08367239j39579857N7487413Q8436153k0176773j41305307
18553b74991321K16712297j6666160j01083286K58236780M9524099j5278679j47925213
18546c1471483o6197479j24002774N6917390K20086690j30754662L25304336k12403993
18539C7478025K6398451R8777579o7875574N9790874P54926k99351036J67343486O2669774
18531H5986505l98649295M8741640L90561860j67003783M3632074k2371818R6409926
$$ plain form
18581 -17255761 13060530 7792950 156959539 -145977267 -154013343 4017838 -67700906
18574 -67700906 84626209 -39763570 -103711364 -102710862 -7036461 -198314652 50440546
18567 50440546 -71234629 -170487598 44541365 142662454 17318639 -184528068 -75152824
18560 -75152824 -11485711 -119852950 -259432807 -201945394 -113509241 -133686014 -274991321
18553 -274991321 -58279024 -74945184 -176028470 82208310 131732409 116453730 -31471483
18546 -31471483 -97668962 -221671736 -164754346 55332344 -75422318 249882018 37478025
18539 37478025 63876476 162654055 94778481 154569355 155324281 -144026755 23316731 85986505
18531 85986505 -312662790 -263921150 126640710 -40363073 3269001 -19102817 77307109
18524G7307109l5292667q1818867P1623185j04070471Q4978596j19786522M5704359
18517f1355278J65426672j44520873R4458801K76422647l01122554N3080822Q5095590
18510A67485827N2676110j21032609L9159805N4347827L2341042j65982527r820216
18503D9175259K5236619M8168011j39779052J57349524l380701j86379068j01116803
18496a50726211L70925095j72660228j41251990J46562784J05621236k06147041n919392
18489e3595747q6288312J58499211k30343217j4512254L75957043j78071755O6055486
18482C7700455j58678478J07253260J16261557j20278928J69211047n7114181r2266581
18475B088151j56900372K05113671j11029960j64403767R3030635K89352393o8571839
$$ plain form
18524 77307109 42014442 -39804425 31818760 -72251711 12726885 -107059637 -61355278
18517 -61355278 104071394 -40449479 54009322 330431969 29309415 82390237 167485827
18510 167485827 220161937 99129328 138289133 192636960 224978002 58995475 49175259
18503 49175259 74411878 122579889 -17199163 140150361 136769660 -49609408 -150726211
18496 -150726211 220198884 47538656 -93713334 52849450 158470686 -47676355 -53595747
18489 -53595747 -139884059 18615152 -211728065 -226240319 149716724 -28355031 37700455
18482 37700455 -120978023 -13724763 102536794 -17742134 151468913 94354732 2088151
18475 2088151 -154812221 50301450 -60728510 -225132277 -132101642 157250751 88678912
18468H8678912o6328169P3548856l68269639K98663062l9241383N2757834M3825330
18461H3634803j14852531N8886461o7771683J44417818j25438989q900942p0406844
18454a00431907J0847593L26551409k11578295q9218494j59511861K66098350L1867033
18447G4623828J07959131p463551p3343889N9570350k33922895L6195816R4144950
18440E7763740J03730373l5856412K6248264M2927418j37755296k02829680K11675597
18433F5904004O0246906r3496670Q8294283j89256179k07500293K55495490m8702326
18426f9014785m4785019L4468490m3938792J63169585L4679488p4993792R4908180
18419I4493355j16345460n3085213N0310286J27981844j23554705p376604j14187986
$$ plain form
18468 88678912 22350743 95899599 -272370040 26293022 -12948361 39809473 83634803
18461 83634803 -31217728 27668733 -40102950 104314868 -21124121 -30025063 -100431907
18454 -100431907 -89584314 236967095 25388800 -63829694 -223341555 42756795 74623828
18447 74623828 182582959 175119408 101775519 161345869 -72577026 -36381210 57763740
18440 57763740 161494113 125637701 151885965 194813383 57058087 -145771593 65904004
18433 65904004 126150910 32654240 120948523 -68307656 -275807949 -20312459 -69014785
18426 -69014785 -113799804 -79331314 -123270106 39899479 74578967 -414825 94493355
18419 94493355 -21852105 -74937318 -24627032 103354812 -20199893 -27576497 -141764483
18412a41764483K38265412q384328k230606p4806945m1062509M54066584l64452580
18405E9630545K37516204k39055076l53280300J91815466K76941868j61764144o5071705
18398e3267142J82254734j10118562K00513243j53892087k00840915J6006002L81679999
18391B62335272R8520724o98324998L50894622j31140063P7702549J04562862q7297654
18384b2746686j9576113N1637505M5899659k50622967K47175623j23047234K03661278
18377A32381065j84500817M7991907k92465437L07862512R8906187m6420419m1012554
18370B2742444K965110K1616846J42404976k1880828k66859719J32086913M3355768
18363G6431510o9392670n8938260j8601371m809880K10823362o1187440P6684458
$$ plain form
18412 -141764483 96500929 88116601 85885995 11079050 -29983459 424083125 59630545
18405 59630545 297146749 58091673 -295188627 -103373161 173568707 11804563 -53267142
18398 -53267142 128987592 18869030 219382273 65490186 -135350729 -119344727 262335272
18391 262335272 360855996 -337469002 13425620 -117714443 -40011894 64550968 -22746686
18384 -22746686 -42322799 9314706 55214365 -195408602 51767021 -71280213 132381065
18377 132381065 -52119752 -4127845 -296593282 11269230 110175417 63754998 22742444
18370 22742444 25707554 47324400 189729376 167848548 -99011171 33075742 76431510
18363 76431510 7038840 -51899420 -70500791 -75310671 135512691 74325251 151009709
18356A51009709l33255134J26406551Q9900212Q5605001n4667477k58445418m8501756
18349b41948312M28137046l10145248q1603583J84548482K9906535R5912425k082774
18342A02724571j06319104L09444779j44024695n4871844k69536501J44122445j26219119
18335a44679468K75832609K0355911n8264598q3724162P7904352q6067228j24819235
18328a23461819P8657445j28457021K54662331L655416q5674303k9393810k10955656
18321b40967417L60023816J07024941k51375690N1002977k59118616L49228175k76264805
18314a60446619K24262204j05454900J92714052m8964960p9264291L26153257l23364925
18307B5633818N6811922k5859534K10024239l18410234R908816J73817213k8878485
$$ plain form
18356 151009709 -182245425 -55838874 34061338 119666339 64998862 -193446556 -241948312
18349 -241948312 186188734 -123956514 -205560097 -21011615 8894920 104807345 102724571
18342 102724571 -3594533 305850246 161825551 106953707 -162582794 -18460349 -144679468
18335 -144679468 131153141 151509052 93244454 9520292 87424644 1357416 -123461819
18328 -123461819 -44804374 -173261395 81400936 85056352 -617951 -30011761 -240967417
18321 -240967417 119056399 226081340 -25294350 25708627 -233409989 115818186 -160446619
18314 -160446619 63815585 -41639315 151074737 102109777 22845486 348998743 25633818
18307 25633818 82445740 56586206 266610445 -51799789 -41890973 131926240 103047755
18300A03047755j22680700o8046283K87020682k26580838m4072306l837461o3046944
18293a38196095J34527444j24660502J06762219r3617231J0514499o1124600K79022864
18286A13228598j28578514j54611168J27421367j28896544K70921696l90559799L11171519
18279B0097155k33923305J54901767J41672507k28575732K6048505L12120945o2789359
18272A29552483o4328539N028955p9902580p5791593J72066634k0695517k40018048
18265a74088205L188027Q5774075K42316416L1141726j00872927o2017575k6079331
18258f37794L7808469J15392373k34589729J09675259l6375828j69979520J89904313
18251A1197543R4257893O44489j5879128J31177153k29121903P2938176r2080865
$$ plain form
18300 103047755 -19632945 -87679228 199341454 -27239384 -71311690 -75149151 -138196095
18293 -138196095 -3668651 -128329153 -21566934 -115184165 -104669666 -165794266 113228598
18286 113228598 -15349916 -169961084 -42539717 -171436261 99485435 -291074364 20097155
18279 20097155 -213826150 -58924383 82748124 -145827608 -119779103 192341842 129552483
18272 129552483 65223944 70252899 -9649681 -85441274 86625360 65929843 -174088205
18265 -174088205 -170900178 -85126103 157190313 188332039 87459112 25441537 -637794
18258 -637794 37170675 152563048 -82026681 27648578 -8727250 -178706770 11197543
18251 11197543 105455436 106099925 90220797 221397950 -7723953 65214223 -26866642
18244b6866642j32823646m8851085J92445388K9894048j63058285J24302622Q8630004
18237F3672404n8515795R5996719k33989047p142657J36716370l6411856K20500897
18230A80827035j42477304r5880791k05186567L79682486j26612714K14665967j48547122
18223E6470990n3822864j07762810N3775312j09666008J37721789l3387855j1547631
18216f8219077L42895204n8226592l86095053m2152154L90771708j79672800K2785933
18209B2087169Q9065103j9197797j29084809l1310014R9831509j3403373p9207464
18202f1219676K7187354J06673865M0957243j504494J22502797q5702731P9183209
18195B28077567o9631746j20159766m2441357P7642024j18084781K14503378j56955488
$$ plain form
18244 -26866642 -159690288 -208541373 -16095985 13798063 -149260222 -24957600 63672404
18237 63672404 5156609 101153328 -132835719 -139978376 -3262006 -39673862 180827035
18230 180827035 38349731 -57531060 -262717627 116964859 -9647855 205018112 56470990
18223 56470990 2648126 -105114684 -51339372 -161005380 -23283591 -56671446 -68219077
18216 -68219077 274676127 216449535 -169645518 -211797672 178974036 -698764 22087169
18209 22087169 111152272 91954475 -37130334 -68440348 31391161 17987788 -61219676
18202 -61219676 -34032322 72641543 113598786 112094292 234597089 148894358 228077567
18195 228077567 158445821 38286055 -4155302 73486722 -44598059 169905319 12949831
18188A2949831J41596035K7111690m2080130J1654143J20752989l16922420m0280075
18181h5217937K10138537k76532620J97339643n1456422N8569130K41077785k02140609
18174I1777507J7870128Q3815000k5025714j14562303o455760k96551095J39808106
18167a09324131o564801J27923124O992567J55184721q2922323J12453898j96160771
18160G582284k1806536j38800724J99925481j57235378l5284424J94548272j81556237
18153a32627262R2157793P1776990J53387949J2062595q5125203j52814789K45498432
18146B04316505l52410605o1752023K01336636Q4474875p3803396L542180K07500798
18139B13204970l72900056R5214110N3148330O1371189j6612760j66954334n5314878
$$ plain form
18188 12949831 154545866 181657556 139577426 151231569 271984558 -44937862 -85217937
18181 -85217937 124920600 -151612020 45727623 -5728799 52840331 293918116 91777507
18174 91777507 109647635 193462635 168436921 53874618 47418858 -249132237 -109324131
18167 -109324131 -115888932 12034192 19026759 174211480 91289157 203743055 7582284
18160 7582284 -14224252 -153024976 46900505 -110334873 -145619297 48928975 -132627262
18153 -132627262 -40469469 31307521 184695470 196758065 111632862 -41181927 204316505
18146 204316505 -148094100 -209846123 -8509487 75965388 2161992 5704172 213204970
18139 213204970 -159695086 -64480976 -11332646 50038543 33425783 -133528551 -188843429
18132a88843429J16170671Q7438743K7338202j30864353n2700507K82621319j65612216
18125b4451570J38443770m5416829j30188440R1986921L945814J64815551k45347987
18118d6212770J78804376J0034883r1870015N1343059o3828589k3276676J05047935
18111A20042203j62937668K50425651j37815584j07333062p0335306K49172225j68847185
18104b7628726P9629317j72524469L84323787k95013802j58963024J61098432J8389563
18097a0688922J39265944j81251924p6570641M5164295O3737781j70956854R977276
18090a81323045K32450854j78100940L68631899l49045662N6232826O2120160n8427538
18083d7461446J68890342l17589126L63442376k15400744L5966637l02177025L45543811
$$ plain form
18132 -188843429 -72672758 14765985 42104187 -88760166 -141460673 141160646 -24451570
18125 -24451570 113992200 68575371 -61613069 30373852 34319666 199135217 -46212770
18118 -46212770 132591606 142626489 50756474 102099533 38270944 14994268 120042203
18111 120042203 -42895465 207530186 69714602 -37618460 -107953766 141218459 -27628726
18104 -27628726 52000591 -120523878 263799909 -31213893 -190176917 -29078485 -10688922
18097 -10688922 128577022 -52674902 -129245543 -84081248 -20343467 -191300321 -181323045
18090 -181323045 51127809 -126973131 241658768 -107386894 -51154068 10966092 -47461446
18083 -47461446 121428896 -196160230 167282146 -48118598 -12151961 -314328986 31214825
18076C1214825p8454735K00990040k53222968J31933527q3165389J06985636j2456176
18069D3824760j46603222J46953655j6397526k04577748L31388848l12428073R983159
18062a47856147j2049546J68360846J39864686k27830341J30928666j32872880J02028898
18055B0574182K61503104l76748672Q7869881O8568419J15083586j63558165J1460155
18048B4752490j76680925J67943273K39241321k18760567P9233397k3441580o4839939
18041B7447470K4561504k1234065L4681046J26685468p762653j9789210l40943932
18034a76354372J52480264L790256Q4575796j62574046N9902704J48725179K6368671
18027A36914452l68007661J58853744R3623102R5754922l5977212r5182771j65794960
$$ plain form
18076 31214825 -47239910 153750130 -99472838 32460689 -50704700 56280936 43824760
18069 43824760 -102778462 44175193 27777667 -176800081 154588767 -157839306 -147856147
18062 -147856147 -159905693 8455153 148319839 -79510502 51418164 -81454716 20574182
18055 20574182 282077286 -94671386 -6801505 61766914 176850500 13292335 24752490
18048 24752490 -151928435 16014838 255256159 36495592 115728989 92287409 27447470
18041 27447470 52008974 30774909 65455955 192141423 184378770 164589560 -176354372
18034 -176354372 -23874108 -20083852 64491944 -98082102 -38179398 110545781 136914452
18027 136914452 -231093209 -72239465 21383637 117138559 81161347 -14021424 -179816384
18020a79816384k5710741M57916072l36518305K66038048j49548932m4378337J7668702
18013E650123R984244k18080108K13258594j3336840K6787105Q2838178q1416517
18006B5684779j52003532J8506861K28503852j84746786J4696014J18324900r6405002
17999b7438914o9552277L9818880N8412893P308710J74748574j75858036m3562482
17992c6122652J47379932j42864204R1374585l2916412O7379703p1575894j9267093
17985C387965n4132644K67083505k83407829L04002679p0110810p2836226j33252164
17978c9265524J3074175K22054400J32706814k76161841j45019364L9875770K44377163
17971A91641593j44603313j2393777J99980742k06615974K041817J2202765j43088654
$$ plain form
18020 -179816384 -205527125 252388947 -84129358 181908690 32359758 -12018579 5650123
18013 5650123 15634367 -202445741 10812853 -2523987 24263118 107101296 25684779
18006 25684779 -126318753 -107811892 120691960 -64054826 -49358812 68966088 -27438914
17999 -27438914 -96991191 -57172311 1240582 8549292 183297866 7439830 -36122652
17992 -36122652 111257280 -31606924 59767661 26851249 94230952 22655058 3387965
17985 3387965 -50744679 216338826 -67069003 236933676 166822866 93986640 -39265524
17978 -39265524 -26191349 195863051 328569865 52408024 -92611340 -52735570 191641593
17971 191641593 47038280 34644503 234625245 28009271 30051088 42253853 -100834801
17964a00834801J20261815j59094406K78961450j75156245J98168562k21161398M8786161
17957a0068862q5610373J05462939J57431435j40412009l5771564r465023L4753037
17950A6319580k4178884M395223l8660572J49752210j10505644j64450025J81249481
17943A3921369k64336053K77516795r0537056K93268000j23381811J4514226o6223526
17936E4741944q5484432J07347700j3013776q0005837M3823243k42394072R5322223
17929a19663007Q9354351Q8181848K9599210q4674415J4068871K35607421l03961663
17922e1487384Q5700994r7410947j30423377J9413507J20125266L15137972m39170019
17915a78113988j8733611j0235867L81756769n7514871l44822101L28366879J42844986
$$ plain form
17964 -100834801 19427014 -139667392 139294058 -35862187 162306375 -58855023 -10068862
17957 -10068862 -95679235 9783704 167215139 26803130 -8968434 -18433457 16319580
17950 16319580 -7859304 -3464081 -42124653 107627557 -2878087 -167328112 13921369
17943 13921369 -250414684 27102111 -63434945 229833055 106451244 120965470 54741944
17936 54741944 -30742488 76605212 63591436 -16414401 27408842 -214985230 -119663007
17929 -119663007 -30308656 57873192 87472402 2797987 16866858 252474279 -51487384
17922 -51487384 34213610 -63197337 -193620714 -174207207 -54081941 261056031 -178113988
17915 -178113988 -196847599 -207083466 174673303 117158432 -227663669 100703210 243548196
17908B43548196L5612108k48633320j55352412j27437614Q941347K86810860q3661851
17901d0172686j4265650j11550138J92782370K10061784j67291956j0977905m65018
17894E8120801J86847716n6866922j90008252K2333733O0887494j93040151M04860632
17887B93135051K075283k18577559L5492224K02514246k06741109k8700370o0329660
17880A8868106J67102229o1944123j69442659J34103430j91998932K16271759J41808847
17873B54768657j76555923J16328070k53669810J48854530j40337207L4922389L6659695
17866B0970401M5795579M489291j95394273O0744359K27862682j12684256P3746464
17859A25530247n7807397J8823591j69397355J42595736k9080438L3025164j35343473
$$ plain form
17908 243548196 279160304 30526984 -124825428 -252263042 -243321695 43489165 -40172686
17901 -40172686 -54438336 -165988474 26793896 236855680 69563724 58585819 58120801
17894 58120801 244968517 188101595 -1906657 20427076 81314570 -111725581 293135051
17887 293135051 295210334 76632775 112124999 314639245 107898136 79197766 18868106
17880 18868106 185970335 124026212 -45416447 88686983 -103311949 112959810 254768657
17873 254768657 78212734 194540804 -59129006 89725524 -50611683 -15689294 20970401
17866 20970401 66765980 71255271 -124139002 -63394643 164468039 51783783 125530247
17859 125530247 67722850 86546441 -82850914 59744822 30664384 63689548 -71653925
17852g1653925K58438288l2470894l22296302L64184463j04931078J7646643J52423263
17845B61340458k27252415P8255667j37105599J0897128j6541953p651282j35904301
17838a73962297K79456176r4439997J54067599j25333134j29047578J42499485m4603624
17831H636630n9517021N9877739j30320830J71177442l63726028M16378885l24835434
17824b22328617L13276223o8660746J16995577m1034136j39306928J72980951j76993932
17817d5071608J12767146K4628719j7222183L7371608l62226232L96525361j09161317
17810C7611494P3682469K43197368k55772649l2082146J3281204q2352404J54219307
17803A51784643k27158708K02099919Q8352195j94565694r7172774l4598115p9054671
$$ plain form
17852 -71653925 186784363 154313469 -167982833 196201630 91270552 108917195 261340458
17845 261340458 34088043 112343710 -24761889 -13864761 -30406714 -38057996 -173962297
17838 -173962297 105493879 11053882 165121481 39788347 -89259231 53240254 8636630
17831 8636630 -50880391 8997348 -121323482 49853960 -313872068 102506817 -222328617
17824 -222328617 90947606 22286860 139282437 98248301 -41058627 131922324 -45071608
17817 -45071608 67695538 92324257 75102074 112473682 -249752550 146772811 37611494
17810 37611494 111293963 354491331 98718682 66636536 79917740 -2434664 151784643
17803 151784643 -75374065 126725854 215078049 20512355 -76660419 -111258534 -190313205
17796a90313205K55425366R6065269j09989982j4942362q4280478l5384901J2622841
17789g0797452K0811706n958539J0459706R7850279o0814569P8502909k7901126j6123264
17781B6029650k4287187m803256O088796m0236683k1438952K44686045l04321160
17774a18282747K73455748j41235216J22485364L5407349j62277273O5258025K2960132
17767I7771382j33291466L4134706L6106260J43710962l38491404O4668949K73726610
17760A78335999k49676507j576180J35362477K10993p8189626q7922203J89497791
17753H6042744j7174026k0976638j54149813J79395348P1630907j21302922r8093908
17746g4628308J97798427j27021788m3992793o7963773k6553725K51395512j93840521
$$ plain form
17796 -190313205 65112161 161177430 51187448 36245086 -48035392 -83420293 -70797452
17789 -70797452 -49985746 -55944285 -45484579 52365700 -8448869 70054040 42152914 26029650
17781 26029650 1742463 -3060793 3028003 -37208680 -58647632 186038413 -118282747
17774 -118282747 155173001 13937785 136423149 171830498 9553225 74811250 97771382
17767 97771382 -35520084 -1385378 34720882 178431844 -160059560 -95390611 178335999
17760 178335999 -71340508 -72916688 62445789 62656782 -15532844 -103455047 86042744
17753 86042744 68868718 47892080 -106257733 73137615 144768522 23465600 -74628308
17746 -74628308 123170119 -3851669 -47844462 -115808235 -142361960 109033552 -84806969
17739h4806969J42559470n9465604J90690196j88295757n6865067J23777199j79416864
17732a11823396K44663539j50237390M7281236M751931r4961883J8945765J91333168
17725A49952970k18870975J2736357m947413L37266382j10722129l01800576K95639643
17718A59254259j08144420o566288J50084876k99266541K86446192k02397380j50811793
17711a71401095L51287962l57053750Q9918682J63523098n4218552K24186458k30237122
17704A6005681j81120379L18994475k17685459m8152223O9498610j01916250K1395581
17697a22979964L5508518n7351717K47912966r9255596J681224J5893468l8735320
17690a7326421j45527894q409352K38889046p8267311o4350130L76838698l31962914
$$ plain form
17739 -84806969 57752501 -1713103 188977093 681336 -56183731 67593468 -111823396
17732 -111823396 132840143 -17397247 29883989 34635920 -60325963 -41380198 149952970
17725 149952970 -68918005 -56181648 -61129061 276137321 165415192 -136385384 159254259
17718 159254259 51109839 44543551 194628427 -104638114 181808078 -20589302 -171401095
17711 -171401095 179886867 -177166883 -87248201 76274897 22056345 246242803 16005681
17704 16005681 -165114698 153879777 -63805682 -111957905 -42459295 -144375545 -122979964
17697 -122979964 -87471446 -144823163 103089803 3834207 5515431 21408899 -17326421
17690 -17326421 -162854315 -171263667 67625379 -10641932 -74992062 301846636 -30116278
17683c0116278K25785426O9415252l93284463O8250974K72528823L3904610k88163431
17676d1679087n9459222K51808529n0227590M420293K68846091k82257339j4397036
17669G7054639K9569810k06452621J24099289j87989031m0909788M40261100k60549455
17662b4916057J22834882j25310358N3489484j10537012J3305726O3335281Q9284287
17655H1486233k83669730r3616686K48782984k11930256K81501611j83498132K77887004
17648A16943028l52326599K03953401k0319207j50821989J11154083j66421523K07052013
17641e0786793n0355226J03052460J34295627j80736836m3904226M0383886J70968636
17634A22917528j59557135j07115616n4662313k7149689J45900441J29565962j0106961
$$ plain form
17683 -30116278 195669148 265084400 -128200063 -59949089 212579734 246484344 -41679087
17676 -41679087 -101138309 150670220 100442630 104862923 373709014 91451675 77054639
17669 77054639 106624449 -99828172 24271117 -163717914 -204627702 235633398 -24916057
17662 -24916057 97918825 -27391533 26097951 -84439061 -71133335 -7798054 81486233
17655 81486233 -202183497 -295800183 -47017199 -258947455 22554156 -160943976 116943028
17648 116943028 -235383571 -31430170 -51749377 -202571366 -91417283 -257838806 -50786793
17641 -50786793 -101142019 1910441 136206068 -44530768 -88434994 -48051108 122917528
17634 122917528 -36639607 -143755223 -198417536 -225567225 -79666784 49899178 39792217
17627C9792217l778597r1270970J32052115k2430985r9829305n9656664K03965253
17620I8843064r0311499L188243K5408624j12131708K09651873R15227j32527645
17613C036179J47011485k30883912l1433767K17472149N8217123k5686248p6064906
17606F1668103r5830184J82114446M3766346o1424867j13910194O1104593j46451958
17599f8963715J74109206j36189157J53056215j38637330J15746067q0617313Q1016052
17592I9520025Q904807k61190022L14547572j72498080P162709L297485j62394027
17585a62649531P1813376N2386541J33933136j08302367p4380130J86558241J07515920
17578B06875186k93288804L54320766k53025717j6642677N5577053J1685634j4500171
$$ plain form
17627 39792217 36013620 -55257350 76794765 54363780 -45465525 -105122189 98843064
17620 98843064 8531565 11719808 37128432 -75003276 134648597 135563824 3036179
17613 3036179 150047664 -80836248 -112270015 105202134 163419257 137733009 61668103
17606 61668103 -34162081 147952365 191718711 130293844 16383650 77488243 -68963715
17599 -68963715 105145491 -31043666 122012549 -16624781 99121286 18503973 99520025
17592 99520025 108424832 -152765190 161782382 -10715698 -3552989 -255504 -162649531
17585 -162649531 -90836155 -38449614 95483522 -12818845 -87198975 99359266 206875186
17578 206875186 -86413618 267907148 14881431 -1761246 53815807 65501441 51001270
17571E1001270K3333826n630558q1516714j43835716K11563981m9978959K37806372
17564B42743502k31128800K09482637K2492266J06996759l82049142j04457410q381632
17557a44301820n8734218K22612841j68203822J33995919j2668201P6555476O7679541
17550A16935716j29600821j20085893K98142629k88144941K67866478k75140211m5039370
17543a75066413L12087488j94517807J20228031l2522978k5385473M0884685j52853566
17536a07146033R1483179O9006558J72476011j01965981j64120259J09553276J13241288
17529A82528039m3026449k65745915N8184352P7117871R0715084o1351354k64220973
17522b25799345J99336055m4446900K29950783R5376690k53973725j00264923Q8804743
$$ plain form
17571 51001270 74335096 68704538 -12812176 -156647892 54916089 4937130 242743502
17564 242743502 11614702 221097339 243589605 350586364 -31462778 -135920188 -144301820
17557 -144301820 -203036038 19576803 -148627019 -14631100 -27299301 49256175 116935716
17550 116935716 -12665105 -132750998 165391631 -122753310 145113168 -130027043 -175066413
17543 -175066413 137021075 -57496732 62731299 30208321 4822848 45707533 -107146033
17536 -107146033 -15662854 53343704 225819715 123853734 -40266525 69286751 182528039
17529 182528039 139501590 -126244325 -68059973 9057898 99772982 38421628 -225799345
17522 -225799345 -26463290 -70910190 159040593 254417283 443558 -99821365 -11016622
17515a1016622J765117l4983052m0191831M4689225M0947525k1297691J57430801
17508A37343472k02989298K06845332m2378255J07664138l14857842n9302777J91196839
17501B3521609J76659965j39499778q8384179j09992336J90289090J94579896j9317696
17494B27856571l56980979L38912657k03372467j17626445O507535o8389236n3868745
17487b26961109M16080172m17347059J81176950Q650555Q9219748P2386060l09018830
17480a85813513L80394898j47665572k01162859K85439792l61142885l668365K7349570
17473b06268934K07787148m0052735J24809927l33428325M23476481q0271238r9693509
17466c641185j82164825J77932163J20532682l04580816K4517479R5864945q7175566
$$ plain form
17515 -11016622 -9251505 -44234557 -84426388 -39737163 1210362 -20087329 137343472
17508 137343472 -65645826 141199506 98821251 206485389 -108372453 -167675230 23521609
17501 23521609 200181574 60681796 -27702383 -137694719 52594371 247174267 227856571
17494 227856571 -129124408 209788249 6415782 -111210663 -104703128 -173092364 -226961109
17487 -226961109 189119063 -228227996 -47051046 -38400491 50819257 123205317 -185813513
17480 -185813513 194581385 46915813 -154247046 131192746 -229950139 -233618504 -206268934
17473 -206268934 1518214 -38534521 86275406 -247152919 176323562 96052324 -3641185
17466 -3641185 -185806010 -7873847 112658835 -191921981 -167404502 -71539557 -158715123
17459a58715123J27078161Q4296456k16080549M9627960q54331J08030509K8590510
17452B1973593r5593917Q9294869k5661734N1443001k23216264N6615979J98894574
17445G3750101J29035857l69370839J07748066K14858494j22119564J89153165k21677052
17438A378228N8627748J90521698p1133174O7426121j86747801o582028N10046629
17431E63537421n45414321K47238101k8595005k17748160n8676731L13791530k63906951
17424A0225884J96665874o2095449Q6557730k59572606k9903468J76106730j19574053
17417a589358Q9465431L7949911j68570054J15189863q8152094j47406116K03824053
17410D0711636j78070846P7063316J73254077m7580097j77154861O9089098M656091
$$ plain form
17459 -158715123 -31636962 52659494 -163421055 -113793095 -114647426 -6616917 21973593
17452 21973593 -73620324 15674545 -9987189 41455812 -181760452 -125144473 73750101
17445 73750101 202785958 -166584881 -58836815 156021679 33902115 223055280 1378228
17438 1378228 60005976 250527674 179394500 246820621 60072820 53490792 563537421
17431 563537421 18123100 265361201 236766196 19018036 -39658695 274132835 10225884
17424 10225884 206891758 144796309 231354039 -28218567 -58122035 117984695 -1589358
17417 -1589358 87876073 125825984 -42744070 72445793 -15706301 -163112417 40711636
17410 40711636 -137359210 -60295894 112958183 65378086 -111776775 -42687677 -38031586
17403c8031586m4747488Q202454J94119958j65150956j19243160n937856R8290727k764420
17395g5262327K03624916j92497201q2834568J09500991J88426364k14723450Q1119639
17388A7354364j77318209L7358426Q2433656P4333186l05171746j0159144L09807984
17381B8638517M8257259M2787540k27218051k08236515J84982268K05800766l1086575
17374D3925209r855736n6017429j68647075J67857763K13493253p6220391j33168819
17367a8633225J57540986j1906168k57084538J95935277k24788300J66728846L1490849
17360C9283727M4057846n8100243N3217117o493996j83618808J78894038P3222336
17353A40462017p0788902j73223801j4961479n326300j27971340K56402118J74321569
$$ plain form
17403 -38031586 -82779074 -74576620 119543338 -45607618 -164850778 -170788634 -72497907 -75262327
17395 -75262327 128362589 -64134612 -146969180 -37468189 150958175 -63765275 17354364
17388 17354364 -159963845 -122605419 -40171763 34161423 -271010323 -281169467 28638517
17381 28638517 76895776 119683316 -107534735 -315771250 -130788982 75011784 43925209
17374 43925209 34069473 -21947956 -190595031 -22737268 190755985 114535594 -18633225
17367 -18633225 138907761 127001593 -130082945 65852332 -158935968 7792878 39283727
17360 39283727 83341573 25241330 78458447 71964451 -111654357 67239681 140462017
17353 140462017 69673115 -103550686 -118512165 -123838465 -251809805 4592313 178913882
17346A78913882k89970645J92787204j29126997J35186669r327141j47823037n6991758
17339a26351823J18874911Q6923058j66988166R1978805q6543873j59991586M22150780
17332A80052106k25473961j58989198L80814801k51210864N6010346J43575214j39794575
17325a5016131k3983783J19071191M9524874K7946115k54438326J30571805j86312075
17318a52636330O625724K88114926j65966579j06505614J58895321K7594020K7257530
17311H3378998Q6473606l4401923j3405221n7035192M8839620q8365713k06889260
17304a81405085J72987773J1961331N681532m8648726j56526089K04013027j58757314
17297a50693551L78928010j17487867j19983233l0951560r1185404J87190641P0144478
$$ plain form
17346 178913882 -111056763 81730441 -47396556 87790113 78462972 -69360065 -126351823
17339 -126351823 -7476912 79446146 -87542020 4436785 -82107088 -242098674 180052106
17332 180052106 -45421855 -204411053 176403748 -74807116 -18796770 124778444 -15016131
17325 -15016131 -38999914 80071277 129596151 157542266 -96896060 33675745 -152636330
17318 -152636330 -146010606 142104320 -23862259 -130367873 28527448 56121468 83378998
17311 83378998 169852604 135450681 122045460 65010268 113849888 25484175 -181405085
17304 -181405085 -8417312 3544019 9225551 -39423175 -195949264 8063763 -150693551
17297 -150693551 228234459 110746592 -9236641 -40188201 -131373605 55817036 125961514
17290A25961514k24633042J58363023O7669150k11246615L44457536k50303764j93998316
17283a83730514L1469656M1541335J26171486j14629323N0769241J32141501P4719321
17276A58452703o1347420K4254423k31580502K01565747M3221083j6228454j88433127
17269g0095547k40300860L40593440L8464460K02567519k62100483k3221348K59666369
17262B45573550n4140782p4032541p0618159J01759584j18182729j8259629j20535989
17255a08436695J78407925k11631831N5204449P5361827J71423945q0628855k44075636
17248a64374871J00420322K65778780k27675269J17012710n2246685L6632109l67435330
17241b91888234J61281387L61456012l59037198J82328368J64766494k61282198Q835864
$$ plain form
17290 125961514 -98671528 59691495 127360645 -83885970 260571566 10267802 -183730514
17283 -183730514 -152260858 -110719523 15451963 -99177360 -48408119 83733382 158452703
17276 158452703 97105283 121359706 -110220796 91344951 134566034 118337580 -70095547
17269 -70095547 -310396407 30197033 68661493 271229012 9128529 -14092819 245573550
17262 245573550 191432768 117400227 46782068 148541652 30358923 12099294 -108436695
17255 -108436695 69971230 -141660601 -86456152 -11094325 160329620 79700765 -164374871
17248 -164374871 -63954549 201824231 -25851038 91161672 38914987 75547096 -291888234
17241 -291888234 -130606847 230849165 -128188033 54140335 218906829 -42375369 -33539505
17234c3539505r2916160L82784369r9548649n2073278r0576582j25445633l7539166
17227a48854604J62283472J72202919k8666689k43239138j68081156K66185184N889647
17220A7719635n3360570J59207800J04177375n38939063K63446396J23496114k11670107
17213a35922420j20739199L26110168l5451318j22292900k9713265J00387714J33242640
17206A15621420j4086694r6925641O2109392K26857329m37067332K7432057J15562938
17199d96531j3599796k06275871M22198836J8494647k03138556l73318161O64568523
17192C08433091l30176320j00916009K89112568r8320873R8367354J1915111n13488134
17185c35073212K30817189K81395706o6822653R2160686k09516188k587907R2512072
$$ plain form
17234 -33539505 -126455665 256328704 156780055 104706777 14130195 -111315438 -148854604
17227 -148854604 13428868 185631787 156965098 -86274040 -254355196 11829988 17719635
17220 17719635 -35640935 123566865 227744240 -311194823 -47748427 75747687 -135922420
17213 -135922420 -256661619 69448549 33997231 -88295669 -118008934 -17621220 115621420
17206 115621420 101534726 4609085 66718477 293575806 -143491526 -116059469 -496531
17199 -496531 -14096327 -220372198 201826638 220321285 17182729 -356135432 308433091
17192 308433091 -21743229 -122659238 166453330 68132457 166499811 178414922 -335073212
17185 -335073212 -104256023 177139683 110317030 202477716 -7038472 -9626379 82885693
17178H2885693r2783969l4526458m1119691J65501423K10581445p8005899l55629452
17171a43096908J24296739o2771714L61841710N80494j53420943k22760038J78772079
17164H3441419K01439658l11228204m2305072m7482609J32498462O6141681m5289181
17157C7216154j08839085n4012194K06526952O9973399r9978328O854529m0421390
17150A7320037j11370890K96227518k23437586m0868440L02581013l98382432L53136384
17143A95205604l4209993M5761390K6326918l21652435J80869308K3935954r500767
17136A06735979L3411532J39658994l62284065Q8599298J33407406k4145692j69975884
17129e4592432J73086562L16528534m77420735P050724j79040313K60246031L7821648
$$ plain form
17178 82885693 -9898276 -44424734 -85544425 79956998 290538443 212532544 -143096908
17171 -143096908 -18800169 -81571883 280269827 280850321 127429378 -95330660 83441419
17164 83441419 284881077 -26347127 -68652199 -116134808 16363654 82505335 37216154
17157 37216154 -71622931 -125635125 80891827 150865226 50886898 57741427 17320037
17150 17320037 -94050853 202176665 -21260921 -62129361 240451652 -157930780 195205604
17143 195205604 160995611 206757001 233083919 -88568516 92300792 116236746 106735979
17136 106735979 140147511 279806505 -82477560 6121738 139529144 115383452 -54592432
17129 -54592432 118494130 435022664 -42398071 -35347347 -214387660 45858371 83680019
17122H3680019n8801385J52847195l85144058K48133244l8042952L18445628k54503132
17115F6614559j31945442r7993040L04855717j37231380j9781157j13283352K06635031
17108G7870936J14579705j78061144n313708j48489234J83480791L9433872p9009611
17101D491607n635248N0708900j80098443J98993057Q6277901j08737562r1027007
17094d5026795O9220598j6386732J1614802J07199853j50225152N1401898J09452105
17087A37250577j56470851j45520591J76657181K6719075j4102374P4389572Q6902880
17080A85825469k68320389K0299753N7839369M2429949K08128995m70769417O8778552
17073a55787719M520952K98895873j46771949m4254443M7738042j7218683J76523351
$$ plain form
17122 83680019 24878634 177725829 -207418229 40715015 2672063 321117691 66614559
17115 66614559 -65330883 -163323923 141531794 4300414 -15480743 -128764095 77870936
17108 77870936 192450641 14389497 9075789 -139413445 44067346 83501218 4491607
17101 4491607 -1143641 49565259 -130533184 68459873 154737774 46000212 -45026795
17094 -45026795 24193803 7807071 19421873 126621726 -23603426 27798472 137250577
17087 137250577 -19220274 -164740865 11916316 38635391 24533017 98922589 185825469
17080 185825469 -82494920 -62195167 -4355798 38074151 246203146 -224566271 -155787719
17073 -155787719 -151266767 147629106 857157 -43397286 4340756 -12877927 163645424
17066A63645424j41058062J14913607l84858533J81178156m744014j58029360K56037627
17059B7084845k70078435K65864262q8302109J75428523J55856181r1373813j65575764
17052H903690M3921477M2031254j09779491j92982639J95187814n5151334J32209247
17045F4340018p0150653J10162478P8875403j63693070K91681928J64566740l45441968
17038A30340876o9623073k399161l05620299K12530256J12917783J4373154j20802912
17031b8283376K89493340k15263054j61057813K51610386o1240916J95959083k09605685
17024F1611965M9255868l9669098p2477155M6180792J393078j1977661J25697885K0870560
17016A80886234j35934549M1672309M8340305K4348504n1986322J63003535j03422557
$$ plain form
17066 163645424 22587362 137500969 -247357564 -66179408 -70923422 -228952782 27084845
17059 27084845 -242993590 22870672 -65431437 109997086 265853267 174479454 8903690
17052 8903690 52825167 94856421 -14923070 -207905709 -12717895 -67869229 64340018
17045 64340018 -5810635 104351843 183227246 19534176 311216104 475782844 130340876
17038 130340876 60717803 58318642 -247301657 -34771401 78146382 92519536 -28283376
17031 -28283376 261209964 45946910 -115110903 136499483 75258567 271217650 61611965
17024 61611965 110867833 71198735 -1278420 44902372 46295450 34317789 160015674 180886234
17016 180886234 44951685 86623994 134964299 159312803 107326481 270330016 166907459
17009A66907459j37613297K54353883l00814112K39130309j91316893n4686658L2827637
17002H788328J07067728P0689529j75541439M5507528K85366310m80394294L53929519
16995B15413209k38438433O4766301k15209177K39071021N641628o2877424k12069491
16988b03702366K51679848K28470347k98295362n526262l25344236L80609834k48143559
16981b20251756K12314775J94445698l25102681M2753946J21503883J48821852j27345273
16974D7140444j96960224R997868J71697594k34513401k1489389N4831229M9332243
16967a19963636J87974677j26344148m4618973K73983948k08845265k4375575L02768797
16960B40579825o1082500j41372295J984934j25853550L33226848k38877875o5413958
$$ plain form
17009 166907459 29294162 283648045 -17166067 221964242 30647349 -24039309 8788328
17002 8788328 115856056 186545585 11004146 56511674 341877984 -138516310 215413209
16995 215413209 -23025224 41741077 -173468100 65602921 71244549 8367125 -203702366
16988 -203702366 47977482 276447829 -21847533 -27373795 -352718031 27891803 -220251756
16981 -220251756 -7936981 186508717 -138593964 -95840018 25663865 174485717 47140444
16974 47140444 -149819780 -139821912 31875682 -202637719 -224127108 -169295879 -119963636
16967 -119963636 68011041 -58333107 -102952080 171031868 -37813397 -62188972 240579825
16960 240579825 179497325 38125030 40109964 -85743586 247483262 8605387 -56808571
16953e6808571q9938707K94168968n5029542K6159287J65569759o2309517q7371526
16946A34440151m6584837O4681953j89357244L42552752l27245051J4815755J26514739
16939A19818218j47982180k1268334J94870793Q604912k26359105J63017343j05986671
16932a5285024j717630k1134676R8774294J06804084j80604341J52531850l50789002
16925b11420445K11451543J72182716j64730835J29785223M3596453l45467070Q5982631
16918g8619784P4472539P7550484J46956026j64219096J81098463k6048893q7481253
16911A23708486j48044518O3789922r5859437N9145933o4520329J16856469k41290263
16904a86213737m3942215L71820566o537502n338384o8924211q8823996N7102508
$$ plain form
16953 -56808571 -146747278 147421690 92392148 118551435 284121194 221811677 134440151
16946 134440151 87855314 152537267 -36819977 305732775 -21512276 -6696521 119818218
16939 119818218 -28163962 -49432296 145438497 154043409 -72315696 90701647 -15285024
16932 -15285024 -17002654 -38137330 60636964 167441048 -13163293 139368557 -211420445
16925 -211420445 31098 172213814 7482979 137268202 180864655 -164602415 -78619784
16918 -78619784 -4147245 73403239 220359265 56140169 237238632 211189739 123708486
16911 123708486 -24336032 39453890 -56405547 2740386 -61779943 55076526 -186213737
16904 -186213737 -230155952 141664614 135127112 129788728 60864517 -27959479 29143029
16897B9143029j08767137k57959867J04553858K26571780j35232131j1009577M96769414
16890C44069369k12942281j18612138K1869120L86362105m13788522L89040850j68767959
16883B27230544j77464119k1973442j91285752M12434631J76576105k60739606l984816
16876A60793545N4896623K07530077m63047644J74022655p6859373J32414816j46335064
16869D3415635J54374357l32819114N0701933j03742800J51934288K43006248j57460368
16862D9410179j68840742K21805426J18753133k33889023J09761619o4104046l7980440
16855e083894J01128586J31730830J07965120j29739365N9394613M6830232J21448760
16848D33674882O12792656l30454232l88591635R1963523l65223408K07215496j17658099
$$ plain form
16897 29143029 -79624108 -337583975 -233030117 -6458337 -141690468 -152700045 344069369
16890 344069369 131127088 12514950 34384070 420746175 6957653 395998503 227230544
16883 227230544 49766425 27792983 -163492769 248941862 425517967 164778361 160793545
16876 160793545 215690168 423220245 -39827399 134195256 57335883 189750699 43415635
16869 43415635 197789992 -135029122 -84327189 -188069989 -36135701 206870547 49410179
16862 49410179 -119430563 102374863 221127996 -12761027 97000592 32896546 -5083894
16855 -5083894 96044692 227775522 335740642 206001277 265395890 312226122 433674882
16848 433674882 1046467538 716013306 327421671 419385194 54161786 261377282 143719183
16841A43719183P505176J31218926L1171175J23911468k34295166L42284904J82539229
16834G28054895o6949572L32785675O30113936J141013942M52843204K31452249J79554326
16827f66098641K55215277J81548574N3977501P7111376o0852620J61657059m7943241
16820d5384715J78502671k59722598m09621393K02537396q42118056M45400314O01488976
16813a28917405J04494676J94770802J3065385j68090670p8853786J75442896k16173435
16806a04261537J25815324j70066271M248747M66519877l02383642n4293813J66692083
16799A32270768p9092494K2106353j17632377J0684582m7075604J20382765p0824610
16792b9180617L13707143k93395039K53845988L59041217J76598628n46150982m14915731
$$ plain form
16841 143719183 151224359 282443285 313614460 437525928 203230762 545515666 728054895
16834 728054895 661105323 993890998 1624004934 2765018876 3217862080 3449314329 3628868655
16827 -666098641 -410883364 -229334790 -175357289 -98245913 -159098533 2558526 -45384715
16820 -45384715 133117956 -126604642 -536226035 -333688639 -1175806695 -730406381 -128917405
16813 -128917405 -24422729 170348073 183413458 15322788 -63530998 111911898 -104261537
16806 -104261537 21553787 -148512484 -144263737 322256140 19872498 -34421315 132270768
16799 132270768 53178274 75284627 -42347750 -31663168 -78738772 41643993 -29180617
16792 -29180617 284526526 -8868513 244977475 604018692 780617320 234466338 -180449393
16785a80449393K46807103o17748311K94304313J32282009J57247939J2628117K82294076
16778C27365853j07720431n2654310J35344578M3940367J81438960M77164979J805478729
16771a484608571M00564342K25628239N5244846L01775663O4528209L50918857j51935810
16764b37884225j74326020J30082037j06222607j66736942L19042006j67890877O8985710
16757c34950918m43852123j98898608P13439671J29287881n9573526j39820282K49928114
16750h4439791j40427981J4135460J4901676K53856037l480985J93780274k95985725
16743d7661035Q9666319p3751757o392804j27181625p16451Q684677J37000638N4198813
16735C3846775k2093367p7392925L2677747M42870031n73727540P9515180J26184470
$$ plain form
16785 -180449393 66357710 -551390601 -257086288 -124804279 32443660 45071777 327365853
16778 327365853 219645422 166991112 302335690 346276057 527715017 1004879996 2810358725
16771 -1484608571 -1084044229 -858415990 -803171144 -501395481 -436867272 -85948415 -237884225
16764 -237884225 -412210245 -282128208 -388350815 -555087757 -236045751 -403936628 -334950918
16757 -334950918 -778803041 -977701649 -264261978 -134974097 -194547623 -334367905 -84439791
16750 -84439791 -224867772 -210732312 -195830636 58025401 54544416 248324690 -47661035
16743 -47661035 42005284 -31746473 -38139277 -165320902 -166037353 -157352676 -20352038 33846775
16735 33846775 11753408 -65639517 -32961770 409908261 -163819279 -84304099 41880371
16728D1880371k41003731o2159877K00094431k50253305L7444394J73362046K77295274
16721A76659603j04686009j10542454p6343266K01760569M4162280j67329625r3930789
16714a30249691J35700827r6538675J97188356k72804265J4182211Q3337045N7972866
16707a1211326n5070825J46026041j44222373k2463018L48941361l70088122J61583214
16700E3494952j56546153j19329297J55574755J10694800j54086669j70655661L52555777
16693G1702504R3468005k46966877K50269244j29983792M0176619p8327711j80800903
16686a80462911Q8628973m2709478J27946665n6138421K94807168p6406024k80677518
16679a25011546J52349894K90683684j19859484k06796252M5310951p7348912M1465968
$$ plain form
16728 41880371 -199123360 -261283237 -61188806 -311442111 -273997717 -100635671 176659603
16721 176659603 71973594 -38568860 -114912126 86848443 131010723 -36318902 -130249691
16714 -130249691 5451136 -91087539 106100817 -166703448 -152521237 -69184192 -11211326
16707 -11211326 -66282151 79743890 -64478483 -86941501 261999860 -108088262 53494952
16700 53494952 -103051201 -222380498 -66805743 43889057 -110197612 -280853273 71702504
16693 71702504 165170509 -81796368 168472876 38489084 78665703 337992 -180462911
16686 -180462911 -91833938 -134543416 -6596751 -62735172 232071996 155665972 -125011546
16679 -125011546 27338348 318022032 198162548 -8633704 36677247 -40671665 794303
16672G94303j62250986J94115913j87486024K06399204k39107700R4468452N4450103
16665c8616735k688768m5230573J02850447Q7646212k73682226j04726834L4735532
16658b39712945J72570600K24828558k96959049n0254072j6496779K04749360r1766780
16651i3041107j1475879K81105363j99750229N7745829l3154278j12784410J24815874
16644A3461163M5753487J728721O2089471n57939638K93836163P9214479K22388382
16637A60532228j87044959Q1526451L1419987J28489601k84213040J29628431l2440305
16630B7898394J95229124n00780327K11983476j62281503J26020762J72873694j43413830
16623g2470210K77861436k79599937q4291970L06362110O7075086k14052214J39049570
$$ plain form
16672 794303 -161456683 32659230 -154826794 51572410 -187535290 -93066838 -38616735
16665 -38616735 -41305503 -86536076 16314371 103960583 -169721643 -274448477 -239712945
16658 -239712945 -67142345 157686213 -139272836 -189526908 -206023687 -1274327 -93041107
16651 -93041107 -104516986 176588377 -23161852 34583977 1429699 -111354711 13461163
16644 13461163 59214650 60943371 123032842 -434906796 -141070633 -61856154 160532228
16637 160532228 -26512731 55013720 86433707 214923308 -69289732 60338699 27898394
16630 27898394 223127518 -277652809 -65669333 -227950836 -101930074 70943620 -72470210
16623 -72470210 205391226 -74208711 -158500681 147861429 214936515 884301 139933871
16616A39933871K4433922k82136980L17120681l55984690J31861531l6907028J64280409
16609A02601716j13221047o8425151j33025054J64554489P9378420K2264751K45305994
16602B99434118k59537272k57462189Q0383081J58566732q9582115j66818161N3748586
16595a81267220P9176367o1753577L5573933k83733609L86245328K6345331k7156063
16588b6569510n692449L0792319O648086o3737091L3179671n1743440p0256893J02049791
16580d5329516k9258034j37084842J53133290m7110921J74250269k7535239q6135645
16573d5070638k131722M2973544J84607273j87993929J65091873q8154433k58971410
16566a89649442M1564197Q5046141r0809527K23850702Q5678474J30319668k56114191
$$ plain form
16616 139933871 164367793 -117769187 199351494 -156633196 -24771665 -61678693 102601716
16609 102601716 -10619331 -79044482 -212069536 -47515047 31863373 54128124 299434118
16602 299434118 39896846 -217565343 -137182262 21384470 -68197645 -235015806 -181267220
16595 -181267220 -102090853 -163844430 -128270497 -412004106 -25758778 586553 -26569510
16588 -26569510 -32261959 -1469640 5178446 -58558645 -25378974 -77122414 -147379307 -45329516
16580 -45329516 -74587550 -211672392 -58539102 -105650023 68600246 41065007 -45070638
16573 -45070638 -47202360 -4228816 180378457 -7615472 157476401 69321968 -189649442
16566 -189649442 -148085245 -63039104 -153848631 70002071 155680545 286000213 29886022
16559B9886022K7723598l4274458N494872l2263004J48667689J00362152j64195311
16552H1401560m6436573j85895380J11365164l0351717J35152559K05334343k49898824
16545B0671132q1552228L8817470P9797489M3370573n1664550p7675822K48106296
16538B19870360j11459328j78811956O5937069J8335505k95492638K74287364K28218828
16531B20885204k86122272M6190033j47232233J39759022O5062001J29107076r7246877
16524G0401954k6981663K60077245l48860220p6934885R0130742j27283439k4070056
16517a83520322K07118742j47368727J4251378J56363674o8789474L451882J11531441
16510I3038594k56236296K38247321R7456124j58019594j39203827j1451654Q8695585
$$ plain form
16559 29886022 57609620 23335162 28830034 -3432970 145234719 245596871 81401560
16552 81401560 34964987 -150930393 -39565229 -69916946 65235613 270569956 20671132
16545 20671132 -60881096 -22063626 57733863 101104436 49439886 -28235936 219870360
16538 219870360 108411032 -70400924 -4463855 13871650 -281620988 -7333624 220885204
16531 220885204 -65237068 -19047035 -166279268 -26520246 38541755 167648831 70401954
16524 70401954 43420291 303497536 -45362684 -122297569 -32166827 -159450266 -183520322
16517 -183520322 23598420 -123770307 -109518929 46844745 -21944729 -18492847 93038594
16510 93038594 -163197702 75049619 172505743 14486149 -124717678 -136169332 -47473747
16503d7473747N9191744j18580888K06403165j11923977j229460O4722184j03274681
16496e2165660L82745602k56047578R7875603r1972592L52352593L00483645n21976816
16489B11294797j42919192K84052214l31691238J94677513j9952450l0342828m8469011
16482A16649805j5858624k4689347K47720856j04785671J27966210J92178611N46292975
16475A085474815j555434382k43801472K87392112M7924520k0135896L58648898k16784479
16468b56715884m82189l8223593K66724853j00516333J19697601l5041325N358107
16461c9198763K8346694l44497400m01042273O43167167J279406L349460J28633868
16454B0038159k32044432k7003093L24963017J4024144J5615068j18166667J61970911
$$ plain form
16503 -47473747 11717997 -106862891 99540274 -12383703 -13613163 51109021 -52165660
16496 -52165660 330579942 74532364 172407967 80435375 432787968 733271613 211294797
16489 211294797 68375605 352427819 20736581 215414094 195461644 165118816 116649805
16482 116649805 100791181 76101834 323822690 219037019 347003229 539181840 1085474815
16475 1085474815 -469959567 -713761039 -426368927 -378444407 -398580303 -39931405 -256715884
16468 -256715884 -257198073 -295421666 -28696813 -129213146 -9515545 -44556870 -39198763
16461 -39198763 -10852069 -355349469 -756391742 -113224575 -111945169 -108595709 20038159
16454 20038159 -212006273 -239009366 85953651 99977795 115592863 -2573804 159397107
16447A59397107k06265212L1657195j20022079J07986282l9647986L36508156j51004954
16440A18608509l03483925R3144466j3614539J13267794o705225k7179350n9439886
16433h5402156K18336194l58513521J40798775L2229028Q846165j5127861j78570804
16426b37404180Q4480230j99529194L40269645l4813092k65368230K65116342j38062232
16419a85310711K31249402N518622l31590246J6406558K70290361j158119l8767804
16412c3361937j84059305K24910277k22876425J21791086j31102703Q8261836L2458759
16405a03978412M3453168j26397253J49656963l9133891N77314q9086448J25557320
16398c9351239l6260356P9374062M8945278k68853110J65029359k06571646O7465757
$$ plain form
16447 159397107 -46868105 -15210910 -135232989 -27246707 -66894693 269613463 118608509
16440 118608509 -184875416 -91730950 -105345489 7922305 1217080 -25962270 -85402156
16433 -85402156 132934038 -225579483 -84780708 -52551680 -43705515 -58833376 -237404180
16426 -237404180 -152923950 -352453144 -12183499 -46996591 -312364821 -47248479 -185310711
16419 -185310711 45938691 51457313 -280132933 -263726375 6563986 5405867 -33361937
16412 -33361937 -217421242 7489035 -215387390 -93596304 -224699007 -136437171 -103978412
16405 -103978412 -60525244 -186922497 -37265534 -76399425 -75822111 -164908559 -39351239
16398 -39351239 -75611595 3762467 52707745 -216145365 -51116006 -257687652 -190221895
16391a90221895Q6523366P8629630j16333290J20956000n0680643m1317829N8881700
16384e3562961m8957595K37533511l29727573K84837044j3917517m52765356Q4504449
16377b92055998J59163912K05132843j20973945J44188268j44745431O6329244K5139977
16370D2178870q3273471m6815433J3433012j33817199K04104995K7039532k35988539
16363b13138233O7969956j60575122L70499453K7039813q264093N1624629l46949486
16356b11793083R0892056K626685L38729J53827554j80862117J55899617O6152907
16349G7082348k05280996Q8964185k9890130K70271732l11339990Q5352348j35661002
16342a60501505j165307j13392755M48818761k2226655k62497494J93905743m5589005
$$ plain form
16391 -190221895 -103698529 -25068899 -141402189 -20446189 -71126832 -112444661 -53562961
16384 -53562961 -102520556 135012955 -194714618 90122426 76204909 -376560447 -292055998
16377 -292055998 -132892086 72240757 -48733188 95455080 -49290351 17038893 42178870
16370 42178870 -41094601 -87910034 -74477022 -208294221 -4189226 22850306 -213138233
16363 -213138233 -145168277 -305743399 64756054 91795867 83531774 135156403 -211793083
16356 -211793083 -120901027 -118274342 -117935613 35891941 -144970176 10929441 77082348
16349 77082348 -128198648 -39234463 -69124593 201147139 -110192851 -24840503 -160501505
16342 -160501505 -161666812 -275059567 173759194 151532539 -110964955 82940788 37351783
16335C7351783r6180140K70452290k26117135r7995012r9235556Q9302765L28534104
16328B06113099k27789832K06297302m12144831K45282310K8406647m5155352p2368591
16321g1359248J5837090k8010587Q0187370J30365693n0329999j23343020o3495230
16314a10147931K66394825j77114538j41920098l0674700M616549R2297065j7582204
16307a14131032K2376105m6053264J78600876k27060079K69025231k2846390o8300130
16300h388683j22922345J03248414o0675891J74876702j13375529M3338362l7234150
16293b1133120l923850j60849477L68042548q6342138M094727j23490101J97705463
16286A74104052j84262501J02921940j64987938Q825611J22860419K1075495o2191760
$$ plain form
16335 37351783 -58828357 211623933 -14493202 -112488214 -211723770 -122421005 206113099
16328 206113099 -21676733 184620569 -227524262 17758048 46164695 1009343 -71359248
16321 -71359248 -55522158 -83532745 -3345375 127020318 76690319 -46652701 -110147931
16314 -110147931 156246894 -20867644 -162787742 -193462442 -188845893 -96548828 -114131032
16307 -114131032 -91754927 -137808191 40792685 -186267394 82757837 59911447 -8388683
16300 -8388683 -131311028 -28062614 -88738505 86138197 -27237332 16101030 -21133120
16293 -21133120 -25056970 -185906447 182136101 95793963 99888690 -23601411 174104052
16286 174104052 -10158449 92763491 -72224447 -63398836 59461583 80537078 18345318
16279A8345318n406077J01525333j31569633K5882042J5281073M9470581n265534J629096
16271F9892199r829970m1864132j75451684K54543654j29331752q1177564M4339224
16264f8880025K32094608k32515698K44310942j49641315l1455228K2395267n4321935
16257c8013384m0227470J82219127j26544243k0301650L37235504n44705877K32815016
16250a7522977j40128111K80785116P7787836k04769564j59777028J26973448r8466612
16243a35117892N8287283j32749478J38153380O374821N2090997J25760297k89464825
16236a76665417k2142321J58401300L2292875J48030566l27444707J13183268J05233291
16229C0888855j52197996q4778735Q4810655J10869474J34742506k33343818j62510558
$$ plain form
16279 18345318 12939241 114464574 -17105059 8776983 24058056 73528637 68263103 69892199
16271 69892199 60062229 18198097 -157253587 97290067 -32041685 -113219249 -68880025
16264 -68880025 163214583 -69301115 175009827 25368512 -6086716 16308551 -38013384
16257 -38013384 -78240854 103978273 -22565970 -42867620 294367884 -250337993 -17522977
16250 -17522977 -157651088 123134028 200921864 -3847700 -163624728 -36651280 -135117892
16243 -135117892 -76830609 -209580087 -71426707 -65051886 -12960889 112799408 -176665417
16236 -176665417 -198807738 -40406438 -8113563 139917003 -187527704 -74344436 30888855
16229 30888855 -121309141 -206087876 -121277221 -10407747 124334759 -109009059 -271519617
16222b71519617R8282007K83537494n0839252l666597n088644N8448660q7239703P1498792
16214I3413140l28096988K36958626p4312117J66891937j44782219O7648869k09940142
16207a92218894J14485289O8980286J49274796m40846557L82656177j93267293k41728219
16200c52664415K20343936k71242K6855409J48497745J31036265k88390733O0107611
16193e4485424j56080274J23920442J26383297N9739690j69213721J7546909R7972044
16186D5782963J6199540j80476635J58421412m1091585O4872874J15326922j23600949
16179E5434542j32120279k9142007J38811981l3566141P8966916m7725169j65145777
16172a34485934J8617510R292790l7430757q8818330K62530884j99721235K42752703
$$ plain form
16222 -271519617 -173237610 110299884 59460632 55794035 50705391 109154051 21914348 93413140
16214 93413140 -234683848 2274778 -72037339 94854598 -49927621 17721248 -192218894
16207 -192218894 -77733605 -8753319 140521477 -300325080 82331097 -110936196 -352664415
16200 -352664415 -132320479 -132591721 -105736312 42761433 173797698 -114593035 -54485424
16193 -54485424 -210565698 -86645256 39738041 99477731 -69735990 -52189081 45782963
16186 45782963 61982503 -118494132 39927280 -1164305 63708569 179035491 55434542
16179 55434542 -76685737 -105827744 32984237 -581904 78385012 30659843 -134485934
16172 -134485934 -115868424 -106575634 -144006391 -232824721 29706163 -170015072 72737631
16165G2737631o2888709j33554605L5963989K28387113l14834141r6400591K89332375
16158A8743062q6784667k02398596K36317681j6902786m8505767J20557971J428749
16151B2455647j7210863J25763979k52366511j1293757K26129636k52240011k141686
16144a60903566K85823558m3258430j3772485j17370156P5478223r4153235K04473573
16137A36317482n1726368j95946813J53569333m4109293n3398066J01758166k9984767
16130A6479674O7362447q754385r203382j45162014J00957166j13861198J15441609
16123B3259917L5216022l04110061K30144174M5255166j11517413J8533984K39145567
16116A75927356k53009802Q30739j33616773M7452044K63652910J24618300j99579538
$$ plain form
16165 72737631 9848922 -123705683 -87741694 140645419 -174188722 -270589313 18743062
16158 18743062 -68041605 -270440201 -34122520 -51025306 -99531073 21026898 22455647
16151 22455647 5244784 131008763 -121357748 -132651505 93478131 -158761880 -160903566
16144 -160903566 124919992 81661562 67889077 -49481079 25997144 -68156091 136317482
16137 136317482 84591114 -111355699 42213634 -1895659 -55293725 46464441 16479674
16130 16479674 83842121 75087736 65884354 -79277660 21679506 -92181692 23259917
16123 23259917 58475939 -245634122 -15489948 29765218 -81752195 -63218211 175927356
16116 175927356 -77082446 -76251707 -209868480 -162416436 101236474 225854774 26275236
16109B6275236n0274771J52713334k27886560P2364414K19984531q2139471j69696760
16102e8660047J93105092j56254212n646409O8294767L2047841N5138709m5009342
16095H3016399o5403715k10930881J59355813j56440781N4667177R0637204K49528306
16088B04429522m63103301L12419512k66180233J35364943J1572476R0571496J08784411
16081A33858826o9633695l84222205K29102215J33497721j42014235J71719665j36779309
16074f4471017K0622367J06908476j72680942n8016073l3812648K24912974j10606633
16067h7143496J88159146j61399478K87190708j78542659p1540987K01054452m66565294
16060b88787608J95098955l2278106K33872876m2724899j66822209M0472019J01691717
$$ plain form
16109 26275236 -23999535 128713799 -99172761 -26808347 193176184 111036713 -58660047
16102 -58660047 134445045 -21809167 -27455576 40839191 72887032 128025741 83016399
16095 83016399 17612684 -193318197 -33962384 -190403165 -135735988 -45098784 204429522
16088 204429522 -258673779 53745733 -212434500 -77069557 -65497081 25074415 133858826
16081 133858826 64225131 -319997074 -90894859 42602862 -99411373 72308292 -64471017
16074 -64471017 -43848650 63059826 -109621116 -167637189 -201449837 23463137 -87143496
16067 -87143496 101015650 -60383828 226806880 48264221 -23276766 177777686 -288787608
16060 -288787608 -93688653 -125966759 107906117 65181218 -101640991 -61168972 40522745
16053D0522745O965509k04207975K77136321J4052777m25889645K78938248k52527326
16046b65009346K07883559j0600980r6376400K68288553l4805955j85317732j29235613
16039b45173914P2838670K98002954j90292948n9702912N4875694q079711j98883702
16032b76415869L35924891O6544661k44004343R0850728j50699080K65040571j21815781
16025c4574222k24862533K51774137J70356650q9935221l39512448J84427534J65071900
16018H2745797k15782114P8832740K524908J87869165j70164046k4558740j16727600
16011a75259890M04510517m30971321j4720317K40369523l5496039j17123644K24603551
16004I5912380l67039935K24254422q5329972q852218K95106801j66263331N1612451
$$ plain form
16053 40522745 47488254 -156719721 120416600 134469377 -291420268 -12482020 -265009346
16046 -265009346 -57125787 -67726767 -164103167 104185386 69379431 -115938301 -245173914
16039 -245173914 -172335244 125667710 -64625238 -124328150 -69452456 -77532167 -276415869
16032 -276415869 59509022 126053683 -117950660 -27099932 -177799012 87241559 -34574222
16025 -34574222 -259436755 -7662618 162694032 72758811 -266753637 -82326103 82745797
16018 82745797 -133036317 -54203577 -51678669 136190496 -33973550 -58532290 -175259890
16011 -175259890 229250627 -201720694 -216441011 23928512 -11567527 -128691171 95912380
16004 95912380 -271127555 -46873133 -132203105 -141055323 154051478 -12211853 39400598
15997C9400598k21411303K42075591p4912748m31570k12558320J20552762J5504492
15990i1780498J24291538p8657965K1619969P5007489j6723100j64407668J43823317
15983A3173082p3445395m9557324k2673380m8232247J68577452p439442R1927173O7684587
15975A40014506j22429193M5798075J28107287j87150860J66564101l60547228J60620313
15968b9022999q183699J13393058k07891688O4659617J20536077R0819547k37337321
15961i3027408j06786596M5201709J41177878J95686881k12234133n1057638P0347587
15954a0691720o2224449J5212208J9910338k8597403J72804220j69198201P0154382
15947G369375n0065115m6169570R3574326J23301525n2859275J86334476m23184220
$$ plain form
15997 39400598 -182010705 60064886 -14847862 -15279432 -227837752 -107284990 -91780498
15990 -91780498 32511040 -46146925 -24526956 50480533 33757433 -130650235 13173082
15983 13173082 -60272313 -109829637 -132503017 -180735264 -12157812 -19597254 72329919 140014506
15975 140014506 17585313 63383388 191490675 4339815 170903916 -189643312 -29022999
15968 -29022999 -37206698 76186360 -131705328 -67045711 53490366 144309913 -93027408
15961 -93027408 -199814004 -154612295 -13434417 182252464 -29981669 -81039307 -10691720
15954 -10691720 -72916169 -57703961 -37793623 -66391026 106413194 -62785007 7369375
15947 7369375 -42695740 -88865310 4709016 128010541 75151266 261485742 -161698478
15940a61698478K48825980o7773779J38527853k27123787J10701832J06626901r1688525
15933E6397997j28568784J457902K42001565j34944834j27320519J0006668J66884202
15926H5914197j4341919K486138l9511542q7267264O9583951N5758844l8526900r273694
15918B4821811j01886107R7766990j30641649m495746k7440540J26791745m259782
15911a9343278J0126643J00115731j78967411J62923538L097848n0618285J01982356
15904A29317142m2243647L9683430M3383276j32225201j54643755P7010514K8482948
15897a1235293Q4480319l2603406Q0352082r080188j29436015J361437K01946902
15890A85785838j08524673K07295283j83838316j46485856J18671322N063283j42505069
$$ plain form
15940 -161698478 87127502 19353723 157881576 -69242211 41459621 148086522 56397997
15933 56397997 -72170787 -70712885 171288680 36343846 -90976673 -80970005 85914197
15926 85914197 71572278 74058416 34546874 -52720390 16863561 72622405 34095505 24821811
15918 24821811 -77064296 20702694 -109938955 -114434701 -141875241 -15083496 -19343278
15911 -19343278 -9216635 90899096 -88068315 74855223 77953071 27334786 129317142
15904 129317142 87073495 126756925 170140201 37915000 -116728755 -39718241 -11235293
15897 -11235293 73245026 40641620 120993702 111913514 -17522501 -16161064 185785838
15890 185785838 77261165 284556448 100718132 -45767724 72903598 77966881 -64538188
15883f4538188L6055579O5096736K85976923k82270869N5027538o6726885j05275987
15876g6655153J77590541p097266j88581202K18208609k65942300M3399257J77612438
15869G8534924k16374698j10350118J94536102J48165349k05583973K78399865r2165194
15862G5162257k01126889L21151050m05900725K1121835K33488617j99528736J68666167
15855A3033576o5682101l4214288J35434610J04317686j01279204R3910492j05703309
15848C9817462R1610920l45560816o2254896J70673962O1653480P3399416J60722517
15841A90062045k6337826n0825667J64593874k05566666J5708444P0760183n8020959
15834A00373428k89889425J94084725M5526849k8542979M833860J22021083r4381936
$$ plain form
15883 -64538188 -28482609 36614127 322591050 40320181 95347719 28620834 -76655153
15876 -76655153 100935388 93838122 -94743080 123465529 -142476771 -99077514 78534924
15869 78534924 -137839774 -248189892 -53653790 94511559 -111072414 167327451 75162257
15862 75162257 -125964632 195186418 -210714307 -189592472 43896145 -155632591 13033576
15855 13033576 -52648525 -86862813 48571797 152889483 51610279 145520771 39817462
15848 39817462 131428382 -214132434 -276387330 -105713368 -44059888 29339528 190062045
15841 190062045 163724219 112898552 277492426 71925760 87634204 158394387 100373428
15834 100373428 -189515997 4568728 50095577 21552598 26386458 148407541 54025605
15827E4025605p684117Q8906250l11724067K91033353k00999119Q4678649p5925464
15820g7688910n4784170j9286053Q0430821L46675555l22431816L3098499q9030407
15813a03016481J18962241m435021r5048217n7445497n2391028L05788113o949376
15806A05464734m47074026L43219871j52279119J97516886j51897858j4214223m9116202
15799a68379937L9149325J14221291j07107906K67534512k87130771J34200134l5117882
15792d2631234J9129609k43463979K18788965m3815739J93163242q4385901j3226683
15785C558280j07280730J14372862M3437963N5351020k37213988J37680853L53127463
15778C63033723m50960811J30767773r2546969K1203387J33554153Q8958114j00351576
$$ plain form
15827 54025605 46341488 135247738 -176476329 114557024 -86442095 -1763446 -77688910
15820 -77688910 -132473080 -151759133 -71328312 275347243 -47084573 -13986074 -103016481
15813 -103016481 15945760 11510739 -83537478 -140982975 -193374003 112414110 105464734
15806 105464734 -341609292 1610579 -150668540 46848346 -105049512 -119263735 -168379937
15799 -168379937 -129230612 -15009321 -122117227 145417285 -141713486 -7513352 -42631234
15792 -42631234 -23501625 -266965604 -48176639 -91992378 101170864 16784963 3558280
15785 3558280 -103722450 10650412 54088375 109439395 -127774593 9906260 363033723
15778 363033723 -87927088 42840685 -49706284 -28502897 105051256 194009370 93657794
15771I3657794N4589690k49140682n2422487K24010775m3373283j47456105K97432983
15764A77298685j86431481J44973788n4901679j94892153j55833033L56767879j26635251
15757c9653245o3060685K40725765k21927724j83042498L83834119j10540167J57887672
15750A64223237N4088349m10115371J62039837N3945312K29877512l30684194J26811443
15743E0186125L3374787j38820257K4641491j00809058J26252674k4956370L7741739
15736G611131K14458474j76060418k85399071K22918427J15275617K41444514m48679174
15729a08430500p4391499K68213841l82258019K24497496N8876854L4897252j38501212
15722a17095787j59698583K12366214J8631082L4319880N5376317j80228443J08374647
$$ plain form
15771 93657794 148247484 -100893198 -153315685 70695090 27321807 -120134298 177298685
15764 177298685 -9132796 135840992 80939313 -113952840 -269785873 86982006 -39653245
15757 -39653245 -102713930 138011835 -83915889 -266958387 116875732 6335565 164223237
15750 164223237 218311586 -191803785 -29763948 24181364 254058876 -76625318 50186125
15743 50186125 83560912 -55259345 -30617854 -131426912 -5174238 -30130608 7611131
15736 7611131 222069605 46009187 -239389884 -16471457 98804160 340248674 -108430500
15729 -108430500 -182821999 85391842 -296866177 -72368681 -13491827 21405425 -117095787
15722 -117095787 -276794370 -64428156 -45797074 -11477194 43899123 -136329320 -27954673
15715b7954673l45073469R9586677M8073836L30119487j21827973m4279385m9021476
15708a10376976N858124L1750865P8444326p4987449N4456071J62589108l67407675
15701b19673606K48880275r8299352n288837O7654404K74975604l35676084j63946911
15694b31374507L86719750j58866541l6105792O9005690J07358166n8647755q2049695
15687c960684q4880919l1941592N6693553J9963817n7200976j21356393K8073658P9846375
15679a14763161J79541980K9099327j94590256J7594744K1031707N0098446k67213283
15672b79200496J59826798J80658023j00944085j75176180K7020400K08416092P0419005
15665I1019557L23237614m11201734l4837233k60507005R0956899O6102941K86402909
$$ plain form
15715 -27954673 -373028142 -273441465 -225367629 104751858 -17076115 -61355500 -110376976
15708 -110376976 -104518852 -72767987 5676339 -69311110 -14855039 147734069 -219673606
15701 -219673606 29206669 -69092683 -74381520 -6727116 268248488 -67427596 -231374507
15694 -231374507 155345243 -3521298 -39627090 29378600 136736766 78089011 -3960684
15687 -3960684 -88841603 -120783195 -64089642 -44125825 -101326801 -222683194 -194609536 -114763161
15679 -114763161 64778819 93878146 -100712110 -83117366 -62085659 -11987213 -279200496
15672 -279200496 -119373698 61284325 -39659760 -214835940 -187815540 20600552 91019557
15665 91019557 414257171 3055437 -31781796 -292288801 -201331902 -135228961 151173948
15658A51173948k64279359L43512725q3190326K6226696k33555526J69674282k38806566
15651a29244126K84339147j20711793Q5504750j90434619j51591239J00312053P6871594
15644d4954233N144697J59082318O7473162l0068307j00005757L7819680p7039066
15637A7452494l1323414J15798613j09558324k90944114J13198347P9560937k9448946
15630a35264407J28963805p6131988K19626907q9425645j04122002J28012316N2318158
15623A23977144j93921354j65960061R6097909M7755996m6220028K6019199N7287330
15616e4963865j3232505k775064K0960245P3068265p256217j66502886J5964581J51561504
15608A6824058j47270200k31035227L84022530m6661087N4084927r6657249Q4662556
$$ plain form
15658 151173948 -113105411 230407314 147216988 173443684 -60111842 109562440 -129244126
15651 -129244126 155095021 34383228 119887978 -70546641 -222137880 -121825827 -44954233
15644 -44954233 -39809536 119272782 186745944 156677637 56671880 94491560 17452494
15637 17452494 -13870920 101927693 -7630631 -298574745 -185376398 -105815461 -135264407
15630 -135264407 -6300602 -82432590 137194317 47768672 -56353330 71658986 123977144
15623 123977144 -69944210 -235904271 -139806362 -92050366 -138270394 -112251195 -54963865
15616 -54963865 -68196370 -70971434 -50011189 23057076 15800859 -150702027 -134737446 16824058
15608 16824058 -130446142 -361481369 22541161 -24119926 29965001 -66692248 17970308
15601A7970308Q4720157K8015771k67584387J38422189N1444821j11337862j66342945
15594b24691948O1208593J74744709J65253198r8909225l16311239K23373950j82649419
15587a97981381Q1904901J63162823p6761309n9364886L8483980O5142287j02666999
15580h8080584J5132377O9611663O7998556q9540223j32907677q9529214J05208790
15573a42106312L9493509J00622347K00271238l10191669q5426048q5739052M17795134
15566A34719147J2997095l01956984J28075924o0207876q6218138P9559283J70112353
15559G7080804k37858472J95731332l6475074j9673478J43627706k94443313K13122041
15552D1111546R4556077n890250k74061008J9366983l4890991J42469203Q7447826
$$ plain form
15601 17970308 102690465 130706236 -136878151 1544038 52988859 -58349003 -224691948
15594 -224691948 -163483355 11261354 176514552 77605327 -238705912 -15331962 -197981381
15587 -197981381 -116076480 47086343 -29674966 -89039852 -50555872 14586415 -88080584
15580 -88080584 -72948207 -3336544 64662012 -24878211 -157785888 -247315102 -142106312
15573 -142106312 -102612803 -1990456 198280782 -111910887 -197336935 -283075987 134719147
15566 134719147 147716242 -154240742 -26164818 -86372694 -172590832 -93031549 77080804
15559 77080804 -160777668 34953664 -1521410 -21194888 122432818 -172010495 41111546
15552 41111546 135667623 129777373 -144283635 -124916652 -159807643 -17338440 70109386
15545G0109386o4955889j46220737K38913380j95466923K61002311l27159630M23466011
15538B59687909k33509665M8390567R4234534j83491114k4458288K6489076p9586519
15531i2243500L72503408k20673239R2888791j17000009P6478857o7677664l4625001
15524I651643J16161600j04517524J06525239l24470604O5925117l6073396J10747759
15517e6050166J96875333j04037565j10091272K7587346p8774058o4435622L2154901
15510a56771103J29554085j42368943K68884385j20511988L2610303j3875800j51896616
15503a54375677n7170799K21351030j95197049J78002713J41128142q7323109p1857875
15496b5442624J92182829j32368231j95694146K16301451R4225494j60851410J19504868
$$ plain form
15545 70109386 5153497 -141067240 97846140 -97620783 163381528 -163778102 259687909
15538 259687909 26178244 74568811 168803345 -14687769 -39146057 -12656981 -92243500
15531 -92243500 280259908 59586669 152475460 35475451 111954308 44276644 9651643
15524 9651643 125813243 21295719 127820958 -196649646 -130724529 -166797925 -56050166
15517 -56050166 140825167 36787602 -73303670 -45716324 -124490382 -188926004 -156771103
15510 -156771103 -27217018 -169585961 99298424 -21213564 11396739 -2479061 -154375677
15503 -154375677 -211546476 9804554 -185392495 -7389782 133738360 46415251 -25442624
15496 -25442624 166740205 34371974 -161322172 54979279 149204773 -11646637 107858231
15489A07858231j73344836j39393666K57502963l4042063J59039498k5008480j04596288
15482D8015359l5497310N6154212M236673j88290852R5263596J12502000j15488582
15475b3104904k0388286J5416224N3851924j63747629K60735913l6670422o2375599
15468B3717221N5624185j35376113o9537688J40407651M5296274j83290845K05266054
15461H2106739j68478345Q7263905j68157033k334173j01178289J72513976L014602
15454i5248618J60474638L9107338o7781904k42305430K36448564J9874348k34313209
15447a83744273K14239505r830427R9661894k2202953l08951734Q6855494K6306623
15440i7665871K88144499p8521393k12012288Q7263792L9010314o7452118L4994962
$$ plain form
15489 107858231 -65486605 -204880271 52622692 18580629 177620127 152611647 48015359
15482 48015359 12518049 68672261 72908934 -115381918 -20118322 92383678 -23104904
15475 -23104904 -43493190 -28076966 25774958 -137972671 122763242 86092820 23717221
15468 23717221 79341406 -56034707 -125572395 14835256 60131530 -123159315 82106739
15461 82106739 -86371606 892299 -167264734 -169598907 -270777196 -98263220 -95248618
15454 -95248618 65226020 104333358 36551454 -205753976 30694588 50568936 -183744273
15447 -183744273 30495232 20664805 120326699 98123746 -210827988 -123972494 -97665871
15440 -97665871 190478628 111957235 -100055053 -12791261 26219053 -41233065 -6238103
15433f238103Q9125298p585489j09831240J66100101k40128998k6752922q8156977
15426b23468330L48353506k47196448J55526427o1701320K57302611l20969914J49486048
15419E7332580j59373397J53317503j92214444L2465242K5650205J31395204k13212220
15412a64639327R5965744m8489789J79306089p351520j10847323J7201192M8526907
15405I671973J66524018k92230597J15102626K0394676j20517312K97155838r7927258
15398I8173964n9011360q4363373J46646331j57162661N1808830j3704193J97215742
15391A79603280k11948002L126756m5586977O7554069J12526101l21127655M08251566
15384A92399138j87766377j18643969k8376828P0440894Q8551799r5435394j50838180
$$ plain form
15433 -6238103 82887195 75301706 -34529534 131570567 -108558431 -135311353 -223468330
15426 -223468330 124885176 -122311272 33215155 -28486165 228816446 -92153468 57332580
15419 57332580 -102040817 51276686 -140937758 -108472516 -82822311 48572893 -164639327
15412 -164639327 -68673583 -117163372 62142717 54791197 -56056126 -38854934 9671973
15405 9671973 176195991 -116034606 -931980 19462696 -101054616 196101222 98173964
15398 98173964 39162604 -45200769 101445562 -55717099 -3908269 -17612462 179603280
15391 179603280 -32344722 -29217966 -74804943 -7250874 105275227 -215852428 192399138
15384 192399138 4632761 -114011208 -142388036 -71947142 16604657 -78830737 -229668917
15377b29668917L45859461k44643118Q0438891j0849880K52069695l79504927J50852183
15370c5446612n6354650J56643036M166088r1207280k33072006J94923843j91114020
15363b51461601Q2792411J63589694j28025277N6008245L2272964Q363563j7781586
15356e4241587M1757351R6090041k88072020K74100981j29266975M1295156j2029434
15349c0366487j5505611R0669435j21142333j04092246K88022289j63435576J82534745
15342A26684216L2233859j83728373k29979101K19623050L5988962J44310017j76675541
15335c1542911Q0271088K6831284j17337772O0853157j81340556J99858283r4618051
15328e7025478J40263951J87169531k99321534J54688826k58857975J82997824K60623594
$$ plain form
15377 -229668917 116190544 -128452574 -48013683 -58863563 193206132 -186298795 -35446612
15370 -35446612 -91801262 64841774 69007862 -22199418 -255271424 -60347581 -251461601
15363 -251461601 -168669190 -5079496 -133104773 -77096528 -44823564 -36460001 -54241587
15356 -54241587 -12484236 83605805 -204466215 69634766 -59632209 -18337053 -30366487
15349 -30366487 -45872098 44797337 -76344996 -180437242 107585047 -55850529 126684216
15342 126684216 158918075 -24810298 -254789399 -35166349 822613 145132630 -31542911
15335 -31542911 48728177 75559461 -41778311 19074846 -162265710 37592573 -57025478
15328 -57025478 83238473 270408004 -28913530 125775296 -133082679 49915145 310538739
15321C10538739k99011621n1113354J5117516K936096N0195796K2065066k08106M4011096
15313I4531228j3169702o697110J15019288k02224786k6884987j05829337M13797233
15306B68541827p21679196L42550723K51348334p1037022l1217455q5426788k7931895
15299g4851472L4593804K7654177J24673667j18375907q9279784j8145610J51293320
15292C7562195K32414604k76074436k76029056P15658954n91712915l7660939J35383403
15285f0458190N8790861J01005056j3907527O4428637j91477676J15067842k9505877
15278D3943126R4507013M6870615l04019248P9231271P5516113q4786141j03372238
15271a52109489J31465240J11202499J05594978m8435497n3225483k42164594J89656029
$$ plain form
15321 310538739 11527118 -39586236 -24468720 -21532624 28663172 50728238 50520132 94531228
15313 94531228 81361526 74664416 189683704 -12541082 -39426069 -145255406 268541827
15306 268541827 -453137369 -110586646 140761688 69724666 38507211 -46919577 -74851472
15299 -74851472 -40257668 -12603491 112070176 -6305731 -95585515 -113731125 37562195
15292 37562195 269976799 -6097637 -282126693 433532261 -158180654 -195841593 -60458190
15285 -60458190 -1667329 99337727 85430200 149858837 -41618839 73449003 43943126
15278 43943126 138450139 185320754 -118698494 -39467223 36048890 -48737251 -152109489
15271 -152109489 -20644249 90558250 196153228 147717731 94492248 -147672346 41983683
15264D1983683k70064930J41475531p3779733J24779052J1450974O8625345j45511655
15257a01041733r6998996L183409J02738527J52028711Q2937531j57228140k86474522
15250c00855213K83144346j70194672J03741039J16078430k6580407R1264090p5770539
15243B0827074p5160994p8493512L23310144j39211767J53288461J00967617j36827417
15236A68699606m64170644K47791314m8931372o9693331K58776669k21806463K26096144
15229I6761923k40649515J82765074K99326879k30473022K68387258m01304091q8855603
15222a14041097j45334954K11911432j57272421J44965635n1110779J00530850R0981684
15215H0630350o3925996n3404383M5022355N9967013k04425440J64984149K2128431
$$ plain form
15264 41983683 -228081247 -86605716 -160385449 -35606397 -24155423 44469922 -101041733
15257 -101041733 -198040729 -194857320 -92118793 59909918 142847449 -14380691 -300855213
15250 -300855213 -17710867 -187905539 -84164500 31913930 5333523 96597613 20827074
15243 20827074 -54333920 -132827432 190482712 51270945 204559406 305527023 168699606
15236 168699606 -295471038 -47679724 -96611096 -166304427 92472242 -129334221 96761923
15229 96761923 -143887592 38877482 338204361 107731339 376118597 -25185494 -114041097
15222 -114041097 -259376051 -47464619 -204737040 -59771405 -110882184 -10351334 80630350
15215 80630350 16704354 -36700029 8322326 68289339 -136136101 28848048 50976479
15208E0976479j09430007q2640382K95619296j01524159o7347656q4876756K49223122
15201A49999937j4707371k17097531P2356246k19477735K92188179j29256331J82105717
15194A16111111j79344734K29849907j35694629N7334151j20660142q7481490k23079585
15187c42965411M95986570m03910293J44441858k0445322j9688940J68861417L2378906
15180E4658785r2238595j06527672J80197725J86158504l42646958L2006177J80941471
15173I2549437L2383838l37115610L25877068j92965982K40251929j78005339J63026646
15166A46001987j11634195j81473993J54498272J70715835j915359k05272880j35246110
15159a64326443J47899196n752735l20766499M44354019j97267684R8156111j40151537
$$ plain form
15208 50976479 -58453528 -141093910 154525386 53001227 -14346429 -99223185 149999937
15201 149999937 135292566 -81804965 -9448719 -228926454 63261725 -65994606 116111111
15194 116111111 -63233623 166616284 30921655 88255806 -32404336 -119885826 -342965411
15187 -342965411 153021159 -250889134 -106447276 -126892598 -146581538 22279879 54658785
15180 54658785 -37579810 -144107482 36090243 222248747 -120398211 -88392034 92549437
15173 92549437 124933275 -212182335 113694733 -79271249 160980680 -17024659 146001987
15166 146001987 34367792 -147106201 7392071 178107906 176192547 -29080333 -164326443
15159 -164326443 -16427247 -22179982 -342946481 101407538 -95860146 2295965 -137855572
15152a37855572L1726837J92010441k70119693J94908074J00027432m421978k05433224
15145i9157683k5821994N0916903K25354974j27584170K5075761n3805013n9170520
15138f4191742K1565609M8313165L7460613J82445036k16914842J16618174K6873163
15131A52169176k25910350o4656764j9595014J63589923K16268928l10343631J36923544
15124D8445812J6685978l13396852P4979639L07959917j03185130J13526478j46699699
15117a683857j74451320J26914709q6174516O6697912j9835113Q7607440N50452K98004066
15109B97629773l06858931r4776922q8173684K37851045m422216m9730312p9559274
15102h8040521J67823421L1246576J86837763l14388279K18081808r4577441p9364453
$$ plain form
15152 -137855572 -106128735 85881706 -184237987 10670087 110697519 106275541 -99157683
15145 -99157683 -124979677 -74062774 151292200 23708030 48783791 -5021222 -64191742
15138 -64191742 -42626133 5687032 43147645 225592681 8677839 125296013 152169176
15131 152169176 -73741174 -138397938 -157992952 5596971 221865899 -88477732 48445812
15124 48445812 65131790 -248265062 -173285423 134674494 31489364 145015842 -1683857
15117 -1683857 -176135177 -49220468 -135394984 -68697072 -88532185 -924745 -374293 297629773
15109 297629773 -9229158 -104006080 -192179764 45671281 41249065 -8481247 -88040521
15102 -88040521 79782900 111029476 297867239 -16521040 201560768 106983327 27618874
15095B7618874K4304397j08434443j10675931L2698753M9638679K05155069j10081379
15088A0224019J51970881j39978570j63485377R3877115L9144346k38988896L10123862
15081F2887380k53629695k4374341R716292J52685061r136077J89917177P254001
15074A35319798j05622480m7408462L9911448K2714146q4623186r5143363J08074347
15067b6777752K05672643j19242701J08641594m9673033j00337529m7204267m1481950
15060g0402995K43453904j47972554M68802K7159397K4825750N4086658k80254028
15053a48635066M9245001J17297557J00313363k11643720L9663729P858484R486041
15046c6414611P2778646j68352947m7009622K34858424q6912438P9480159O1999386
$$ plain form
15095 27618874 51923271 -56511172 -167187103 -134488350 -84849671 120305398 10224019
15088 10224019 162194900 22216330 -141269047 -47391932 -8247586 -247236482 62887380
15081 62887380 -190742315 -215116656 -205400364 -52715303 -61851380 128065797 135319798
15074 135319798 29697318 -17711144 22200304 44914450 -39708736 -134852099 -26777752
15067 -26777752 178894891 59652190 168293784 118620751 18283222 -28921045 -70402995
15060 -70402995 173050909 25078355 25547157 52706554 77532304 131618962 -148635066
15053 -148635066 -99390065 17907492 118220855 -93422865 -53759136 -45900652 -36414611
15046 -36414611 36364035 -131988912 -178998534 55859890 -31052548 48427611 110426997
15039A10426997k33401210j6279106R5188698q6275906J98383357m0713692J7029251
15032D4358389R98378j40705653m6446806J13266296K10687563o3546769k8447900
15025I0163498j36306892n313102k0662790J14700141M9058369l9366667m6941548
15018E331009j06865356o3497441j7836396Q3862217K84844970l48287005K13360363
15011E0912361Q825932j60701315J5033091K20602464j2327566k44213097K23905942
15004A02037812j3309794j89304329k3247056O9139466R6711227J63427292q5446937
14997A20007681k16057682K47364090J7504170k65619933o6131758M5771458J57792789
14990D0630815j19071064J10665297K45591062m09470709L167855K70865178j90301901
$$ plain form
15039 110426997 -122974213 -139253319 -44064621 -130340527 68042830 27329138 44358389
15032 44358389 45356767 -95348886 -141795692 -28529396 182158167 118611398 90163498
15025 90163498 -46143394 -51456496 -72119286 42580855 91639224 52272557 5331009
15018 5331009 -101534347 -165031788 -182868184 -99005967 185839003 -162448002 50912361
15011 50912361 59738293 -100963022 -85929931 134672533 122344967 -121868130 102037812
15004 102037812 88728018 -100576311 -123823367 -54683901 42027326 205454618 120007681
14997 120007681 -96050001 151314089 168818259 -96801674 -162933432 -117161974 40630815
14990 40630815 -78440249 32225048 277816110 -131654599 -128486744 142378434 -47923467
14983d7923467J51429817m47906895M17108837k37000824j32535656J44363970J31768569
14976b0695649Q2251229l4770683P4070637J83114651j51990906j84389738k20009371
14969b72419830L59324719Q0113012l29743907O7865911J53081274n8635838K07035733
14962B06621074j4582406N8953753K0597997j64342046r4311648J8306332k87527254
14955b56284198K21442842N7143405J57464138r2249431q799984j1208806R5114528
14948A62622494q8878894p7362024O0445856P5150839j50495414j90321401P3886520
14941a34952024k3186754J29402986J69386255q2663979j33023879N9985896M1454760
14934B6403261L5537043k05467709J16488735k7093462L20042364l87528698J68572833
$$ plain form
14983 -47923467 103506350 -344400545 72708292 -164292532 -296828188 -152464218 -20695649
14976 -20695649 61555580 26784897 100855534 283970185 131979279 -52410459 -272419830
14969 -272419830 86904889 167017901 -162726006 -94860095 58221179 -414659 206621074
14962 206621074 192038668 250992421 271590418 107248372 12936724 31243056 -256284198
14955 -256284198 -34841356 22302049 179766187 87516756 78716772 67507966 162622494
14948 162622494 73743600 -3618424 56827432 131978271 -18517143 -208838544 -134952024
14941 -134952024 -158138778 -28735792 140650463 57986484 -75037395 -15051499 26403261
14934 26403261 61940304 -143527405 -27038670 -54132132 265910232 -121618466 46954367
14927D6954367p3665633J21103912j82068028k29925096L02789838K48975421j59203894
14920G4960887q0476572k7141419Q6834724r6458922P0206463K82105280m05612855
14913i5582414J16188244R2187803k56543846O3893872j50897816K93055142K32159796
14906B94460781l67583170K10972081l91321373K13512524O9243847n7915106n054732
14899c3685148o8951526p0599916M0437542J10947339k84857419O29015297n34110823
14892b11804654J65897814k32709802K01415653j10562459J12724281N6082540j06336742
14885a25293369J20333710j40653968R8520320J36125049l36030665K43305975J4123260
14878A0430312K04439714l40149036K18715935j17786660n8692323L04747837l20029531
$$ plain form
14927 46954367 -26711266 94392646 -87675382 -317600478 -14810640 234164781 74960887
14920 74960887 -5515685 -32657104 54177620 -42281302 27925161 310030441 -95582414
14913 -95582414 20605830 112793633 -143750213 -79856341 -230754157 62300985 294460781
14906 294460781 -73122389 137849692 -253471681 -39959157 29284690 -28630416 -33685148
14899 -33685148 -102636674 -173236590 -132799048 -21851709 -306709128 322306169 -211804654
14892 -211804654 -45906840 -278616642 -77200989 -187763448 -75039167 -18956627 -125293369
14885 -125293369 -4959659 -145613627 -47093307 89031742 -246998923 -3692948 10430312
14878 10430312 214870026 -125279010 93436925 -24349735 -83042058 221705779 -98323752
14871i8323752J15455215k20966012Q1002742K73938562k14752712R5034333K3489548
14864E4877924k6711890O501973J7916098r576577O1576874k50558443R8708594M04587115
14856C57321668l66418980P4358694k01440842L9691169O522564k6599642k0591556
14849a37156925R7522304J00769194j82303445j7198926J08684201k3543315J60881227
14842A07654315L2312141k46475717K3842205l5145582j13519361M1194892K89706993
14835I9569886k63493894J17944186K17932713j98881830M3706780J6569549J9278788
14828E2626178N9599109k73565796J23686013m418708J46174775q9484343n8531583
14821d3914355K74065667l66277551L20633671k77033128K42463172j48556043P6498715
$$ plain form
14871 -98323752 17131463 -203834549 -122831807 151106755 -63645957 31388376 54877924
14864 54877924 28166034 34668007 52584105 43007528 104584402 -145974041 -47265447 357321668
14856 357321668 -9097312 65261382 -136179460 -96488291 -89965727 -116565369 -137156925
14849 -137156925 -39634621 61134573 -121168872 -138367798 -29683597 -53226912 107654315
14842 107654315 139966456 -106509261 -82667056 -117812638 -231331999 -190137107 99569886
14835 99569886 -163924008 -45979822 171952891 -26928939 16777841 33347390 52626178
14828 52626178 112225287 -161340509 -37654496 -42073204 104101571 14617228 -43914355
14821 -43914355 230151312 -136126239 184507432 -92525696 149937476 1381433 77880148
14814G7880148K23736607m04717739j62502926K17670126L30802457M3287320m28272120
14807a02116127L9189479K56038501l60120822O3520506J59670893Q2075046k9308222
14800A08949254o958686k06655069K57658249k73013281L40458340j65376951J45411947
14793B00473803l03004568J2579227J23396920j09665356j6092728J38596208J50694250
14786A96977756j71368776K1201917p9512897l0766542K14701451m40409991K99213724
14779A0036642j86474761M8747644J65490352k08106591J05979141M3655113k7448380
14772d8120840o5869l8822716j0990579J37922996l05371079L04285551k46015394
14765b07177930O6536403J22271041p4414781L04248859k10497548m7175720J55283560
$$ plain form
14814 77880148 301616755 -103100984 -265603910 -47933784 282868673 326155993 -102116127
14807 -102116127 -62926648 193111853 -167008969 -103488463 56182430 138257476 108949254
14800 108949254 101990568 -104664501 152993748 -120019533 220438807 55061856 200473803
14793 200473803 -102530765 -89951538 33445382 -76219974 -92312702 46283506 196977756
14786 196977756 25608980 46810897 -32702000 -63468542 151232909 -289177082 10036642
14779 10036642 -176438119 -127690475 37799877 -170306714 -64327573 -20672460 -48120840
14772 -48120840 -48186709 -87009425 -98000004 39922992 -265448087 38837464 -207177930
14765 -207177930 -140641527 -18370486 -92785267 211463592 966044 -46209676 109073884
14758A09073884p0764012j74803154P5425047n776119J02940525J505114r6039586
14751e8438301k6247917O8558246J16714985J68307921j53153458l0501981k92323119
14744b07083624m8640082J79433910n2587177k9475432M0959692J09970582k0201717
14737b7623848M8549998k4137668N6819591L5650675k61144427J9455664j11258509
14730b63688524J41237125J66444937N3515732o0501944j55460270q1242626J45874416
14723e3821154L52307260k16636655q0855318Q8215427n1973666o3776072j95842874
14716b22383052K85088211J39704729r3083092j19389897K26096457k52034904k63470231
14709b99471779L08382569J98386306n4436401q0203621N9761111k44419914L08212149
$$ plain form
14758 109073884 38309872 -136493282 -61068235 -66844354 36096171 37601285 -58438301
14751 -58438301 -84686218 -16127972 100587013 268894934 115741476 85239495 -207083624
14744 -207083624 -255723706 -76289796 -128876973 -158352405 -117392713 -7422131 -27623848
14737 -27623848 20926150 -3211518 53608073 89258748 -171885679 -152430015 -263688524
14730 -263688524 -122451399 43993538 97509270 37007326 -118452944 -199695570 -53821154
14723 -53821154 298486106 81849451 994133 89209560 37235894 -26540178 -222383052
14716 -222383052 62705159 202409888 109326796 -10063101 216033356 -36001548 -299471779
14709 -299471779 8910790 207297096 152860695 72657074 132418185 -112001729 196210420
14702A96210420k49857206J11555683Q86759j58141822J92311323K35207823l28615231
14695d42251R1017313r8727530J72995871n49087l99093690J82677167r007332j28421560
14687a89551099K63615283l21507584K01912160p9031023J77723181J18918397K5241470
14680A97320785n13433357L63426225N0980226k83655773k60779939N33044337k21321266
14673a34418762L4111825j19103465L38194875k58558592R8062171J53033343L6920797
14666A48242192j16921429k93677488J37795012L43669529l87144149K63643977k0958096
14659G4649548J5016715r2584281Q2731689m8309542J5173392q6834834L0629500M1511491
14651C1983678j5116055J2311418J19944591j22927003m9956163Q4291021K1391461
$$ plain form
14702 196210420 -53646786 57908897 58795656 -99346166 92965157 328172980 -442251
14695 -442251 90575062 -8152468 164843403 164294316 -234799374 -52122207 -61129539 -189551099
14687 -189551099 74064184 -247443400 -45531240 -124562263 53160918 172079315 197320785
14680 197320785 -316112572 47313653 98293879 -185361894 -446141833 86902504 -134418762
14673 -134418762 -100306937 -219410402 118784473 -139774119 -41711948 111321395 148242192
14666 148242192 31320763 -262356725 -124561713 219107816 -168036333 95607644 74649548
14659 74649548 89666263 -2918018 79813671 31504129 46677521 -40157313 -9527813 31983678
14651 31983678 16867623 29179041 149123632 26196629 -23759534 60531487 81922948
14644H1922948l9621322k7205656J88226030l09223977N2077459J3124418K2611386
14637a8088714J40495790j21693741J42909729m8282534o8073137p5344543K5948687
14630b2128463j37368220j38474406K03839412J12926002O758036o7201904J88258606
14623A46609063n6184874O5163206k369175k34748021N9290956k52108662K25067962
14616d9279545k5440825O9191550k14567573K28333265M7007719J36177324J68461112
14609C59883027m52825120L19548965k73572804J68127401k38392751l0363271K73908370
14602A26313817l72199143L15211848M2773387Q9919345j38957969J14280807L988863
14595A81330955j96715946Q6739594j31201690J17790551O7657609j24778655o1124472
$$ plain form
14644 81922948 42301626 15095970 203322000 -105901977 -53824518 -40700100 -18088714
14637 -18088714 122407076 713335 143623064 95340530 27267393 -48077150 -22128463
14630 -22128463 -159496683 -297971089 -94131677 18794325 25552361 -41649543 146609063
14623 146609063 90424189 155587395 153218220 -81529801 -22238845 -274347507 -49279545
14616 -49279545 -74720370 -5528820 -220096393 8236872 55244591 191421915 359883027
14609 359883027 -92942093 226606872 -46965932 121161469 -117231282 -147594553 126313817
14602 126313817 -245885326 69326522 112099909 202019254 63061285 177342092 181330955
14595 181330955 -15384991 71354603 -59847087 57943464 125601073 822418 -60302054
14588f0302054M9835426j70833913Q2550551J09989068n8353323p6378398J52667887
14581B9175244O1288397l61452797M15260902r3828363j20953461K50535916j13846852
14574F6178986j78419557M554108J05208960k10823563J76340738L01101821l42332034
14567g8190541j3745019J17847408r9145146K22056851O1675243l01126378q6152050
14560a76779632K33283820l96300210J29191108K21904700J00282885N3606030j60061929
14553E126772j78708968n2648442J5865764K64998932k11528929o9171018K11104774
14546a4961115k00532169L88785839l15225196J08950794J30910817j26178584l4909102
14539f3158716J22080849j38393739K52299481k14976266J99699J06021143N9829867
$$ plain form
14588 -60302054 -10466628 -181300541 -98749990 11239078 -47114245 -123492643 29175244
14581 29175244 90463641 -270989156 144271746 50443383 -70510078 180025838 66178986
14574 66178986 -112240571 -107686463 -2477503 -213301066 -36960328 264141493 -78190541
14567 -78190541 -91935560 25911848 -73233298 148823553 210498796 -90627582 -176779632
14560 -176779632 56504188 -339796022 -210604914 11299786 111582671 165188701 5126772
14553 5126772 -173582196 -226230638 -210364874 54634058 -156894871 -226065889 -14961115
14546 -14961115 -215493284 173292555 -141932641 -32981847 97928970 -28249614 -63158716
14539 -63158716 58922133 -79471606 172827875 -42148391 -41948692 64072451 123902318
14532A23902318o5716469N2224231j40741951K01642750k32083860r3099105R5947054
14525e7925032O7037838O4856380j14606606K93334632k89839903M1220099o2209794
14518e8132386R6585103k21804570J44058214m8705094l3279177J56100172r8873683
14511f4051421j02494404J70460294l2291626k32582802P5157195k7400300m6914578
14504b60117642K33091303q5040185J05157412k01434651J67521380k17497908J84275468
14497g4044823m181583j44907000K31707849j87829468o1283833J2258575M6358453
14490a81921830J21202412o565076p7638129J29060831j08163969j70455037M4869810
14483b49610988P1327533K18551331j47573986j14123411Q9983050k09868837K06141907
$$ plain form
14532 123902318 58185849 110410080 -30331871 171310879 -60772981 -153872086 -57925032
14525 -57925032 9112806 73969186 -40637420 252697212 -37142691 4077408 -58132386
14518 -58132386 38452717 -183351853 -39293639 -87998733 -121277910 34822262 -64051421
14511 -64051421 -166545825 3914469 -28377157 -260959959 -185802764 -213203064 -260117642
14504 -260117642 -27026339 -112066524 -6909112 -208343763 -40822383 -258320291 -74044823
14497 -74044823 -78226406 -223133406 8574443 -179255025 -240538858 -228280283 -181921830
14490 -181921830 -60719418 -67284494 -144922623 -15861792 -124025761 -294480798 -249610988
14483 -249610988 -178283455 40267876 -107306110 -221429521 -131446471 -341315308 -135173401
14476a35173401J26910495n912638j73789228Q6214411J24758607P421360k2734274
14469G695332l9422901J50268050j81751500P3175457k97414428L19665179n8264201
14462b6049012l7724798J54221068M9131340J15765938k29742792J10556260K69211317
14455D05369321m02553607R4561499R468187j00381540n9626616j39746484J30280786
14448f2628454j0856447q8146930K81395879N2429109j17373313j60645200J80992807
14441G5167451k4230929k31124194O0467403R4226495L6475488L8251724J43889070
14434A93122508m32809897K26969588Q7459586j80901122N3799175N1682551J08087100
14427A07409489R5503345k02903369Q647219K1440395J16503589j65092566j1333815
$$ plain form
14476 -135173401 -8262906 -14175544 -187964772 -101750361 23008246 30429606 7695332
14469 7695332 -31727569 118540481 -63211019 9964438 -287449990 32215189 -26049012
14462 -26049012 -63773810 90447258 139578598 255344536 25601744 136158004 405369321
14455 405369321 2815714 97377213 106845400 6463860 -53162756 -192909240 -62628454
14448 -62628454 -73484901 -161631831 119764048 172193157 54819844 -105825356 75167451
14441 75167451 50936522 -180187672 -119720269 -25493774 10981714 49233438 193122508
14434 193122508 -239687389 -12717801 74741785 -106159337 -52360162 -677611 107409489
14427 107409489 202912834 9465 8656684 30097079 146600668 -18491898 -29825713
14420b9825713J4466268R8211799j85018827Q354608J42414147n1104417j33347368
14413a35849503L00398270j7521388j54320072p0190214p3079054J42521270q5384808
14406i3425499j98957437L65515999j31150656N4489708j09221125O86837J32783575
14399B0721402j73846079L42759862q1621297j52177868J73326469j33318377l6819728
14392d0975616K45600852j748917P4831639k78941574k05944836K52644213o6809185
14385b1343424P4010620j0585095R1603865K4693777k25298181K23429371j66647823
14378a0136890J94160959q5248572j70950727k0292931J21916010k06015547O1775566
14371a14792132r9190094J60749142R3442080K7582635j49334949L6353269J47430774
$$ plain form
14420 -29825713 -15359445 82852354 -102166473 -93811865 48602282 -2502135 -135849503
14413 -135849503 164548767 147027379 -7292693 -77482907 -150561961 -8040691 -93425499
14406 -93425499 -292382936 73133063 -58017593 -3527885 -112749010 -112062173 20721402
14399 20721402 -153124677 189635185 108013888 -44163980 129162489 -4155888 -40975616
14392 -40975616 204625236 202876319 277707958 -1233616 -207178452 45465761 -21343424
14385 -21343424 52667196 42082101 133685966 158379743 -66918438 156510933 -10136890
14378 -10136890 184024069 98775497 -72175230 -92468161 29447849 -176567698 -114792132
14371 -114792132 -213982226 -53233084 40208996 67791631 -81543318 -45190049 102240725
14364A02240725l3768795J2184581r3121075k71235099L37415848j20305382K29973335
14357A63384138j53932140j08920889J3282807p4007571K96513880k68427253J6032845
14350a16074183K26291148Q0891219k91595323K01551610j61499274J03806300k5545799
14343A7825698k792696K296469k5343255j02379416J93408304j24531495j50963919
14336a92480310J49653127q8683729J31912477J9641724j83842857J15966364p9567641
14329a27400845r3259269L4830274K25610769j65863777L8843469J22804104o3453389
14322b7888664j31732907K55890229j81010985L56448213k06620072q1239280M0556252
14315B4402786J31390636L3623864l16730326N4570051K73014733j33431036O4473923
$$ plain form
14364 102240725 68471930 80656511 -12464564 -283699663 53716185 -66589197 163384138
14357 163384138 9451998 -99468891 -86186084 -160193655 136320225 -132107028 -116074183
14350 -116074183 110216965 191108184 -100487139 101064471 -60434803 43371497 17825698
14343 17825698 15033002 17329471 -8013784 -110393200 83015104 -41516391 -192480310
14336 -192480310 -42827183 -131510912 401565 20043289 -163799568 -47833204 -127400845
14329 -127400845 -220660114 -185829840 39780929 -126082848 -87239379 35564725 -27888664
14322 -27888664 -159621571 96268658 -84742327 271705886 65085814 -16153466 24402786
14315 24402786 155793422 189417286 -127313040 -72742989 200271744 66840708 131314631
14308A31314631j73721381p7046547K8521821L30436505n9299793k4208645k39524280
14301h3527689L05216169k57254242j28167159Q4341792O7083639Q1519426j20857683
14294e1645747n42020Q7232697j17995227l3596955L52817893k37631047M6955308
14287D5594902j78432081L88220328m68260007Q5062580J2026421O2189129P04762
14280e2893966R8495342q4270749M2260398j79111541K62951345j56089745K40637661
14273A71978745j40744077j6304483R5456633k04788838R8749097p1706054L43951235
14266B76592258m03985162R2068071L03000260l67611544K3464846J89737454J28545197
14259B41811380k08514856o5251350J4479801J52277277j17646905K0042375j24232684
$$ plain form
14308 131314631 -42406750 -119453297 -90931476 239505029 180205236 155996591 -83527689
14301 -83527689 221688480 -35565762 -163732921 -79391129 -12307490 69211936 -51645747
14294 -51645747 -52187767 35044930 -82950297 -116547252 236270641 -1360406 45594902
14287 45594902 -132837179 255383149 -212876858 -127814278 -115787857 -53598728 -52893966
14280 -52893966 45601376 -38669373 3591025 -175520516 87430829 -68658916 171978745
14273 171978745 31234668 14930185 110386818 -94402020 4347077 -67358977 276592258
14266 276592258 -127392904 -35324833 267675427 -99936117 -76471271 113266183 241811380
14259 241811380 33296524 -31954826 -17475025 134802252 17155347 37197722 -87034962
14252h7034962J21819844N1242034k89938913K40594006n3353056j8404695K06587231
14245A71511489l17058732J32668528m9631769L0360525J10755165k13003500J88266769
14238E3868475j82074485J23045754Q6613126j91665484n7234174J96164177j91477645
14231a62760256L35312149m27042754J72559503J52028609l12131048M73973353m02715996
14224a70776440J19587665O0170225O8279706j95813348P5063847J2808326J81165532
14217A50485513j99286012m1269807L40800764l40244251K00094120j21297099J54502360
14210A43785588k67260161R2948741K73919903J8016789k78445110P2465207q8091407
14203c2660450r2335517O520451K55645555p7972564k32438331K70324934K8958277
$$ plain form
14252 -87034962 34784882 86026916 -203911997 36682009 -16671047 -35075742 171511489
14245 171511489 -145547243 -12878715 -62510484 -32149959 78605206 -134398294 53868475
14238 53868475 -128206010 -5160256 81452870 -110212614 -167446788 28717389 -162760256
14231 -162760256 172551893 -254490861 -81931358 70097251 -242033797 231939556 -170776440
14224 -170776440 -51188775 8981450 77261156 -118552192 -43488345 -30680019 150485513
14217 150485513 -48800499 -90070306 250730458 -89513793 110580327 -10716772 143785588
14210 143785588 -123474573 -30525832 243394071 261410860 -17034250 55430957 -32660450
14203 -32660450 -124995967 -118475516 137170039 59197475 -173240856 97084078 126042355
14196A26042355R8988920j96501841M2127567j77077959K49671378j56858910L2264382
14189A8655892P4944118m3678502R777900q0059421l9876587K91139969j90225455
14182D0677914j50026401Q9479273J2864922J66381580j40286940J14017797j43110950
14175a0002805O628429K40418958m70784335J65631199K76593857k90576213K24151079
14168A42060169j14457091k25049140J8558809j64105351M91569441k2604858l12796595
14161a86824616L63980371M7551140r9674274j52891586j75915051J18408980K40271179
14154A54906143o8760083j05257095k37806725J74950160m2448825L22826820P561054
14147B05971449l21505425M8116234P5336038L4089740j38774957J47692962k89985775
$$ plain form
14196 126042355 225031275 28529434 70657001 -106420958 143250420 -13608490 18655892
14189 18655892 93600010 49921508 59699408 -20360013 -60236600 230903369 40677914
14182 40677914 -109348487 -19869214 -7004292 159377288 19090348 133108145 -10002805
14175 -10002805 -3374376 237044582 -233739753 -68108554 208485303 -82090910 142060169
14168 142060169 27603078 -197446062 -178887253 -342992604 148576837 125971979 -186824616
14161 -186824616 177155755 224706895 125032621 -27858965 -203774016 -85365036 154906143
14154 154906143 86146060 -19111035 -256917760 -81967600 -124416425 198410395 205971449
14147 205971449 -115533976 -67417742 7918296 42008036 -96766921 50926041 -239059734
14140b39059734L47747901N8977129o9134889r9234600M2659806p447029R7706328
14133A32214912k10533541j8767969r0604258O1255666J65634891k16888707J40947738
14126c6741268L6389584k14618635J79471843k21201514J65875061N8583042k33942258
14119b66184145J06375587K75123344l77605017J97502429j27419173J16516305K06486580
14112A30795910k46982458J13813933j80874725J65672764J4588771l56409984L90201989
14105C0806200n7542570J62997179J12438945l31199564L53859226l02740361L46870318
14098C15489373k67689107j93677503J81628761j73517226J58971361J0393039k16360333
14091a84761635K11420605Q4731291o4945986q4572577J43315285q5919281J28446507
$$ plain form
14140 -239059734 108688167 167665296 98530407 -704193 41955613 34508584 132214912
14133 132214912 -78318629 -97086598 -187690856 -126435190 39199701 -177689006 -36741268
14126 -36741268 -351684 -214970319 -35498476 -256699990 -90824929 -32241887 -266184145
14119 -266184145 -159808558 115314786 -262290231 -64787802 -192206975 -75690670 130795910
14112 130795910 -116186548 -2372615 -183247340 -17574576 -2985805 -359395789 30806200
14105 30806200 -26736370 136260809 248699754 -82499810 271359416 -31380945 315489373
14098 315489373 47800266 -145877237 35751524 -137765702 21205659 31598698 -184761635
14091 -184761635 26658970 111390261 46444275 -38128302 105186983 19267702 147714209
14084A47714209j15986996l75677015K36913898K4135055J17679639j261577k89139338
14077b55622125J75950988L2813244K50770333l21926391J33148838N0068329M8579640
14070A13782856j68878321n5901137j22466798J52149331K15922364q2750662O9361768
14063A21219401k60874404L55205624j17256285k07688765J57967093K08888240k91272710
14056c3811806K51191715l51829345J24790707P8186661k11916817J34104844k06268947
14049b15552988O2498821L9584493L06650045k86143472n3486732Q1502372J13794838
14042D8847377j26437367l52595922L86589310J25060805k98567238N6132330M4536504
14035a16434201r564414J02153450Q1090095k48278887K63815014l32177249J77794867
$$ plain form
14084 147714209 31727213 -343949802 -107035904 -82900849 34778790 33517213 -255622125
14077 -255622125 -79671137 -46857893 203912440 -118013951 15134887 65203216 113782856
14070 113782856 -55095465 -110996602 -233463400 -81314069 134608295 51857633 121219401
14063 121219401 -139655003 215550621 98294336 -109394429 48572664 257460904 -33811806
14056 -33811806 217379909 -134449436 -9658729 68527932 -143388885 -9284041 -215552988
14049 -215552988 -153054167 -113469674 193180371 -92963101 -146449833 -64947461 48847377
14042 48847377 -77589990 -430185912 -43596602 81464203 -217103035 -160970705 -116434201
14035 -116434201 -125998615 -23845165 57244930 -191033957 72781057 -259396192 -81601325
14028h1601325N1003286k8663676j10868187J75424020J1236376j47979957k3292144
14021a54741607J07658006j7353695Q5171636j30763760p7938429M34304740l91203086
14014a44866195J97429107k00284380O7251665O2585274k60611357K26554794k1314645
14007g3255737N612364K6381117m4296173K11538596L7269371k21661727J50059986
14000I1647797k17126543M5110196m7154968L33780290k74676489P7793465N5436445
13993F4810193l114319J06089415j46367473j7916874J66918478l22122584O1879647
13986h9823517p576353K1165595N1877639q4812289J09992222Q4187061k4501349
13979F0509009L21320586p83640495K29663319K45163418l04356516K35070116o1234332
$$ plain form
14028 -81601325 -30598039 -59261715 -170129902 5294118 16530494 -131449463 -154741607
14021 -154741607 -47083601 -64437296 20734340 -110029420 -187967849 246336891 -144866195
14014 -144866195 52562912 -147721468 -80469803 -17884529 -278495886 -51941092 -73255737
14007 -73255737 -67643373 -41262256 -85558429 125980167 163249538 -58412189 91647797
14000 91647797 -125478746 -80368550 -127523518 206256772 -68419717 9373748 64810193
13993 64810193 61695874 167785289 21417816 3500942 170419420 -151703164 -89823517
13986 -89823517 -97399870 -76234275 -24356636 -109168925 823297 85010358 60509009
13979 60509009 381829595 -401810900 -172147581 73015837 -231340679 3729437 -57504895
13972e7504895J2053853M5109359L0251479J46636880j25716619j97507686K02173025
13965E5495396j92182382K66666283l16348288J04123918P7155343N8642495o8093638
13958a4540873K02960025j01754160J5368213l4418658o4333501r2489753K39004602
13951A49795895l87094472J82297132j27287068K24064468j11515357K73602574l15191265
13944a11328093k7330601L09764713k36372960N228324p0580204J66740515j80812267
13937a44690573J11132261j95584343J37189332P6524890K31510536j82231620j08501823
13930g4651340J67248216k33812004J75594648m5965429l3150030J85449975j89107171
13923d8393135P4982728j26880799J29459307j25727715K78841639J93299974l76412794
$$ plain form
13972 -57504895 -45451042 -341683 29909796 176546676 50830057 -146677629 55495396
13965 55495396 -136686986 129979297 -186368991 -82245073 -5089730 53552765 -14540873
13958 -14540873 188419152 86664992 102033205 67614547 3281046 -89208707 149795895
13951 149795895 -237298577 -55001445 -182288513 41775955 -69739402 203863172 -111328093
13944 -111328093 -138658694 171106019 -65266941 -60038617 -130618821 36121694 -144690573
13937 -144690573 -33558312 -229142655 -91953323 -15428433 216082103 33850483 -74651340
13930 -74651340 92596876 -141215128 34379520 -11585909 -44735939 140714036 -48393135
13923 -48393135 26589593 -100291206 29168101 -96559614 182282025 375581999 -830795
13916h30795O0643499j69688225J55616003j08006788J00747910J95891911j81050089
13909E3323426R2988794L3026682J3006387P0282268k34435671k6720730p0301314
13902f8830158K33533147q8307716j62637019j53411228M58926482r9744507J36191565
13895B55720566j59862630k50300095N9171326K84781562j76745705j31566665J02431268
13888a6370373L1183822m1334431Q3339132j50587825Q2204632K4894927N2484035
13881F5813919k6573707Q7884117j14026610k42741460N5344008l4828718K55647246
13874D6518795R221427j78930083K10527985j51816816j72082023K91326843k44951451
13867a90185323N8931850M3792020R8651819j16062954j43043048K35790101j74585723
$$ plain form
13916 -830795 59812704 -109875521 45740482 -62266306 38481604 234373515 53323426
13909 53323426 146312220 179338902 192345289 262627557 28191886 1471156 -68830158
13902 -68830158 164702989 76395273 -86241746 -239652974 219273508 119529001 255720566
13895 255720566 95857936 -154442159 -95270833 189510729 12765024 -118801641 -16370373
13888 -16370373 14813449 -26520982 56818150 -93769675 -11565043 13329884 65813919
13881 65813919 39240212 127124329 13097719 -229643741 -174299733 -209128451 46518795
13874 46518795 55740222 -123189861 87338124 -64478692 -236560715 54766128 -190185323
13867 -190185323 -131253473 -87461453 11190366 -104872588 -247915636 -12125535 -186711258
13860a86711258K59954001j00983795p0534549K46052550j54695885p3957499J37736903
13853E6860468k58770514J34504378J50279483o2164972q412077O1506020m2098695
13846C1704091M510542l2330777q6215363J33438574K10146453l02827718j05409943
13839a46984141q2042715L87966644k60805728J6565168K49801458k77367096J51786877
13832C8920467l4959854j06679719r9588972J63666645J21960937m4816958k16467084
13825a77964538q4486422N2020499L57455369l58207714L96255411k96046684K56947088
13818A45973009k25855533J91951714l1734604j30944726k9578878J55602386J7117716
13811I2531084j97918715K66282138J4782127L8297810j69461951j55900844K16286753
$$ plain form
13860 -186711258 73242743 -27741052 -98275601 147776949 -6918936 -80876435 56860468
13853 56860468 -201910046 -67405668 82873815 20708843 12296766 73802786 31704091
13846 31704091 36214633 3883856 -82331507 51107067 261253520 -41574198 -146984141
13839 -146984141 -229026856 158939788 -101865940 -85300772 164500686 -112866410 38920467
13832 38920467 3960613 -102719106 -202308078 -38641433 83319504 38502546 -177964538
13825 -177964538 -262450960 -210430461 147024908 -211182806 185072605 -110974079 145973009
13818 145973009 -79882524 112069190 80334586 -50610140 -80189018 75413368 92531084
13811 92531084 -105387631 160894507 175676634 213974444 44512493 -111388351 104898402
13804A04898402k07255865R0241568o436969P3607696J24157289l51318470J23684710
13797d8421639Q1941736J17068332k91856161m8171377j7180010j0183883J38509444
13790g8293558N8056154M2696502k31365034K16049689L3939620J09502344k19209009
13783f8623292m19504n1661735R775118l6828912K2157170K05369305o1829784k66973
13775A7671393l3228842J7006339j9302119K19397136l84708513Q6756359L28902432
13768B32494185j52809653j7416890j04759296N1349046m1130341J39315401j26019879
13761a8977427L3724073J0325439k7171018K3570181n721016k9560027Q3063112J53491706
13753B22745023k42793067k09565980J09132831O5249682q6325209J34229113r6582331
$$ plain form
13804 104898402 -102357463 -12115895 -18552864 55054832 179212121 -172106349 -48421639
13797 -48421639 33520097 150588429 -141267732 -189439109 -206619119 -216803002 -78293558
13790 -78293558 -20237404 22459098 -208905936 7143753 41083373 150585717 -68623292
13783 -68623292 -69042796 -120704531 -110929413 -147758325 -125601155 79768150 17938366 17671393
13775 17671393 -15557449 1448890 -17853229 201543907 -183164606 -96408247 232494185
13768 232494185 79684532 62267642 -42491654 8857392 -32272949 107042452 -18977427
13761 -18977427 14746646 25072085 -2098933 21471248 15750232 -13809795 69253317 222745023
13753 222745023 -20048044 -229614024 -120481193 -55231511 -141556720 -7327607 -103909938
13746a03909938O857905K82808230j23915723j0099738K162578j79688022J32143518
13739F358810j80034731J55639991j35050441J21750506j08051182K9360060K32984577
13732A22957590o2251827q4834445M0212331J33095376r2838576l8082651k82125726
13725b63867928K22521462P7683643p632873n7305779Q2645181o7847797j15638975
13718a29443066J71621420o6879803j4488311K85092995k7641463j89754398j04365693
13711g5858319j34377781K89347159M552024L0929884j20382066J82480323j55205034
13704B1486190K01292318j29960772o2070219l7992534M4153645J23691391j87591709
13697b6991690n7808798O5614850p3237044L15321229l16481367J51923565L0089759
$$ plain form
13746 -103909938 -97052033 185756197 61840474 51740736 53903314 -125784708 6358810
13739 6358810 -173675921 -18035930 -153086371 -31335865 -139387047 -110026987 122957590
13732 122957590 60705763 -24128682 16083649 149179025 56340449 18257798 -263867928
13725 -263867928 -41346466 36337177 28704304 -28601475 54043706 -13804091 -129443066
13718 -129443066 42178354 -24701449 -39189760 245903235 218261772 28507374 -75858319
13711 -75858319 -210236100 79111059 83663083 114592967 -5789099 176691224 21486190
13704 21486190 222778508 92817736 30747517 -7245017 36908628 160600019 -26991690
13697 -26991690 -84800488 -19185638 -92422682 222898547 -93582820 58340745 88430504
13690H8430504K16070076l65798609j4499765n5180980K25229354j41828808J1160226
13683c6418002J05995943J57851880j92289235n1554369P6158073j2998947j30681550
13676h3936207R0985796J60928924j13689967Q6745790j56313585Q5172478j28041274
13669e8148045J10162850k90891812K48866651K6629793n267937k1101670j1459014
13662a209184J33823238j97102948J35464156M7702703j78886046J73517047k58770692
13655a45461726r0699027K61577002j19664461K34408240O8852766m6791916j6032783
13648A46188095j9407492q8869336j30021027K33140874l13293838J06942471m2503988
13641a07824241K0048820J56896524N4500061K28942729k06326026j1936919m9606024
$$ plain form
13690 88430504 304500580 -61298029 -75797794 -130978774 94250580 -47578228 -36418002
13683 -36418002 69577941 227429821 35140586 -16413783 59744290 46745343 -83936207
13676 -83936207 7049589 167978513 54288546 141034336 -15279249 69893229 -58148045
13669 -58148045 52014805 -238877007 9989644 36619437 31351500 10249830 -1209184
13662 -1209184 132614054 -64488894 70975262 118677965 -60208081 113308966 -145461726
13655 -145461726 -236160753 25416249 -94248212 140160028 209012794 162220878 146188095
13648 146188095 126780603 37911267 -92109760 141031114 -172262724 -65320253 -107824241
13641 -107824241 -87775421 69121103 123621164 352563893 146237867 134300948 84694924
13634H4694924q7556953k51842709J71979668o1972458Q8665937m5439101K21931402
13627A20460710r3606317L0167253O5771259P0168813r0248461k26649865R6002101
13620b7934507k7199109n8331585M9455312q4378001k46800L9434831j4948529j1551942
13612a35700330J96063045P2055573r326253m3355906J801543k21372328L6576317
13605a03258339n5687009K31221619l4109379q8490597Q5697761j68499729J16166281
13598a6959392L7246967M7423802M8662J18060914k11252146O5501799O537330j23705891
13590g7097955j09568181Q4979420O5805215q9490829K33560031L5297666j58080433
13583a4595066N0755795j49490883m6702174J0151702K14560748L851760j78086173R75941
$$ plain form
13634 84694924 -2862029 -254704738 -82725070 -144697528 -56031591 -101470692 120460710
13627 120460710 26854393 57021646 122792905 192961718 102713257 -123936608 -27934507
13620 -27934507 -55133616 -113465201 -64009889 -148387890 -148634690 -109199859 -124148388 -135700330
13612 -135700330 60362715 132418288 123092035 79736129 81537672 -139834656 -103258339
13605 -103258339 -158945348 72276271 38166892 -50323705 35374056 -133125673 -16959392
13598 -16959392 20287575 67711377 67760039 185820953 -25431193 40070606 46607936 -77097955
13590 -77097955 -186666136 -101686716 -35881501 -125372330 108187701 143485367 -14595066
13583 -14595066 36160729 -113330154 -160032328 -149880626 64680122 68531882 -109554291 -108578350
13575a08578350J20652804j15393911J99442594j65006602L05220321m62046167K59642799
13568C3933488j48124410K46791334k56306705J01016439J92140932n9894109l89510
13561A09167459k24069294J56478533Q1047470o6799151N796878k70760264K90861645
13554H1723276j87988602P7120850J36056715j9379033k10600078J91095323O3556015
13547A31584466k39509762p6229587O2928196N4334760l2079587k7905385P3490917
13540e3385982J46905974r194504j40808543J8276924M0726705j86696959J45619187
13533c8557198P8833027j12341275n0558234j25119160J34957409R1165217M2789348
13526B1169134k08711336L34426670k02547715N7730931P4969858k77475418J04177717
$$ plain form
13575 -108578350 12074454 -103319457 96123137 -68883465 236336856 -225709311 33933488
13568 33933488 -114190922 132600412 -123706293 -22689854 169451078 109556969 109167459
13561 109167459 -114901835 41576698 122624168 55825017 61621895 -209138369 81723276
13554 81723276 -106265326 -29144476 106912239 87533206 -123066872 68028451 131584466
13547 131584466 -107925296 -184154883 -121226687 -66891927 -98971514 -126876899 -53385982
13540 -53385982 93519992 84325488 -56483055 -38206131 2520574 -184176385 -38557198
13533 -38557198 40275829 -72065446 -122623680 -247742840 -112785431 -21620214 21169134
13526 21169134 -187542202 146884468 -55663247 2067684 77037542 -200437876 -96260159
13519i6260159K26165785r0665701J16198486q4479169l01958706L50241173j87937006
13512f8695297J26717058k367107q1976069J02316522P3872335k6009925k02183226
13505g8325709P9860701J00053744q2623307r3552512K43954339j92716672P9659960
13498E6310544m5309649j7020432Q545101J3569091J04728731j60201376m1556081
13491h0934071j66173536L37609531j49512941l5473376J06596421N6374308k16346290
13484a47859954J49780048K8862257o2596382j2284368R7121653P8069555j54315229
13477b3222420j88879652K50006365r9248261K14192454m07032172K18659790P9504866
13470D3980970J08256227k36199719J38008274j47065481j48570638L18768187O5756911
$$ plain form
13519 -96260159 129905626 39239925 155438411 70959242 -230999464 119241709 -68695297
13512 -68695297 58021761 55654654 -26321415 75995107 149867442 123857517 -78325709
13505 -78325709 1534992 101588736 18965429 -74587083 169367256 -23349416 56310544
13498 56310544 11000895 -6019537 2525564 16094655 120823386 -39377990 -80934071
13491 -80934071 -247107607 90501924 -59011017 -94484393 12112028 68486336 -147859954
13484 -147859954 1920094 30782351 -31814031 -44098399 53023254 131092809 -23222420
13477 -23222420 -212102072 37904293 -61343968 152848486 -254183686 -35523896 43980970
13470 43980970 152237197 -83962522 54045752 -93019729 -241590367 77177820 142934731
13463A42934731j96150637O903824M1101567O8480703o0302944L1182216p1621003
13456c7471543J43542034r7955073J65156233l0750149r6447932J04803804j56962002
13449f084628L2057237J33609308j94985583p5671964J49992157K90722910q3059464
13442B46579973j93259788p2632949J71479619j7157671k13800481L5126029J58277325
13435A14612057J11858881l77234214J05511208J63268683k25899622Q4234218O3889754
13428D0240965P1695813j21654532m5433866N6167602P0833141Q8580904l81649174
13421b21219147J59869583o022136L8802869r9398963J67084609j15898006K5870482
13414e0910709o5824835N9246213Q1856931O0355631r0371961m9062874Q7106715
$$ plain form
13463 142934731 -53215906 -46312082 -5210515 63270188 2967244 34149460 -37471543
13456 -37471543 106070491 8115418 173271651 142521502 46073570 150877374 -6084628
13449 -6084628 25972609 159581917 -35403666 -111075630 38916527 329639437 246579973
13442 246579973 53320185 -19312764 152166855 135009184 -78791297 -43665268 114612057
13435 114612057 226470938 -150763276 -45252068 118016615 -107883007 -23648789 40240965
13428 40240965 111936778 -9717754 -55151620 1015982 71849123 160430027 -221219147
13421 -221219147 -61349564 -67371700 -28568831 -127967794 39116815 -76781191 -50910709
13414 -50910709 -116735544 -57489331 24367600 84723231 -5648730 -54711604 32395111
13407C2395111k52547913J52187944J5131971L34060729l23955370K11000919j08002059
13400F0271332k34551962J11261081J26065414n6606423p7271803Q2667352k86479442
13393b74644451L27488550J02315524j89966011m8314395J51548380K1343296j46509145
13386e6738252O8799126j03064540l883892m4594007J32813377o545045Q683830J2025615
13378G496212J67003905n3817655k93662072J18969185l2189404J48011789q8314906
$$ plain form
13407 32395111 -220152802 -67964858 -52832887 281227842 -42727528 168273391 60271332
13400 60271332 -174280630 -63019549 63045865 6439442 -70832361 11834991 -274644451
13393 -274644451 52844099 155159623 -34806388 -83120783 68427597 89770893 -56738252
13386 -56738252 12060874 -91003666 -94887558 -139481565 -6668188 -13213233 -4529403 7496212
13378 7496212 174500117 120682462 -172979610 -54010425 -86199829 61811960 -26502946
$$ [...]
-3284a0088696  $$ checkpoint
##END NTUPLES=
##END=
