##TITLE= S#500222
##JCAMP-DX= 5.00 $$ JEOL NMR v1.10
##DATA TYPE= NMR SPECTRUM
##DATA CLASS= NTUPLES
##NUM DIM= 1
##ORIGIN= DELTA_NMR
##OWNER= NMR
##SPECTROMETER/DATA SYSTEM= DELTA_NMR
##.OBSERVE FREQUENCY= 7.5568234259928E+01
##.OBSERVE NUCLEUS= ^13C
##.DELAY= (5.14E+01,5.14E+01)
##.ACQUISITION MODE= SIMULTANEOUS
##.FIELD= 7.0586013
##.FILTER WIDTH= 8.6618213122048E-01
##.ACQUISITION TIME= 1.7334272
##.SPINNING RATE= 17
##.OBSERVE 90= 9.5
$$ ------------------------
$$ JEOL SPECIFIC PARAMETERS
##$FILENAME= C:\NMR/eb-9.jdf
##$TITLE= S#500222
##$AUTHOR= NMR
##$CREATION=  1-FEB-2018 13:51:30
##$REVISION=  1-FEB-2018 13:58:48
##$CONTENT= CARBON NMR EXPERIMENTn
##$INSTRUMENT= DELTA_NMR
##$SITE= Center College ECP+ 300
##$NODENAME= nmr2
##$DIMENSIONS= 1
##$STORAGE= FLOAT
##$X_FORMAT= COMPLEX
##$X_CURR_POINTS= 32768
##$X_START= 225.07631 $$ppm
##$X_STOP= -25.06868 $$ppm
##$X_TITLE= 13C                            
##$X_ZERO_POINT= 0.39976
##$X_FREQ_FLIP= FALSE
##$X_POINTS= 32768
##$X_PRESCANS= 4
##$X_DOMAIN= 13C
##$X_OFFSET= 100 $$ppm
##$X_FREQ= 75.56823 $$MHz
##$X_SWEEP= 18.90359 $$kHz
##$X_RESOLUTION= 0.57689 $$Hz
##$SOLVENT= CHLOROFORM-D
##$TEMP_GET= 22.1 $$dC
##$ACQ_DELAY= 51.4 $$us
##$DIGITAL_FILTER= FALSE
##$FILTER_FACTOR= 1
##$FILTER_WIDTH= 9.446 $$kHz
##$FILTER_MODE= BUTTERWORTH
##$TRANSITION_RATIO= 0.9
##$ORDERS
##$FACTORS
##$LOCK_STRENGTH= 866
##$LOCK_LEVEL= 200
##$LOCK_GAIN= 27
##$LOCK_OSC_OFFSET= 25.6519 $$kHz
##$LOCK_PHASE= 187 $$deg
##$LOCK_OSC_STATE= 2H OSC ON
##$X_ANGLE= 30 $$deg
##$X90= 9.5 $$us
##$X90_HI= 9 $$us
##$X90_LO= 35 $$us
##$X_90_WIDTH= 9.5 $$us
##$X_PULSE= 3.16667 $$us
##$RELAXATION_DELAY= 1 $$s
##$SCANS= 100
##$PROBE_ID= 1412
##$ITERATIONS= 1
##$FIELD_STRENGTH= 7.0586 $$T
##$TEMP_SET= 25 $$dC
##$SPIN_SET= 15 $$Hz
##$SPIN_GET= 17 $$Hz
##$HE_LEVEL= 75 $$%
##$N2_LEVEL= 82 $$%
##$CHANGER_SAMPLE= 0
##$ADC_CARD= 16/1MHz/20
##$EXPERIMENT= single_pulse_dec
##$OBS_NOISE= WAUGH
##$IRR_NOISE= WALTZ
##$TRI_NOISE= WALTZ
##$QUA_NOISE= WAUGH
##$OBS_PWIDTH= 1 $$us
##$IRR_PWIDTH= 50 $$us
##$TRI_PWIDTH= 1 $$us
##$QUA_PWIDTH= 1 $$us
##$IRR_DOMAIN= 1H
##$IRR_FREQ= 300.52966 $$MHz
##$RECVR_GAIN= 15
##$IRR90= 9.2 $$us
##$TRI90= 10 $$us
##$QUA90= 10 $$us
##$IRR90_HI= 10 $$us
##$QUA90_HI= 10 $$us
##$IRR90_LO= 50 $$us
##$TRI90_LO= 10 $$us
##$QUA90_LO= 10 $$us
##$IRR_OFFSET= 5 $$ppm
##$MOD_RETURN= 1
##$TOTAL_SCANS= 100
##$X_ACQ_DURATION= 1.73343 $$s
##$DELAY_OF_START= 1 $$s
##$ACTUAL_START_TIME= 886340798
##$CLIPPED= FALSE
##$DC_BALANCED= FALSE
##$TRI90_HI= 10 $$us
##$SPIN_LOCK_90= 100 $$us
##$SPIN_LOCK_ATTN= 24.4 $$dB
##$DEUT_GRAD_SHIM_90= 213 $$us
##$DEUT_GRAD_SHIM_ATTN= 9 $$dB
##$IRR_CODE= 146
##$LOCK_STATE= LOCK ON
##$AUTOLOCK_LEVEL= 200
##$SAWTOOTH_RANGE= 5
##$LOCK_STATUS= IDLE
##$LOCK_SETTLE_POINT= 4096
##$LOCK_ACHIEVE_POINT= 0
##$SPIN_ACTION= SPIN ON
##$SPIN_STATE= SPIN ON
##$SPIN_STATUS= SPIN ON
##$SPIN_GAS_SOURCE= AIR
##$TEMP_ACTION= TEMP OFF
##$TEMP_STATE= TEMP OFF
##$TEMP_STATUS= TEMP OFF
##$TEMP_COMP= 0
##$TEMP_DELAY= 0 $$s
$$ [...]
##$VT_PID_STD_WB_H_CBL= 10
##$VT_PID_STD_WB_H_CBH= 0
##$VT_PID_STD_WB_H_HC= 2.4
##$VT_PID_STD_WB_H_HL= 70
##$VT_PID_STD_WB_M_PB= 1.5
##$VT_PID_STD_WB_M_TI= 30
##$VT_PID_STD_WB_M_TD= 5
##$VT_PID_STD_WB_M_CBL= 9.9
##$VT_PID_STD_WB_M_CBH= 2.3
##$VT_PID_STD_WB_M_HC= 2.5
##$VT_PID_STD_WB_M_HL= 70
##$VT_PID_STD_WB_L_PB= 1.3
##$VT_PID_STD_WB_L_TI= 29
##$VT_PID_STD_WB_L_TD= 5
##$VT_PID_STD_WB_L_CBL= 20
##$VT_PID_STD_WB_L_CBH= 20
##$VT_PID_STD_WB_L_HC= 0.6
##$VT_PID_STD_WB_L_HL= 100
##$VT_PID_LONG_0_H_PB= 1.5
##$VT_PID_LONG_0_H_TI= 30
##$VT_PID_LONG_0_H_TD= 5
##$VT_PID_LONG_0_H_CBL= 9.9
##$VT_PID_LONG_0_H_CBH= 2.3
##$VT_PID_LONG_0_H_HC= 2.5
##$VT_PID_LONG_0_H_HL= 70
##$VT_PID_LONG_0_M_PB= 1.5
##$VT_PID_LONG_0_M_TI= 30
##$VT_PID_LONG_0_M_TD= 5
##$VT_PID_LONG_0_M_CBL= 9.9
##$VT_PID_LONG_0_M_CBH= 2.3
##$VT_PID_LONG_0_M_HC= 2.5
##$VT_PID_LONG_0_M_HL= 70
##$VT_PID_LONG_40_H_PB= 1.5
##$VT_PID_LONG_40_H_TI= 30
##$VT_PID_LONG_40_H_TD= 5
##$VT_PID_LONG_40_H_CBL= 9.9
##$VT_PID_LONG_40_H_CBH= 2.3
##$VT_PID_LONG_40_H_HC= 2.5
##$VT_PID_LONG_40_H_HL= 70
##$VT_PID_LONG_40_M_PB= 1.5
##$VT_PID_LONG_40_M_TI= 30
##$VT_PID_LONG_40_M_TD= 5
##$VT_PID_LONG_40_M_CBL= 9.9
##$VT_PID_LONG_40_M_CBH= 2.3
##$VT_PID_LONG_40_M_HC= 2.5
##$VT_PID_LONG_40_M_HL= 70
##$SAMPLE_ACTION= LOADED
##$SAMPLE_STATE= LOAD
##$SAMPLE_STATUS= LOADED
##$AUTOSHIM_MODE= AUTOSHIM OFF
##$AUTOSHIM_DELAY= 3600 $$s
##$AUTOSHIM_TRACK= AUTOSHIM OFF
##$SHIM_MAX_RECALL= MAX FOUND
##$SHIM_NAMES= SHIM_Z0
##$SHIM_Z0= 9198
##$SHIM_Z1= 5125
##$SHIM_Z2= -64
##$SHIM_Z3= -2829
##$SHIM_Z4= -240
##$SHIM_Z5= 46
##$SHIM_Z6= -33
##$SHIM_X= -14
##$SHIM_XZ= 16
##$SHIM_XZ2= 0
##$SHIM_XZ3= 0
##$SHIM_X2= -7
##$SHIM_X2Z= -40
##$SHIM_X3= 0
##$SHIM_Y= 1608
##$SHIM_YZ= 13
##$SHIM_YZ2= 10
##$SHIM_YZ3= 0
##$SHIM_Y2= -11
##$SHIM_Y2Z= -20
##$SHIM_Y3= 0
##$NUM_SCANS= 1
##$END_TIME= 886341088
##$LOCAL_TIME= 886341091
##$PROBE_ATN= 0
##$PROBE_TUNE= 3853
##$PROBE_MATCH= 5069
##$PROBE_COARSE= NONE
##$LF_TUNE_DIAL= 0
##$LF_MATCH_DIAL= 0
##$HF_TUNE_DIAL= 0
##$HF_MATCH_DIAL= 0
##$PASS_RIPPLE= 0.01 $$dB
##$STOP_RIPPLE= 60 $$dB
##$PROBE_RECOVERY= 0 $$us
##$AF_DELAY_RATIO= 0
##$VERSION= 4.3.3
##$X_ACQ_TIME= 1.73343 $$s
##$DEAD_TIME= 0 $$us
##$DELAY= 0 $$us
##$PHASE_PRESET= 3 $$us
##$UNBLANK_TIME= 2 $$us
##$INITIAL_WAIT= 1 $$s
##$NORMALIZED= TRUE
$$ END OF JEOL SPECIFIC PARAMETERS
$$ -------------------------------
##NTUPLES= NMR SPECTRUM
##VAR NAME= FREQUENCY,    SPECTRUM/REAL, SPECTRUM/IMAG, PAGE NUMBER
##SYMBOL=   X,            R,             I,             N
##VAR TYPE= INDEPENDENT,  DEPENDENT,     DEPENDENT,     PAGE
##VAR FORM= AFFN,         ASDF,          ASDF,          AFFN
##VAR DIM=  32768, 32768, 32768, 2
##UNITS= PPM,     ARBITRARY UNITS, ARBITRARY UNITS, 
##FIRST=  2.25076309295504E+02, -1.26541179435631E+02, -4.94007957298532E+01, 1
##LAST=  -2.50686752434227E+01, 2.43575965890304E+01, -3.14515274190163, 2
##FACTOR=  7.63405208102439E-03, 9.82673903041287E-04, 9.82673903041287E-04, 1
##PAGE= N=1
##DATA TABLE=(X++(R..R)), XYDATA
$$ [...]
13661D1197448K3002372j03299165P3285453j3007214r351751M197010p5523126J93526500
$$ 41197448 64199820 -39099345 34186108 21178894 11827143 16024153 -59498973 134027527
13653A34027527j09348028Q8796137O5145331n6776850j48639061j4507297R5807468
$$ 134027527 24679499 113475636 178620967 121844117 -26794944 -41302241 54505227
13646E4505227j3051464M2608637j60739264N7481637m3034062M2877334J12014294
$$ 54505227 41453763 84062400 -76676864 -19195227 -62229289 -19351955 92662339
13639I2662339j04240394P3026954q586318p1388285p2579197M7941082j1172990O4513293
$$ 92662339 -11578055 61448899 52862581 -18525704 -91104901 -43163819 -54336809 10176484
13631A0176484r2854942R3080976O2322719l165304j60427126J33820038Q1068047
$$ 10176484 -82678458 10402518 72725237 69559933 -90867193 42952845 124020892
13624A24020892j31534158P5666691m7898880N2984468l7530824r8862502J32000896
$$ 124020892 -7513266 68153425 20254545 73239013 35708189 -63154313 68846583
13617F8846583J04453260p2662506j17183442J05471749j04675360N7647745n6310708
$$ 68846583 173299843 100637337 -16546105 88925644 -15749716 41898029 -14412679
13610a4412679Q6440690r2117907O4084763Q6118860L2444132q5048934j46865512
$$ -14412679 72028011 -20089896 43994867 130113727 162557859 77508925 -69356587
13603f9356587O7024303J13881748m4671478r5790122P8969412p559141p6100049K0405249
$$ -69356587 -2332284 111549464 66877986 -28912136 50057276 42498135 -33601914 -13196665
13595a3196665K0502163m1643266J7391191Q4926508l6867181o4658278j01824583
$$ -13196665 7305498 -34337768 -16946577 67979931 31112750 -33545528 -135370111
13588a35370111J54902767J02576513n2906254p6447750j1547735Q4907285j5460074
$$ -135370111 19532656 122109169 69202915 -7244835 -18792570 66114715 50654641
13581E0654641j00120124P5460372J5830874N601770P544473o0594089r1024925O5624290
$$ 50654641 -49465483 25994889 41825763 47427533 54972006 -5622083 -96647008 -31022718
13573c1022718P3482128J06263616l0247559j59031976J9841053Q0778085k8084358
$$ -31022718 42459410 148723026 118475467 -40556509 -20715456 60062629 31978271
13566C1978271n4846228k438764J39422990j67388586J00547225j18097754l694382
$$ 31978271 -22867957 -25306721 114116269 -53272317 47274908 -70822846 -74517228
13559g4517228J64872518O6881671k08425836J16734195q0301640k0107501Q4705142
$$ -74517228 90355290 157236961 -51188875 65545320 -14756320 -34863821 49841321
13552D9841321r7055814N0644492m6167161Q1755208j00451495P9928020o7923589
$$ 49841321 -47214493 3429999 -42737162 39018046 -61433449 18494571 -49429018
13545d9429018K4339072K9747802J6522938k19117923K46822039l0032691k4573677
$$ -49429018 -25089946 4657856 21180794 -197937129 48884910 18852219 -5721458
13538e721458o4634303J20388683q8824337J34265127l2004937o0978197n0854801
$$ -5721458 -70355761 50032922 -38791415 95473712 63468775 2490578 -48364223
13531d8364223R4618502r7121258R5921501J7038317j05955377o392610P4918052M0351037
$$ -48364223 46254279 -50866979 45054522 62092839 -43862538 -50255148 24662904 65013941
13523F5013941n8795471j42150281J31092728n1924382R8778628r8422366m635304
$$ 65013941 6218470 -135931811 -4839083 -56763465 42015163 -56407203 -61042507
13516f1042507J52844659j57584810K7944984K3612654l6957587p6906397J46748886
$$ -61042507 91802152 -65782658 -37837674 -14225020 -51182607 -128089004 18659882
13509A8659882n7749328J76506467j92401401m8805780J83030383J5450568l3581073
$$ 18659882 -39089446 137417021 -54984380 -103790160 79240223 94690791 61109718
13502F1109718q9747948j3672138J60745440j73199841J16013082j30952491N0179910
$$ 61109718 -28638230 -42310368 118435072 -54764769 61248313 -69704178 -19524268
13495a9524268R0163841K051547j8993135K3231007j42432947J15683349J30675151
$$ -19524268 70639573 72691120 53697985 76928992 -65503955 50179394 180854545
13488A80854545k22654964P8426206O3070586p8581876q721168j03898148J2903107
$$ 180854545 -41800419 36625787 99696373 21114497 12393329 -91504819 -78601712
13481g8601712J37288395n8308304N6621980k6434625J36668295j59126913M629325
$$ -78601712 58686683 378379 57000359 30565734 167234029 8107116 12736441
13474A2736441N7526055j46626405J34352662m3130942m3766243K7492518j9729559
$$ 12736441 70262496 -76363909 57988753 14857811 -28908432 -1415914 -21145473
13467b1145473j2967054O1445416Q5357454j20687790j3219407P7931601J34584657
$$ -21145473 -34112527 27332889 112690343 -7997447 -21216854 56714747 191299404
13460A91299404k16144997Q9379790r0971600J0238181O8694803l3293419k6043527
$$ 191299404 -24845593 64534197 -26437403 -16199222 52495581 19202162 -6841365
13453f841365j9024939p2900266O5294695J11566321k3186579q3965583P8863935O76987
$$ -6841365 -25866304 -98766570 -33471875 78094446 54907867 -29057716 49806219 50483206
13445E0483206p1540720N5978681k2990450n9094192Q5518723r9583747R4802371
$$ 50483206 -21057514 34921167 11930717 -47163475 38355248 -61228499 33573872
13438C3573872j30802905M3734060K17014608j16737996J2860491L32973o5890129
$$ 33573872 -97229033 -53494973 163519635 46781639 59642130 59975103 -5915026
13431e915026J7010909P7428221o5993954m1152897j1176094M842113J42316458r0461479
$$ -5915026 11095883 88524104 22530150 -18622747 -29798841 -24956728 117359730 26898251
13423B6898251j26906364J42016141j4321603J8399867j58827715K13107097k89859473
$$ 26898251 -100008113 42008028 27686425 46086292 -112741423 100365674 -189493799
13416a89493799J53514672J04840827j41439517J073292o0684450J50013002M1009808
$$ -189493799 -35979127 68861700 -72577817 -71504525 -132188975 17824027 58833835
13409E8833835p2538470l6962850O2136215l548703q581524Q0447867j2099996m7867506
$$ 58833835 -13704635 -50667485 11468730 7920027 -661497 79786370 67686374 19818868
13401A9818868o4199246J2378858P9614566O5004537q0167332M566772j37128178O3288660
$$ 19818868 -44380378 -32001520 47613046 112617583 32450251 37017023 -100111155 -36822495
13393c6822495o69373J03824035o6842491J4250122O8352404r9905472n0480870k1824473
$$ -36822495 -37491868 66332167 -510324 13739798 82092202 -17813270 -68294140 -90118613
13385i0118613J1583806J35388715q5231493j2162978P175212o4634998P4003440j3992543
$$ -90118613 -78534807 56853908 -28377585 -40540563 -33365351 -98000349 -23996909 -37989452
13377c7989452J17307810j23186045N5864850N4522847n4963696r543187p6710102
$$ -37989452 79318358 -43867687 11997163 66520010 11556314 2013127 -74696975
13370g4696975Q2678066P2461273j19225005J00488936M7661816p4533149j2099544
$$ -74696975 7981091 80442364 -38782641 61706295 109368111 34834962 22735418
13363B2735418K9153371J3149637J8381248r9253221J63456414q5173466J264726o7336945
$$ 22735418 51888789 65038426 83419674 -15833547 147622867 62449401 63714127 -3622818
13355c622818M7845674q3898382J05301494J2835287O0756017o0504458j17697756
$$ -3622818 44222856 -39675526 65625968 78461255 139217272 78712814 -38984942
13348c8984942N0876694p0965138O9141307j14418156J54254758r4646014M455231K951526
$$ -38984942 11891752 -59073386 10067921 -104350235 49904523 -44741491 -40286260 -37334734
13340c7334734Q2302344q869383P5742846q8746386L8341681j02860506k0693357O7161905
$$ -37334734 44967610 36098227 111841073 23094687 61436368 -41424138 -62117495 5044410
13332E044410o13534L0672981k1029556N4302756m2657853L147139L0833945j5317648
$$ 5044410 4430876 35103857 14074301 68377057 25719204 28866343 59700288 44382640
13324D4382640O8757954l7166176r0035679k9934494M5045956p1191971L0510633
$$ 44382640 113140594 75974418 -14061261 -43995755 1050201 -70141770 -39631137
13317c9631137J45118093j09949031O3768053q5464302O4277455J392263j09995365
$$ -39631137 105486956 -4462075 59305978 -26158324 38119131 39511394 -70483971
13310g0483971P8181608k1904445R0437479k13738509J40071358P1364754n6781113
$$ -70483971 7697637 -14206808 76230671 -137507838 2563520 73928274 17147161
13303A7147161N9342581p8607389p1960368r206237J07752189o1909934L247907p526091
$$ 17147161 76489742 -2117647 -74078015 -83284252 24467937 -37441997 -34194090 -41720181
13295d1720181J51542314j48586881O8768726j19612786O1596746L7184244l8186271
$$ -41720181 109822133 -38764748 30003978 -89608808 -28012062 9172182 -29014089
13288b9014089N7086421m325636K4676258j32599613K8341180r498633P8636565K1355126
$$ -29014089 28072332 23746696 48422954 -84176659 -55835479 -65334112 13302453 34657579
13280C4657579n5962690k8461280j2187269j8682635R7515935l2413933o8777728
$$ 34657579 -21305111 -49766391 -61953660 -80636295 16879640 -15534293 -84312021
13273h4312021J46717323m6756733m3796943n4731518J36707162j00282665L9041266
$$ -84312021 62405302 15648569 -28148374 -82879892 53827270 -46455395 -7414129
13266g414129K007777J39591160j57351049k4614194j3832197J8220450m973436k4097579
$$ -7414129 -5406352 134184808 -23166241 -47780435 -61612632 -43392182 -48365618 -72463197
13258g2463197l8166600J76936750p0474527l1562690J40495089j63830197l577086
$$ -72463197 -110629797 66306953 -4167574 -35730264 104764825 -59065372 -62642458
13251f2642458M8288423J047834J9957836r7664746J42266456j09345910O3014451
$$ -62642458 -14354035 -13306201 6651635 -91013111 51253345 -58092565 4921886
13244D921886l6897596j3928399P7780019J3137135m4703891j1301209p7082926R2091590
$$ 4921886 -31975710 -45904109 31875910 45013045 309154 -10992055 -88074981 4016609
13236D016609l6980958O9885593r3749955M1138108J12448484r7740038j16056186
$$ 4016609 -32964349 36921244 -56828711 -15690603 96757881 -982157 -117038343
13229a17038343J36430118J6374974N5670221o1440572k8367234k9174867L3372368
$$ -117038343 19391775 35766749 91436970 29996398 1629164 -27545703 5826665
13222E826665r834246l0279072j0491609M1786038J4524253n3216803J6674017O404717
$$ 5826665 -4007581 -34286653 -44778262 -2992224 11532029 -41684774 -25010757 -18606040
13214a8606040L1981953n5693252J38625140j63269839k4891501Q3660853k3095609
$$ -18606040 13375913 -42317339 96307801 -66962038 -91853539 -8192686 -31288295
13207c1288295n7908844J6115944P5149116k3679792k0845318O5622167j3696211o2274708
$$ -31288295 -89197139 -73081195 2067921 -21611871 -42457189 23164978 9468767 -52805941
13199e2805941Q5295798L0961905q7927863l5821081q953211J4764834P468716K5323922
$$ -52805941 32489857 63451762 -24476101 -60297182 -69250393 -54485559 -47016843 -21692921
13191b1692921m0738232J57264362M867953p7454118K1839575l4549798o4678364
$$ -21692921 -62431153 94833209 99701162 22247044 44086619 9536821 -55141543
13184e5141543J33716355k549199o045423j15783478J48628599j94135201J31663222
$$ -55141543 78574812 76025613 69980190 -45803288 102825311 -91309890 40353332
13177D0353332o2756737l5057754J22105371j23080302J47948067n8615519O2179166
$$ 40353332 -22403405 -57461159 64644212 -58436090 89511977 30896458 93075624
13170I3075624j04677604Q4026087r6759608M0519394j10671542P0668049K8622470
$$ 93075624 -11601980 72424107 -24335501 16183893 -94487649 -23819600 4802870
13163D802870o9691543K6403797O1742049P3796224n8544781N390301j5385877l3454931
$$ 4802870 -64888673 -38484876 23257173 97053397 38508616 43898917 28513040 -4941891
13155d941891M9899576p5738237n4923195N1740237P046099k5151760O0236279J76404506
$$ -4941891 44957685 -30780552 -85703747 -33963510 -26917411 -52069171 8167108 184571614
13147A84571614j60490288K0458629P465248L9656589k08134328J7841290K7902747
$$ 184571614 24081326 44539955 52005203 91661792 -116472536 -98631246 -70728499
13140g0728499N3673174m1250142R6674874o1605302Q1215592j56103963J32778751
$$ -70728499 -17055325 -58305467 38369407 -23235895 57979697 -98124266 34654485
13133C4654485L8588560j41236604J39975127j42855546O2785436q3697360J08565189
$$ 34654485 73243045 -67993559 71981568 -70873978 -8088542 -91785902 16779287
13126A6779287o0557453L8963546J39442665k13258580Q7663303p926526k3353277
$$ 16779287 -43778166 -4814620 134628045 -78630535 9032768 1106242 -22247035
13119b2247035Q8231813p7130934J00961183M81426825n35000006j34907398R7273918
$$ -22247035 65984778 -11146156 89815027 571241852 36241846 -98665552 -1391634
13112a391634O6082740r876345j46598805L5045879J8377288R179882Q6318984o7834664
$$ -1391634 64691106 54814761 -91784044 -56738165 -38360877 -29180995 57137989 -10696675
13104a0696675j4165842l1039045k5975388L1149120J07502646p3601685K219433P3461522
$$ -10696675 -24862517 -55901562 -81876950 -50727830 56774816 -16826869 -14607436 58854086
13096E8854086n5603289j05400420J00117200R8746805k34501978J06968332J4790160
$$ 58854086 3250797 -102149623 -2032423 96714382 -137787596 -30819264 -16029104
13089a6029104j9848143j8546958J4884367j54146517J21875613n10702634O28809123
$$ -16029104 -35877247 -54424205 -39539838 -193686355 -71810742 -582513376 46295747
13082D6295747L0392561r3799380P7262541N8624588r7585823p6999541J6081498n667227
$$ 46295747 76688308 -17111072 60151469 118776057 21190234 -55809307 -39727809 -45395036
13074d5395036J99605186o2943651n0337111n5478784M3040251P3498533l1194975
$$ -45395036 154210150 91266499 40929388 -14549396 28490855 101989388 70794413
13067G0794413o1992441N4150631J7843878K2615222l6076616k4220773q2026033R0317708
$$ 70794413 8801972 62952603 80796481 103411703 67335087 43114314 -38911719 51405989
13059E1405989P7522421j30813675l5230340k6669659L9920438O6854255j03502500
$$ 51405989 128928410 -1885265 -37115605 -63785264 -23864826 42989429 -60513071
13052f0513071j23655383L19262872j43336682N7951507q9014032K6382250p069517
$$ -60513071 -184168454 135094418 -8242264 49709243 -39304789 -12922539 -19992056
13045a9992056j12949788J86293156k9343988r2085911J12647505q902267K8273170
$$ -19992056 -132941844 53351312 24007324 -68078587 44568918 35666651 63939821
13038F3939821m6325201M9908106l2829699n1202697q3250739P4100049K0947914l1926484
$$ 63939821 17614620 67522726 34693027 -16509670 -99760409 -25660360 -4712446 -36638930
13030c6638930L9890634J29855265p7628202n3712869P9864117q1916232L4148022
$$ -36638930 3251704 133106969 55478767 1765898 81630015 -286217 33861805
13023C3861805q2921794P2544203m9440546j26620874J26749561Q6007900j3448260
$$ 33861805 -49059989 23484214 -25956332 -152577206 -25827645 60180255 46731995
13016D6731995p6991307Q2071667m8805448Q1584241j44699511P1498545j0159018
$$ 46731995 -30259312 51812355 3006907 84591148 -60108363 11390182 1231164
13009A231164q4838833P8464449P1994919o3982265n432174O6764133j10786214J02857809
$$ 1231164 -83607669 -5143220 66851699 2869434 -2562740 64201393 -46584821 56272988
13001E6272988j12143084p530888j7441897L2544138J03520779k6010290J1306466
$$ 56272988 -55870096 -63400984 -80842881 -48298743 55222036 29211746 40518212
12994D0518212n9158481O4319942r7052421J03098146j26733356M5629250j03131216
$$ 40518212 -18640269 45679673 -51372748 51725398 -75007958 -29378708 -132509924
12987a32509924J25460268q7030110J00979137r5894819R8965780K3402764k945206
$$ -132509924 -7049656 -94079766 6899371 -88995448 9970332 33373096 30427890
12980C0427890K1391524j15008988o6187528R0246925j2586465N0845335P608559Q1087794
$$ 30427890 51819414 -63189574 -129377102 -39130177 -51716642 -871307 6737252 87825046
12972H7825046n4330079q3141272M6353509L8311724q2087545R7101550L0850353m8751073
$$ 87825046 33494967 -49646305 -3292796 35018928 -47068617 50032933 80883286 32132213
12964C2132213l0014986r9914781J53819384K8631438m8544124m6578186Q0874288
$$ 32132213 2117227 -97797554 56021830 84653268 36109144 -10469042 70405246
12957G0405246q1748089j28020181J45076375J26688546j80924581J57719077j565767
$$ 70405246 -11342843 -139363024 5713351 132401897 -48522684 109196393 107630626
12950A07630626o0077497o6214041K0669246J33711434o8864988k22671158J96827235
$$ 107630626 47553129 -18660912 2008334 135719768 66854780 -155816378 41010857
12943D1010857N9370727q2451880j11500095J76652617K6829991r3638083K0378390
$$ 41010857 100381584 17929704 -93570391 83082226 109912217 16274134 36652524
12936C6652524L929472q126343l1507221n647347K7558545j62759865M2535754J32287310
$$ 36652524 40581996 32455653 948432 -4698915 22859630 -139900235 -97364481 34922829
12928C4922829N8906463j32449543k8931248J3997441j8117740N2425350o3271433
$$ 34922829 93829292 -38620251 -67551499 -53554058 -71671798 -19246448 -82517881
12921h2517881M3373442k473052L1406680l3733512r9206900p975302J72659128j0440083
$$ -82517881 -39144439 -41617491 -10210811 -43944323 -143151223 -151126525 21532603 11092520
12913A1092520J9263102o7395620l7169532R258400L4954671L8257399M762066j90432461
$$ 11092520 30355622 -37039998 -74209530 -64951130 -29996459 8260940 13023006 -177409455
12905a77409455J99114339o6505585k4800815k3655604J15540027Q3514053n4599666
$$ -177409455 21704884 -44800701 -69601516 -93257120 22282907 105796960 51197294
12898E1197294j03603364J36256174j4145208j76443394Q8924221r0620112R591731
$$ 51197294 -52406070 83850104 69704896 -106738498 -17814277 -108434389 -98842658
12891i8842658N5737192J05632908K8738901n4723142l8082398L7827150O884832r4810763
$$ -98842658 -43105466 62527442 91266343 36543201 -1539197 36287953 43172785 -51637978
12883e1637978q6198185K12889338n8223649k0431286o6803944J92736328m0071183
$$ -51637978 -137836163 75053175 16829526 -3601760 -70405704 122330624 82259441
12876H2259441p4381500M6108729J7881920j14921717l0432707K4541360q221757P7011938
$$ 82259441 7877941 53986670 71868590 -43053127 -73485834 -48944474 -57166231 19845707
12868A9845707l6932705R8912315j8288122q2416616L2380835P1469251m8188664r506267
$$ 19845707 -17086998 81825317 63537195 -18879421 13501414 84970665 36782001 27275734
12860B7275734m2287387k5815511J16385862n7758657m4688903L9915666j3828029
$$ 27275734 -15011653 -40827164 75558698 17800041 -26888862 13026804 -801225
12853h01225R9246039j44992464O058816J14032597J9870920q5378405J8751918r3702328
$$ -801225 98444814 -46547650 -40488834 73543763 93414683 8036278 26788196 -66914132
12845f6914132J00820496o0791919Q5649671n0331446l8325994l8251662O1869890p099556
$$ -66914132 33906364 -26885555 58764116 8432670 -29893324 -68144986 -6275096 -13374652
12837a3374652K6757585o1035484O1714636L8505603j90479060J60544186P0790573
$$ -13374652 13382933 -47652551 14062085 52567688 -137911372 22632814 93423387
12830I3423387J9208187j00272004j49178417J18417546j28764985K71680942j12814408
$$ 93423387 112631574 12359570 -136818847 -18401301 -147166286 124514656 11700248
12823A1700248p4986472j3909291O4646312N4206544k224475m3087187p3525216O5146702
$$ 11700248 -63286224 -77195515 -12549203 41657341 39432866 -3654321 -77179537 -12032835
12815a2032835J01019103k16074912j0138371J29537278j46015420J75972543Q470006
$$ -12032835 88986268 -127088644 -137227015 -7689737 -153705157 22267386 30737392
12808C0737392o0560286N6277881N0206952m5828209n4544976R7754698q4589438P339987
$$ 30737392 -29822894 26454987 76661939 30833730 -23711246 74043452 -10545986 -3205999
12800c205999q205643J6496629q8999418p940347P6796789J3811913J00476889n3367896
$$ -3205999 -11411642 5084987 -83914431 -91854778 -15057989 -1246076 99230813 45862917
12792D5862917N9401769j7163116r4313566r5912335J31021377j1744962J1219695
$$ 45862917 105264686 88101570 -6211996 -102124331 28897046 17152084 28371779
12785B8371779L7601017n1122447N238742n7391412J36934654m4582947j02797590
$$ 28371779 65972796 14850349 20089091 -37302321 99632333 55049386 -47748204
12778d7748204J09371767j1815892j47264507J14747876j39322399K18503325j9555734
$$ -47748204 61623563 49807671 -97456836 17291040 -122031359 96471966 76916232
12771G6916232J1990890m5253100O736501j7242373o0581171N2624893J40409281
$$ 76916232 88907122 43654022 50390523 33148150 -27433021 25191872 165601153
12764A65601153l18541584K63223004q4933620j1080824j8796110K3247827P5480858
$$ 165601153 -152940431 110282573 25348953 14268129 -4527981 18719846 94200704
12757I4200704o1383129q0886164J38171415n1719371N1153508j26975725L7882005
$$ 94200704 32817575 -48068589 90102826 38383455 89536963 -37438762 443243
12750D43243k6731522P5153991j19266921J92915286o9460105K5772000n2072967P9568557
$$ 443243 -26288279 48865712 -70401209 122514077 53053972 78825972 26753005 106321562
12742A06321562j21271698m9139755J67411898o4632235r0330843J16146309o8299128
$$ 106321562 -14950136 -64089891 103322007 38689772 -51641071 64505238 -3793890
12735c793890O7182806o5201779q0976722L0115136J53791878j31416422K1358720M551676
$$ -3793890 63388916 -1812863 -82789585 -52674449 101117429 -30298993 -8940273 -4388597
12727d388597J4083730q3226341K47825738k63164804n9528209N6201955J00325372
$$ -4388597 9695133 -73531208 174294530 -88870274 -148398483 -92196528 8128844
12720H128844k5044711M1520930m1031494N770975O2663801r4037453m2822465J03346286
$$ 8128844 -16915867 24605063 -16426431 -10655456 52008345 -42029108 -84851573 18494713
12712A8494713m6200602L1154052n7176184Q6526280r4131949j7824804P0147763O7271013
$$ 18494713 -27705889 3448163 -53728021 32798259 -61333690 -79158494 -9010731 58260282
12704E8260282q0862164N274647P9909018j21059126j6616435J16732134K1231546l969236
$$ 58260282 -22601882 -17327235 62581783 -58477343 -75093778 41638356 62869902 58900666
12696E8900666q630659n3760961M9301597K3017202j8866801j952125l2377337p2698498
$$ 58900666 50270007 -3490954 45810643 68827845 49961044 48008919 15631582 -57066916
12688e7066916O4945345P674947j36233577J93653774L7681424k5563647o5470353
$$ -57066916 7878429 15553376 -120680201 72973573 110654997 85091350 19620997
12681A9620997l2594243N3771617o1722987l5755570O2140396n6978292J63268299
$$ 19620997 -12973246 40798371 -20924616 -56680186 5460210 -51518082 111750217
12674A11750217j76908973N6428816k2912831L49622O3838489m6189122l9482765O6311598
$$ 111750217 -65158756 -8729940 -31642771 -31293149 32545340 -13643782 -53126547 13185051
12666A3185051j53922444P8628931J1068214K8894519J2917439K0033113K9902581
$$ 13185051 -140737393 -62108462 -51040248 -22145729 -9228290 10804823 40707404
12659D0707404j26873233k2391873J01622179o6134812J910281N0063852j2984558
$$ 40707404 -86165829 -108557702 -6935523 -73070335 -71160054 -21096202 -34080760
12652c4080760K9956696n0473768l9587047K1819291J79763199r8729370Q199962q081393
$$ -34080760 -4124064 -54597832 -94184879 -72365588 107397611 8668241 16868203 8786810
12644H786810L7331219j30770226J17615112o9530233o7968611Q5078620M6497654
$$ 8786810 46118029 -84652197 32962915 -36567318 -104535929 -19457309 27040345
12637B7040345k0526713j24275186P1272926J77457436m0630205o5957464M8720579
$$ 27040345 6513632 -117761554 -46488628 130968808 90338603 24381139 73101718
12630G3101718j12739175R1233181j22781900J61717105j24634561N9535109j0753364
$$ 73101718 -39637457 51595724 -71186176 90530929 -34103632 25431477 14678113
12623A4678113j506322r8713006R5371366M1305781M7061338K498668M5448621j59198523
$$ 14678113 13171791 -85541215 9830151 51135932 98197270 100695938 146144559 -13053964
12615a3053964M4358906k8897150L7430300p6179786J29255745j7806700m7569804
$$ -13053964 31304942 2407792 39838092 -36341694 92914051 75107351 27537547
12608B7537547J7295200p7173537R7334485M333587m3616794o446480O331787J2918613
$$ 27537547 44832747 -32340790 64993695 69327282 25710488 19264008 25595795 38514408
12600C8514408q9933451J75304868j9192682o6200823J0337283L4299549o7322135
$$ 38514408 -51419043 123885825 104693143 38492320 48829603 83129152 15807017
12593A5807017j12662307J09769034n4824092J10179313J0524383p6621750J21765010
$$ 15807017 -96855290 12913744 -41910348 68268965 78793348 2171598 123936608
12586A23936608q7980119j06119398J56807999k7541356m1681381k2797038L8536101
$$ 123936608 35956489 -70162909 86645090 59103734 17422353 -5374685 33161416
12579C3161416J24307704j97839508P47995J18509035p3188727L4173987l7883606
$$ 33161416 157469120 -40370388 -39622393 78886642 5697915 39871902 1988296
12572A988296L9515706J00698162j50558576O340697N9118127K41690l279311n3263155
$$ 1988296 41504002 142202164 -8356412 -2015715 57102412 57344102 54064791 801636
12564H01636J25284105k02903138O4396748P0812841j40619965Q7311485Q964188N0197579
$$ 801636 126085741 -76817397 -12420649 58392192 -82227773 5083712 14047900 64245479
12556F4245479l6446871n5819520Q469633M8720891K0590982J2698316j56816327
$$ 64245479 27798608 -28020912 -19551279 29169612 49760594 62458910 -94357417
12549i4357417J30205428j10530140P9198917n289880n8139299J76586866n3452232
$$ -94357417 35848011 -74682129 4516788 -773092 -58912391 117674475 64222243
12542F4222243N0708824n3147906j2367656m7421629O1113729r4566656J49785806
$$ 64222243 114931067 61783161 49415505 1993876 63107605 -31459051 118326755
12535A18326755j25331485J9403428l7520506Q6669239j03565300K8384093Q3540410
$$ 118326755 -7004730 12398698 -25121808 61547431 -42017869 -13633776 69906634
12528F9906634M6447460j73610229Q3187473J5275785l0500074N6693033r6662513J954661
$$ 69906634 116354094 -57256135 25931338 41207123 10707049 67400082 -29262431 -27307770
12520b7307770j1003848O5136242k2380124k5858915l4236798k073552N6560620m9529193
$$ -27307770 -38311618 26824624 4444500 -21414415 -55651213 -57724765 -1164145 -50693338
12512e0693338K4489310k4183416K13418182j43819359n8246398O4250587j10014358
$$ -50693338 -26204028 -50387444 163030738 19211379 -39035019 25215568 -84798790
12505h4798790L7211894N0722624L7181439q4270027R4329831j16444589J30900147
$$ -84798790 -47586896 3135728 40317167 -43952860 50376971 -66067618 64832529
12498F4832529l6169370J3476145o6889655j8913587M3793811L2424243k2944928r52381
$$ 64832529 28663159 42139304 -24750351 -43663938 129873 32554116 9609188 8656807
12490H656807L8226107L8710069l813618k41241907M8036842L9925107R0900010k1340779
$$ 8656807 46882914 85592983 81779365 -159462542 -111425700 -71500593 19399417 -1941362
12482a941362m0525972J1984582n8046054J21198978J5404322m9737100o995667P9530672
$$ -1941362 -42467334 -30482752 -88528806 32670172 48074494 -1662606 -8658273 70872399
12474G0872399n2617430P866694j78648371O5918740N5862307J3423434k8319085j2725967
$$ 70872399 18254969 26121663 -152526708 -86607968 -30745661 -17322227 -45641312 -58367279
12466e8367279K2024976Q9118494L8649306l0362779j16709919L0085416J16131467
$$ -58367279 -36342303 52776191 91425497 61062718 -55647201 -25561785 90569682
12459I0569682j42472912L8750183j86704188N8706745N1574694M9695477k97328N3474895
$$ 90569682 -51903230 -13153047 -199857235 -141150490 -89575796 -39880319 -40177647 13297248
12451A3297248J914851p060799J04804364j64857693j4233883J28027877j9522731
$$ 13297248 15212099 8151300 112955664 -51902029 -66135912 61891965 42369234
12444D2369234m1667979M720594l4904213l0340640R3219043m3252851M4224395l2131720
$$ 42369234 701255 5421849 -29482364 -59823004 33396039 -9856812 34367583 2235863
12436B235863N5693543j04189358R5563330p1181590o1875109P8510142j3721692n4319166
$$ 2235863 57929406 -46259952 49303378 -21878212 -83753321 -5243179 -18964871 -73284037
12428g3284037J21690505p872863r8477410R1848736m6798645K7707514m6818011R1507650
$$ -73284037 48406468 40533605 -57943805 33904931 -12893714 14813800 -32004211 59503439
12420E9503439R084277r5478151P2826234r799171r5605650R2884616o7098691R1586933
$$ 59503439 68587716 -26890435 45935799 36136628 -59469022 33415594 -33683097 57903836
12412E7903836m1458521J2969317p1824220j0752417l8534881P1146373J63750070
$$ 57903836 16445315 29414632 -42409588 -53162005 -91696886 -20550513 143199557
12405A43199557j09035006j22659609Q2892053m91343r1366388J43374232j7227921
$$ 143199557 34164551 -88495058 -5603005 -6094348 -97460736 45913496 28685575
12398B8685575o5164911K6045432l2029240k7337160r2511863J74104689N3681103
$$ 28685575 -36479336 -10433904 -42463144 -69800304 -162312167 11792522 65473625
12391F5473625l4377960k9419118n5661842Q739870N2807187j48779698O7867362M790926
$$ 65473625 31095665 1676547 -53985295 -45245425 7561762 -141217936 -73350574 -68559648
12383f8559648P6619250K313860n243386l4346863Q278274J814487L2231873L5334172
$$ -68559648 8059602 10373462 5130076 -29216787 -20938513 -19124026 13107847 48442019
12375D8442019K46984j34947915J08025714M2875444m2928021k3056263N52588P0857130
$$ 48442019 48689003 -86258912 21766802 64642246 21714225 -1342038 -789450 70067680
12367G0067680L1193342j69996597O0539330l2279116n3006718N1173962M8364745l259628
$$ 70067680 101261022 -68735575 -8196245 -40475361 -93482079 -42308117 6056628 2797000
12359B797000j3130157P8880538o9249785m6029246K7457819Q0202391m7057902k5447992
$$ 2797000 -10333157 68547381 -702404 -46731650 -19273831 60928560 13870658 -11577334
12351a1577334q6501451J04434096j39896137O3468955O3694106p2832611J60714177
$$ -11577334 -98078785 6355311 -133540826 -70071871 -6377765 -79210376 81503801
12344H1503801M9889805j22842594m5477566P5649426q9474097J05763859j11770753
$$ 81503801 131393606 8551012 -36926554 38722872 -50751225 55012634 -56758119
12337e6758119J55523691j26546846J88050343r7851669r5905288J08721923m1731885
$$ -56758119 98765572 -27781274 160269069 62417400 -33487888 75234035 33502150
12330C3502150n3431391R6070499k6587237j44743711J95620040j27154659l1633213
$$ 33502150 -19929241 76141258 49554021 -95189690 100430350 -26724309 -58357522
12323e8357522J46507713L4707579p9129443K0994741q9336888k0890975L15514M0634554
$$ -58357522 88150191 122857770 43728327 64723068 -24613820 -45504795 -45189281 -4554727
12315d554727r237535K1468254k1042749P2187276q9481591P1274771k1002897J2484874
$$ -4554727 -13792262 7675992 -13366757 58820519 -30661072 40613699 19610802 32095676
12307C2095676n1982643J6110247P187084Q6726946o8595496j10185258J41658191
$$ 32095676 -19886967 -3776720 3410364 90137310 21541814 -88643444 53014747
12300E3014747O0379069o4242244J6030146l4479363j06652776R9540557O2608677
$$ 53014747 113393816 49151572 65181718 30702355 -75950421 23590136 86198813
12293H6198813l3546202j2872929m8731388k2652507J25728854p6709663r9385991
$$ 86198813 52652611 39779682 -8951706 -31604213 94124641 17414978 -81971013
12286h1971013M5714186K2131870K084304q705269M136091o287945J07985184p8929770
$$ -81971013 -36256827 -14124957 -12040653 -20745922 -16609831 -22897776 85087408 6157638
12278F157638m4881352R4866965j34315080J65141047j15293727K9830596M9444210
$$ 6157638 -38723714 56143251 -78171829 86969218 -28324509 1506087 50950297
12271E0950297j18209208J67006950j05564457k9876278J39690759o9657141j44764281
$$ 50950297 -67258911 99748039 -5816418 -35692696 103998063 34340922 -110423359
12264a10423359J68006181n7777325N3774874k0617224n0217305L1354070o3695918
$$ -110423359 57582822 -194503 53580371 32963147 -17254158 14099912 -49596006
12257d9596006O6901668j8529977l7249788j4305806K8229798N8026311k9272084k5295316
$$ -49596006 17305662 -1224315 -38474103 -52779909 -24550111 33476200 4204116 -21091200
12249b1091200n428079N8054731J647646k9330620r438801m7537775L5639478L9188086
$$ -21091200 -26519279 31535452 33183098 3852478 -5586323 -53124098 -17484620 21703466
12241B1703466m6430278l0511166N0033114M7089245p277821K4276358p1408713M8637971
$$ 21703466 -24726812 -55237978 -5204864 41884381 34606560 58882918 -12525795 36112176
12233C6112176n502289p2969790R6867192q812653k3046174n9092754J43449164m3175641
$$ 36112176 30609887 -42359903 54507289 45694636 22648462 -36444292 107004872 63829231
12225F3829231k4221055L1266376j62973515K67864889q1258376q7855787j23405772
$$ 63829231 39608176 70874552 -92098963 175765926 94507550 6651763 -116754009
12218a16754009M0612534J22083401r2776636O3313367J0025954L9712887q5285290
$$ -116754009 -76141475 45941926 -46834710 16478657 26504611 66217498 -19067792
12211a9067792K69655248l24430928Q1372840M6938519L2140830n5571464j32182668
$$ -19067792 250587456 -73843472 7529368 54467887 86608717 31037253 -101145415
12204a01145415J08335553o3402019N2922452k9416003L768494m1709331J31436754
$$ -101145415 7190138 -56211881 -3289429 -32705432 -28936938 -70646269 60790485
12197F0790485k2216410m036569K6118919j04924612n4579076J22308885m2097010
$$ 60790485 38574075 34537506 60656425 -44268187 -98847263 23461622 -18635388
12190a8635388n2973546J35038208j77321798Q1996700M9694358J6355377M0618234
$$ -18635388 -71608934 63429274 -113892524 -31895824 17798534 34153911 74772145
12183G4772145q2328730J41952880k10080845L5261042p6679027O3088275J58435310
$$ 74772145 -7556585 134396295 -75684550 -40423508 -117102535 -54014260 104421050
12176A04421050j12679980l3946250K5365623l425504Q3248455n9702176m4734689
$$ 104421050 -8258930 -42205180 -16839557 -20265061 62983394 3281218 -41453471
12169d1453471J18496176j23223701j1365317N0026379j19466380J92518228l5401148
$$ -41453471 77042705 -46180996 -57546313 -7519934 -126986314 65531914 30130766
12162C0130766M4928354l2366566j8534054l7778516j7976944J73083342k06013504
$$ 30130766 75059120 42692554 24158500 -13620016 -31596960 141486382 -64527122
12155f4527122J4363744m9249858J47351389m7721543r8511412O7598138K2707309O477161
$$ -64527122 -50163378 -99413236 47938153 216610 -98294802 -30696664 -7989355 -1512194
12147a512194J9562563j27743087J62355353j55072638r466903M2322228K3631759
$$ -1512194 18050369 -109692718 52662635 -102410003 -111876906 -69554678 -45922919
12140d5922919l0970165J19671341m9543676N6911018j8547619q8544800j8381186
$$ -45922919 -76893084 42778257 -6765419 50145599 31597980 -56946820 -75328006
12133g5328006k3733171J08362874n2480569K7248268N6178398j16546204o24106
$$ -75328006 -99061177 9301697 -43178872 -15930604 40247794 -76298410 -76922516
12126g6922516J52509794j36119072J01728878O2383344o4376653j99388273J46830615
$$ -76922516 75587278 -60531794 41197084 103580428 39203775 -160184498 -13353883
12119a3353883m5142652K8543818J04509898r3265483p1822292J74463170n148463L183412
$$ -13353883 -58496535 -29952717 74557181 -18708302 -90530594 83932576 78784113 81967525
12111H1967525n9835903k1949403j1448325R9122990j57775812n918354p492315J49151531
$$ 81967525 22131622 182219 -11266106 87856884 -69918928 -75837282 -83329597 65821934
12103F5821934j1637743j30553840J12108494o3479581M7578516O7624010k2261247
$$ 65821934 54184191 -76369649 35738845 -27740736 19837780 87461790 65200543
12096F5200543j5647461r5485392L4073125j0779762Q861763J1439909J12720903
$$ 65200543 49553082 -45932310 -11859185 -22638947 -13777184 -2337275 110383628
12089A10383628j54088956J24627316j6888096k9158285n973138P080212j1971060
$$ 110383628 -43705328 80921988 64033892 34875607 28902469 35982681 24011621
12082B4011621k7924192R0001085j71057424R6226212K1017968J1644358l0750034l072791
$$ 24011621 -3912571 86088514 -84968910 11257302 32275270 43919628 13169594 10096803
12074A0096803L1145266j35144103J46054981o9732865K7080143m6510538L5774776
$$ 10096803 41242069 -93902034 52152947 -17579918 9500225 -37010313 -1235537
12067a235537k0125858M8987888q5701863J04833566o3451560Q459278K6000148l9252845
$$ -1235537 -21361395 27626493 -58075370 46758196 -16693364 -8234086 17766062 -21486783
12059b1486783j02693974k4165905J09328721O6875077r6554637J39676043q2815408
$$ -21486783 -124180757 -148346662 -39017941 27857136 -68697501 70978542 -11836866
12052a1836866J56123263j53461645o6954244R1299907m9812830l2064451J19036602
$$ -11836866 144286397 -9175248 -76129492 15170415 -34642415 -66706866 52329736
12045E2329736o7698665o4817920O1861002M0818940J27203510j56645619J48639218
$$ 52329736 -15368929 -80186849 -18325847 22493093 149696603 -6949016 141690202
12038A41690202r3831973j06903058J7906619J0859934N8111630k1222768p0658851
$$ 141690202 47858229 -59044829 -41138210 -30278276 27833354 6610586 -64048265
12031f4048265P4945131R136099o1953891J7977200j878583R9983068l6155817l8404036
$$ -64048265 10896866 20032965 -41920926 -23943726 -25822309 74160759 38004942 -399094
12023c99094j03196584Q1281634j12597778J20840064Q2159777J1978412r6560797
$$ -399094 -103595678 -22314044 -134911822 -14071758 68088019 80066431 -16494366
12016a6494366j17858809J35695522L9271540j36878876K022158J64547929q1729632
$$ -16494366 -134353175 1342347 40613887 -96264989 -94242831 70305098 -11424534
12009a1424534k2462308K5720403l0851375M8509773J9677729r9815996J42829291
$$ -11424534 -33886842 -8166439 -39017814 9491959 29169688 -70646308 72182983
12002G2182983j00123423o6091415O783201P6546405p7424329J47014279l5244733
$$ 72182983 -27940440 -94031855 -87248654 -10702249 -88126578 58887701 23642968
11995B3642968p3070004m8189795J9961682Q0988545m8036769N714827q256445J22753667
$$ 23642968 -49427036 -97616831 -77655149 3333396 -44703373 -38988546 -47244991 75508676
11987G5508676j33244797k239862k6134074m4643472J23486237M0417930j27274811
$$ 75508676 -57736121 -59975983 -86110057 -130753529 -7267292 33150638 -94124173
11980i4124173l3902737J06921735O943428M4812912K4622998m9295315k0246712Q5125233
$$ -94124173 -128026910 -21105175 -14161747 30651165 55274163 5978848 -14267864 70857369
11972G0857369o7317445j9600289k0569115n7072443J50335459R637519q9695079O5033342
$$ 70857369 3539924 -16060365 -36629480 -93701923 56633536 66271055 -23424024 41609318
11964D1609318l96915j6859759j5905544J9245381L5236943n9398402r1932270R5750821
$$ 41609318 41212403 24352644 8447100 27692481 62929424 3531022 -88401248 7349573
11956G349573j4901949L7547256j34413794J35672501N3968144J3403772j34569831
$$ 7349573 -7552376 29994880 -104418914 31253587 85221731 98625503 -35944328
11949c5944328J9975924r014553K9674826m379078l5717202k5763207N2834522R137208
$$ -35944328 -15968404 -24982957 4691869 312791 -35404411 -61167618 -8333096 804112
11941H04112l3300412L5562590o4984603M1587509K4840530L1050985j7188053q9957289
$$ 804112 -32496300 3066290 -61918313 -20330804 4509726 35560711 18372658 -71584631
11933g1584631k2661471J53837963r5710074M2544527L1059274M1705826L5832316
$$ -71584631 -94246102 59591861 -36118213 6426314 37485588 79191414 115023730
11926A15023730n1536541j43704374N1068336J01396108k9622792l2317502l9954718
$$ 115023730 63487189 -80217185 -29148849 72247259 42624467 10306965 -29647753
11919b9647753J5813783n8444187J25641596p5450122L4601743P0688159m7222558
$$ -29647753 -13833970 -72278157 53363439 -22086683 12515060 83203219 35980661
11912C5980661K2109473n789561p4785488J02893867k7663521o6606126Q827938K7467539
$$ 35980661 58090134 52300573 -22484915 80408952 52745431 -13860695 -5032757 22434782
11904B2434782j13113022q7560386J67257317J01158742k4246940L2079232r1596281
$$ 22434782 -90678240 -178238626 -10981309 90177433 65930493 98009725 6413444
11897F413444J45455583j68820593M1359750n9317837R786745j2460433N2793308p6674505
$$ 6413444 151869027 -16951566 24408184 -34909653 -25122908 -37583341 15209967 -61464538
11889f1464538P0559045l0982748l3379324P2522034L814428l9746071L7066273r1804265
$$ -61464538 9094507 -21888241 -55267565 17254469 21068897 -18677174 18389099 -73415166
11881g3415166J1134011P3815318R372654J3304174R584633n0192774P5634137j77955070
$$ -73415166 -62281155 11534163 20906817 34210991 43795624 -6397150 69236987 -108718083
11873a08718083Q8325936k6029228M3241359j4132699o9268632K6943727J07565571
$$ -108718083 -20392147 -46421375 -3180016 -17312715 -86581347 -59637620 47927951
11866D7927951p5347271J38685956n1833353J1862874j13752334K22849l3041024
$$ 47927951 -27419320 111266636 59433283 71296157 -42456177 -42233328 -75274352
11859g5274352J43966568J681590j54033041Q0736544n7525338J15248534j13759107
$$ -75274352 68692216 70373806 -83659235 -2922691 -60448029 54800505 -58958602
11852e8958602O2732927J8144205N1654664j05189552k2897807j6121864J4988942m943925
$$ -58958602 3774325 21918530 73573194 -31616358 -54514165 -70636029 -55647087 -60591012
11844f0591012J02733452j06498850Q9851796j17534316m2026921J79535322j12313873
$$ -60591012 42142440 -64356410 25495386 -92038930 -134065851 45469471 -66844402
11837f6844402j3161509R7904245M375659p2730038M5159327n5535304P9228209l791347
$$ -66844402 -80005911 17898334 22273993 -50456045 -5296718 -60832022 18396187 14604840
11829A4604840l1644943n857275J3590896o3989722J63518036q9812188P0404081k8201605
$$ 14604840 -17040103 -22897378 -9306482 -73296204 90221832 409644 70813725 42612120
11821D2612120p9227571O5302693j9570775J898054J0219080j2101792l5392294O570889
$$ 42612120 -36615451 28687242 9116467 11014521 21233601 9131809 -26260485 -19689596
11813a9689596L6077696m9145828R6178866j16928762Q4272850j18711490M8018795
$$ -19689596 16388100 -32757728 63421138 -53507624 30765226 -87946264 -39927469
11806c9927469r573743l2424522J32130142r7699330k7806869R3851647m5210994J7304877
$$ -39927469 -49501212 -81925734 50204408 -47494922 -75301791 18549856 -26661138 -9356261
11798i356261n3732934J15063247p3646935m0946846P9808844n1072791J0970967M4607637
$$ -9356261 -63089195 51974052 -21672883 -62619729 17189115 -33883676 -22912709 21694928
11790B1694928N1647292m5521278O7708546j40640774J18845383n2020974j37170061
$$ 21694928 73342220 27820942 95529488 -45111286 73734097 21713123 -115456938
11783a15456938R8207285n735408N247411M453716J26919431p4899705L2376263n3828727
$$ -115456938 -17249653 -22985061 -17737650 -13283934 113635497 38735792 71112055 17283328
11775A7283328q529141p2016794J146153j5498852r3353079K31245931o9011110q4914315
$$ 17283328 8754187 -63262607 -62116454 -77615306 -170968385 60277546 -8733564 -93647879
11767i3647879M0751942Q3630459N1029191K8985329n4597238j19960997J15690135
$$ -93647879 -52895937 30734522 81763713 110749042 56151804 -63809193 51880942
11760E1880942J7379991p1281183j3486708L0398182l2622134J54634801k06571947
$$ 51880942 69260933 -2020250 -15506958 14891224 -17730910 136903891 -69668056
11753f9668056J60124487j29447644L3179729N0710574k0646997j7292351j9465364
$$ -69668056 90456431 -38991213 -5811484 44899090 24252093 6959742 -12505622
11746a2505622O3882777p4082175k1365200K7191643J9483577j9529429K4708037n4304308
$$ -12505622 51377155 -22705020 -44070220 -16878577 2605000 -16924429 7783608 -46520700
11738d6520700m6846745l055747L3307208P2400339K8103826q8184064M0068787M8267702
$$ -46520700 -93367445 -96423192 -63115984 9284355 37388181 -50795883 -10727096 37540606
11730C7540606n0528926r3888653K9887485J21010225j27820875P8484952p4698908
$$ 37540606 -12988320 -106876973 -76989488 44020737 -83800138 -5315186 -80014094
11723h0014094K016500J44142R1536600N0391573l0934205j21444869J30440226P392886
$$ -80014094 -77997594 -77853452 13683148 64074721 33140516 -88304353 42135873 49528759
11715D9528759n5242205N6232340j8326356r07070K7859367n3187297M6170089j19266513
$$ 49528759 -5713446 50518894 32192538 31285468 59144835 5957538 52127627 -67138886
11707f7138886P4501424P0108670K6640735p2811096m5591147J1081938R8973484
$$ -67138886 7362538 77471208 104111943 31300847 -14290300 -3208362 95765122
11700I5765122j09047873L4475963J7020118j6161759j05222834K9467483M3347724
$$ 95765122 -13282751 21193212 38213330 22051571 -83171263 -53703780 -10356056
11693a0356056j22187190P2402212P6959100M5158275j64125870R6922795R6248155
$$ -10356056 -132543246 -60141034 16818066 61976341 -102149529 -5226734 91021421
11686I1021421j00289081k389876k3104601P5216312j21062177P0668737k2635016
$$ 91021421 -9267660 -11657536 -34762137 40454175 -80608002 -9939265 -32574281
11679c2574281K9773079n8138770L6116045J3457446O8100542j4436815l9915873Q6705146
$$ -32574281 -2801202 -60939972 -24823927 -11366481 56734061 42297246 2381373 89086519
11671H9086519o5212016M6202250o5527277n6758177O3164220n1275698P596802L2179182
$$ 89086519 23874503 70076753 4549476 -52208701 10955519 -40320179 -32723377 -544195
11663e44195r0083058Q8060005k055077k9825854M5072275l2763909R2184073k2261036
$$ -544195 -90627253 -2567248 -4622325 -34448179 10624096 -22139813 70044260 47783224
11655D7783224n6409979M1316489Q325727o3996468m8002530j4906230Q9719536o8896032
$$ 47783224 -8626755 32689734 41015461 -22981007 -70983537 -85889767 3829769 -65066263
11647f5066263m983155k2915896J9249643O1353845O6807721K0364221n9086702m0026604
$$ -65066263 -70049418 -92965314 -73715671 -12361826 54445895 74810116 15723414 -24303190
11639b4303190L2945046R4338810k17986064O095853L2658435J7533290l0357784L2480768
$$ -24303190 8641856 102980666 -115005398 -108909545 -76251110 -58717820 -89075604 -56594836
11631e6594836j5328875j3420588J49230486j46818490J66735541j33571748L2186964
$$ -56594836 -71923711 -85344299 63886187 -82932303 83803238 -49768510 -17581546
11624a7581546n324812K7504339l5623654m1566473K8207164N9039650N964042p3930642
$$ -17581546 -22906358 4597981 -31025673 -72592146 -44384982 14654668 20618710 -53311932
11616e3311932O8557126p0604934O7504811q7838191J53200199J7622708l2454085
$$ -53311932 15245194 -55359740 12145071 -75693120 77507079 95129787 62675702
11609F2675702o4493643P8994155p5524954p253445J34559558j47045301j2225113
$$ 62675702 -1817941 77176214 1651260 -5602185 128957373 -18087928 -30313041
11602c0313041j3636389N4223585m7199846L4727662Q871534O0336380Q5644212j43688215
$$ -30313041 -43949430 10274155 -36925691 -2198029 6673505 67009885 152654097 8965882
11594H965882O4298635p5302702n3520073M3062874o722683l0216813p0063990N5598213
$$ 8965882 73264517 -2038185 -55558258 -12495384 -19218067 -49434880 -119498870 -63900657
11586f3900657L6559735N1698537N4213231r9005581J02532244K316242J1523014
$$ -63900657 -27340922 24357615 78570846 -20434735 82097509 84413751 95936765
11579I5936765j57744765j3897367l6393960J46074675o3506343m143418P646578M8975842
$$ 95936765 -61808000 -75705367 -112099327 33975348 -29530995 -33674413 -26027835 22948007
11571B2948007K9924878p872813n9786059K4133655p523272m45580l8576258J0873041
$$ 22948007 52872885 45000072 -14785987 9347668 1824396 1378816 -37197442 -26324401
11563b6324401k3169336K9626854k7040882Q1985476o2795268p753161j5751538Q9029698
$$ -26324401 -49493737 -19866883 -46907765 35077711 -27717557 -35470718 -51222256 37807442
11555C7807442j06479082j6646846K08089346j66837167J47870091j32430579J60036165
$$ 37807442 -68671640 -85318486 122770860 -44066307 103803784 -28626795 131409370
11548A31409370j53083107j37654K2742245p9594091N6295371K3329274O8472011
$$ 131409370 -21673737 -21811391 930854 -78663237 -22367866 961408 69433419
11541F9433419j28754355J86587086l8071679m5599705l0052635O5366522r7320370
$$ 69433419 -59320936 127266150 89194471 43594766 13542131 78908653 -18411717
11534a8411717L615878L7550355m2897208K23690850k93759878R718694Q1758155L9391551
$$ -18411717 -14795839 22754516 -20142692 203548158 -90211720 -80493026 1265129 40656680
11526D0656680j9936236j0226469R2768062j40909202O140731n8156322L7778392Q2343824
$$ 40656680 20720444 10493975 103262037 -37647165 -31506434 -89662756 -51884364 30459460
11518C0459460o4495429L8362362N3212589l7890248j40420128J83837273p3442273
$$ 30459460 -34035969 4326393 57538982 19648734 -120771394 63065879 -10376394
11511a0376394n1961189K1031471O5055356j63287037K1166163J08069606O7823936
$$ -10376394 -62337583 -41306112 23749244 -139537793 -118371630 -10302024 57521912
11504E7521912j4562008m2451323M3295841k5311253J04746162j06440339j6917472
$$ 57521912 42959904 508581 43804422 18493169 123239331 16798992 -118480
11497a18480l4719207K1718159J6584801O9273741r1379442r4152524Q6825813K9597453
$$ -118480 -34837687 -13119528 3465273 72739014 -18640428 -112792952 -25967139 3630314
11489C630314J11004664l6167613r736721L5605077m7363297M4104501k02825547J9761181
$$ 3630314 114634978 78467365 68730644 104335721 56972424 101076925 -101748622 -81987441
11481h1987441J77109394p7166526j04175351M6680485J04338452n4804922M6268617
$$ -81987441 95121953 17955427 -86219924 -39539439 64799013 9994091 56262708
11474E6262708J1593247m8907288J1975098j9340660j2828912N4272530j14049439
$$ 56262708 67855955 18948667 30923765 11583105 -1245807 53026723 -61022716
11467f1022716J2011277L1202560N1357660q5236072J07784127K7452933j15442118
$$ -61022716 -49011439 -17808879 33548781 -51687291 56096836 83549769 -31892349
11460c1892349j9996738M9508714o427860O4950586P893910p8339769J78375182j50018854
$$ -31892349 -51889087 -2380373 -8808233 56142353 64036263 -14303506 164071676 14052822
11452A4052822K9905745M6257077j31257606l9266596R7158147j047763j6752627n0520671
$$ 14052822 43958567 90215644 -41041962 -80308558 16849589 15801826 -950801 -51471472
11444e1471472J09806137o4529765R5012390j8844218j36594836K6756033P3626300
$$ -51471472 58334665 -6195100 88817290 69973072 -66621764 -39865731 33760569
11437C3760569r6854991J6280649K259174K350992j2412836j447245K646732R5464291
$$ 33760569 -63094422 -46813773 -44554599 -42203607 -54616443 -56063688 -53416956 42047335
11429D2047335J268070j3482160J2912998p6302297j4310485o3369721Q3844558l3052140
$$ 42047335 43315405 29833245 42746243 -33556054 -47866539 -111236260 -27391702 -60443842
11421f0443842N3016712K9831877m0697989k5188976J2060843m5234108R9366146L20607
$$ -60443842 -7427130 22404747 -18293242 -43482218 -31421375 -76655483 22710663 23031270
11413B3031270O515748o2814042O7276783J7228040m0877119P4493820r9277935J20606967
$$ 23031270 29547018 -33267024 34009759 51237799 10360680 84854500 -14423435 106183532
11405A06183532j13139813K1657789q3761409M3995353L9769199J559027N5098597
$$ 106183532 -6956281 14701508 -69059901 -25064548 14704651 16263678 71362275
11398G1362275r9953508N1474113N4691350m5799572l4020630o6520705j5494027L9440803
$$ 71362275 -28591233 22882880 77574230 31774658 -2245972 -68766677 -84260704 -44819901
11390d4819901P9019724J5746057j61349569J81040889k942586j16715889P8020565
$$ -44819901 34199823 49945880 -111403689 69637200 66694614 -50021275 27999290
11383B7999290j4033071M422213L919674p9603305N1441588j00918756J05403392
$$ 27999290 13966219 18388432 22308106 -57295199 -5853611 -106772367 -1368975
11376a368975J11302042j7480734j86197775J21630080j00508514L1390183m9901744
$$ -1368975 109933067 92452333 -93745442 27884638 -72623876 -41233693 -91135437
11369i1135437J33833574j11951081J76224780o5162604o2698774R036959j7233653
$$ -91135437 42698137 -69252944 106971836 41809232 -20889542 -11852583 -29086236
11362b9086236J06668851q4861641L374394j54119182Q7679344L0867657P588681j7874950
$$ -29086236 77582615 -7279026 -3904632 -158023814 -70344470 -39476813 -31888132 -49763082
11354d9763082N6715722j5109611J0817981r3202578Q7010226N0279236j39215554
$$ -49763082 6952640 -8156971 2661010 -90541568 -3531342 46747894 -92467660
11347i2467660P1456022R576722n9170524o1397163J07286272L9890040J0893529l2947040
$$ -92467660 -21011638 -11434916 -70605440 -132002603 -24716331 15173709 26067238 -6879802
11339f879802k3965741J7857900J16099127r5222334j0234673J07419441j95173172
$$ -6879802 -30845543 -12987643 103111484 7889150 -2345523 105073918 -90099254
11332i0099254j929269L9682384m6509504J94963115j17332415K9508438j5736625
$$ -90099254 -92028523 -52346139 -98855643 96107472 -21224943 8283495 -7453130
11325g453130L6087930p9092076m1422253M1193643J06151166n0378284P0418588p1040106
$$ -7453130 28634800 -50457276 -91879529 -50685886 55465280 5086996 75505584 4465478
11317D465478m5384323m4369365J04626914M6545505j1177382l5451052p8389635
$$ 4465478 -40918845 -85288210 19338704 65884209 54706827 19255775 -59133860
11310e9133860J25793267j34623210L7619882j8182844J13214780j8712442q4698824
$$ -59133860 66659407 -67963803 -30343921 -48526765 64688015 45975573 -38723251
11303c8723251L7768685k8139587r74138L6948840M7755583J2013170m392194j35214322
$$ -38723251 -954566 -29094153 -30068291 6880549 54636132 66649302 62257108 -72957214
11295g2957214J43760664j71866584J46770697n0975339Q7982185l4863377O026686
$$ -72957214 70803450 -101063134 45707563 -5267776 82714409 47851032 53877718
11288E3877718m9777637P0371994l0989041l9689745P3178443n6071102j8146706k9353753
$$ 53877718 4100081 74472075 43483034 3793289 76971732 20900630 2753924 -26599829
11280b6599829L2510378j8859541k4135399Q0972169j2579701o6785171Q575700M328633
$$ -26599829 5910549 -12948992 -37084391 43887778 31308077 -35477094 -26901394 -22572761
11272b2572761L0593786j05431373L2538238K0008774m5840038J13034460j18084561
$$ -22572761 8021025 -97410348 -64872110 -44863336 -90703374 22331086 -95753475
11265i5753475Q5400938p204550j6273838K0203679n0501455l9325342N4718723L989638
$$ -95753475 -10352537 -17557087 -33830925 -13627246 -64128701 -103454043 -48735320 -44745682
11257d4745682Q8388614j05547850O9423974j11979486J00332984K9047297k1500901
$$ -44745682 43642932 -61904918 7519056 -104460430 -4127446 24919851 3418950
11250C418950L8774340j09364300O2374447q2938496J69211872q9440563K3463087
$$ 3418950 42193290 -67171010 -4796563 -87735059 81476813 -7963750 15499337
11243A5499337K7830017N430412j28547409J24866461q1105098l3953837J31782475
$$ 15499337 43329354 48759766 -79787643 45078818 -36026280 -69980117 61802358
11236F1802358r0971652Q3044364j5669728n8955413q7292806K47447861j26580741
$$ 61802358 -29169294 53875070 38205342 -20750071 -108042877 139404984 12824243
11229A2824243k6252933n2545654L8479117R4230287p5385158J63709250l1488520
$$ 12824243 -13428690 -65974344 -27495227 66735060 -8650098 155059152 123570632
11222A23570632p0086222M9475576k2772872j10724084k896865l2907453N9434767
$$ 123570632 53484410 102959986 80187114 -30536970 -33433835 -66341288 -6906521
11215f906521J55050336k31007942K5494936J22927640k9801221J9472319M2315336
$$ -6906521 148143815 -82864127 -57369191 65558449 35757228 55229547 97544883
11208I7544883m4149892j51450780J52262788p0839131j26651994J03786862k5890039
$$ 97544883 53394991 -98055789 54206999 -16632132 -143284126 -39497264 -65387303
11201f5387303J09291583K9387421r366114n4883371L5327731Q9772899k16040712
$$ -65387303 43904280 73291701 63925587 9042216 44369947 134142846 -81897866
11194h1897866J42719489L9636568j38508738J719406q520831l0775829R1159926
$$ -81897866 60821623 100458191 -38050547 -36331141 -44851972 -75627801 15532125
11187A5532125J02703012m5179527q4687105J94401577j76864062L5997056p6039494
$$ 15532125 118235137 73055610 -11631495 182770082 5906020 41903076 -34136418
11180c4136418m8544238R7583576M0420722n2398436l114931L9532805q9143048M81405
$$ -34136418 -82680656 14902920 55323642 2925206 -189725 39343080 -49799968 -49318563
11172d9318563Q783968l297180L4415644j8388794P2117080o2369864j11160458P2751325
$$ -49318563 -40534595 -43831775 -9416131 -27804925 44312155 -18057709 -129218167 -56466842
11164e6466842J09876573j3833610l0586561P3964589j26180869J182265m994184n218211
$$ -56466842 53409731 39576121 8989560 82954149 -43226720 -42044455 -47038639 -52256850
11156e2256850Q6045771j12743993R6055560P785911q2534559M3478682q5906645
$$ -52256850 33788921 -78955072 17100488 24886399 -57648160 -14169478 -100076123
11149a00076123J56783502n0595613R5878209q3814997j03176062p08124P6529431K813451
$$ -100076123 56707379 6111766 101989975 18174978 -85001084 -85709208 -9179777 -6366326
11141f366326O9789607m7003297M6991989p7874775j2219699N7168478q1406145k5052753
$$ -6366326 63423281 16419984 63411973 -14462802 -26682501 30485977 -50920168 -75972921
11133g5972921L9501709L1361023M577106l1004313K6267620J07717611j86294682
$$ -75972921 -36471212 -5110189 -533083 -31537396 -5269776 102447835 -83846847
11126h3846847O0839088o2892734m3270761J60203175l6130526o5517194L8164744
$$ -83846847 -23007759 -85900493 -129171254 31031921 -5098605 -70615799 -32451055
11119c2451055j38294596J29339457J45210637q8619725Q374514j6967474p4079355
$$ -32451055 -170745651 -41406194 103804443 15184718 23559232 6591758 -67487597
11112f7487597p0475723K2374529L8502222J6107232R3853800o6887493k6171600q891937
$$ -67487597 -137963320 -115588791 -77086569 -60979337 32874463 -34013030 -60184630 -69076567
11104f9076567n8449646J27831301K3100904L9567468q3875817m0958854M1390442
$$ -69076567 -127526213 305088 23405992 62973460 -20902357 -61861211 -20470769
11097b0470769m9382132L9468517K8457855k5663823J02582177j54722934J292956
$$ -20470769 -69852901 -30384384 -1926529 -27590352 74991825 -79731109 -78438153
11090g8438153m5276079J56340658L5690026k6579599M0603068j30699538O2218029
$$ -78438153 -123714232 32626426 68316452 41736853 82339921 -48359617 13858412
11083A3858412J7167475o1020989l9631994K8027058P2930679j02754110K1478124
$$ 13858412 31025887 -29995102 -69627096 -41600038 31330641 -71423469 -49945345
11076d9945345O9997024j5151934M4670618L1024770j11345591m631092j6126288L637122
$$ -49945345 20051679 4899745 49570363 80595133 -30750458 -35381550 -51507838 -47870716
11068d7870716N5542032K490592j22007118P7014742R295154N8022766n6084717M8707989
$$ -47870716 7671316 10161908 -111845210 -34830468 -25535314 32487452 -23597265 25110724
11060B5110724l1087077r386498m2762097k9791304J19351324m5694040Q0843233m6095888
$$ 25110724 -5976353 -15362851 -58124948 -87916252 31435072 -14258968 66584265 20488377
11052B0488377m2338050k4343639J6321197R0918169K1575487r8085920p0286907M9104032
$$ 20488377 -21849673 -46193312 -29872115 61046054 82621541 -15464379 -85751286 -36647254
11044c6647254O2476805n8078865R8249080Q4057662j17285226j9320978l2308604
$$ -36647254 25829551 -32249314 65999766 150057428 32772202 13451224 -18857380
11037a8857380J39662311j56905147j9294899N3909548P64909P2954034q2219763P235921
$$ -18857380 120804931 -36100216 -55395115 -1485567 -720658 72233376 -9986387 -2750466
11029b750466M1344873o5043752J43628130o6609994M834942k6636793l4291678L8474560
$$ -2750466 38594407 -26449345 117178785 50568791 55403733 28766940 -5524738 32949822
11021C2949822P8244858j99061653O6514072K3480719O8015752j6842631n3859486
$$ 32949822 111194680 -87866973 -21352901 2127818 70143570 53300939 -558547
11014e58547l1348408O9249997O35383r9413147l3547582J38292756l6063276j2461540
$$ -558547 -31906955 37343042 37978425 -61434722 -94982304 43310452 7247176 -5214364
11006e214364J39419536j58371008J15806363j14892384J52581841j97648062R4020683
$$ -5214364 134205172 -24165836 91640527 -23251857 129329984 -68318078 25702605
10999B5702605r5684584Q8690190K330016N4158130j41222873J25895510n2548533
$$ 25702605 -69981979 18708211 21038227 75196357 -66026516 59868994 7320461
10992G320461m8470552J65646379j25288536J07999877q7998852M2120476L4845185
$$ 7320461 -41150091 124496288 -792248 107207629 19208777 61329253 96174438
10985I6174438j38553846J04492598k9420425k611046J5212957k4949993r1488180
$$ 96174438 -42379408 62113190 32692765 30081719 45294676 20344683 -71143497
10978g1143497J20895758p328954L5819556j38938745P4193629k1281286n8089680
$$ -71143497 49752261 42423307 78242863 -60695882 13497747 -7783539 -65873219
10971f5873219J7902186J10886884p8036994J60434203j82532009j4527122n5507273
$$ -65873219 -47971033 62915851 -15121143 145313060 -37218949 -51746071 -107253344
10964a07253344J70000159k2052977J4481258l9975276n3308442J7852979o6117914
$$ -107253344 62746815 40693838 55175096 15199820 -38108622 -20255643 -86373557
10957h6373557Q3636470j3865727L8382673N2963304l1842254m8078758k6597649P8838155
$$ -86373557 -2737087 -16602814 21779859 74743163 42900909 -5177849 -31775498 47062657
10949D7062657J1802556p3424291N9166055r9952364N6011828q375789p7339818R6230662
$$ 47062657 58865213 -14559078 44606977 -55345387 666441 -7709348 -85049166 11181496
10941A1181496m8763264R0745286m2875437N6051235j06433236J7168617p608088j7918868
$$ 11181496 -37581768 53163518 10288081 66339316 -40093920 -22925303 -30533391 -48452259
10933d8452259k4491035M9548539m0586015N4642770O426671J30836684j23463170R371444
$$ -48452259 -72943294 -23394755 -63980770 -9338000 -2911329 127925355 4462185 13833629
10925A3833629L9609878L6069344m5424391N5338853k6764799o2567522o1601530O8744777
$$ 13833629 53443507 89512851 44088460 99427313 72662514 10094992 -51506538 17238239
10917A7238239l8778013J673286J8961137l7165043L0798478R5240907j94220370
$$ 17238239 -21539774 -19866488 -905351 -38070394 -7271916 87968991 -106251379
10910a06251379J37008430k1497727l7315997K675110n2333662M7018415L7743848n822658
$$ -106251379 30757051 9259324 -28056673 -25381563 -77715225 -30696810 7047038 1224380
10902A224380M659374l9718993L4995554j8151611l2939352J58043266j66357532O2345187
$$ 1224380 5883754 -33835239 1160315 -16991296 -49930648 108112618 -58244914 4100273
10894D100273L7719823m3669152k1337382O7058398O9558610P499913j54603631M6683753
$$ 4100273 41820096 -1849056 -23186438 43871960 113430570 120930483 -33673148 13010605
10886A3010605P6738968o8646898L4742650m4824933K9160701r5836041L9645175p0579219
$$ 13010605 89749573 21102675 55845325 11020392 40181093 -55654948 -16009773 -86588992
10878h6588992j2361539M9452290K2441223P5215731j03682432K8114926l1344480
$$ -86588992 -98950531 -49498241 -27057018 48158713 -55523719 -27408793 -58753273
10871e8753273J5181851N2566782o1928521j3977989Q7305481m5024853q8046008L1242087
$$ -58753273 -43571422 8995360 -52933161 -66911150 20394331 -24630522 -112676530 -81434443
10863h1434443P8454363o2443786P5941315J72534997j17264775r5561454R2756072
$$ -81434443 -2980080 -65423866 10517449 183052446 65787671 -29773783 62982289
10856F2982289K5665890p7754040P9887763j20985535R6697941n0208558p2221502
$$ 62982289 88648179 10894139 90781902 -30203633 66494308 16285750 -55935752
10849e5935752R3410884M0232347p344719K0277217O9595836j11459305k9051380
$$ -55935752 37475132 77707479 70362760 90639977 160235813 48776508 19725128
10842A9725128J07966729j52632906p91156O959160m8804375R7843724n6872569O6012702
$$ 19725128 127691857 -24941049 -25732205 -18773045 -67577420 30266304 -26606265 39406437
10834C9406437l7610290k9199696J9144802P892658l8884864L6482030N9268366j21256246
$$ 39406437 1796147 -27403549 -8258747 -366089 -39250953 -2768923 56499443 -64756803
10826f4756803J7686462O8875274q5227679j3006696J71225393j04010030o0259344
$$ -64756803 -47070341 21804933 -63422746 -76429442 94795951 -9214079 -69473423
10819f9473423J03742867m1565377j7766173Q4833301j958013q3204257J0783809n6661589
$$ -69473423 34269444 -7295933 -25062106 59771195 57813182 -25391075 -14607266 -71268855
10811g1268855l3131358J78284676l5481403m6643339N6235568l6117650O4721188
$$ -71268855 -104400213 73884463 38403060 -8240279 47995289 11877639 76598827
10804G6598827j09546697L3830359J8699300j1087632P2773905j09349952J7143826
$$ 76598827 -32947870 882489 19581789 8494157 81268062 -28081890 -10938064
10797a0938064o095026k2800649J16448107n8808077p5547229O9388109k8852710O6304330
$$ -10938064 -17033090 -39833739 76614368 17806291 -57740938 11647171 -17205539 49098791
10789D9098791j66949201J82704323k4747232q3600813P8753235n0862193L7613877
$$ 49098791 -117850410 64853913 40106681 -43494132 35259103 -15603090 22010787
10782B2010787m4650264M6411658O8183436o3363236q9328750R1283566n5589636N9607484
$$ 22010787 -22639477 23772181 91955617 28592381 -60736369 30547197 -25042439 34565045
10774C4565045o8186257O4812701r0723817J16171631q9072509k1295140J06186034
$$ 34565045 -33621212 31191489 -59532328 56639303 -32433206 -53728346 52457688
10767E2457688j44164076Q0287704J5313982K5020532k5786214j30100721R5572272
$$ 52457688 -91706388 -11418684 3895298 28915830 3129616 -126971105 -31398833
10760c1398833n0443451J03395694m8830220j445565n8534155M0618343j24103566
$$ -31398833 -81842284 21553410 -27276810 -28722375 -87256530 -46638187 -170741753
10753a70741753K28269496q5565974O5662511P7610188q6668099N8702198j34692780
$$ -170741753 57527743 -28038231 37624280 115234468 28566369 87268567 -47424213
10746d7424213l5350460J30860295p5317577m7949329q484753Q7689798p9059242J6901273
$$ -47424213 -82774673 48085622 -27231955 -75181284 -83666037 4023761 -75035481 -58134208
10738e8134208J64334473m7681598k0772663Q8400448r3704841n7677590O9199054
$$ -58134208 106200265 58518667 37746004 126146452 32441611 -25235979 43963075
10731D3963075j75227174K33462362l4646397l6414438n3152458L116572K9109486
$$ 43963075 -131264099 102198263 67551866 31137428 -22015030 -18898458 10211028
10724A0211028K7471462n1711828j6309359M8380641K7480675o9971054Q3855343o4291925
$$ 10211028 37682490 -14029338 -30338697 18041944 45522619 -24448435 59406908 -4885017
10716d885017l0961792O2853398l5866225P059337j10668164K1010789j3271141J18099626
$$ -4885017 -35846809 27006589 -8859636 -1800299 -112468463 -91457674 -104728815 13370811
10708A3370811L619707n7580311l3893736J48949496k2511059l0647906o581640k3237773
$$ 13370811 16990518 -40589793 -74483529 74465967 51954908 21307002 14725362 -8512411
10700h512411r5863642k6836902J16716708j5213642K3058010J01374924N5460259
$$ -8512411 -104376053 -131212955 -14496247 -29709889 -6651879 94723045 150183304
10693A50183304r6063916m8461459M0480779o191278J6993283j04578913L3554488o984378
$$ 150183304 54119388 5657929 46138708 39947430 56940713 -47638200 -14083712 -21068090
10685b1068090J4895524l8000251J57914978n8313578J1998591M2660392o0293812
$$ -21068090 -6172566 -44172817 113742161 55428583 67427174 110087566 49793754
10678D9793754j03749565K4988874P6734499j60685885N7576715J08765660r0299077
$$ 49793754 -53955811 -28966937 47767562 -112918323 -55341608 53424052 -36875025
10671c6875025K7570252k9157609J8862299j4198145P038595J7213727M926609L6574774
$$ -36875025 -9304773 -38462382 -19600083 -33798228 -26759633 -9545906 -4619297 31955477
10663C1955477k03894106K16421454m9538173j267162j95747825J16555913J17125883
$$ 31955477 -171938629 44482825 -5055348 -6322510 -202070335 -85514422 31611461
10656C1611461m4729960l8055736K3026950k839649J5967806Q6552260o874173j18234151
$$ 31611461 -13118499 -51174235 -28147285 -30986934 -15019128 71533132 64658959 -53575192
10648e3575192r0300497J84533250j91393566Q3931556O3796120j86127339K45845176
$$ -53575192 -143875689 40657561 -150736005 -66804449 -3008329 -189135668 56709508
10641E6709508L8604589q7396459N6115005p0970065l5093729J11775118q0353397
$$ 56709508 95314097 7917638 64032643 -6937422 -42031151 69743967 -10609430
10634a0609430r1262455R463962l8716769K9966020K4111509L6380773L676929j6028912
$$ -10609430 -101871885 -92407923 -131124692 -101158672 -77047163 -40666390 -36989461 -53018373
10626e3018373J91283423j65992380N4224580m6231415J09642740j24908189q9599296
$$ -53018373 138265050 -27727330 26497250 -19734165 89908575 -34999614 -124598910
10619a24598910J51150771p1366943j7086423J70385158j19886383J06025056j522369
$$ -124598910 26551861 -44815082 -61901505 108483653 -11402730 94622326 93099957
10612I3099957j35188776Q8424649N6287940j01109441Q085216l0881547j049385j6530367
$$ 93099957 -42088819 46335830 102623770 1514329 9599545 -21282002 -22331387 -38861754
10604c8861754P9557951n4647328k2877538r469889J3086370J43718777r3093460J3555781
$$ -38861754 40696197 -13951131 -36828669 -46298558 -33212188 110506589 17413129 30968910
10596C0968910J3034739n2969379K6862736j5330575m5977323N8744367J164323k1144648
$$ 30968910 44003649 -8965730 17897006 2566431 -43410892 15333475 16497798 -4646850
10588d646850q9750594N3812512L7393815R2361570r3217155J9370688M1638101m5448240
$$ -4646850 -94397444 -40584932 -3191117 89170453 -4046702 15323986 56962087 11513847
10580A1513847l528118p3885425R2633042M9755981p8684906j3108062M6080824Q6004429
$$ 11513847 7985729 -65899696 26733346 76489327 -2195579 -15303641 30777183 116781612
10572A16781612j71772433M5072148P8267331p850158p7675850O9650682k407125Q9573256
$$ 116781612 -54990821 -9918673 68348658 60498500 -17177350 52473332 50066207 139639463
10564A39639463j25336658m4182131M8333180R4297778j54434168N5078270J00057274
$$ 139639463 14302805 -29879326 18453854 112751632 -41682536 13395734 113453008
10557A13453008j38798184j9249845K1944512P1136713o1432881Q6785091r8234879
$$ 113453008 -25345176 -44595021 -22650509 48486204 -12946677 73838414 -24396465
10550b4396465J07697245j18025933n2058299J77103751k878702r1452433K7185003
$$ -24396465 83300780 -34725153 -86783452 90320299 87441597 -4010836 23174167
10543B3174167M6544405j04538928k2280210K1911930k2429725l5723995J44078918
$$ 23174167 69718572 -34820356 -57100566 -35188636 -57618361 -93342356 50736562
10536E0736562r2185902J26525071r2197206p2745295Q5508470m5989772M182917R8741986
$$ 50736562 -41449340 85075731 -7121475 -79866770 5641700 -40348072 -36165155 62576831
10528F2576831q6260837p9515594k5599097N4921618k9340108J91163265j22930557
$$ 62576831 -23684006 -103199600 -128798697 -73877079 -103217187 87946078 -34984479
10521c4984479L1635304j1346789K5943954o0122656N5698277n2732818M9822675l6493445
$$ -34984479 -3349175 -14695964 11247990 -48874666 6823611 -45909207 3913468 -32579977
10513c2579977n970320J7227242k2424356P2847088m662121l8938489L7210752k4082900
$$ -32579977 -38550297 -21323055 -43747411 29099677 24437556 -14500933 22709819 -1373081
10505a373081J0870137r502189M6479845k0011487o7992636M0031295O4600974j33324630
$$ -1373081 9497056 -5133 46474712 26463225 -41529411 -1498116 63102858 -70221772
10497g0221772l83079K8526699n1816634P4279214L9715439l5033358k3248516J31765625
$$ -70221772 -70604851 -42078152 -93894786 -19615572 20099867 -14933491 -38182007 93583618
10489I3583618n4167271K443786k3121782j1619060m3944306O4833139m3048627m1697732
$$ 93583618 39416347 41860133 18738351 7119291 -36825015 28008124 -15040503 -56738235
10481e6738235k0370601J16959778M613489p0570320P3725698o672143j1639191M0532002
$$ -56738235 -77108836 39850942 44464431 -26105889 47619809 40947666 29308475 69840477
10473F9840477l1653380n9643990o3005145J26454675q1224196M4164397m73178n3243544
$$ 69840477 38187097 -21456893 -84462038 41992637 -39231559 4932838 4459660 -48783884
10465d8783884P4319347m0445017J32138873j72049175K55459671j82863713P1073803
$$ -48783884 25535463 -14909554 117229319 -54819856 200639815 17776102 88849905
10458H8849905m9701695j09849842K0541964Q5223597j08329385P2355778O1333687
$$ 88849905 39148210 -70701632 -50159668 35063929 -73265456 -909678 60424009
10451F0424009o4122547O8061532n619104n8413347O9168307j07804444o246532L1885769
$$ 60424009 -3698538 64362994 58743890 330543 69498850 -38305594 -44552126 -12666357
10443a2666357K0117850j7928953j9638766J18176825j32044049l4213653J62535058
$$ -12666357 7451493 -10477460 -30116226 88060599 -43983450 -78197103 84337955
10436H4337955j07979714O7187382k0254603K0103896k1183677M009289n6479608L7676139
$$ 84337955 -23641759 43545623 23291020 43394916 22211239 26220528 -30259080 7417059
10428G417059Q7711248q7371803m7913497J80337861j10673512J4472180l8936758
$$ 7417059 95128307 7756504 -40156993 140180868 29507356 43979536 5042778
10421E042778o1643221J50488200n8429125J1327968q3694126j12028m7019798R3353888
$$ 5042778 -56600443 93887757 35458632 46786600 -36907526 -37019554 -84039352 9314536
10413I314536K3171222P89265j44077558P9774321O460771J1274375l1365478R5381592
$$ 9314536 32485758 33275023 -110802535 -31028214 -24567443 -13293068 -44658546 50723046
10405E0723046n0467550K958417J8963856j53764768J75667163j8024104q9882762
$$ 50723046 255496 3213913 22177769 -131586999 44080164 26056060 -63826702
10398f3826702j8593105J32923880j90051728J54572943M8123782l2057277j2934726
$$ -63826702 -82419807 50504073 -139547655 15025288 63149070 31091793 18157067
10391A8157067O174583l1958090J4686488m6634998N9194505l3887509P6165708o5958119
$$ 18157067 24331650 -7626440 7060048 -39574950 19619555 -14267954 61897754 -4060365
10383d060365N2537049J7045003n622409j4505090n5191321M7189008l937917J358928
$$ -4060365 48476684 65521687 59899278 45394188 -9797133 37391875 33453958 34812886
10375C4812886m5389364J327710M9173072O207076j90627121J72745460k5546448J3418529
$$ 34812886 -10576478 -9248768 39924304 46131380 -144495741 28249719 2703271 16121800
10367A6121800o8534651J64204503n0500669r6005547n0704656J77870218m6367540
$$ 16121800 -52412851 111791652 61290983 -34714564 -85419220 92450998 46083458
10360D6083458j05354168Q8311999j0264n5270472l9312998Q3000923O1282061p7226730
$$ 46083458 -59270710 29041289 29031025 -26239447 -65552445 17448478 78730539 1503809
10352A503809O0438304j00396876N210955M2499898n5665970L7013255O3578152j38771677
$$ 1503809 61942113 -38454763 -33243808 9256090 -46409880 -9396625 54181527 -84590150
10344h4590150l2396028J10333722P6418797k7444904j28184289J42875559Q210946
$$ -84590150 -116986178 -6652456 69766341 42321437 -85862852 57012707 65223653
10337F5223653j3546923k7004580r1164407J30960313k6197588n4105499K2447309
$$ 65223653 51676730 24672150 -66492257 64468056 38270468 -15835031 6612278
10330F612278j17843642J54308633m9296035L539477K5696569k9207128L9539410m2257897
$$ 6612278 -111231364 43077269 -6218766 -2679289 23017280 -6189848 33349562 -8908335
10322h908335O1151630r4229941m7960259R0015519L7671207l4957035k6452833o7361635
$$ -8908335 52243295 -41986646 -89946905 68614 37739821 2782786 -23670047 -91031682
10314i1031682j595414N9847256L0343722n8433222P9534125R0094766p4250849N5094661
$$ -91031682 -92627096 -32779840 -2436118 -60869340 18664785 108759551 34508702 89603363
10306H9603363p0252060n7800584J3248118K4038443o0337728J86491366k03213989
$$ 89603363 19351303 -38449281 -25201163 -1162720 -61500448 124990918 -78223071
10299g8223071J01439449J8237760L3721956J9565884q2425824J7209051j19564345
$$ -78223071 23216378 41454138 75176094 94741978 12316154 29525205 -90039140
10292i0039140J16456946l025764M0937663P9880306j92427248R9940149J10731221
$$ -90039140 26417806 23392042 64329705 144210011 -48217237 51722912 162454133
10285A62454133j32169739N5531897K1115432j03979684L8982815p6689685j5661776
$$ 162454133 30284394 85816291 106931723 2952039 41934854 -34754831 -50416607
10278e0416607J58865122q7771138J21067104j39914584O0893488m6397043K0881906
$$ -50416607 108448515 20677377 141744481 1829897 62723385 16326342 37208248
10271C7208248k062033M1440105j58332122L2042555J6542698P6282921K8677322
$$ 37208248 35146215 76586320 -81745802 -49703247 -33160549 43122372 71799694
10264G1799694j66115759J15740669O662502o2074384o3997087O0408334K9233869
$$ 71799694 -94316065 21424604 28087106 -33987278 -97984365 -37576031 -8342162
10257h342162j1569849Q9586216l6106437j08869588k8792724N5218891J4489399R0353963
$$ -8342162 -19912011 69674205 33567768 -75301820 -104094544 -48875653 -34386254 55967709
10249E5967709j04986211L5140348p0947910K47436386j76312671O7912583n1486226
$$ 55967709 -49018502 -13878154 -84826064 162610322 -13702349 54210234 2724008
10242B724008J56145534n5782107j28917168l8952228J52283417Q738877l4028478
$$ 2724008 158869542 103087435 -25829733 -64781961 87501456 96240333 62211855
10235F2211855p3419910O2302674l9517189N5807166J10063487o1326407l06247584
$$ 62211855 -11208055 51094619 11577430 67384596 177448083 116121676 -190125908
10228a90125908J73597271L4088178l5184148p4202869R1324352L5367506J02573160
$$ -190125908 -16528637 17559541 -17624607 -91827476 -503124 34864382 137437542
10221A37437542k04718113L7263508R4390123j32012788j0292775J7848683K1504792
$$ 137437542 -67280571 -30017063 64373060 -67639728 -77932503 -60083820 -38579028
10214c8579028M7173740j8352802J13019425k4927193r1498429m2909342J35934822
$$ -38579028 8594712 -9758090 103261335 78334142 -13164287 -56073629 79861193
10207G9861193q663966l1456628j11988019J5545356J9101829N9908576o7195872
$$ 79861193 71197227 39740599 -72247420 -56702064 -37600235 22308341 -44887531
10200d4887531J27566229k2800673L2113355o0422812o0147728N5408145p6756416
$$ -44887531 82678698 59878025 91991380 31568568 -28579160 26828985 -49927431
10193d9927431J93790417j08943073j4138849p6285483M5681274j2094040P3642336
$$ -49927431 143862986 34919913 20781064 -55504419 -9823145 -21917185 51725151
10186E1725151k10007356q3672996J47344835J14572905L6640806O1282461M4202207
$$ 51725151 -158282205 -241955201 -94610366 19962539 56603345 117885806 162088013
10179A62088013j4800118K4463134k18865045J04290334m4185Q8368669p2401564L4354643
$$ 162088013 147287895 171751029 -47114016 57176318 57132133 145500802 73099238 107453881
10171A07453881K5081969K2768778J66908241L63554617m4366209k23972436r8548536
$$ 107453881 132535850 155304628 322212869 685767486 641401277 417428841 318880305
10164C18880305j15105587r420164r0498365J6989211M352566L0779317P5096419l2294417
$$ 318880305 203774718 194354554 103856189 120845400 125197966 155977283 231073702 198779285
10156A98779285p9167668J66111733m43054R95004r5313237j26657418q0900359p0143146
$$ 198779285 119611617 285723350 285280296 286275300 190962063 64304645 -16595714 -86738860
10148h6738860J7591714J05745416n6145951l7494834N6746547M7382480m2584610
$$ -86738860 -69147146 36598270 -19547681 -57042515 -295968 47086512 4501902
10141D501902n6602423J51585221k09459946J43852115o1634902N4161715l0118558
$$ 4501902 -52100521 99484700 -109975246 33876869 -27758033 26403682 -3714876
10134c714876L1635558m8554640M457269K3233420j0095868O6917995J32716312M313604
$$ -3714876 27920682 -20633958 -16176689 7056731 -3039137 63878858 196595170 200908774
10126B00908774O8156991O360356j19877212Q9068741L4822973r1699732J3947566
$$ 200908774 269065765 275426121 155548909 244617650 279440623 187740891 201688457
10119B01688457j71264791J04471714Q3913886K3902711K268976J47789126K34926920
$$ 201688457 30423666 134895380 218809266 242711977 244980953 392770079 627696999
10112F27696999j47062313p4145644n4482124j34998836j06056181P609012l7056355
$$ 627696999 480634686 406489042 352006918 217008082 110951901 118560913 81504558
10105H1504558k8513053Q2786751M1460180j7687607o8953600N0507742M8772735L5063958
$$ 81504558 52991505 135778256 177238436 159550829 90597229 141104971 189877706 224941664
10097B24941664k78299937l945607o089690J20173963k70398342J27516757O6187866
$$ 224941664 -53358273 -57303880 -63393570 56780393 -213617949 -86101192 -19913326
10090a9913326m8274896L8803364j673948o8772658l2059534P7208147O9673488N3819182
$$ -19913326 -68188222 -29384858 -31058806 -99831464 -131890998 -54682851 14990637 68809819
10082F8809819j55788265N4386058p1354247K9677796l0426332R7501091r0217713
$$ 68809819 -86978446 -32592388 -103946635 -74268839 -104695171 -7194080 -97411793
10075i7411793J49074771k01665651K43275009R1392320j45060114J45317457K0245552
$$ -97411793 51662978 -150002673 93272336 184664656 39604542 184921999 205167551
10068B05167551q5333159Q038456k2516622P9066576j77244183R3072951L8318812
$$ 205167551 119834392 127872848 105356226 184422802 7178619 100251570 138570382
10061A38570382j36016890J94341124p173964J99527654J13327652j55022957j19120530
$$ 138570382 2553492 196894616 189720652 389248306 502575958 347553001 228432471
10054B28432471j34405754j05232035M7380474j140420P8419137j10308338N5476700
$$ 228432471 94026717 -11205318 36175156 35034736 113453873 3145535 58622235
10047E8622235n5470913r4057350J59207509k9828593j0272559o9836938q7228777
$$ 58622235 3151322 -90906028 68301481 38472888 28200329 -41636609 -128865386
10040a28865386Q3306383k1468324q8480885O2068495K7846781N5024594J2432633
$$ -128865386 -45559003 -67027327 -155508212 -93439717 -65592936 -10568342 1864291
10033A864291l5174013j22560699M9966384P8958091m9143123R294836j4105535R3043833
$$ 1864291 -33309722 -155870421 -105904037 -26945946 -76089069 -66794233 -80899768 12144065
10025A2144065o3776469k0265280m1404060O1325933l8816566J01203621R4393832
$$ 12144065 -51632404 -71897684 -113301744 -51975811 -90792377 10411244 104805076
10018A04805076j09931564n2265112M3693764J21422965j69759911Q2163265J01674929
$$ 104805076 -5126488 -57391600 -13697836 107725129 -62034782 20128483 121803412
10011A21803412n2264809m5112027l0458573n0430500q4249195J81100961j7341183
$$ 121803412 69538603 24426576 -6031997 -56462497 -140711692 40389269 23048086
10004B3048086L1046309j47519387O5061970M2482523k4780906k9473795J69949019
$$ 23048086 54094395 -93424992 -28363022 14119501 -10661405 -40135200 129813819
9997A29813819k21867776R3059194P854413K4215526r0708461K065245N4611991m6465868
$$ 129813819 -92053957 1005237 8859650 33075176 -57633285 -55568040 -956049 -47421917
9989d7421917j21370565J87658781j05783692N5051065L6018975r451741N7826466
$$ -47421917 -168792482 18866299 -86917393 -31866328 4152647 -5299094 52527372
9982E2527372r2081670L678441L1477628n997789p1893289Q497140j6422329M0622887
$$ 52527372 -39554298 -35875857 -4398229 -10396018 -82289307 -73792167 -90214496 -49591609
9974d9591609m7519118K28165934j47517325k670134K4966423o1537541L5373415O0756467
$$ -49591609 -97110727 131055207 -16462118 -19132252 5834171 -55703370 -20329955 40426512
9966D0426512r4201719J9743806k6893602K0118493j288922J8736208Q3733273q9561556
$$ 40426512 -53775207 -34031401 -60925003 -40806510 -42095432 -23359224 60374049 -29187507
9958b9187507R4609268j10440416M0083696j0021302L5523151r9337886J77372060
$$ -29187507 65421761 -45018655 -4934959 -14956261 20566890 -78770996 98601064
9951I8601064j77269107P5555542m4505624O4904671K0388901m0760765R183142p8954239
$$ 98601064 -78668043 -3112501 -47618125 17286546 37675447 -3085318 6097824 -72856415
9943g2856415J14048624p8671152J14051664q5449938J3716706j28501034J00199285
$$ -72856415 41192209 -37478943 76572721 -8877217 4839489 -123661545 -23462260
9936b3462260Q8646415j2758078q5658189j7207197k9060674R2815033M227022o939097
$$ -23462260 65184155 52426077 -33232112 -50439309 -79499983 13315050 17542072 10602975
9928A0602975l227209j06627808P6807624m5836801K2728734K1422811J9378493K5109684
$$ 10602975 7375766 -99252042 -22444418 -68281219 -45552485 -24129674 -4751181 20358503
9920B0358503K5673666r1841246n2839067r8908189J39664095M2850842M2977495
$$ 20358503 46032169 -45809077 -98648144 -197556333 -57892238 -15041396 27936099
9913B7936099j28269338O1363506o1092893k62238K9773497R7120598p3873237J60507741
$$ 27936099 -100333239 -38969733 -100062626 -100324864 -70551367 26569231 -47304006 113203735
9905A13203735j32806846l1049779J0162936M366766J8324595n3345083Q1280805j5770182
$$ 113203735 -19603111 -50652890 -40489954 -36123188 -17798593 -71143676 10137129 -5633053
9897e633053M9637219j09826876k0506778P6077749J10634034o2443104K6572496p1108737
$$ -5633053 44004166 -65822710 -86329488 -10251739 100382295 37939191 64511687 -6597050
9889f597050M4351459o9998116N5191996j03135463M8992482P5349438J15031017
$$ -6597050 37754409 -32243707 22948289 -80187174 -31194692 44154746 159185763
9882A59185763j31148093o4121502j058557P1485779J02375570j75533526K4946045
$$ 159185763 28037670 -36083832 -37142389 34343390 136718960 -38814566 -13868521
9875a3868521M8711146j12039464O2549763m2957059N7858332M6555368K746943P3687570
$$ -13868521 34842625 -77196839 -14647076 -57604135 254197 46809565 49556508 123244078
9867A23244078j68206063q816751J0001351J74412975p5258008j15693308K4584802
$$ 123244078 -44961985 -53778736 -43777385 130635590 55377582 -60315726 -35730924
9860c5730924L9034726P4893854m2058632J30883313j55800125k1890329O93079K0961297
$$ -35730924 3303802 78197656 36139024 167022337 11222212 -10668117 -9975038 10986259
9852A0986259P5220209l1604853j24067862N4952451R8009065j11254729R0953018
$$ 10986259 86206468 54601615 -69466247 -14513796 83495269 -27759460 63193558
9845F3193558l1755847l6853972N2933884n1570532K4842116j66094542M5430995k9953422
$$ 63193558 31437711 -5416261 47517623 -4052909 20789207 -145305335 -99874340 -129827762
9837a29827762J43900107m7834388m2794803o1588498K32164981r1809553p9299952
$$ -129827762 14072345 -33762043 -76556846 -138145344 94019637 2210084 -77089868
9830g7089868k3339043m210704J74193746m4443960m9737427o5624975L4768506N4689592
$$ -77089868 -100428911 -104639615 69554131 25110171 -24627256 -90252231 -55483725 -794133
9822g94133j46842710Q4449053o4727135J18432584L3862340m4859246j8958032J2345739
$$ -794133 -147636843 -63187790 -127914925 -9482341 24379999 -20479247 -39437279 -27091540
9814b7091540J09518757n2359288j829876j2653498r6430439M530644L3421471o1127204
$$ -27091540 82427217 30067929 28238053 15584555 -80845884 -76315240 -42893769 -104020973
9806a04020973L662414J42772444Q273414L9324456j80427149M1830882P9184135N46568
$$ -104020973 -100358559 42413885 50687299 90011755 -90415394 -48584512 30599623 31146191
9798C1146191q4132597P8345850L2045682l2645288k5341871n150120k6666033L2473833
$$ 31146191 -52986406 25359444 57405126 24759838 -582033 -5732153 -32398186 75647
9790G5647O2913525k9322791K3881401n9552780J7975879l6140649M0789527J388838
$$ 75647 62989172 33666381 57547782 -2004998 15970881 -20169768 20619759 22008597
9782B2008597l526667L5569237n3983707l8983060j2446088J4238778K8146453m3866715
$$ 22008597 18481930 54051167 67460 -38915600 -51361688 -37122910 -8976457 -52843172
9774e2843172Q6079862q8355814P4928336m122745j4270091K480741M4934106p2247324
$$ -52843172 33236690 -55119124 19809212 15686467 1416376 3897117 48831223 -23416101
9766b3416101k6251530P2511699p5533118j2442165J2287578M739796N0606236k3059165
$$ -23416101 -49667631 22844068 -52689050 -65131215 -52843637 -48103841 2502395 -20556770
9758b0556770n6792419M7614087k173783P4944742N4569931n1524825R916712p3355025
$$ -20556770 -77349189 -29735102 -31908885 43035857 97605788 46080963 55997675 -17357350
9750a7357350k2771782J9372804M3336232P507085r587044n8998952K1427022J5137619
$$ -17357350 -40129132 -20756328 22579904 30086989 20499945 -38499007 -17071985 -1934366
9742a934366j5414539j7819991K0271182L6338879j39784979J58162147K4422166
$$ -1934366 -17348905 -35168896 -14897714 21441165 -118343814 39818333 64240499
9735F4240499j19876520N5259360K4682762r5004852Q6588211n2761591K0654729M8951278
$$ 64240499 -55636021 -376661 24306101 -70698751 15889460 -36872131 -16217402 32733876
9727C2733876q4912516M3090494p7122578J05435491n3700029N1795020J24787719
$$ 32733876 -52178640 -9088146 -86210724 19224767 -34475262 17319758 142107477
9720A42107477j89001656N5206111l1389181k2851646R3757257p3413944k417372Q5068192
$$ 142107477 -46894179 8311932 -23077249 -45928895 47828362 -25585582 -28002954 57065238
9712E7065238q0807775J8806940N3913587O1105165p6143619j6398346K7651948N4993088
$$ 57065238 -23742537 -4935597 48977990 110083155 33939536 17541190 45193138 100186226
9704A00186226k32009797M6961839O1848852j5615034L5083194L4095895j9001162
$$ 100186226 -131823571 -84861732 -23012880 -38627914 -3544720 30551175 11550013
9697A1550013n9459639K5801441K7945293P9415138j5232227o2251508L6309024p750675
$$ 11550013 -47909626 -22108185 5837108 85252246 70020019 7768511 44077535 36326860
9689C6326860q2826920J5438184K6930112n6705462Q2195876j3905270Q1271210j36296260
$$ 36326860 -46500060 -31061876 -4131764 -60837226 21358650 7453380 88724590 -47571670
9681d7571670M0916935m4803898J12001230J6764862o1248919m9986874L7027019n1972570
$$ -47571670 -6654735 -51458633 60542597 77307459 16058540 -33928334 3098685 -48873885
9673d8873885l6164239N3106055K0476327N3085447m5409894O8695380m0704468r0954207
$$ -48873885 -85038124 -31932069 -11455742 41629705 -3780189 64915191 24210723 -66743484
9665f6743484j6809306R8461855J9214936j14086434P3563174l140200J44445982
$$ -66743484 -83552790 14909065 34124001 -79962433 -6399259 -9539459 134906523
9658A34906523j16891914o5650359O7425829L0162333O5756278j40223571l421242N985513
$$ 134906523 18014609 -47635750 19790079 49952412 115708690 -24514881 -27936123 -21950610
9650b1950610K315516j6197182M0193844p8707383J68891369n7313316N1309828q0531836
$$ -21950610 -19635094 -35832276 4361568 -74345815 94545554 37232238 88542066 8010230
9642H010230R432497q0366167K5711237L3201171L5391440l6022234K8837942N4656485
$$ 8010230 17442727 -62923440 -37212203 -4011032 31380408 -4641826 24196116 78852601
9634G8852601j34838817K0565058J2073833J17799963j10409694Q6097291j30478517
$$ 78852601 -55986216 -35421158 -23347325 94452638 -15957056 70140235 -60338282
9627f0338282j1577218P2532723J4480276j4983214K07890579k06562232j6496246
$$ -60338282 -71915500 617223 15097499 114285 208004864 1442632 -15053614
9620a5053614O1173999m3066740n399305P6281090j65801918J49214333J7576731r6953986
$$ -15053614 46120385 3053645 -2345660 73935430 -91866488 57347845 74924576 -22029410
9612b2029410J22011710j46349014L3182505M7256143o5870390N4302912k14773502
$$ -22029410 99982300 -46366714 -13184209 34071934 -31798456 22504456 -192269046
9605a92269046K35331391r7058597N752581J05391351k25768769K08053240o9095113
$$ -192269046 43062345 -53996252 -48243671 57147680 -168621089 39432151 -29662962
9598b9662962J2868226L0065889j17955297J26451511o4186361J54620l4755044J8896052
$$ -29662962 -16794736 13271153 -104684144 21767367 -42418994 -42264374 -77019418 -58123366
9590e8123366K1514745Q2017047k5841867p6343271R3657803o0189635M5528958m6125756
$$ -58123366 -36608621 45408426 19566559 -56776712 36881091 -23308544 22220414 -23905342
9582b3905342L9589609N7832728j42880710R0715578r599926J1558044k3316469l9436702
$$ -23905342 15684267 73516995 -69363715 21351863 11751937 23309981 -6488 -39443190
9574c9443190L4673798P8189830p4266415P3267919R118730r7656175N6528426K5358400
$$ -39443190 -4769392 73420438 -845977 72421942 81540672 -16115503 40412923 65771323
9566F5771323n6665513L3184126l7109804N7933565K8809616p9516479j9685974j2938930
$$ 65771323 9105810 42289936 5180132 63113697 91923313 12406834 -7279140 -20218070
9558b0218070Q3306946m874805j06627534m3394689j8838511J34400501Q034961j16290299
$$ -20218070 63088876 58214071 -48413463 -91808152 -110646663 23753838 31788799 -84501500
9550h4501500J05911592p8081583L8252470K2624849M0207848l8390038k753109m1453226
$$ -84501500 21410092 -56671491 -18419021 4205828 44413676 6023638 3270529 -38182697
9542c8182697j6382818q9541761J60369700j10564137R5794718L3952215k6253244R116496
$$ -38182697 -54565515 -144107276 16262424 -94301713 1493005 35445220 9191976 18308472
9534A8308472Q3668978j46679476k956804N0709869j1774497k366451m2567869J05792466
$$ 18308472 101977450 -44702026 -47658830 3051039 -8723458 -11089909 -53657778 52134688
9526E2134688n991496k9548414j3543969R3578790j71385567K8445799R8450423n4499089
$$ 52134688 46143192 16594778 3050809 96629599 -74755968 -46310169 52140254 -2358835
9518b358835j46343780J22178644M6515246O0022385j00460094k8923290R8707614
$$ -2358835 -148702615 -26523971 19991275 80013660 -20446434 -49369724 49337890
9511D9337890N0063422p5159207o4141108j8467655Q5208477o0609022J03904047n8524687
$$ 49337890 99401312 24242105 -39899003 -58366658 26841819 -33767203 70136844 11612157
9503A1612157k1889950m4540230J78612430j05250295L01814m063319J0070193m012967
$$ 11612157 -10277793 -54818023 123794407 18544112 18845926 14782607 24852800 20839833
9495B0839833J40694552j62608611n5051375N4047708r3111741O8160704J02151513
$$ 20839833 161534385 -1074226 -56125601 -2077893 -95189634 -27028930 75122583
9488G5122583q5378037m459163O7386185j06730453J22705302m4289142O897312M090180
$$ 75122583 -10255454 -14714617 52671568 -54058885 68646417 24357275 31254587 35344767
9480C5344767o5187823M1865731n4942518J31477247j30464036J51975463j10203392
$$ 35344767 -29843056 12022675 -42919843 88557404 -41906632 110068831 -134561
9473a34561J32966566j72889871J8580708M1906861q979868L2604928o2078002M4503399
$$ -134561 132832005 -40057866 -21477158 20429703 11449835 44054763 -18023239 26480160
9465B6480160j26732857R3985902M4158720j4285065q8501484J20362291n1926286
$$ 26480160 -100252697 -6266795 37891925 23606860 -64894624 55467667 3541381
9458C541381q0771343J22584053n8253711M9008900N0983005k0066334j58245464
$$ 3541381 -77229962 45354091 -12899620 36109280 87092285 67025951 -91219513
9451i1219513J14117647p3835529P75468P4754288p3526275K7096814m9272787M3760097
$$ -91219513 22898134 -50937395 -50161927 24592361 -48933914 -21837100 -71109887 -27349790
9443b7349790j4367345M7958299m8286891k3627536J01579404n2596093o0182911
$$ -27349790 -41717135 6241164 -42045727 -65673263 35906141 -16689952 -76872863
9436g6872863J16601531K2052783k1971112N0689259r3517015L8332570J55094135
$$ -76872863 39728668 61781451 39810339 90499598 -3017417 35315153 190409288
9429A90409288k45081654J21039456k3795702M5298186j26137262J01670391N3832793
$$ 190409288 -54672366 66367090 42571388 87869574 -38267688 63402703 117235496
9422A17235496q310447q981565n6767199j05835634O5867180R7884366j65985499
$$ 117235496 108925049 99943484 43176285 -62659349 3207831 101092197 -64893302
9415f4893302J67068715j38185635Q0947962m7119926j9743869O639375J6353226P4362108
$$ -64893302 102175413 -36010222 44937740 -2182186 -21926055 -15286680 1066546 75428654
9407G5428654k839779l4112421o4535529o3001248J34295675j9216795n6035179N2932100
$$ 75428654 72588875 38476454 -26059075 -89060323 45235352 26018557 -30016622 22915478
9399B2915478N6860586p5938488M8678875q4033031j936689p517306J51380045j18896316
$$ 22915478 79776064 3837576 52516451 -31516580 -33453269 -40970575 110409470 -8486846
9391h486846j9325527L3257653P8414950Q289026J8019310j46164344K28918433k22185138
$$ -8486846 -27812373 5445280 83860230 92149256 110168566 -35995778 192922655 -29262483
9383b9262483Q6900451L88582o8254597M4494512q2695516J50220166r3358595K3377700
$$ -29262483 57637968 58026550 -10228047 34266465 -48429051 101791115 8432520 31810220
9375C1810220N1542720q6197216k5403982m966717l4663565K02017629p7144537r8388758
$$ 31810220 83352940 -2844276 -28248258 -33214975 -67878540 134139089 56994552 -41394206
9367d1394206O4840440k5257824k0595035l762908K2725267J9309410K6683184j08283462
$$ -41394206 23446234 -1811590 -22406625 -26169533 -3444266 15865144 42548328 -65735134
9359f5735134J02324034l4699615J04205029j56065058R1824299q5324940l7880947
$$ -65735134 36588900 1889285 106094314 -49970744 41853555 -43471385 -81352332
9352h1352332O3074490O3865372p3034105L7574749N9587423q7778301J06108114r0621692
$$ -81352332 -18277842 45587530 -27446575 10128174 69715597 -18062704 88045410 -2576282
9344b576282P1248669l9845876Q547574j90255018J91052228j46904449J23697582
$$ -2576282 68672387 28826511 37374085 -152880933 38171295 -108733154 14964428
9337A4964428J18524799j21191649L5069663p1930998J13856070n5905279j4170332
$$ 14964428 133489227 12297578 47367241 -24563757 89292313 33387034 19216702
9330A9216702m8196431O8560086l003571r1684577J21350202m33083M7421969p1108309
$$ 19216702 -28979729 39580357 36576786 -55107791 66242411 65809328 113231297 42122988
9322D2122988J8313956K7127108j78952684J42281051p6628204L9370191j1791998
$$ 42122988 60436944 87564052 -91388632 50892419 -25735785 13634406 1842408
9315A842408j17630247R2902103r4981343R4804699P7876758p6952770j504396L4583009
$$ 1842408 -115787839 -22885736 -117867079 -23062380 54814378 -22138392 -23642788 10940221
9307A0940221n8587876M0957204r7854140K6207932P1906649k3972842O2160642j60718571
$$ 10940221 -47647655 -6690451 -104544591 -78336659 -6430010 -30402852 31757790 -128960781
9299a28960781P8055388O8064770n32858K5002418j0635755n7623349R2652732k7914817
$$ -128960781 -50905393 17159377 16626519 41628937 30993182 -26630167 66022565 38107748
9291C8107748O9931336p5640727r7793413J18714788p8160620o4658881K7916337L0647571
$$ 38107748 108039084 32398357 -65395056 53319732 -24840888 -89499769 -61583432 -30935861
9283c0935861J43683411q1797922l5585113o5452108R9512182J2451922n3435166n7536629
$$ -30935861 112747550 30949628 -4635485 -70087593 29424589 41876511 -11558655 -69095284
9275f9095284M3733510J3997891j5305207Q0260065q9663490P9485676m0198838q5925175
$$ -69095284 -25361774 -11363883 -26669090 53590975 -36072515 43413161 3214323 -82710852
9267h2710852K8987115J27352708l8085264r7355452J49648077j22640461N2416070
$$ -82710852 -53723737 73628971 35543707 -61811745 87836332 -34804129 17611941
9260A7611941J3044629L0060322r5991403O843107N3733681j4675422M1373850j73265851
$$ 17611941 30656570 60716892 -35274511 -28431404 25302277 10626855 52000705 -121265146
9252a21265146K8251657N9764426Q3204515o7509421P160285J7772024k3216581n5804751
$$ -121265146 -93013489 -33249063 49955452 -17553969 -10393684 7378340 -15838241 -71642992
9244g1642992J5566339K8815807N3565348r8338285P5042205p3449047L5321896K3449136
$$ -71642992 -56076653 -27260846 26304502 -72033783 3008422 -70440625 -35118729 -11669593
9236a1669593k6511414k8593270K2654427M3592993r5652895J16935139p859703p5910002
$$ -11669593 -38181007 -66774277 -44119850 -526857 -96179752 20755387 12895684 -63014318
9228f3014318R0338469P9567069j23049988m7516777J21801285m994024k6305070l4154736
$$ -63014318 27324151 106891220 -16158768 -63675545 58125740 53131716 26826646 -7328090
9220g328090P8072J02449930l937381r3425434R5350530j4360059k7286966k8291499
$$ -7328090 -7250018 95199912 91262531 -2162903 93187627 78827568 51540602 23249103
9212B3249103Q3778023o346662j30174239O2079117P0462196n1398454J183169o464939
$$ 23249103 107027126 100680464 -29493775 32585342 103047538 51649084 52832253 46367314
9204D6367314J32953819o1821170j74813974J38904393j8726604j7260920n877526
$$ 46367314 179321133 117499963 -57314011 81590382 62863778 45602858 39725332
9197C9725332l6129485J01432806p0118536o4769379K4571964j106732K9505215N8561890
$$ 39725332 3595847 105028653 34910117 -29859262 -5287298 -6394030 23111185 81673075
9189H1673075l7194458K3873391j93965208J64024955j29775373J21780544L3161654
$$ 81673075 44478617 68352008 -125613200 38411755 -91363618 30416926 63578580
9182F3578580J728422o3810369j7187836l6185069n8929854R3256894M5153744l0824110
$$ 63578580 65307002 1496633 -15691203 -51876272 -110806126 -17549232 27604512 -3219598
9174c219598N5361189k5730057L5643230J6358868J1210107n3862464R7774392r0084679
$$ -3219598 52141591 26411534 62054764 78413632 89623739 35761275 133535667 43450988
9166D3450988j00008562P834667K2061911M6267930M8139147p6165213Q1325885J3762363
$$ 43450988 -56557574 -48722907 -26660996 19606934 67746081 -8419132 72906753 86669116
9158H6669116j35777612K9887950j1454863K831392m593491k8321050K2378725M0218821
$$ 86669116 -49108496 -19220546 -30675409 -27844017 -32437508 -60758558 -38379833 1838988
9150A838988M8578516k3510651j01249951N8816547R4109501k2513781L985101N0123946
$$ 1838988 50417504 26906853 -74343098 -15526551 78582950 56069169 60054270 110178216
9142A10178216j44362046l9805208M0540135j1872258N7379398n9548060Q6020789
$$ 110178216 -34183830 -73989038 -33448903 -45321161 12058237 -47489823 38530966
9135C8530966K8992388p1570193q0391415R7005459k5727597J7244768K1090031j510449
$$ 38530966 67523354 -4046839 -84438254 12567205 -13160392 4084376 25174407 23663958
9127B3663958n4277830J5218493M5885064J9252669j4785667p3742472J39760738
$$ 23663958 -30613872 -15395379 30489685 49742354 34956687 -38785785 100974953
9120A00974953j00166634N4081924j31947464J22547233k2853284n6469725N3958240
$$ 100974953 808319 54890243 -77057221 45490012 22636728 -33832997 20125243
9113B0125243L0706091j08329823M9229582l251741M8480523n3678108J5937864k9115532
$$ 20125243 50831334 -57498489 -8268907 -11520648 36959875 -16718233 -780369 -29895901
9105b9895901N6643834L482576K337348p9738596M6198314O3223204j36041032Q8928181
$$ -29895901 26747933 30230509 32567857 -47170739 -972425 62250779 -73790253 15137928
9097A5137928k5969587O6446130r5473074m2017824O5830395l3142600K2840868p4479453
$$ 15137928 -10831659 55614471 -39858603 -81876427 -16046032 -49188632 -26347764 -100827217
9089a00827217O1587272l5722269J07199414q5337088k4179840J59333264q7811782
$$ -100827217 -39239945 -74962214 32237200 -53099888 -77279728 82053536 -5758246
9082e758246n3968239L4010179q8200989R4094595N784232R051691K9045982l6401379
$$ -5758246 -59726485 -25716306 -113917295 -19822700 -14038468 -4986777 24059205 -12342174
9074a2342174l9581887L4190170O6603125J05113202k14444787j5466733J00568968
$$ -12342174 -51924061 -17733891 48869234 153982436 -60462351 -75929084 24639884
9067B4639884j1291110n8471816K2133696j0891725J02680481p0324938M1705301L2677746
$$ 24639884 13348774 -45123042 -22989346 -33881071 68799410 -1525528 40179773 72857519
9059G2857519p498933j34373786R6051236L9039667j13233272l5018639J18255993
$$ 72857519 65358586 -69015200 27036036 66075703 -47157569 -82176208 36079785
9052C6079785j15820158K3885710N8187213K7133143K6519538j8955121j40464820
$$ 36079785 -79740373 -55854663 2332550 29465693 55985231 37030110 -103434710
9045a03434710R5451071q2617746M0138618M5815704n949457m5449389M5583037K7892877
$$ -103434710 -7983639 -90601385 -50462767 -4647063 -10596520 -56045909 -10462872 17430005
9037A7430005K1100357M9729787o2500828Q7809430j50830617R4494627o9041090l2670162
$$ 17430005 38530362 88260149 25759321 113568751 -37261866 57232761 -11808329 -44478491
9029d4478491l0254736J45776644k9080937r8160335J20469048l245472k1102351
$$ -44478491 -74733227 71043417 41962480 -56197855 64271193 61025721 39923370
9022C9923370j27067028J03633392m3910100J5464472k3898305l1005653M0757574
$$ 39923370 -87143658 16489734 -27420366 -11955894 -35854199 -66859852 -26102278
9015b6102278M5599931m4197632k0115N1846410o3919629R9129565j18751607O4278964
$$ -26102278 19497653 -24699979 -24720094 27126316 -36793313 62336252 -56415355 7863609
9007G863609l2705926K2497655n4019604j4352337n158726Q8250785p9097996J27366987
$$ 7863609 -24842317 -2344662 -56364266 -70716603 -75875329 12375456 -66722540 60644447
8999F0644447j53502667J07767630J1805701L7350821j4571061o5626827l5412686
$$ 60644447 -92858220 14909410 26715111 64065932 49494871 -16131956 -51544642
8992e1544642J45814620j13221149k2122040O3981026j06521766J28975599o893121
$$ -51544642 94269978 -18951171 -41073211 22907815 -83613951 45361648 38468527
8985C8468527M0017363j5944315M3373224q4123176J5641504m7589064k0564827j4158963
$$ 38468527 78485890 62541575 105914799 21791623 37433127 -10155937 -30720764 -44879727
8977d4879727J17590143l4125559j46188147J36119435Q306975Q8246205o399575m3894656
$$ -44879727 72710416 38584857 -107603290 28516145 36823120 125069325 118669750 74775094
8969G4775094R184221j23709592q253751q618663Q8290424k7382874r9957413P2897020
$$ 74775094 83959315 -39750277 -48004028 -56622691 31667733 4284859 -95672554 -22775534
8961b2775534L7040418p9258975L3142602P0896803M4058j86037224J83347974r8683013
$$ -22775534 14264884 -64994091 -31851489 39045314 39089372 -146947852 36400122 -62282891
8953f2282891J47805375j81330141P2699995n7358608M7364761j03036689P9295766
$$ -62282891 85522484 -95807657 -23107662 -80466270 -33101509 -136138198 -56842432
8946e6842432M0892041P5067833o7857894R4126055j5546412j06914074l442907L2671424
$$ -56842432 -15950391 59117442 -8740452 85385603 69839191 -37074883 -40517790 -7846366
8938g846366P2328737j21452702J66754286j83420672P1049995L1102684p7577457
$$ -7846366 64482371 -56970331 109783955 -73636717 -2586722 28515962 -49061495
8931d9061495R0232846l9072286p553694k6249622M6969362o8450473m9815474J01423212
$$ -49061495 41171351 2099065 -5454629 -31704251 15265111 -53185362 -103000836 -1577624
8923a577624k3650349J7752094P4130207j17249230m753835j4800820N8262248k2909979
$$ -1577624 -25227973 -7475879 66654328 -50594902 -55348737 -70149557 -11887309 -34797288
8915c4797288M2872653m0772107M7366036R5687837k8060764p8482569O3011487M6052301
$$ -34797288 8075365 -32696742 14669294 110357131 82296367 3813798 66825285 112877586
8907A12877586j1879171J954724q5349627K0218124k4524425j0177608L020616k3585417
$$ 112877586 100998415 102953139 17603512 37821636 13297211 3119603 6140219 -17445198
8899a7445198R0588359o871257m5442594l5326813J51058758q4470675l2462374M153017
$$ -17445198 73143161 66271904 20829310 -14497503 136561255 52090580 19628206 23781223
8891B3781223o6896639m4806096l6236837Q9704470k6234736j18061123J36563243
$$ 23781223 -43115416 -87921512 -124158349 -34453879 -60688615 -178749738 -42186495
8884d2186495j12089075Q9643929L4721892L370505R0893729n5219760j0129856j02499529
$$ -42186495 -154275570 -64631641 -29909749 -26539244 64354485 9134725 -995131 -103494660
8876a03494660Q0564988o6566209Q9822235L9277994j27350047J21370518P1962699
$$ -103494660 -22929672 -89495881 326354 39604348 -87745699 33624819 105587518
8869A05587518n8165395j16184159J13834083m929735K7692663j1424438M7307684
$$ 105587518 47422123 -68762036 45072047 40142312 67834975 56410537 103718221
8862A03718221r3616309j8464595j5852543k2467761P8357650p3719841p6598987
$$ 103718221 10101912 -8362683 -24215226 -46682987 31674663 -42045178 -118644165
8855a18644165J93290450n4176628o6005861m090287N3996328j06692544J22177038
$$ -118644165 74646285 20469657 -45536204 -49626491 4369837 -102322707 19854331
8848A9854331r0646862M5688191j4056403o2611034P7085076k5261901k913151n2460881
$$ 19854331 -70792531 -25104340 -39160743 -101771777 -24686701 -49948602 -52861753 -105322634
8840a05322634J06511642N832022m2029483M5689586j10679974P3873504R641229O1929385
$$ -105322634 1189008 7021030 -35008453 10681133 -99998841 -26125337 -16484108 45445277
8832D5445277r2186250N4916780j23388204R4221667M337942q8458164J70331834n3727527
$$ 45445277 -46740973 8175807 -115212397 -20990730 -16652788 -105110952 65220882 11493355
8824A1493355N7635982j60125069Q2127913m1852820Q3109233Q040516j18087183k4820821
$$ 11493355 69129337 -90995732 -8867819 -50720639 32388594 40429110 -77658073 -102478894
8816a02478894J71432099q4582533K4654203L8400241m1777997K0403697m7434549
$$ -102478894 68953205 -15629328 9024875 47425116 5647119 26050816 -21383733
8809b1383733k2053547J14043399m2768441N4413469j12670088L9457114q609476m2421550
$$ -21383733 -43437280 70606119 27837678 82251147 -30418941 9038173 428697 -41992853
8801d1992853J07328969K0407916N3480808j75408126N7888615J7162143j22217693
$$ -41992853 65336116 85744032 139224840 -36183286 21705329 38867472 -83350221
8794h3350221N2121670J49442977m3903445r2708386J2460824k8929767M1634687n7164715
$$ -83350221 -31228551 118214426 74310981 -18397405 -5936581 -34866348 6768339 -50396376
8786e0396376N2995073p712605R1772991j8012525r2167410k4436077L0407276j9861038
$$ -50396376 2598697 -5113908 86659083 68646558 -23520852 -47956929 -17549653 -37410691
8778c7410691L3155788L3245559j8584093m2474996L0330171l5239938k196800j45815394
$$ -37410691 -4254903 28990656 10406563 -32068433 -1738262 -36978200 -39175000 -184990394
8770a84990394J41292666P2751013J6108749n071583m1826313p6433048P5012091p3408926
$$ -184990394 -43697728 29053285 45162034 40090451 -1735862 -78168910 -3156819 -76565745
8762g6565745P7558388K219458L6250177j70550768R0222070n1770789l5587074J72810201
$$ -76565745 992643 3212101 39462278 -131088490 -40866420 -92637209 -128224283 44585918
8754D4585918q8378305P3671879j6764530Q830741p1886208l2850320O3362697L1618219
$$ 44585918 -43792387 29879492 13114962 21945703 -49940505 -82790825 -19428128 12190091
8746A2190091p1684759o2795366M7447384j149014L4461150K2392194R9590176j02463127
$$ 12190091 -59494668 -122290034 -74842650 -75991664 -41530514 -19138320 80451856 -22011271
8738b2011271M2029122o1387930R7549954n3491731q192736m4972902O2582156l4826834
$$ -22011271 20017851 -41370079 56179875 2688144 -5504592 -50477494 12104662 -22722172
8730b2722172N9536652l3316568K9667481J01629347j67614075p056262J8964811J511820
$$ -22722172 36814480 3497912 33165393 134794740 -32819335 -39875597 -20910786 -19398966
8722a9398966o4177030J92889886j36459971p8620374J56821211j7388272l9363002
$$ -19398966 -83575996 109313890 -27146081 -105766455 51054756 33666484 -5696518
8715e696518L9131202k2547688o2325646N7958256L9178032j15091448l6264029J36926027
$$ -5696518 33434684 10886996 -51438650 6519606 45697638 -69393810 -105657839 31268188
8707C1268188q2329964J21594264J9820383j09079959l1569144M9581711m4421168K02103
$$ 31268188 -51061776 70532488 90352871 -18727088 -50296232 -714521 -45135689 -44933586
8699d4933586Q5379745r2391095J33462683m6743543j22712622L2820727k4661077
$$ -44933586 40446159 -51944936 81517747 34774204 -87938418 -55117691 -79778768
8692g9778768J4744572Q1453543O0606030r678730j73830087P3519069M434990O5381792
$$ -79778768 -65034196 16419347 77025377 67346647 -106483440 -32964371 -28529381 36852411
8684C6852411n6108207M7080983m1480308Q4073691j06841779k3152032K0409234K0725470
$$ 36852411 -19255796 27825187 -13655121 70418570 -36423209 -59575241 -39166007 -18440537
8676a8440537O0446649N1096499l8170817o0907652k6146085R886724J63027710j7473498
$$ -18440537 42006112 93102611 54931794 -5975858 -32121943 -22235219 140792491 123318993
8668A23318993j74143019O8584181o2135424L0381500j2696804R2929428j27246129
$$ 123318993 -50824026 17760155 -44375269 -13993769 -26690573 66238855 -61007274
8661f1007274O2644388o1845935P2580634m1691969L4651618R672646J0557375Q2303934
$$ -61007274 1637114 -60208821 12371813 -29320156 5331462 15004108 25561483 107865417
8653A07865417j84988604J145658L3927934L746325n875473J09417463j60487566
$$ 107865417 -77123187 -75977529 -42049595 -38303270 -44178743 65238720 -95248846
8646i5248846J07671840l8891133o2445081J38825582n1554978P9189990l7162403
$$ -95248846 12422994 -26468139 -88913220 49912362 -1642616 77547374 40384971
8639D0384971k0098071N252906n5740933p7417496R8286326J7084350l1195098M6275791
$$ 40384971 20286900 25539806 -30201127 -107618623 -9332297 7752053 -23443045 22832746
8631B2832746j05014233M5941804o227048O8003119j4233390O8480469m8322159l1803842
$$ 22832746 -82181487 -36239683 -42466731 25536388 11302998 79783467 31461308 -342534
8623c42534K3591745j58746916J36267672O9311275o6969679J783681j18441456J59044590
$$ -342534 23249211 -135497705 769967 70081242 3111563 4895244 -113546212 45498378
8615D5498378j40388665J70143684o6832589J1910396P7558739L7125268j52688246
$$ 45498378 -94890287 75253397 8420808 20331204 97889943 135015211 -17673035
8608a7673035l320858J9340576l9477200J22891154j9619448l9816438r5387704N7396586
$$ -17673035 -20993893 -1653317 -41130517 81760637 62141189 22324751 -73062953 -15666367
8600a5666367N9175786K7966902n9582885j4364372R3499360j3750111q0631981p1241084
$$ -15666367 43509419 71476321 11893436 -2470936 91028424 77278313 -3353668 -74594752
8592g4594752Q6325241J2607161q9101424L5840003L0272982N4047860r5399840J7791272
$$ -74594752 11730489 24337650 -64763774 -28923771 1349211 55397071 -40002769 -22211497
8584b2211497M3179076K307569j10640958J32546946m4840416m5690037L6578903r7561740
$$ -22211497 20967579 23275148 -87365810 45181136 340720 -45349317 -8770414 -106332154
8576a06332154J79114751n7984430q1661046O6102121k3568664m1805558N7415232
$$ -106332154 72782597 14798167 -66862879 -760758 -24329422 -66134980 -8719748
8569h719748J0725574l7575252j126520M30731J9124106m0645819J24015515j88203101
$$ -8719748 2005826 -35569426 -36695946 -36265215 -17141109 -57786928 66228587 -121974514
8561a21974514J73897648M0009733j29838498n5116093j6114115J50841483j10446109
$$ -121974514 51923134 91932867 -37905631 -93021724 -109135839 41705644 -68740465
8554f8740465N5773403L2002238j1862387K212462J31361248j74542285P0766914o7043620
$$ -68740465 -12967062 19035176 7172789 9385251 140746499 -33795786 36971128 -30072492
8546c0072492L4821275O0593436r0152054O6953548o3066904J7241888k6604644Q5386115
$$ -30072492 4748783 65342219 -24809835 42143713 -20923191 -3681303 -30285947 55100168
8538E5100168p0365688P188793M5869637K6927363q2996157j09017472M5840268J49986878
$$ 55100168 -15265520 -8076727 37792910 64720273 -18275884 -127293356 -81453088 68533790
8530F8533790p6493299m9493719Q6524890l1972142O1702544k7696199m323027j05101682
$$ 68533790 -7959509 -57453228 29071662 -2900480 58802064 31105865 26782838 -78318844
8522g8318844J49750544p6642994Q5402114j31794319L491832J12923461M8781369
$$ -78318844 71431700 -5211294 80190820 -51603499 -48111667 64811794 113593163
8515A13593163j37910140J25838441j7119637M2938999q7739303m2298260K6856089
$$ 113593163 -24316977 101521464 84401827 127340826 39601523 -2696737 24159352
8508B4159352j2574835n6139875M6456336R9167787r7468852j25596360J28844853
$$ 24159352 11584517 -44555358 1900978 101068765 3599913 -121996447 6848406
8501F848406L6930402o2116581Q1998265q9477880j9439170K2775294k8461205L2460519
$$ 6848406 43778808 -18337773 63660492 -25817388 -45256558 -22481264 -50942469 -18481950
8493a8481950M4593069j05987708P0130956P0726672j43798097m487376J06303763
$$ -18481950 26111119 -79876589 -9745633 60981039 -82817058 -87304434 18999329
8486A8999329r2362801J82354449j25864485O3359865k8634871o9155852N8631099
$$ 18999329 -73363472 108990977 -16873508 46486357 17851486 -51304366 7326733
8479G326733r4824560Q8600318m4872938k1791266J09014332j7727403Q861951k8291880
$$ 7326733 -87497827 1102491 -43770447 -65561713 43452619 25725216 34587167 6295287
8471F295287P9130111o9902227p239580O7594524q1034620j8869681r9704308J17364592
$$ 6295287 85425398 15523171 8283591 75878115 -5156505 -24026186 -123730494 -6365902
8463f365902o1220320Q0184116p5008939P5763111l21134J05619754n7374802o1838858
$$ -6365902 -67586222 12597894 -62411045 13352066 13030932 118650686 61275884 -562974
8455e62974O071921k7725308Q1172988j12594490K2037704l5828981L3807717J81286605
$$ -562974 5508947 -22216361 58956627 -53637863 -31600159 -67429140 -33621423 147665182
8447A47665182p2558976k0499741o5796434M8551275j5287719K4607079l9682250J6796527
$$ 147665182 75106206 54606465 -11189969 37361306 22073587 46680666 6998416 23794943
8439B3794943L0794444j31092799J24726171K7921745p3669598k0085551J31589474
$$ 23794943 54589387 -76503412 48222759 76144504 2474906 -17610645 113978829
8432A13978829j20577282q445290L1069410O3013155J3902832r4319589j4120381N6553793
$$ 113978829 -6598453 -15043743 16025667 79038822 92941654 -1377935 -15498316 41055477
8424D1055477j88080237J27414293L045956P6989275l8934099p4616955K3045200R1920079
$$ 41055477 -147024760 -19610467 -16564511 60424764 21490665 -53126290 -30081090 61838989
8416F1838989m3414645m606274R1002384j18705392n5525492L0617580P4532423j25948295
$$ 61838989 18424344 13818070 104820454 -13884938 -69410430 -38792850 35739573 -90208722
8408i0208722J91700678r1509328Q9012306k0618362q6943532r0710148J65772325o043826
$$ -90208722 101491956 9982628 98994934 78376572 -8566960 -99277108 66495217 60451391
8400F0451391O4393812k33030760L2199809J4032947p1510347J34746228L2301857
$$ 60451391 124845203 -108185557 -75985748 -61952801 -133463148 1283080 33584937
8393C3584937l7647881L0895368N6301864j11238996m7176591J00821848o0923095n933415
$$ 33584937 -4062944 26832424 83134288 -28104708 -75281299 25540549 -35382546 -41315961
8385d1315961J10702028p9644021m0285895n787981Q1369973Q087525M826229J3437623
$$ -41315961 69386067 -10257954 -50543849 -56331830 25038143 33125668 37951897 51389520
8377E1389520r1945685J40122302k14523738P4549786P8061850N6074082q2732910
$$ 51389520 -40556165 99566137 -114957601 -40407815 37654035 93728117 10995207
8370A0995207J9087411k987224m7638497l9733696P4592450j46472281K18385090O6773693
$$ 10995207 30082618 27095394 -20543103 -60276799 14315651 -132156630 86228460 153002153
8362A53002153j60046463K5591912n9574842K4856241N3829450p91018m9553907n8243437
$$ 153002153 -7044310 18547602 -41027240 -16170999 37658451 36867433 -12686474 -70929911
8354g0929911L4642376K6136059N6170702m8785017J7136801R4539599j03525282N248758
$$ -70929911 -36287535 -10151476 46019226 -2765791 14371010 108910609 5385327 10634085
8346A0634085K6765001j06700709K2566326R1103794j06968474m4988189l2256482
$$ 10634085 37399086 -69301623 -46735297 44368497 -62599977 -107588166 -139844648
8339a39844648K27751259r1564485k0244123P4507284j07117884M020213O0167880
$$ -139844648 87906611 -3657874 -23901997 50605287 -56512597 -52492384 7675496
8332G675496j43531620J45268508q8313701Q7439393n9029581j4844334J352425M4390671
$$ 7675496 -135856124 9412384 -78901317 8538076 -50491505 -65335839 -63983414 -19592743
8324a9592743J9384873k495559J9538031O4102760q2556006q7986323J24375596j9384267
$$ -19592743 -207870 -2703429 16834602 80937362 -1618644 -89604967 34770629 15386362
8316A5386362j3150107J1868211J01769556j02060510m1035579R723630R653872N4193993
$$ 15386362 2236255 14104466 115874022 13813512 -27222067 -17498437 -7844565 46349428
8308D6349428o5726095O2496946L1175127j28457478n6788476J10106244L2414860
$$ 46349428 -19376667 43120279 74295406 -54162072 -110950548 -844304 31570556
8301C1570556l4774101J18844416j20675053j4409053q5529181K28701718j70334280
$$ 31570556 -3203545 115640871 -5034182 -19443235 -104972416 123729302 -46604978
8294d6604978K3248475q057346l7277061J17400215j09215436K2177082R9843534m1490972
$$ -46604978 -23356503 -31413849 -68690910 48709305 -60506131 -38329049 61514485 20023513
8286B0023513q368206o2885084M2539064k9611199R21202L595538J08152575j92690293
$$ 20023513 11655307 -51229777 -8690713 -38301912 -37380710 -33785172 74367403 -118322890
8278a18322890Q6332586l5309117q6235882J97426818M878914j1132756l9231986q0952431
$$ -118322890 -31990304 -67299421 -153535303 43891515 48770429 37637673 -1594313 -82546744
8270h2546744R1006928n0663986K354737J8702203j5170943j4221104Q728720r2486296
$$ -82546744 8460184 -42203802 -39849065 -21146862 -36317805 -50538909 -41810189 -134296485
8262a34296485J16635108K210063J6700792M1598974j9219051l7353350q8524791Q0516207
$$ -134296485 -17661377 -15451314 1249478 42848452 23629401 -13723949 -102248740 -21732533
8254b1732533j02331695J40219751p9874524Q5629406J2514424K3093817o7363043
$$ -21732533 -124064228 16155523 -63719001 21910405 34424829 57518646 -9844397
8247i844397k1912828P2379096K2519699j38131653M2685065N534537L7145282q5568803
$$ -9844397 -31757225 40621871 63141570 -74990083 -32305018 -26770481 10374801 -75194002
8239g5194002R2861126o1761106O90998K3348620m340225m8576256m734619K6362419
$$ -75194002 17667124 -44093982 -43402984 -20054364 -24394589 -72970845 -77705464 -51343045
8231e1343045n6484124J40702667J0761720n650821J59240177k26124283m9184987
$$ -51343045 -107827169 32875498 43637218 37986397 197226574 -28897709 -78082696
8224g8082696L7061676l5739460Q9170075J5603436p5323754P6013948n2024377Q0669423
$$ -78082696 -41021020 -76760480 12409595 28013031 -47310723 28703225 -23321152 57348271
8216E7348271q0145602Q2096110L8294125q9244257p2998849O3883080p9369673K7747741
$$ 57348271 -22797331 59298779 97592904 8348647 -64650202 -767122 -80136795 -52389054
8208e2389054N2280377J8891722m7648055J39728932n6072122l2407245K3821299
$$ -52389054 -108677 18783045 -28865010 110863922 54791800 22384555 46205854
8201D6205854j48592483J51684275j41370160O4421597q3208626J05520774n4123717
$$ 46205854 -102386629 49297646 -92072514 -27650917 -110859543 -5338769 -59462486
8194e9462486J02597102m6794646O5721453q0255889R87860m6162974m5331780P7797837
$$ -59462486 43134616 -3660030 62061423 -18194466 -17206606 -63369580 -108701360 -30903523
8186c0903523J7651070o7301843j5492668J28912825o5896038O6754685o263100J00912864
$$ -30903523 -13252453 -80554296 -96046964 32865861 -33030177 33724508 27461408 128374272
8178A28374272k12456299P8879502l2260072j359672K9089894l0815427Q8720579k5396871
$$ 128374272 -84082027 -5202525 -37462597 -38822269 -9732375 -40547802 48172777 22775906
8170B2775906M7385734j85410639J10971964m3173038J09295567l0577972l3401320
$$ 22775906 70161640 -115248999 -4277035 -47450073 61845494 31267522 -2133798
8163b133798j1086809R1450177o3325412R203675M720856O1972143o3718557j45314796
$$ -2133798 -13220607 78229570 14904158 24107833 28828689 90800832 27082275 -118232521
8155a18232521L3640884k537335P9006141J3728728J02843772K6599932j24979690
$$ -118232521 -84591637 -87128972 -8122831 5605897 108449669 135049601 10069911
8148A0069911l7888986O6888199o8554653n2454892J2178972M0773030N5609155j27272735
$$ 10069911 -27819075 39069124 -29485529 -81940421 -69761449 -28988419 26620736 -100651999
8140a00651999j0302204K30088557j40856058J7289974j9653686L9639592q8961301
$$ -100651999 -110954203 119134354 -21721704 -4431730 -24085416 15554176 -73407125
8133g3407125m2129044l2371474J58434480q2394947R5609479N7675818R222208j26365172
$$ -73407125 -115536169 -147907643 10526837 -71868110 23741369 81417187 90639395 -35725777
8125c5725777J9033823l5782588O5691955r4101851P0522340K4353388n5118741P5117170
$$ -35725777 -16691954 -52474542 13217413 -80884438 -10362098 13991290 -41127451 33989719
8117C3989719j05650348J35646007R0023933k7919509j40191p8269813r0295008K3964440
$$ 33989719 -71660629 63985378 154009311 126089802 125949611 47679798 -42615210 -18650770
8109a8650770l8989242P0153357J17396595j26331622M7788297o0065163l3691754
$$ -18650770 -57640012 12513345 129909940 3578318 51366615 -8698548 -42390302
8102d2390302N8691149N111891J59888406j14993958j33298089M8348804j067246k8543588
$$ -42390302 16300847 21412738 181301144 66307186 -66990903 -18642099 -19709345 -48252933
8094d8252933O7758003r65968K756538j42496282R8521473k7958645N9931925L9128770
$$ -48252933 19505070 18539102 21295640 -121200642 -22679169 -50637814 9294111 48422881
8086D8422881J1060077m4633817J7354123j55421602J63473818Q896590l9751051
$$ 48422881 59482958 14849141 32203264 -123218338 40255480 49152070 9401019
8079I401019j07534147J68565791k4638669o2268930O5706772M4480028n0248295q1053839
$$ 9401019 -98133128 70432663 45793994 -16474936 49231836 93711864 43463569 -37590270
8071c7590270Q0971472j17911152N0196600l8957918L5030346N9179106j2870086M6750557
$$ -37590270 43381202 -74529950 -24333350 -63291268 -28260922 30918184 18048098 64798655
8063F4798655k0745696M3607271k40539029K13750909l6547039j53056089Q2670768
$$ 64798655 44052959 87660230 -152878799 60872110 24325071 -128731018 -46060250
8056d6060250r413686M4032873O8384192q7911482n718793J07740411o3530982L5634332
$$ -46060250 -55473936 -11441063 56943129 -30968353 -36687146 71053265 7522283 43156615
8048D3156615j474714q7967363M0642644j1139994m0861388j4359955L2664182O4015596
$$ 43156615 41681901 -46285462 -5642818 -16782812 -57644200 -72004155 -39339973 24675623
8040B4675623J6353698k025336l0747717K3960071p9618636M9404475K858759n0924098
$$ 24675623 41029321 39003985 8256268 32216339 -47402297 2002178 4860937 -46063161
8032d6063161p5193557J25916480J7760613m5335561M8246992Q4783225k25547837
$$ -46063161 -121256718 4659762 22420375 -22915186 25331806 110115031 -115432806
8025a15432806J40069234J0410499j41900016M9609114m2213493R370364R1956692Q424839
$$ -115432806 24636428 35046927 -106853089 -57243975 -99457468 -90087104 1869588 10294427
8017A0294427k7999412J0621344n7255686J8106834L5217759n2270757N0883755j02543735
$$ 10294427 -17704985 -7083641 -64339327 -46232493 -11014734 -63285491 -12401736 -114945471
8009a14945471M1531564Q2923057J5968705k4575261r1872447J60600054n8566208
$$ -114945471 -73413907 9509150 25477855 902594 -90969853 69630201 11063993
8002A1063993r7624802J37103574p1282525j0208201J8190818j71314731J15769047
$$ 11063993 -86560809 50542765 -20739760 -30947961 -12757143 -184071874 -68302827
7995f8302827L4243089M5651381N8497832n0989058J426010k4019144N477285J03665220
$$ -68302827 -34059738 11591643 70089475 19100417 20526427 -3492717 1984568 105649788
7987A05649788j09958517J25408807j45508967o0982239K4545184K9968597j7321052
$$ 105649788 -4308729 121100078 -24408889 -85391128 -60845944 -30877347 -48198399
7980d8198399J24958908L8489074j37847504L3608680K1226785J19228747j66814850
$$ -48198399 76760509 115249583 -22597921 11010759 32237544 151466291 -15348559
7973a5348559j8563255O9334192l4487987K7639941r0274091O8493486n7851512P3235194
$$ -15348559 -33911814 35422378 934391 28574332 -61699759 6793727 -51057785 22177409
7965B2177409p995513N7572830m0815640q0061730o370914R4249612Q614530n3828497
$$ 22177409 14181896 71754726 30939086 -49122644 -55493558 38756054 47370584 -6457913
7957f457913J7533844j48200053J48651798M7830661j2264773j729117p6975473J08334500
$$ -6457913 11075931 -137124122 11527676 59358337 47093564 45364447 -31611026 76723474
7949G6723474o2473706l9692178k0968111P1268147k9636616O7445277j61385282N4110649
$$ 76723474 14249768 -25442410 -46410521 24857626 -4778990 62666287 -98718995 -44608346
7941d4608346O400092L9812312J00936237n7574479j34472578J04326885k7469342
$$ -44608346 -38208254 1604058 102540295 44965816 -89506762 14820123 -12649219
7934a2649219M6452447j30414554K7055453J46315532r3793394J20975215l9604366
$$ -12649219 33803228 -96611326 -69555873 76759659 -17033735 103941480 64337114
7927F4337114j03410751m1243575J17668234M743540j59525716J62044979p5500451
$$ 64337114 -39073637 -80317212 37351022 42094562 -117431154 44613825 -30886626
7920c0886626q7386761Q0918538M7288839j13894564J64189035K5685488j21441079
$$ -30886626 -118273387 -37354849 9933990 -103960574 60228461 85913949 -35527130
7913c5527130J7179132K6879698r4452540N0075469j7798993j436902P6496384o0827092
$$ -35527130 -18347998 8531700 -85920840 -35845371 -53644364 -55081266 21415118 -39411974
7905c9411974m1935827L4662209P6341347l2874209m7508577J37211248j48440676
$$ -39411974 -81347801 -46685592 29655755 -3218454 -50727031 86484217 -61956459
7898f1956459L2352912M8865726n5558163j2970310K5424732J9067566j0291864N1434007
$$ -61956459 -29603547 19262179 -36295984 -49266294 -23841562 -4773996 -15065860 36368147
7890C6368147j06163189J11785259l1141104l8527633L7699813l9833795P975251
$$ 36368147 -69795042 41990217 10849113 -27678520 10021293 -29812502 -21837251
7883b1837251J10029744m4827876q2559479n3087029J01487776o1247516k7410457
$$ -21837251 88192493 43364617 -39194862 -92281891 9205885 -52041631 -79452088
7876g9452088P5564184l9360710L7836014m5458129R40791K3356835L4507088o7818561
$$ -79452088 -3887904 -43248614 -5412600 -50870729 -49929938 -26573103 7933985 -59884576
7868e9884576P5691786k4356087m5621651N169131J07432783j32365280J38651741
$$ -59884576 15807210 -8548877 -54170528 -49001397 58431386 -73933894 64717847
7861F4717847r7939308J44698998j90412226J18243526m2135888M2811679j4483571
$$ 64717847 -33221461 111477537 -78934689 39308837 -2827051 39984628 25501057
7854B5501057M4403619m3281321J2234454j19329241J57995527o6353329j8519716
$$ 25501057 69904676 26623355 38857809 -80471432 77524095 11170766 -7348950
7847g348950j4866824O2491848j07675714M4978945j1255238J8842859l3970305N4467874
$$ -7348950 -22215774 40276074 -67399640 -22420695 -33675933 -14833074 -48803379 5664495
7839E664495j222339m2081440j52467681K01017833J2703946r1176644R8111300m883439
$$ 5664495 4442156 -37639284 -190106965 10910868 23614814 -67561830 30549470 25666031
7831B5666031o3100536m1254128L8245936Q0250066k4619207p5253683O0654759N9095438
$$ 25666031 -37434505 -78688633 -40442697 39807369 15188162 -60065521 589238 59684676
7823E9684676j05602652J6092624O5641997R1685259j23235044j7720652K873252m3529067
$$ 59684676 -45917976 -29825352 35816645 127501904 4266860 -13453792 -10580540 -54109607
7815e4109607O0317773L2421762P3471846o7839376j16981794N5940182o8867301M07947
$$ -54109607 6208166 38629928 112101774 44262398 -72719396 -16779214 -85646515 -85238568
7807h5238568J13852347l5603944J5599261r0922316k2717848R0091121r2330690
$$ -85238568 28613779 -6990165 8609096 -82313220 -105031068 -14939947 -107270637
7800a07270637J71515605l6961284K3231885p683101p8703218j0784333N2757185j6168861
$$ -107270637 64244968 27283684 50515569 42832468 -35870750 -46655083 6102102 -10066759
7792a0066759N9087975J79888j55093523Q5423385M6261175p5775090j140505P1909283
$$ -10066759 49021216 49201104 -105892419 -20469034 25792141 -49982949 -51123454 20785829
7784B0785829P8505110M6421399j38316431M618616j00391343O9565251j4251324J2403089
$$ 20785829 99290939 145712338 7395907 12014523 -88376820 -18811569 -33062893 -20659804
7776b0659804L6894830j60461284K38708474r5674066l689278l9580177L7079533K1551941
$$ -20659804 16235026 -144226258 94482216 -1191850 -4881128 -44461305 -7381772 14170169
7768A4170169J9987490m2141544r2078871L6690769p972459J84536953j42321732L1457604
$$ 14170169 34157659 -7983885 -100062756 -63371987 -71344446 113192507 -29129225 2328379
7760B328379l8858794K5932601J21714838k28407176R6959937L2974947K8788977k8274475
$$ 2328379 -36530415 -10597814 111117024 -117290152 -20330215 12644732 41433709 13159234
7752A3159234J270563J1325187M7751534l1156642o1732628O6365457o6681966J4171368
$$ 13159234 14429797 25754984 73506518 42349876 -19382752 46982705 -19699261 -5527893
7744e527893J1631599P9864377j73066907J00155260j60707124J50996495K291368
$$ -5527893 6103706 85968083 -87098824 13056436 -147650688 3345807 5637175
7737E637175J8443512P124140r2630087N4865873j7693527m2711260N2282069N5070569
$$ 5637175 24080687 31204827 -61425260 -6559387 -24252914 -66964174 -14682105 40388464
7729D0388464K8409496J5503820j23023163r7370651J00031897K3735608P7461230
$$ 40388464 68797960 84301780 -38721383 -136092034 -36060137 -12324529 65136701
7722F5136701j57116861J03616532r9424109N2700293m1353739r9865567K57384550
$$ 65136701 -91980160 11636372 -87787737 -35087444 -76441183 -176306750 81077800
7715H1077800j10847817M2058273L1129975m8810840j18527153P0465494J34603067
$$ 81077800 -29770017 12288256 43418231 -5392609 -123919762 -53454268 81148799
7708H1148799n7711209n1040983r6692365J21060556O8071704p6933090j5415427n3644819
$$ 81148799 23437590 -27603393 -124295758 -3235202 64836502 -12096588 -27512015 -81156834
7700h1156834n924857O6050155J5913266j3724358P4959558k08009370K08546278p1752600
$$ -81156834 -87081691 -21031536 -5118270 -18842628 56116930 -151892440 56653838 -15098762
7692a5098762N3027958n5074782R4036312R8741476k36394344M1782779K1015340
$$ -15098762 37929196 -17145586 76890726 175632202 -60762142 -18979363 2035977
7685B035977j42094445J88824801k2146209j34017234O7277944r2407284J76513027
$$ 2035977 -140058468 48766333 26620124 -107397110 -40119166 -132526450 43986577
7678D3986577J0644640j7805166L6433036p3002811R060324o8497692j865332L0998229
$$ 43986577 54631217 36826051 73259087 256276 9316600 -59181092 -61046424 -30048195
7670c0048195O9367565r6053885J64164817K3659875M5550823r9439792r403040O4679595
$$ -30048195 39319370 -56734515 107430302 131090177 176641000 77201208 67798168 132477763
7662A32477763j884753n5811494m2098841j4480447L3029856L2168789l2229214M928225
$$ 132477763 130593010 74781516 32682675 18202228 51232084 83400873 51171659 56099884
7654E6099884k0010451J28550017o6142609J4488836j39738762j4928379K3955647
$$ 56099884 36089433 164639450 98496841 112985677 -26753085 -41681464 -17725817
7647a7725817O8188186j34233345P7576727o0042306J47434122k01799861N1427873
$$ -17725817 50462369 -83770976 -6194249 -66236555 81197567 -120602294 -69174421
7640f9174421O3078290M2832784R034669j37546996J37429484p4942082r0714881
$$ -69174421 -6096131 36736653 45771322 -91775674 45653810 -29288272 -120003153
7633a20003153J07268387k8572986r033877O8501937n0413891N9665796j42636477
$$ -120003153 -12734766 -41307752 -50341629 18160308 -32253583 27412213 -115224264
7626a15224264J02762892M0693290N250247p3635860Q7000820q852500M8976441P296736
$$ -115224264 -12461372 28231918 33482165 -40153695 46847125 37994625 86971066 94267802
7618I4267802k5819573m8213285K7943360j05322436Q1065009j03632898p452343
$$ 94267802 68448229 20234944 48178304 -57144132 23920877 -79712021 -87164364
7611h7164364J17279244q0196862J05076267o2372286P527213k6540637L9179385O334804
$$ -87164364 30114880 -50081982 54994285 -7378001 149212 -26391425 12787960 19122764
7603A9122764q4286841j4066933M6682508K3537944J2000136L754239p4691544J76057572
$$ 19122764 -65164077 -79231010 -32548502 -9010558 2989578 6743817 -67947727 108109845
7595A08109845k9040135o1414190j51238399J78989914p7196528n3561710J30787715
$$ 108109845 79069710 17655520 -133582879 45407035 -31789493 -85351203 45436512
7588D5436512j55512087J12896273J9802120L2664167j01122401K7744657p0498319
$$ 45436512 -110075575 2820698 22622818 55286985 -45835416 -18090759 -88589078
7581h8589078Q7844198J35108204k46987107N5736375K9780451M2353996k3758043
$$ -88589078 -744880 134363324 -112623783 -56887408 -27106957 15247039 -8511004
7574h511004L6151570k8740608J7625364p287064l2914397O9120183r6762778Q812203
$$ -8511004 27640566 -1100042 16525322 9238258 -23676139 45444044 -51318734 -42506531
7566d2506531R6529450o366685m7153563k0814174K664260R4622371o9124698O7174926
$$ -42506531 54022919 47656234 502671 -20311503 -17647243 76975128 7850430 75025356
7558G5025356j23801640N3313983Q90344J068544j86205J9272909o6516073P2397227
$$ 75025356 -48776284 4537699 5428043 6496587 6310382 25583291 -40932782 31464445
7550C1464445Q7244443j39937183L8193603r1238214J02318013l3287632P2723863
$$ 31464445 118708888 -21228295 16965308 -74272906 28045107 -5242525 67481338
7543F7481338j90422219J08588695J084952P9871022l4390348R0076716j48051760
$$ 67481338 -122940881 -14352186 -13267234 66603788 32213440 122290156 -25761604
7536b5761604J4781393K059519J16099455j56050509m8571858N4941821L639673J17845439
$$ -25761604 -10980211 -8920692 107178763 -48871746 -97443604 -42501783 -38862110 78983329
7528G8983329j50987227P4408008L7050613m8179573o7019003k3574878R5668041N6018835
$$ 78983329 -72003898 2404110 39454723 -8724850 -75743853 -99318731 -3650690 52368145
7520E2368145q7359797j791767p7164813O3928792n8126853P1434224N5659058R534787
$$ 52368145 -34991652 -36783419 -113948232 -50019440 -108146293 -36712069 18946989 28481776
7512B8481776o8693602R6699742N5870700j95355647J01006001J1873206K9258757
$$ 28481776 -40211826 56487916 112358616 -82997031 18008970 29882176 59140933
7505E9140933p7056585n068717M9776698p4648028M9311144j1164288Q2943848l6120793
$$ 59140933 -17915652 -22984369 26792329 -47855699 1455445 -9708843 73235005 37114212
7497C7114212n443701J0903403k6189806j03110195P3404893J3321893O3026413q4687513
$$ 37114212 31670511 42573914 16384108 -86726087 -13321194 699 63027112 -21660401
7489b1660401J7352035Q3791245k3074659q0184096J9314178L8600733n1761208L4890660
$$ -21660401 -4308366 79482879 56408220 -23775876 -4461698 34139035 -17622173 17268487
7481A7268487q9960510R5237033o4482399p8203570J42962355k4435832l0082805R8666524
$$ 17268487 -72692023 22545010 -41937389 -120140959 22821396 -1614436 -31697241 66969283
7473F6969283m3113213J7320358m9597966Q405217Q1101828j18331392j7080672L1412318
$$ 66969283 23856070 41176428 -8421538 -16321 81085507 -37245885 -54326557 -22914239
7465b2914239k5934544J31168057o7052001K1973332j9398579J4292325N2468786j8261915
$$ -22914239 -48848783 82319274 15267273 37240605 17842026 32134351 84603137 66341222
7457F6341222j31703459J07554718k3806129o8827556m069590R599699L1348368n7701114
$$ 66341222 -65362237 42192481 18386352 -50441204 -54510794 -44911095 -13562727 -71263841
7449g1263841K39799525j18400256l0393480M8385174j30945148L4474476j6605327
$$ -71263841 168535684 50135428 19741948 68127122 -62818026 -28343550 -44948877
7442d4948877p0207078J09371641j7030437O7701299j50565752J58399793O372807
$$ -44948877 -115155955 -5784314 -22814751 44886548 -105679204 52720589 59093396
7435E9093396K2931433L8588711j45008365N7479173p5122610q5346299p058040J39142755
$$ 59093396 82024829 120613540 -24394825 33084348 -42038262 -127384561 -134442601 4700154
7427D700154R8581210P311453j26700560P744763K0843934l5846421J6998355m3514855
$$ 4700154 103281364 110592817 -16107743 -8362980 12480954 -23365467 -6367112 -49881967
7419d9881967o9399079M2073049J36776428j63761213N5257199L0678237J06658984
$$ -49881967 -119281046 -77207997 59568431 -104192782 -48935583 -18257346 88401638
7412H8401638M4873498o6536171p8485358j06703528N0105070O1956131R60342l7139241
$$ 88401638 133275136 66738965 -11746393 -118449921 -68344851 -6388720 -5428378 -42567619
7404d2567619p4649517J28838346J50033386j81246772Q5489564O4100406j02955073
$$ -42567619 -117217136 11621210 161654596 -19592176 65897388 129997794 27042721
7397B7042721l8761063L3824826o959420R642790j03568670J01998751k9820215K2070666
$$ 27042721 -11718342 22106484 15147064 24789854 -78778816 23219935 -6600280 15470386
7389A5470386m2851873m5586159J05062891L3625673p9181756J2212988r3737673J5813540
$$ 15470386 -27381487 -72967646 32095245 65720918 -13460838 -1247850 -94985523 -79171983
7381g9171983L9834437K71668k0684642m3882424L9457872M7654331p5030243O9301908
$$ -79171983 -39337546 -39065878 -59750520 -103632944 -64175072 -16520741 -91550984 -22249076
7373b2249076m8173933J513473J09856369M3257861n1376557j06712674Q0598345L5319524
$$ -22249076 -70423009 -68909536 40946833 84204694 32828137 -73884537 6713808 42033332
7365D2033332j08235223j2134341N1695467K466016M6304884j7497385j6651058p8165318
$$ 42033332 -66201891 -78336232 -26640765 -24174749 22130135 4632750 -12018308 -90183626
7357i0183626J71501845j31573165J25121712r1227723M1987064n6890764j1943459
$$ -90183626 81318219 -50254946 74866766 -16360957 25626107 -31264657 -43208116
7350d3208116j0559494P9469705L3428073K9833567p2731943O014699m7702763m5632836
$$ -43208116 -53767610 25702095 59130168 88963735 16231792 22246491 -25456272 -71089108
7342g1089108J32092236j03654700R2056755K7351580j4862360J8019280j04053358
$$ -71089108 61003128 -42651572 49405183 76756763 61894403 79913683 -24139675
7335b4139675l8143648Q9601332n2486665P5344793o9840330L1942076p6297920J10040643
$$ -24139675 -62283323 27318009 -25168656 50176137 -19664193 12277883 -64020037 46020606
7327D6020606p4858907J04698127j03933393O1972062J6427066o5996843P0709664
$$ 46020606 -28838301 75859826 -28073567 33898495 50325561 -15671282 55038382
7320E5038382p5083111J1274078r6229677J45884584N5834792j22633503O2080621
$$ 55038382 -20044729 -8770651 -105000328 40884256 96719048 -25914455 36166166
7313C6166166p8649917J29433900j03464686k7467287J13147285j35411831R1287021
$$ 36166166 -42483751 86950149 -16514537 -43981824 69165461 -66246370 25040651
7306B5040651L1344608Q266727j29856390M1187523R218686J34162569j81924629k305872
$$ 25040651 56385259 64651986 -65204404 -24016881 -14798195 119364374 -62560255 -64866127
7298f4866127m295462O7290399J5075777p9763773Q9365753k1271086R0277701p4475192
$$ -64866127 -69161589 -1871190 13204587 -66559186 22806567 1535481 91813182 17337990
7290A7337990K7808651r8074929p4373890J91042306p6514606k0670268j3505471l374072
$$ 17337990 45146641 -52928288 -127302178 63740128 -12774478 -33444746 -46950217 -50324289
7282e0324289N4516118J12666669p6496159k7724547p1576060L9577759l8674732P7387808
$$ -50324289 4191829 116858498 40362339 12637792 -58938268 -19360509 -58035241 19352567
7274A9352567O101314o2362963o8764387J15019413K1403195J7721882o7626569K5694383
$$ 19352567 25453881 -36909082 -105673469 9345944 30749139 48471021 -19155548 6538835
7266F538835j6953780j1766302j71443919Q1427411J48956938q767959k4257239J00019642
$$ 6538835 -10414945 -22181247 -193625166 -112197755 36759183 27991224 3733985 103753627
7258A03753627j4939851o9325900K5706551K71829k7779582n0163732J893543L077604
$$ 103753627 88813776 19487876 45194427 45466256 17686674 -32477058 -30583515 -27505911
7250b7505911l7334255N5887059O7852502P0738709o854246j42753380M7762246j0688237
$$ -27505911 -64840166 -8953107 58899395 129638104 122783858 -19969522 27792724 17104487
7242A7104487R821733j6610127M2357325j37031198k3181410J34693368l3485584O506292
$$ 17104487 26926220 10316093 52673418 -84357780 -107539190 27154178 -6331406 174886
7234A74886Q9683840m5705445q01450j6974955q0426815l9208885K0151419Q7395953
$$ 174886 89858726 44153281 43351831 26376876 -54049939 -93258824 -73107405 14288548
7226A4288548q0557430K4616148j19503301J01693932R8446645o9129834M9958018
$$ 14288548 -66268882 -41652734 -161156035 -59462103 38984542 -30145292 19812726
7219A9812726j13989865J01821127o2051592J32297520k21310739J77633679k4696763
$$ 19812726 -94177139 7643988 -54407604 77889916 -143420823 34212856 9516093
7212I516093Q1980856m0675717j12194034j3834820J29634057Q0439785j31492765
$$ 9516093 91496949 50821232 -61372802 -75207622 54426435 134866220 3373455
7205C373455m6667267K04197237j72616905J13863001j07759714l086915k3514763
$$ 3373455 -43293812 160903425 -11713480 102149521 -5610193 -8697108 -32211871
7198c2211871L2760448P3423187j14630260M2861553j15255838K52666684j81201955
$$ -32211871 548577 73971764 -40658496 2203057 -113052781 139613903 -41588052
7191d1588052K9015745M1215474o9006691K4809004q298625j02424836J06336281o1424381
$$ -41588052 -12572307 28643167 -40363524 -15554520 -23853145 -126277981 -19941700 -81366081
7183h1366081N8727571K4568348k1319373k7281207j15800605J83484517m394078o6021157
$$ -81366081 -22638510 1929838 -19389535 -46670742 -162471347 21013170 16619092 -49402065
7175d9402065M2685373k2182102J00880249P2238223j00234081n9000246J12270107
$$ -49402065 -6716692 -28898794 71981455 144219678 43985597 -15014649 97255458
7168I7255458q5515940K9458912o1743118L6477359j16526725Q0964994N2119630r3068874
$$ 97255458 11739518 41198430 -20544688 15932671 -100594054 -19629060 32490570 -60578304
7160f0578304K5341291J35850352k3609763p8689678j5930457o2700615Q9678533
$$ -60578304 -35237013 100613339 77003576 -1686102 -17616559 -80317174 9361359
7153I361359j39752403K3266378L8016509L7667725J3639649L4192735l8477185j3653576
$$ 9361359 -130391044 -107124666 -69108157 -31440432 -17800783 16391952 -22085233 -35738809
7145c5738809Q5793070j32082367N8685161n520961l4016847L806334Q9780926n7240882
$$ -35738809 50054261 -82028106 -23342945 -28863906 -62880753 -59074419 30706507 -26534375
7137b6534375J07956199l3750386k2956907j4673031M7614815j2862833Q602259j710087
$$ -26534375 81421824 47671438 24714531 10041500 57656315 44793482 53395741 51685654
7129E1685654j06235226O5975601M6518374k8472851k3934239R6736141k2420766o0653643
$$ 51685654 -54549572 11426029 57944403 29471552 5537313 102273454 79852688 19199045
7121A9199045K2542216k9592123j15403524J80178045p3770266j7168729M664556O829166
$$ 19199045 41741261 12149138 -103254386 76923659 3153393 -14015336 -9350780 -2521614
7113b521614J1074433q2303785J11826385p4584022K357407R0993989m5921952r6974694
$$ -2521614 8552819 -73750966 38075419 -36508603 -34151196 56842793 10920841 -86053853
7105h6053853N8470400J9011151K2987704N8377534l0223208l6974400K5152618K8891108
$$ -86053853 -27583453 -8572302 14415402 72792936 42569728 5595328 30747946 59639054
7097E9639054j02857196M7194241N4847398j05711452N9857884K8786609q0708804K000861
$$ 59639054 -43218142 3976099 58823497 -46887955 12969929 41756538 -38952266 -36951405
7089c6951405N9164447j51062284J45381003j11500161J07633753r0977702P5636231
$$ -36951405 22213042 -128849242 16531761 -94968400 12665353 -78312349 -2676118
7082b676118r84561L717063l7656037M4629390L7887951o4017133Q7706522j70148674
$$ -2676118 -3660679 56384 -37599653 7029737 44917688 -19099445 68607077 -101541597
7074a01541597K1655242K9744457L2823360p3502836R2843836L549023l717638j0002082
$$ -101541597 -79886355 -50141898 -17318538 -90821374 2022462 5571485 1853847 -8148235
7066h148235J9960024M242690R6666038j78827473M8182763k4798789K0020861r6670982
$$ -8148235 11811789 16054479 112720517 -66106956 -17924193 -42722982 -22702121 -119373103
7058a19373103J54881369j00437257J84738451l9315538o342294j73754501P9345181
$$ -119373103 35508266 -64928991 119809460 80493922 74151628 -99602873 -20257692
7051b0257692N6780788R3388042j40639044P387917J1727364j0333262M9203323m3597778
$$ -20257692 36523096 129911138 -10727906 -3339989 8387375 -1945887 47257436 3659658
7043C659658j29111770J46830339k1082931J31015116k26579729R6306247k3666544
$$ 3659658 -125452112 21378227 295296 131310412 -95269317 1036930 -22629614
7036b2629614J88052583j52480405j09339811O5001403j7645383k2902073P3838460
$$ -22629614 165422969 12942564 -96397247 -31395844 -49041227 -71943300 1895160
7029A895160M4294251m6475982j5948365m8535190J01802302j02369218J71899331
$$ 1895160 46189411 -286571 -16234936 -64770126 37032176 -65337042 106562289
7022A06562289l8221570Q8159m4114541j24459907J04223514j0861166l1467148O9526391
$$ 106562289 68340719 68428878 24314337 -100145570 4077944 -6783222 -38250370 31276021
7014C1276021o399659Q1736820q5659995n0421350N1455317k1623795O0521622j02684465
$$ 31276021 24876362 106613182 20953187 -29468163 21987154 363359 60884981 -41799484
7006d1799484k7664561j8056577N6961700m7591906J22677922j01208227N1627615
$$ -41799484 -69464045 -87520622 -30558922 -78150828 44527094 -56681133 -5053518
6999e053518J52484086j86066502p1151110M7576956J2732603L9755916K1932808N2251454
$$ -5053518 147430568 -38635934 -109787044 -62210088 -49477485 -9721569 12211239 64462693
6991F4462693j52920468R2565238Q6453542r6580334o2912237K7596288p0041801
$$ 64462693 -88457775 4107463 90561005 -6019329 -68931566 -41335278 -111377079
6984a11377079J21268811Q389649j40471732J24569589J12838539n6737974m3279294
$$ -111377079 9891732 18281381 -122190351 2379238 115217777 58479803 15200509
6977A5200509J17893291j07140010J1831041L1585995p6729756k8260969M8135730
$$ 15200509 133093800 25953790 37784831 69370826 -7358930 -35619899 12515831
6970A2515831j9841094J66934362j89943151P3075248l8651204J48773426j45104896
$$ 12515831 -7325263 159609099 -30334052 42741196 4089992 152863418 7758522
6963G758522p7433194P3094586p2782664J0015409J58595171j2548094j23936034L3969922
$$ 7758522 -69674672 3419914 -69362750 -59347341 99247830 86699736 -37236298 -3266376
6955c266376K9573987m0913772n6111427K15554101k20531008M6750141J0039350
$$ -3266376 26307611 -14606161 -70717588 144836513 -75694495 -28944354 -18905004
6948a8905004j37130496J11452895J6547912M3519555m1434358M8891240m285914m6179459
$$ -18905004 -156035500 -44582605 -28034693 15484862 -25949496 22941744 18655830 -27523629
6940b7523629o5716044J8347185J80938029o4539443l3609909o3311535N4191950L4383962
$$ -27523629 -93239673 -74892488 106045541 41506098 7896189 -55415346 -1223396 33160566
6932C3160566p5074492Q7573910K4896014r1318574P6163983j0930900m3209173O912337
$$ 33160566 -41913926 45659984 70555998 -20762576 55401407 44470507 1261334 8173671
6924H173671l9895713Q0016242j30289529J4962854k609298k6698693J09088857k4773333
$$ 8173671 -31722042 48294200 -81995329 -67032475 -69641773 -96340466 12748391 -12024942
6916a2024942L901416M8536480M0475993n7681116l2607682N00599m6050246M2291090
$$ -12024942 -8123526 40412954 80888947 23207831 -9399851 -8899252 -54949498 -12658408
6908a2658408L7836566j08439177R3533425R9251339j13058017J0930777k6406193
$$ -12658408 25178158 -83261019 10272406 109523745 -3534272 7396505 -19009688
6901a9009688L4590725j8803399O0526461j5115913q6124154j9965389J05026356n3283975
$$ -19009688 15581037 -3222362 57304099 42188186 -43935968 -63901357 41124999 -12158976
6893a2158976m1907689O7304094r671663L572027K2930138o1256773j4141378Q1299185
$$ -12158976 -54066665 13237429 3565766 7137793 30067931 -31188842 -45330220 35968965
6885C5968965k2820271k2916237O5685210J6432914j69962426Q5949133N9088841l3378411
$$ 35968965 13148694 -9767543 55917667 72350581 -97611845 -11662712 47426129 14047718
6877A4047718r9526725N3702988R2982185n6659539J11693763n6514698m6507697
$$ 14047718 -85479007 -31776019 61206166 4546627 116240390 59725692 13217995
6870A3217995j02574459R5849466K8032084l4762117Q314862n9712244J10471845o5618099
$$ 13217995 -89356464 6493002 34525086 -237031 8077831 -51634413 58837432 -6780667
6862f780667L1209326M9987240k2952449P1532791J3209256p5918296p8356084l2817708
$$ -6780667 24428659 74415899 51463450 122996241 136205497 60287201 -18068883 -50886591
6854e0886591j2279723R0785494o677633M9812961j72380944J62938017q1102k2993901
$$ -50886591 -63166314 27619180 20941547 70754508 -101626436 61311581 61230479 38236578
6846C8236578j19513054L8209294N422627n2048015J01347788m4092874o9077866K8371127
$$ 38236578 -81276476 -43067182 -37644555 -89692570 11655218 -32437656 -101515522 -73144395
6838g3144395R1778742k22199R317541j03432191l2318742K7877318J43592444k50433195
$$ -73144395 18634347 18412148 27729689 -75702502 -108021244 -80143926 63448518 -186984677
6830a86984677J05064415J10210471l0705356O1541752j41021906R7132143O3648300
$$ -186984677 -81920262 28290209 -2415147 59126605 -81895301 15236842 78885142
6823G8885142m2878737J868771m4239574J02736900p5075470L4554674n4277811J3140036
$$ 78885142 36006405 37875176 -6364398 96372502 21297032 55851706 1573895 14713931
6815A4713931J506756N9465218q4941785P01584l1138085K9222103J40708027j42401709
$$ 14713931 16220687 75685905 -9255880 -8554296 -39692381 -10470278 130237749 -12163960
6807a2163960m6630274O2713805J3962055K9598289m8748294P1463048j0485584q7134003
$$ -12163960 -58794234 3919571 17881626 47479915 -1268379 70194669 59709085 -27424918
6799b7424918M8654782o0279094J16529650m1872883l2271338O6442151l6850875m0218645
$$ -27424918 21229864 -39049230 77480420 35607537 3336199 69778350 32927475 -7291170
6791g291170l359572M8517767l9024398J35330112l3941223r8071634J21177250q5752230
$$ -7291170 -10650742 37867025 -1157373 134172739 100231516 2159882 123337132 37584902
6783C7584902R5580473N5646016n4809803j51273513l6640392J93595935j18140203
$$ 37584902 133165375 188811391 134001588 -17271925 -53912317 139683618 21543415
6776B1543415m0154525M1352861Q0509194J8393500n2287183l9978061m2160726J6162872
$$ 21543415 -18611110 22741751 103250945 121644445 69357262 29379201 -12781525 3381347
6768C381347r334435K4468729r53715l4630815n4005305J59936144P4451877r1245736
$$ 3381347 -5953088 18515641 17561926 -17068889 -71074194 88861950 163313827 72068091
6760G2068091l1382762o1954219K520435n8455925q255119O558460J3684313J4745551
$$ 72068091 40685329 -21268890 -18748455 -77204380 -85459499 -78901039 -65216726 -50471175
6752e0471175J41612718m6286577q2211620l421533J11015543q2444691j42096579
$$ -50471175 91141543 44854966 -37356654 -40778187 70237356 -12207335 -154303914
6745a54303914J57829450o4682214j8518372J286724L6987337J20204595K0745667
$$ -154303914 3525536 -61156678 -79675050 -78388326 -41400989 78803606 99549273
6738I9549273j37992663N7700205j06343389O0827947N1848707J2583914l3931891
$$ 99549273 -38443390 19256815 -87086574 -26258627 25590080 38173994 4242103
6731D242103m7481964L2431361o0885953R0639391m3756977p725836R4778604p4975053
$$ 4242103 -43239861 -10808500 -71694453 18944938 -24812039 -32537875 62240729 -12734324
6723a2734324j1794028l3422042P1775280o318929q641272L7332323j9450546k2068988
$$ -12734324 -24528352 -57950394 13824886 7505957 -1135315 36197008 16746462 -5322526
6715e322526q2552385N9251386K312513o708531N248123M2067868r348284o7173328
$$ -5322526 -87874911 -28623525 -26311012 -33019543 -27771420 14296448 4948164 -62225164
6707f2225164m7487287K5218129J38405137j10735082J02523096l672702j59936155
$$ -62225164 -109712451 -84494322 53910815 -56824267 45698829 42026127 -117910028
6700a17910028J17146121n1301551J61529382n8845965k1060982p7706434Q2009981
$$ -117910028 -763907 -52065458 109463924 50617959 29556977 -48149457 33860524
6693C3860524j8806372j3960163p830325K4522857K7912903j1217115Q181344q2369039
$$ 33860524 15054152 1093989 -6736336 17786521 45699424 34482309 42663653 -39705386
6685c9705386P612319k3491869J22928569j73544569J11610075K2410210o2282691
$$ -39705386 -32093067 -55584936 67343633 -106200936 5409139 27819349 -34463342
6678c4463342J03548113j38475348J13190985m1451942N8081009q8742970j3001652
$$ -34463342 69084771 -69390577 43800408 2348466 60429475 -28313495 -41315147
6671d1315147K6200766m8870333L1159558K4032781L6861410N7637518j1929550j28081083
$$ -41315147 -15114381 -63984714 -32825156 -8792375 28069035 85706553 73777003 -54304080
6663e4304080J97496603j72999029M3894760K9783605J50238p0433016O6638931n9701597
$$ -54304080 143192523 -29806506 14088254 43871859 44022097 -26410919 40228012 -19473585
6655a9473585n6993157L4033194J01705252p2256188J18089632o4243467j63824149
$$ -19473585 -76466742 -42433548 59271704 -12984484 105105148 40861681 -122962468
6648a22962468J29646047n6249027R1187379q409895j14639722N1788869P6794367
$$ -122962468 6683579 -49565448 41621931 33212036 -81427686 -29638817 47155550
6641D7155550J4301294j16573312P6614839K4879376m6981830q476098K4785254j7421124
$$ 47155550 61456844 -55116468 21498371 46377747 -604083 -9080181 15705073 -1716051
6633a716051M8146832j09116542J12180041j37859585Q1862960L0708604l489016O5905766
$$ -1716051 46430781 -62685761 49494280 -88365305 -6502345 24206259 20717243 86623009
6625H6623009j29453609N738920R8330870j52626196J04141013N0567324o892436p0197813
$$ 86623009 -42830600 -37091680 61239190 -91387006 12754007 63321331 56428895 -13768918
6617a3768918J26246m9581985R3023778L9500138K9202480n0436737r8641561O0858993
$$ -13768918 -13642672 -63224657 29799121 69299259 98501739 48065002 -50576559 10282434
6609A0282434p110208l1426601K25555J906246O9950969P5357100p3173009k0877076
$$ 10282434 3172226 -28254375 -28028820 -26122574 43828395 119185495 46012486 25135410
6601B5135410k0720993l9172286M6761993j4789398o3760774R6350048j02148864L6781775
$$ 25135410 4414417 -34757869 12004124 -2785274 -66546048 29804000 -72344864 -35563089
6593c5563089R170005l1200930O4232733m8186028O5343636o5479901j0349708q5948519
$$ -35563089 -26393084 -57594014 6638719 -41547309 23796327 -41683574 -52033282 -137981801
6585a37981801L9006077l2019342j0794036L8634725O4392508K2879907J4239121
$$ -137981801 -98975724 -130995066 -141789102 -103154377 -38761869 -15881962 -1642841
6578a642841j52650072J54817417m1736626l0031938M4504429k759057L6914529j27491811
$$ -1642841 -154292913 524504 -41212122 -71244060 -26739631 -29498688 7415841 -120075970
6570a20075970Q0097510P809486P6814950N8066961j31240232J56373889j91577891
$$ -120075970 -39978460 -32168974 44645976 102712937 -28527295 127846594 -63731297
6563f3731297O9566887m7902331n4293128R5357687M1544420n413045k6908796K1773963
$$ -63731297 5835590 -42066741 -96359869 -1002182 40542238 35129193 8220397 29994360
6555B9994360j08614952Q6044869N7819037j03589154n875709Q8198815o2886452
$$ 29994360 -78620592 7424277 65243314 -38345840 -44221549 43977266 -18909186
6548a8909186j03966455Q7084130j10081573J45501748o6109687L2200060M0521934O60813
$$ -18909186 -122875641 -35791511 -145873084 -371336 -66481023 -34280963 6240971 6901784
6540F901784n4217699O1148103K5085047j07119277R0639671L1466477K8214107j19284662
$$ 6901784 -47315915 13832188 38917235 -68202042 22437629 53904106 82118213 -37166449
6532c7166449k3600080N7137342l1562195K0983748J2585704j4170933k1924834R629158
$$ -37166449 -60766529 -3629187 -35191382 -14207634 -1621930 -15792863 -37717697 -28088539
6524b8088539P4684983l3505485j6101405K7049411O0385129K1963264k00113228R3629632
$$ -28088539 46596444 13090959 -3010446 24038965 84424094 106387358 -93725870 -96238
6516i6238L4105717J1653189o8243114J36223942j19191482r8959540O6504652K4527802
$$ -96238 34009479 45662668 -22580446 113643496 -5547986 -104507526 -38002874 -13475072
6508a3475072n060988R8464715M251423j84515954J76349603j881665j59573095Q7467819
$$ -13475072 -18536060 79928655 84180078 -100335876 76013727 74132062 -85441033 2026786
6500B026786k0878874n8832065R8567183j13676900m8737396Q4206848j4913543M6138240
$$ 2026786 -18852088 -77684153 20883030 -92793870 -141531266 -57324418 -72237961 -26099721
6492b6099721J14312156j02751560m3394937J69079463k01715035J0792226O1319592
$$ -26099721 88212435 -14539125 -57934062 111145401 -90569634 -79777408 -18457816
6485a8457816k4816878M8957800k3456979p5905622J18223111j20680276O8121190
$$ -18457816 -43274694 5683106 -17773873 -93679495 24543616 -96136660 -28015470
6478b8015470J51063114r6491434m7990485n532276J10015607l3919545r8416443
$$ -28015470 123047644 26556210 -21434275 -26966551 83049056 49129511 -49286932
6471d9286932J44833437r4822957m5632326O7696838J608484l8890568n7317794K5924682
$$ -49286932 95546505 723548 -44908778 22788060 24396544 -14494024 -71811818 -45887136
6463d5887136J22137067p1795372K5696961q0579294J43257527j13720140r988687
$$ -45887136 76249931 4454559 30151520 -50427774 92829753 -20890387 -30879074
6456c0879074R7482402r8316604o575228j55414671K15087627j20726096j1287505
$$ -30879074 66603328 -31713276 -38288504 -193703175 21384452 -99341644 -110629149
$$ [...]
-3284c257039  $$ checkpoint
##END NTUPLES=
##END=
