##TITLE= S#285200
##JCAMP-DX= 5.00 $$ JEOL NMR v1.10
##DATA TYPE= NMR SPECTRUM
##DATA CLASS= NTUPLES
##NUM DIM= 1
##ORIGIN= DELTA_NMR
##OWNER= NMR
##SPECTROMETER/DATA SYSTEM= DELTA_NMR
##.OBSERVE FREQUENCY= 3.00529655924288E+02
##.OBSERVE NUCLEUS= ^1H
##.DELAY= (2.195E+02,2.195E+02)
##.ACQUISITION MODE= SIMULTANEOUS
##.FIELD= 7.0586013
##.FILTER WIDTH= 1.81675738660864
##.ACQUISITION TIME= 3.6339712
##.SPINNING RATE= 16
##.OBSERVE 90= 9.2
$$ ------------------------
$$ JEOL SPECIFIC PARAMETERS
##$FILENAME= C:\NMR/eb2-5.jdf
##$TITLE= S#285200
##$AUTHOR= NMR
##$CREATION=  6-FEB-2018 07:48:32
##$REVISION=  6-FEB-2018 07:55:49
##$CONTENT= PROTON NMR EXPERIMENT
##$INSTRUMENT= DELTA_NMR
##$SITE= Center College ECP+ 300
##$NODENAME= nmr2
##$DIMENSIONS= 1
##$STORAGE= FLOAT
##$X_FORMAT= COMPLEX
##$X_CURR_POINTS= 16384
##$X_START= 12.50103 $$ppm
##$X_STOP= -2.50012 $$ppm
##$X_TITLE= 1H                             
##$X_ZERO_POINT= 0.33329
##$X_FREQ_FLIP= FALSE
##$X_POINTS= 16384
##$X_PRESCANS= 0
##$X_DOMAIN= 1H
##$X_OFFSET= 5 $$ppm
##$X_FREQ= 300.52966 $$MHz
##$X_SWEEP= 4.50857 $$kHz
##$X_RESOLUTION= 0.27518 $$Hz
##$SOLVENT= CHLOROFORM-D
##$TEMP_GET= 20.7 $$dC
##$ACQ_DELAY= 0.2195 $$ms
##$DIGITAL_FILTER= FALSE
##$FILTER_FACTOR= 1
##$FILTER_WIDTH= 2.254 $$kHz
##$FILTER_MODE= BUTTERWORTH
##$TRANSITION_RATIO= 0.9
##$ORDERS
##$FACTORS
##$LOCK_STRENGTH= 580
##$LOCK_LEVEL= 200
##$LOCK_GAIN= 26
##$LOCK_OSC_OFFSET= 25.6519 $$kHz
##$LOCK_PHASE= 187 $$deg
##$LOCK_OSC_STATE= 2H OSC ON
##$X_ANGLE= 45 $$deg
##$X90= 9.2 $$us
##$X90_HI= 10 $$us
##$X90_LO= 50 $$us
##$X_90_WIDTH= 9.2 $$us
##$X_PULSE= 4.6 $$us
##$RELAXATION_DELAY= 4 $$s
##$SCANS= 2
##$PROBE_ID= 1412
##$ITERATIONS= 1
##$FIELD_STRENGTH= 7.0586 $$T
##$TEMP_SET= 25 $$dC
##$SPIN_SET= 15 $$Hz
##$SPIN_GET= 16 $$Hz
##$HE_LEVEL= 73 $$%
##$N2_LEVEL= 91 $$%
##$CHANGER_SAMPLE= 0
##$ADC_CARD= 16/1MHz/20
##$EXPERIMENT= single_pulse.exp
##$OBS_NOISE= WAUGH
##$IRR_NOISE= WALTZ
##$TRI_NOISE= WALTZ
##$QUA_NOISE= WAUGH
##$OBS_PWIDTH= 1 $$us
##$IRR_PWIDTH= 1 $$us
##$TRI_PWIDTH= 1 $$us
##$QUA_PWIDTH= 1 $$us
##$RECVR_GAIN= 4
##$IRR90= 10 $$us
##$TRI90= 10 $$us
##$QUA90= 10 $$us
##$IRR90_HI= 10 $$us
##$QUA90_HI= 10 $$us
##$IRR90_LO= 10 $$us
##$TRI90_LO= 10 $$us
##$QUA90_LO= 10 $$us
##$MOD_RETURN= 1
##$TOTAL_SCANS= 2
##$X_ACQ_DURATION= 3.63397 $$s
##$DELAY_OF_START= 1 $$s
##$ACTUAL_START_TIME= 886751289
##$CLIPPED= FALSE
##$DC_BALANCED= FALSE
##$TRI90_HI= 10 $$us
##$SPIN_LOCK_90= 100 $$us
##$SPIN_LOCK_ATTN= 24.4 $$dB
##$DEUT_GRAD_SHIM_90= 213 $$us
##$DEUT_GRAD_SHIM_ATTN= 9 $$dB
##$IRR_CODE= 146
##$LOCK_STATE= LOCK ON
##$AUTOLOCK_LEVEL= 200
##$SAWTOOTH_RANGE= 4
##$LOCK_STATUS= IDLE
##$LOCK_SETTLE_POINT= 4096
##$LOCK_ACHIEVE_POINT= 0
##$SPIN_ACTION= SPIN ON
##$SPIN_STATE= SPIN ON
##$SPIN_STATUS= SPIN ON
##$SPIN_GAS_SOURCE= AIR
##$TEMP_ACTION= TEMP OFF
##$TEMP_STATE= TEMP OFF
##$TEMP_STATUS= TEMP OFF
##$TEMP_COMP= 0
##$TEMP_DELAY= 0 $$s
##$TEMP_LIMIT_HI= 150 $$dC
##$TEMP_LIMIT_LO= -100 $$dC
##$TEMP_MELTING= -63 $$dC
$$ [...]
##$VT_PID_STD_WB_H_TD= 5
##$VT_PID_STD_WB_H_CBL= 10
##$VT_PID_STD_WB_H_CBH= 0
##$VT_PID_STD_WB_H_HC= 2.4
##$VT_PID_STD_WB_H_HL= 70
##$VT_PID_STD_WB_M_PB= 1.5
##$VT_PID_STD_WB_M_TI= 30
##$VT_PID_STD_WB_M_TD= 5
##$VT_PID_STD_WB_M_CBL= 9.9
##$VT_PID_STD_WB_M_CBH= 2.3
##$VT_PID_STD_WB_M_HC= 2.5
##$VT_PID_STD_WB_M_HL= 70
##$VT_PID_STD_WB_L_PB= 1.3
##$VT_PID_STD_WB_L_TI= 29
##$VT_PID_STD_WB_L_TD= 5
##$VT_PID_STD_WB_L_CBL= 20
##$VT_PID_STD_WB_L_CBH= 20
##$VT_PID_STD_WB_L_HC= 0.6
##$VT_PID_STD_WB_L_HL= 100
##$VT_PID_LONG_0_H_PB= 1.5
##$VT_PID_LONG_0_H_TI= 30
##$VT_PID_LONG_0_H_TD= 5
##$VT_PID_LONG_0_H_CBL= 9.9
##$VT_PID_LONG_0_H_CBH= 2.3
##$VT_PID_LONG_0_H_HC= 2.5
##$VT_PID_LONG_0_H_HL= 70
##$VT_PID_LONG_0_M_PB= 1.5
##$VT_PID_LONG_0_M_TI= 30
##$VT_PID_LONG_0_M_TD= 5
##$VT_PID_LONG_0_M_CBL= 9.9
##$VT_PID_LONG_0_M_CBH= 2.3
##$VT_PID_LONG_0_M_HC= 2.5
##$VT_PID_LONG_0_M_HL= 70
##$VT_PID_LONG_40_H_PB= 1.5
##$VT_PID_LONG_40_H_TI= 30
##$VT_PID_LONG_40_H_TD= 5
##$VT_PID_LONG_40_H_CBL= 9.9
##$VT_PID_LONG_40_H_CBH= 2.3
##$VT_PID_LONG_40_H_HC= 2.5
##$VT_PID_LONG_40_H_HL= 70
##$VT_PID_LONG_40_M_PB= 1.5
##$VT_PID_LONG_40_M_TI= 30
##$VT_PID_LONG_40_M_TD= 5
##$VT_PID_LONG_40_M_CBL= 9.9
##$VT_PID_LONG_40_M_CBH= 2.3
##$VT_PID_LONG_40_M_HC= 2.5
##$VT_PID_LONG_40_M_HL= 70
##$SAMPLE_ACTION= LOADED
##$SAMPLE_STATE= LOAD
##$SAMPLE_STATUS= LOADED
##$AUTOSHIM_MODE= AUTOSHIM OFF
##$AUTOSHIM_DELAY= 3600 $$s
##$AUTOSHIM_TRACK= AUTOSHIM OFF
##$SHIM_MAX_RECALL= MAX FOUND
##$SHIM_NAMES= SHIM_Z0
##$SHIM_Z0= 9202
##$SHIM_Z1= 5122
##$SHIM_Z2= -38
##$SHIM_Z3= -2829
##$SHIM_Z4= -240
##$SHIM_Z5= 46
##$SHIM_Z6= -33
##$SHIM_X= -14
##$SHIM_XZ= 16
##$SHIM_XZ2= 0
##$SHIM_XZ3= 0
##$SHIM_X2= -7
##$SHIM_X2Z= -40
##$SHIM_X3= 0
##$SHIM_Y= 1608
##$SHIM_YZ= 13
##$SHIM_YZ2= 10
##$SHIM_YZ3= 0
##$SHIM_Y2= -11
##$SHIM_Y2Z= -20
##$SHIM_Y3= 0
##$NUM_SCANS= 1
##$END_TIME= 886751310
##$LOCAL_TIME= 886751311
##$PROBE_ATN= 0
##$PROBE_TUNE= 0
##$PROBE_MATCH= 2077
##$PROBE_COARSE= A
##$LF_TUNE_DIAL= 0
##$LF_MATCH_DIAL= 0
##$HF_TUNE_DIAL= 0
##$HF_MATCH_DIAL= 0
##$PASS_RIPPLE= 0.01 $$dB
##$STOP_RIPPLE= 60 $$dB
##$PROBE_RECOVERY= 0 $$us
##$AF_DELAY_RATIO= 0
##$VERSION= 4.3.3
##$X_ACQ_TIME= 3.63397 $$s
##$DEAD_TIME= 0 $$us
##$DELAY= 0 $$us
##$PHASE_PRESET= 3 $$us
##$UNBLANK_TIME= 2 $$us
##$INITIAL_WAIT= 1 $$s
##$NORMALIZED= TRUE
$$ END OF JEOL SPECIFIC PARAMETERS
$$ -------------------------------
##NTUPLES= NMR SPECTRUM
##VAR NAME= FREQUENCY,    SPECTRUM/REAL, SPECTRUM/IMAG, PAGE NUMBER
##SYMBOL=   X,            R,             I,             N
##VAR TYPE= INDEPENDENT,  DEPENDENT,     DEPENDENT,     PAGE
##VAR FORM= AFFN,         ASDF,          ASDF,          AFFN
##VAR DIM=  16384, 16384, 16384, 2
##UNITS= PPM,     ARBITRARY UNITS, ARBITRARY UNITS, 
##FIRST=  1.2501033903057E+01, -1.14996385029492E+01, -1.09072028603102, 1
##LAST=  -2.50011824950436, -1.07936025550877E+01, -1.30505855401201, 2
##FACTOR=  9.1565355261926E-04, 1.43209575664335E-03, 1.43209575664335E-03, 1
##PAGE= N=1
##DATA TABLE=(X++(R..R)), XYDATA
$$ [...]
5932d768534q46814P51995K11509k40650k68584p6223k39199O8621N38187K23847n33720
5921e179565j1592J92322j00520n89284M81734M14894j34217j79247m74406N3776K9511
5910e496594M06354M43628m29110J28590l29149J8676r2016O83294K5760k61961l63663
5899e266191k92926o10446N67398P23974K36156m40937r03792Q14328M37230l81734m01310
5888e518250m96068K53183L65529M82022L1193k76953K50537P9604o78073R3677K51837
5877e161762k5265J24496M4164r1693P22978n68044M70530m53110p61336R70097j8534
5866d747479o92339J59630L57037k20277J13118L53626n71768l77654M81414j41118K93155
5855d992655J28159J22738L06373k14351L1593k40624l53755K31483n83999l11814O52766
$$ y = [-4768534, -5615348, -4863353, -4651844, -4892494, -5161078, -5237301, -5476500, -5407879, -4869692, -4645845, -5179565, -5191157, -4998835, -5099355, -5688639, -5206905, -4792011, -4926228, -5105475, -5579881, -5526105, -5496594, -5090240, -4646612, -5075722, -4947132, -5276281, -5257605, -5349621, -4666327, -4640567, -4902528, -5266191, -5559117, -6169563, -5602165, -4878191, -4642035, -5082972, -5986764, -5172436, -4735206, -5116940, -5518250, -6014318, -5761135, -5395606, -4913584, -4882391, -5159344, -4908807, -4829203, -5507276, -5413599, -5161762, -5187027, -5062531, -5018367, -5110060, -4387082, -4955126, -4484596, -4937706, -5699042, -4728945, -4747479, -5439818, -5280188, -4923151, -5143428, -5030310, -4676684, -5248452, -5626106, -5144692, -5285810, -4992655, -4864496, -4741758, -4435385, -4649736, -4618143, -4858767, -5212522, -4981039, -5565038, -5876852, -5224086]
5844e224086J72838n57788j72033N67334k35076K03132L2024J3105m76108L96951m8234
5833e327941N88292m65312m9147k36960L62783L66595n8070j40189O49966l42396j31632
5822d784011l62109K40793q4563l14481J6186J93125J94308q47107L26312J00198Q01922
5811d519427j41567n77148j05112j7607l496O31778l06615k61863N19485k8551k18024
5800e028147K08133l8001P6059l09708k76176P82219m33700j05445M33127m83631L14097
5789d861173k99189L07405K45673r3544l56136j32911L78609k82058l1781j7229k63657
5778e405991L29963k5990q1834J49663m77672j18278O58360J41837j64358Q2366M86367
5767d425567m64179L21904q25217J88857K34584j53290p7503j20335L86069m1767j17321
$$ y = [-5224086, -5051248, -5609036, -5781069, -5213735, -5448811, -5245679, -5213655, -5200550, -5676658, -5279707, -5327941, -4739649, -5204961, -5254108, -5491068, -5128285, -4761690, -4819760, -4959949, -4309983, -4652379, -4784011, -5146120, -4905327, -4989890, -5304371, -5288185, -5095060, -4900752, -5747859, -5421547, -5321349, -4519427, -4660994, -5238142, -5343254, -5360861, -5364357, -4732579, -5039194, -5301057, -4781572, -4810123, -5028147, -4820014, -4858015, -4781956, -5091664, -5367840, -4585621, -5019321, -5124766, -4691639, -5175270, -4861173, -5160362, -4852957, -4607284, -4700828, -5056964, -5189875, -4811266, -5093324, -5125105, -5142334, -5405991, -5076028, -5102018, -5183852, -5034189, -5511861, -5630139, -4971779, -4829942, -4994300, -4911934, -4425567, -4889746, -4567842, -5393059, -5204202, -4969618, -5122908, -5200411, -5320746, -4934677, -4976444, -5093765]
5756e093765M89521o64067L095o7599k2210Q07064j00080p99047q616K90601j55945O5486
5744e255562K7337m6222L33029m97831j06733O04808M56683m37034J15308K02437J06028
5733d497752p28007J82526k60256K79220j0557M96224m64191l06790O0968N18155n42259
5722e272719P74041k38239O0936j24588k28693M6464K84854p37584j41607L44611j6153
5711e248677L01852n4009L48212l72861k65688l6998L98530J09994j53776N61638n82708
5700d994491L59388m3267n22029J72691Q0206j31892J43897p060p7145k92049o3940K15857
5688e159834N67037l11155k07051j7989q1131r013K77275M26987O48227j254747l14568
5677e435962L49905K21033m91039M18485l31914j351K79701Q3067m78028O50484l55107
$$ y = [-5093765, -4604244, -5268311, -5265216, -5332815, -5355025, -4547961, -4648041, -5447088, -5455704, -5165103, -5321048, -5255562, -5228225, -5274447, -4941418, -5439249, -5545982, -4941174, -4484491, -4921525, -4806217, -4603780, -4497752, -5225759, -5043233, -5303489, -5024269, -5034826, -4538602, -5002793, -5309583, -5248615, -4730460, -5272719, -4498678, -4736917, -4675981, -4800569, -5029262, -4982798, -4697944, -5435528, -5577135, -5232524, -5248677, -4946825, -5000834, -4652622, -5025483, -5291171, -5328169, -4929639, -4819645, -4973421, -4411783, -4994491, -4635103, -4678370, -5200399, -5027708, -4947502, -5079394, -4935497, -4942557, -5019702, -5311751, -5375691, -5159834, -4592797, -4903952, -5111003, -5128992, -5210123, -5219136, -4941861, -4514874, -3866647, -5121394, -5435962, -5086057, -4865024, -5356063, -4937578, -5269492, -5270843, -4991142, -4908075, -5386103, -4735619, -5090726]
5666e090726J93553k06836l91026O20385k05442J51133M8076J05284L68687J18091k71540
5655d560361m1643m54361P1247n9254L03755q4043L3522m48486J68011K75983J62489
5644d633141k29053N6292m83581j51954L16827L00218L72338L14688l40233L19926m37441
5633d595114P5915K09133k69283k32446m1457n18829P04978J98493n92502J96152J28820
5622d736140j23149L96454j82654p41979n2564M23801o75307L31393R257M89759L69521
5611d491608Q5762o60406J43366l12980P24864k83645k47892k42529M89333l8231J19061
5600d714905k81600K70044j7962L1731m48922L40311l05762k7338p6806J77673O8512q5848
5588e070872L67969j85259l41545j6602L30638P8213j30295k55337J73788M70032k02961
$$ y = [-5090726, -4897173, -5104009, -5495035, -4874650, -5080092, -4928959, -4880883, -4775599, -4406912, -4288821, -4560361, -4602004, -5056365, -4985118, -5044372, -4740617, -4824660, -4791138, -5239624, -5071613, -4795630, -4633141, -4862194, -4805902, -5289483, -5441437, -5124610, -4824392, -4452054, -4137366, -4477599, -4157673, -4595114, -4519199, -4310066, -4579349, -4811795, -4853252, -5372081, -4667103, -4468610, -5061112, -4864960, -4736140, -4859289, -4462835, -4645489, -5387468, -5440032, -5016231, -5691538, -5360145, -5350888, -4861129, -4491608, -4405846, -5066252, -4922886, -5235866, -4511002, -4794647, -5042539, -5285068, -4795735, -4833966, -4714905, -4996505, -4726461, -4744423, -4712692, -5161614, -4821303, -5127065, -5154403, -5231209, -5053536, -4985024, -5070872, -4702903, -4888162, -5229707, -5246309, -4915671, -4837458, -4967753, -5223090, -5049302, -4579270, -4782231]
5577d782231K12694K56555n58211j71114l27498K70570m37718k44981J67273J22585L84412
5566e107664M79876m07067J862J52341p27692K63952r2248K5756L37178p00906l9746
5555e814358N85587n7480K38390k19505K93298o3450J24148k08727j77717j38569l9073
5544e477456L84179L97963O4271K97517r30303p7307m20126N27831L68589l78048l12026
5533e554916M03272L73547l40546L43032m08244j65103k16972J043529l60882J07683
5523d775600m55043l23072M06566N39715j57092N13770o57324q2696k32625N6163N81557
5512d585681q6243L04773p11230N78679r51588N84665q4757M75787j62818p6388k61499
5501d976300k18355j95983O94992J14927n7600m75395J18067n40977Q2938J22880j2541
$$ y = [-4782231, -4569537, -4312982, -4871193, -5042307, -5369805, -5099235, -5536953, -5781934, -5614661, -5492076, -5107664, -4627788, -5034855, -5032993, -4880652, -5608344, -5344392, -5436640, -5410884, -5073706, -5774612, -5814358, -5228771, -5286251, -5047861, -5267366, -4974068, -5037518, -4913370, -5122097, -5299814, -5438383, -5477456, -5093277, -4695314, -4631043, -4333526, -5263829, -5341136, -5761262, -5233431, -4864842, -5242890, -5554916, -5151644, -4778097, -5118643, -4775611, -5183855, -5348958, -5565930, -4522401, -4883283, -4775600, -5230643, -5553715, -5147149, -4607434, -4764526, -4250756, -4908080, -4990776, -5223401, -5167238, -4585681, -4671924, -4367151, -5078381, -4499702, -5451290, -4866625, -4951382, -4475595, -4638413, -4714801, -4976300, -5194655, -5390638, -4695646, -4580719, -4638319, -5113714, -4995647, -5536624, -5453686, -5330806, -5343347]
5490e343347j060737K13845O46118J19775M38780l982N72894j05030o98331k02032J222412
5479d199635l63913K95631m81752p5331j65094j38010n31435O72885Q02780L08729p3254
5468c948399l01589o41234k32629o02022J720528k008161M537760j626459k437375n93423
5458f133003P16312L07519p16680J8679n53960N35393K28762K99502O03997K19959p14354
5447e187874j88495J142303j18825k81151l60935m99576j20143K58430K91137k30253
5437e295382L37638m8496j017238K61307j3989R0672J277856r8373o92573j26826n30823
5426e856227J26201J162686j99115k12723k26474M39106l17542Q55081r24294m03305
5416e556606M86316L88110J96446o63309J89782m50540M37340J34276J59654o03229J51009
$$ y = [-5343347, -6404084, -6190239, -5544121, -5424346, -4985566, -4989548, -4416654, -4521684, -5220015, -5422047, -4199635, -4563548, -4267917, -4749669, -4825000, -4990094, -5128104, -5659539, -4986654, -4183874, -3875145, -3948399, -4249988, -4891222, -5123851, -5725873, -4005345, -6013506, -1475746, -3102205, -5539580, -6133003, -5416691, -5109172, -5825852, -5807173, -6361133, -5825740, -5596978, -5297476, -4693479, -4473520, -5187874, -5376369, -4234066, -4352891, -4634042, -4994977, -5494553, -5614696, -5356266, -5065129, -5295382, -4957744, -5006240, -6023478, -5762171, -5776160, -5685488, -4407632, -4506005, -5198578, -5325404, -5856227, -5730026, -4567340, -4766455, -4979178, -5205652, -4766546, -5084088, -4229007, -5153301, -5556606, -5070290, -4682180, -4485734, -5149043, -4959261, -5409801, -4972461, -4838185, -4678531, -5281760, -5130751]
5405e130751J38038O42296k87049k24613j67964j3043m81150K35131l68829m4126P86584
5394d915476L86516J37055j50861j175774P27356n99166K51004m63408L32092O19093
5384d851569J97703p35264K86773j80890L76237M267K92759l84476l06211J39837n5559
5373e216393K51892K28214j00295l49062l93605L99300J60228O70347P7457k26001j000147
5362e498065K0344M5697Q3582J5324K01504l11304N63508k32969L34587l40564k84520
5351e402876K87255m9032K21154k98514l26754L21082j89591K34466k32744K92387l07679
5340e450846M54855o03154M27895J03676j33291j92668M76232L12343q31149L91756K14959
5329d829392m14184k34507K84963N26929n09439O61763m75543k5789J25918r4087j35392
$$ y = [-5130751, -4992713, -4350417, -4637466, -4862079, -5030043, -5043086, -5524236, -5289105, -5657934, -5702060, -4915476, -4528960, -4391905, -4542766, -5718540, -4991184, -5590350, -5339346, -5802754, -5470662, -4851569, -4653866, -5389130, -5102357, -5283247, -4907010, -4902743, -4609984, -4994460, -5300671, -5160834, -5216393, -4964501, -4736287, -4836582, -5185644, -5579249, -5179949, -5019721, -4349374, -4271917, -4497918, -5498065, -5477721, -5432024, -5348442, -5333118, -5131614, -5442918, -4879410, -5112379, -4777792, -5118356, -5402876, -5115621, -5164653, -4943499, -5242013, -5568767, -5247685, -5437276, -5202810, -5435554, -5143167, -5450846, -4995991, -5599145, -5171250, -5067574, -5200865, -5393533, -4917301, -4604958, -5436107, -5044351, -4829392, -5243576, -5478083, -5193120, -4666191, -5175630, -4513867, -4989410, -5015199, -4889281, -4983368, -5118760]
5318e118760n65816M87854J16313L38862j56129j27873j18415k26613L665J88394O9996
5307e108522k49110J3888O74470n29617J48707k82980M1601J12640k00369l3156N90721
5296d821727o42876O62888p6694J9750J65542k39759m226n2917J18733J5947n74164O67600
5284d761903k77332K2559j34083M3154j99655m40276L98335M23692k99062j00786L31910
5273d993447O8148P9194l73567j89417j68780L70991Q3444L40272j29971L8477j93966
5262e068622k7369K57212m4407l6395L98387O8427k37033j08044M21364p5964q3426k10351
5250d746221k41331j48016N21242j29495n23928J0380N5262L55472J53362J47677K24927
5239d320669p59891J31637L02622o70742O85662L26339j83324J84331L71384p59911l51915
$$ y = [-5118760, -5684576, -5196722, -5080409, -4741547, -4897676, -5025549, -5143964, -5370577, -5366912, -5178518, -5108522, -5357632, -5343744, -4669274, -5198891, -5050184, -5333164, -5291563, -5178923, -5379292, -5412448, -4821727, -5464603, -4801715, -4878409, -4858659, -4693117, -4932876, -4937102, -4990019, -4871286, -4855339, -5429503, -4761903, -5039235, -5016676, -5150759, -5107605, -5307260, -5747536, -5349201, -4925509, -5224571, -5325357, -4993447, -4925299, -4846105, -5219672, -5409089, -5577869, -5206878, -5123434, -4783162, -4913133, -4874656, -5068622, -5095991, -4838779, -4883186, -4919581, -4521194, -4452767, -4689800, -4797844, -4376480, -4452444, -4535870, -4746221, -4987552, -5135568, -4614326, -4743821, -5267749, -5257369, -5202107, -4846635, -4693273, -4545596, -4320669, -5080560, -4948923, -4646301, -5317043, -4631381, -4305042, -4488366, -4304035, -3932651, -4692562, -5044477]
5228e044477L73221m59031L63210K09722q4319M4374L48839j71153k09367N6956m66663
5217e038688J49364m12326K51902m31909N55847N4876P24788r19187q5700O08106K84085
5206d258842q6311l18665J41331m18863P2063N1039J35029P5682p58672k54365L71164
5195e249410J23763K23592J2265K91608l41673K31055K55795l24703p6338l38239O53058
5184d539227m35899k54803K91840J91269k68510N60744m65861M15167l61389p4769r7216
5173e038654L75876j12271l45388J48740K55289p0827j45178K78269m22137m21774q7103
5162e585158P28810J77644J82875q56257p0412K10092N69729j51899k30191J16823m80637
5151e388581L08771Q1679l33617J53024K64018M4875k96795M66037R5769Q3137q16462
$$ y = [-5044477, -4671256, -5130287, -4767077, -4557355, -4641674, -4597300, -4248461, -4419614, -4628981, -4572025, -5038688, -4889324, -5301650, -5049748, -5481657, -4925810, -4870934, -4146146, -5065333, -5151033, -4542927, -4258842, -4345153, -4663818, -4522487, -4941350, -4869287, -4818248, -4683219, -4607537, -5366209, -5620574, -5249410, -5125647, -4902055, -4889790, -4598182, -4939855, -4708800, -4453005, -4777708, -4854046, -5192285, -4539227, -4975126, -5229929, -4938089, -4746820, -5015330, -4454586, -4920447, -4505280, -4866669, -4941438, -5038654, -4662778, -4775049, -5120437, -4971697, -4716408, -4787235, -4932413, -4654144, -5076281, -5498055, -5585158, -4856348, -4678704, -4495829, -5352086, -5422498, -5212406, -4642677, -4794576, -5024767, -4907944, -5388581, -5079810, -4998131, -5331748, -5178724, -4914706, -4869831, -5166626, -4700589, -4604820, -4521683, -5338145]
5140e338145L45955K99209m81825J81053p6855J79236j77334n40402L56269M00617m36575
5129e288797L46575q2483j64309m33935L86317J53636O25011k79825l67591l29468O42314
5118d792555k0170n8980r9778n33424J17523j55610K31323J49074L75202n0350l27355
5107e165100J02265L90804j8481k52000r7580M76445k87655n02394O74818o78237K11424
5096e145691J50720j18901k55632K83261M03092Q9656m39850l7900K77640k57128O09132
5085d441601m36836m53178R1521M6313K23690k86572M83344o55200l1683J79825o68517
5074e948894L56634L07862k14333J43456P45760m40233J95218j66293n06027Q09266K6724
5063d690860k653k81440k70433J65871m64351L52977k05985k04965L81133M7177k0016
$$ y = [-5338145, -4992190, -4692981, -5174806, -4993753, -5070608, -4891372, -5068706, -5609108, -5252839, -4852222, -5288797, -4942222, -5024705, -5189014, -5622949, -5236632, -5082996, -4457985, -4737810, -5105401, -5434869, -4792555, -4812725, -4871705, -4971483, -5504907, -5387384, -5542994, -5311671, -5162597, -4787395, -4837745, -5165100, -5062835, -4672031, -4690512, -4942512, -5040092, -4563647, -4851302, -5353696, -4678878, -5357115, -5145691, -4994971, -5113872, -5369504, -5086243, -4683151, -4593495, -5033345, -5071245, -4793605, -5050733, -4441601, -4878437, -5331615, -5240094, -5193781, -4970091, -5256663, -4773319, -5428519, -5460202, -5280377, -5948894, -5592260, -5284398, -5498731, -5355275, -4609515, -5049748, -4854530, -5020823, -5526850, -4717584, -4690860, -4693513, -4974953, -5245386, -5079515, -5543866, -5190889, -5396874, -5601839, -5220706, -5173529, -5193545]
5052e193545K74348M1269j0715l23016j08700L9099j94312J33599M75036k85902K95412
5041d857427L07673l91589k78574L56149l9871J70224l94034K02552l99489J16037M48701
5030d759648k90139L14258l94231q7436K7683M57411m3917L15852m90383k41722J5396
5019e176876L88570L70933n64420k15703L82825j01572m55695O98962k612m47340l78706
5008e501634L62308J41768k29303J92675n2948k66059n02074R47058m2676J46564M29103
4997d375218n58593J70116q7857j28469l18348N83352L14487n50364L6099N0950j54185
4986e018030m26662J83668M71229n76148J66621K32423K92998K72373n88737M43416j04870
4975d651719r92155N31695l15572P56107l04256o0054L45868j76507j51140J9514J72637
$$ y = [-5193545, -4919197, -4877928, -4888643, -5211659, -5320359, -5281260, -5475572, -5341973, -4866937, -5152839, -4857427, -4549754, -4941343, -5219917, -4863768, -4903639, -4733415, -5127449, -4924897, -5324386, -5208349, -4759648, -5049787, -4735529, -5129760, -5217196, -5189513, -4732102, -4776019, -4460167, -4950550, -5192272, -5176876, -4788306, -4417373, -4981793, -5197496, -4814671, -4916243, -5371938, -4672976, -4675588, -5122928, -5501634, -5139326, -4997558, -5226861, -5034186, -5087134, -5353193, -5855267, -4908209, -4950885, -4804321, -4375218, -4933811, -4763695, -4851552, -4980021, -5298369, -4715017, -4400530, -4950894, -4914795, -4863845, -5018030, -5444692, -5261024, -4789795, -5365943, -5199322, -4966899, -4673901, -4401528, -4990265, -4546849, -4651719, -5643874, -5112179, -5427751, -4671644, -4975900, -5035954, -4690086, -4866593, -5017733, -4998219, -4825582]
4964d825582L86327l70701K46713j30613o3734j2351j74726j73592L85879j20196l02955
4953e155531L66424l60819j24427L11105k21290J83615K47686m30926J08834N5546r7834
4942e117617K7680O44131o35185J93793m30569M28168l85565l9596M72858n20272m71544
4931e833718Q24721L36142k08905n50453N1775R60239j51483n40917l83686L44690J42480
4920e009115l2706k53996K72281r194L15215j88884k21889n53563Q47556l08547P0378
4909e072464O28732j87783J99223l05276k9770l20832J8869O25070l63416o96583j74930
4898e679160N54937m17696N44067Q8309j95290M87140Q3724l42851L702l21240M0028
4887e154330j78633J66086J49272M11709l41412m28884K21945M43592p52447P0028M96377
$$ y = [-4825582, -4439255, -4809956, -4563243, -4693856, -4757590, -4769941, -4944667, -5118259, -4732380, -4852576, -5155531, -4789107, -5149926, -5274353, -4963248, -5184538, -5000923, -4753237, -5184163, -5075329, -5019783, -5117617, -5089937, -4445806, -5080991, -4887198, -5317767, -4889599, -5275164, -5314760, -4841902, -5362174, -5833718, -5008997, -4672855, -4881760, -5432213, -5380438, -4420199, -4571682, -5112599, -5496285, -5151595, -5009115, -5041821, -5295817, -5023536, -5032730, -4717515, -4906399, -5128288, -5681851, -4834295, -5142842, -5072464, -4443732, -4631515, -4432292, -4737568, -4767338, -5088170, -5069301, -4444231, -4807647, -5504230, -5679160, -5124223, -5541919, -4997852, -4909543, -5104833, -4617693, -4533969, -4876820, -4873118, -5194358, -5154330, -5332963, -5166877, -5017605, -4605896, -4947308, -5376192, -5154247, -4710655, -5463102, -5393074, -4896697]
4876d896697k36736N42970k1956n12635r5775k98996O00787o5302l6755r2885L74920
4865d739060M61421n78421o6200j44706j5542K03622l50085n802K61494l14277R4872L1372
4853e161312O00846m53340j25495j81525r2503K86844L21434L33098R7082n79924j16988
4842e071783M56631J74277Q2435q03305L99763l32521M96361m80960R4748k22037R8554
4831e107837l25314m73354J062146N8114M08907m60990m32489N10890l58494r152N18671
4820d608902j57627k52325O4977j70598K31603l76213O64023Q75k65370J04400K51590M432
4808d509135n07511o22140J58584N9805R9517J4248L44292q7924N2920M3837k07847r2959
4796e254313J9295L62052m17388L80515q8275l99559o8114j43106M13046M4581J86656r687
$$ y = [-4896697, -5133433, -4590463, -4612419, -5125054, -5220829, -5519825, -4919038, -4984340, -5021095, -5113980, -4739060, -4277639, -4856060, -4922260, -5066966, -5082508, -4878886, -5228971, -5234773, -4973279, -5287556, -5192684, -5161312, -4560466, -5013806, -5139301, -5320826, -5413329, -5126485, -4805051, -4471953, -4374871, -4954795, -5071783, -4615152, -4440875, -4358440, -5161745, -4761982, -5094503, -4598142, -5079102, -4984354, -5206391, -5107837, -5433151, -5906505, -4844359, -4786245, -4377338, -4838328, -5270817, -4759927, -5118421, -5127573, -4608902, -4766529, -5018854, -4953877, -5124475, -4892872, -5269085, -4605062, -4604187, -4869557, -4765157, -4513567, -4509135, -5016646, -5638786, -5480202, -5420397, -5320880, -5306632, -4962340, -5050264, -4997344, -4953507, -5161354, -5254313, -5235018, -4872966, -5290354, -4909839, -4998114, -5397673, -5465787, -5608893, -5195847, -5151266, -4964610, -4974297]
4784d974297L661L7070J41565l16770K27329o0374j77517k2872j3427l39942J27179L788
4772e364607J31546P8416K57524j3151j11950n62628N31962k88516R9375o3263j03059
4761e408351J79250m2048K29382K36304m72880O60775k46377l59933L11143j15982q7393
4750e116110L56041p66166J53062Q56998m94991O2040m14395q844J69166M70279m37639
4739e170559P05408m61494J00726l49340J90057p20878L25386J83123M2986J43683J36442
4728d874460M10969k56060m56177J42092L75930n1903j06488L72676m68463j59582k77229
4717e348695M19165j18134m16893K13736q4175M36781k24207L35441j30817m8100M24582
4706d541316k59281n470N677J47905l56820j88148K40904n778N6858j50658j91770k04239
$$ y = [-4974297, -4970636, -4933566, -4792001, -5108771, -4881442, -4941816, -5119333, -5142205, -5155632, -5495574, -5368395, -5364607, -5233061, -5154645, -4897121, -4910272, -5022222, -5584850, -5052888, -5341404, -5242029, -5305292, -5408351, -5229101, -5271149, -5041767, -4805463, -5278343, -4617568, -4863945, -5223878, -4912735, -5028717, -5116110, -4760069, -5526235, -5373173, -4516175, -5011166, -4949126, -5363521, -5372365, -5203199, -4732920, -5170559, -4465151, -4926645, -4825919, -5175259, -4985202, -5706080, -5380694, -5197571, -5154585, -5010902, -4874460, -4463491, -4719551, -5175728, -5033636, -4657706, -4709609, -4816097, -4443421, -4911884, -5071466, -5348695, -4929530, -5047664, -5464557, -5250821, -5334996, -4898215, -5122422, -4786981, -4917798, -4965898, -4541316, -4800597, -4806067, -4800390, -4652485, -5009305, -5197453, -4956549, -4962327, -4905469, -5056127, -5247897, -5452136]
4694e452136K24887K80709j34680m3057J04730L31929l22299j72323L81593n29815K70104
4683e060358p5209j30095N08368p4500j47054J28909J75331J22614j37196j52479K11011
4672d630658l84732L57742K00923j71434k27283N4212m7272m83981R5407L24186J43436
4661d769454K36819q35525k29911N89414L3986m83314Q42580q7957l28137O6767J9381
4650d945351N18049l70736J80805m27968j58288L9220k80181k97590P26790K7081L11233
4639d676936k08750k51681p3337o6704P6483l32061K16138L34909l67687N80452m34276
4628e203450M36490m02301J81763L00681l84792M80683n04578J47671Q3920j02313m8182
4617e014408J95886j55976m64311M19374k59892J52375n86860P01619j74554o05293L9610
$$ y = [-5452136, -5227249, -4946540, -5081220, -5124277, -5019547, -4687618, -5009917, -5182240, -4800647, -5330462, -5060358, -5135567, -5265662, -4757294, -4831794, -4978848, -4849939, -4674608, -4551994, -4689190, -4841669, -4630658, -5015390, -4657648, -4456725, -4628159, -4855442, -4801230, -4848502, -5332483, -5237076, -4912890, -4769454, -4532635, -5368160, -5598071, -5008657, -4974671, -5457985, -4615405, -4703362, -5031499, -4964732, -4945351, -4427302, -4798038, -4617233, -5045201, -5203489, -5164269, -5444450, -5742040, -5015250, -4988169, -4676936, -4885686, -5137367, -5210704, -5277408, -5200925, -5532986, -5316848, -4981939, -5349626, -4769174, -5203450, -4766960, -5169261, -4987498, -4686817, -5071609, -4590926, -5095504, -4947833, -4863913, -4966226, -5014408, -4818522, -4974498, -5438809, -5019435, -5279327, -5126952, -5713812, -5012193, -5186747, -5792040, -5752430]
4606e752430N62832L22419n75919J55449J28430M9919K02851O3796o47190Q18534m06831
4595e078140k10198M22285m4058q8622N05562p95982l38528O07634m6825J54277m89473
4584e402068L50187n0312L54510n31394O28234m69161L9730L39640L00752k56466K03059
4573d493289n07557j02869K52969j12511n65483l0271K29484o5767M37567L14786m20035
4562e062976J67558M1048l98456K01511l10891L07981n51113L26289k43997L19395K79625
4551d924026N1528J20879j019966j14340P12102M13371j85745l46475J74401k29185l8959
4540e386415J86121j35968K19435J27380p54421L13922N33815m33309o1030K71155o09764
4529e729079O29925L77925m62631l94897K05099K3317L44081K61883o44752k21988l20117
$$ y = [-5752430, -5189598, -4867179, -5443098, -5287649, -5159219, -5109300, -4906449, -4842653, -5489843, -4671309, -5078140, -5288338, -4866053, -4910111, -4998733, -4493171, -5289153, -5627681, -5020047, -5066872, -4912595, -5402068, -5051881, -5102193, -4747683, -5279077, -4650843, -5120004, -5080274, -4740634, -4439882, -4696348, -4493289, -5000846, -5103715, -4850746, -4963257, -5528740, -5559011, -5329527, -5395294, -4957727, -4642941, -5062976, -4895418, -4854370, -5252826, -5051315, -5362206, -5054225, -5605338, -5279049, -5523046, -5203651, -4924026, -4872498, -4751619, -5771585, -5885925, -5173823, -4760452, -4946197, -5292672, -5118271, -5347456, -5386415, -5200294, -5336262, -5116827, -4989447, -5743868, -5429946, -4896131, -5329440, -5390470, -5119315, -5729079, -5099154, -4721229, -5183860, -5578757, -5373658, -5350341, -5006260, -4744377, -5389129, -5611117, -5931234]
4518e931234o370N72619j5904J22958O96023m60235J34036k3309l58664N85300j26579
4507d811359k68832m2475J09405k16697M21108r8974j00779k36531N24716l04573M72915
4496d552076k06510m55763L99201k12173r5219K44167K1468j73147L15544p32741O19817
4485d827432m0413j53582k34901J74823N69158k99575j1939l42167m7777L12990k11163
4474e111978j61279O80124m70514j71801k06487N43949j8450m29384N3152O41181j87137
4463d838624k41641J97117k06388J9238K0400k87090N560N09357m31618m8356J96294
4452e105751j58667L76219l00029K01460N71042R8502l46917p31691K48950O17903n688
4441d534667k04546O5369j05482q2042R9190l80366l6095m3267M39891p3312o85274J77149
$$ y = [-5931234, -5937604, -5364985, -5380889, -5257931, -4561908, -5022143, -4888107, -4911416, -5270080, -4684780, -4811359, -5080191, -5122666, -5013261, -5229958, -4808850, -4907824, -5008603, -5245134, -4720418, -5024991, -4552076, -4758586, -5214349, -4815148, -5027321, -5122540, -4878373, -4856905, -5030052, -4714508, -5447249, -4827432, -4867845, -5021427, -5256328, -5081505, -4512347, -4811922, -4823861, -5166028, -5213805, -4900815, -5111978, -5273257, -4593133, -5063647, -5235448, -5441935, -4897986, -4916436, -5345820, -5292668, -4651487, -4838624, -5080265, -4883148, -5089536, -5070298, -5049898, -5336988, -5331428, -4822071, -5253689, -5302045, -5105751, -5264418, -4888199, -5188228, -4986768, -4415726, -4317224, -4664141, -5395832, -5146882, -4528979, -4534667, -4739213, -4673844, -4779326, -4861368, -4762178, -5142544, -5178639, -5221906, -4782015, -4855327, -5540601, -5363452]
4429e363452Q3717J34981N56676m51678L24070n49108N02932l68064l5471J04633l17026
4418e377790k00498K83582L11413k90867n9781L08681k62214k09512R74206L32643m36532
4407d626669l69332K58590k70728J52043K27237M95754n99541n47990L26517J24904n8599
4396d887814l69814J04430k75004M1114J06504J23990n40944M83956K11788J08721n77369
4385e470442K22097K52634j10016K08262Q6640l402k39386N65337o66817k61712M74878
4374d941927n8064k66911m81528O42723l07889O37484k06996j90312P2428L52900k00794
4363d948886k352J76812j87417K34776r1392k939J13731l29250m9687J9840n62191M25400
4351e203555K59341K49738l46668N971K19627j85137J47390P6001n16536O24036K70417
$$ y = [-5363452, -5279735, -5144754, -4588078, -5039756, -4715686, -5264794, -4761862, -5129926, -5165397, -5060764, -5377790, -5578288, -5294706, -4983293, -5274160, -5333941, -5025260, -5287474, -5496986, -4522780, -4190137, -4626669, -4996001, -4737411, -5008139, -4856096, -4628859, -4133105, -4732646, -5280636, -4954119, -4829215, -4887814, -5257628, -5153198, -5428202, -5387088, -5280584, -5156594, -5697538, -5213582, -5001794, -4893073, -5470442, -5248345, -4995711, -5105727, -4897465, -4810825, -4814227, -5053613, -4488276, -5155093, -5416805, -4941927, -4999991, -5266902, -5748430, -5105707, -5413596, -4776112, -4983108, -5173420, -5100992, -4748092, -4948886, -4951238, -4774426, -4961843, -4727067, -4818459, -4821398, -4707667, -5036917, -5086604, -5066764, -5628955, -5203555, -4944214, -4694476, -5041144, -5035173, -4815546, -5000683, -4853293, -4777292, -5293828, -4669792, -4399375]
4340d399375k29061n6473k42777k63158J08216K58267j20507J14642o76561N52J27093
4329e379142K59760m43640M11287k77892N60221k47083p3248J41136K07762P3314j48579
4318d916104K52722k32758l740J02209J68854o49060o3322L05930R954k61164m0679j76944
4306e504102P58662j91543Q9213l82095m5587J40825l26621j87852r7425P56251j68451
4295e158725j87355L21061j32185O2869Q8745m38915N8809M05958l09437K83661j6870
4284e022384K1230R188l95025L78716k40871n8373k9591J67494N99038j100262O67850
4273e002990j04779l47450O59476J47053j83371K72860q9263o93228J80450J76716M02684
4262d581842J07128n36228j49286J72459j81803j80727K82917j62331M80567k48442l96070
$$ y = [-4399375, -4628436, -4684909, -4927686, -5190844, -5082628, -4824361, -4944868, -4830226, -5506787, -5506235, -5379142, -5119382, -5563022, -5151735, -5429627, -4869406, -5116489, -5189737, -5048601, -4840839, -4767525, -4916104, -4663382, -4896140, -4899880, -4797671, -4628817, -5277877, -5341199, -5035269, -5025315, -5286479, -5327158, -5504102, -4745440, -4936983, -4847770, -5229865, -5275452, -5134627, -5461248, -5649100, -5746525, -4990274, -5158725, -5346080, -5025019, -5157204, -5094335, -5005590, -5444505, -5385696, -4979738, -5289175, -5005514, -5022384, -5001154, -4991966, -5386991, -5008275, -5249146, -5307519, -5337110, -5169616, -4570578, -5670840, -5002990, -5107769, -5455219, -4795743, -4648690, -4832061, -4559201, -4648464, -5341692, -5161242, -4984526, -4581842, -4474714, -5010942, -5160228, -4987769, -5169572, -5350299, -5067382, -5229713, -4749146, -4997588, -5393658]
4251e393658L29629l12356r4816M33554N3298N80915n4642J3673m55289N8180k17542
4240e059054L52938k51187k64759l39621r5140K83150K50186N81227p17449K36912K01705
4229d821092l79043j36658M33327n15491J20889K09070n71891L08549k0393L98421l49936
4218e324248j32737P5560J89535P5077l69523Q33610n86324M0570K22302m82236O12785
4207d845629J19111m91667J80994m14665K67544L68867l64967m74044L51495j74501N18747
4196d958715l80818K2337J37883l04768M53415n71948j64437J57973J86600N70771K15949
4185d635758j46093J53775j4260k22191o31189M36661j91124J79920k5407j76146J42800
4174e129012K68207m07699M05069j5310j17312k28242j88388Q47804J7202l62756L23747
$$ y = [-5393658, -5064029, -5376385, -5471201, -5037647, -4984349, -4403434, -4458076, -4444403, -4899692, -4841512, -5059054, -4706116, -4957303, -5222062, -5561683, -5656823, -5373673, -5123487, -4542260, -5259709, -5022797, -4821092, -5200135, -5336793, -4903466, -5418957, -5298068, -5088998, -5660889, -5352340, -5372733, -4974312, -5324248, -5456985, -5381425, -5191890, -5116813, -5486336, -4652726, -5239050, -5198480, -4976178, -5458414, -4845629, -4726518, -5218185, -5037191, -5451856, -5184312, -4815445, -5180412, -5654456, -5302961, -5477462, -4958715, -5339533, -5317196, -5179313, -5484081, -5030666, -5602614, -5767051, -5609078, -5422478, -4851707, -4635758, -4781851, -4628076, -4642336, -4864527, -5495716, -5059055, -5250179, -5070259, -5095666, -5271812, -5129012, -4860805, -5268504, -4863435, -4878745, -4996057, -5224299, -5412687, -4564883, -4547681, -4910437, -4586690]
4163d586690m01054o4169p73724m6403P58505L02723N78196o2413p63049k11497n11586
4152e781161M04362n5709L0344J95189J9698k73043P68834K9619k99941k62597K3061
4141e201344K64212K37267n26353K35394J80138L01055j80253K87125L6536M06098K128193
4130a831932K936709o18177K071683l723295o67014j030088o61787l18989p5527o62886
4120d581303j968k1250m36565M67149N1026m3839M79427p83394L79049j22564k46856
4109d861088l21821J17656K57733m96553p4660J07489N1862M59263L72708k02626M7616
4098d542421j74286j4367k95914k46293L14195M16108n72072l6592n7208j56013L86844
4087d978019J2977L56003q26512L69632J73884J85776k86100J18653R1923k34043M78196
$$ y = [-4586690, -4987744, -5051913, -5825637, -5872040, -5113535, -4810812, -4232616, -4295029, -5058078, -5269575, -5781161, -5376799, -5432508, -5402164, -5206975, -5187277, -5460320, -4691486, -4661867, -4961808, -5224405, -5201344, -4937132, -4699865, -5226218, -4990824, -4810686, -4509631, -4689884, -4402759, -4366223, -3960125, -1831932, 1104777, 486600, 2558283, -1165012, -1832026, -2862114, -3523901, -3842890, -3918417, -4581303, -4583271, -4604521, -5041086, -4573937, -4522911, -4566750, -4087323, -4870717, -4491668, -4614232, -4861088, -5182909, -5065253, -4807520, -5304073, -5378733, -5271244, -5219382, -4760119, -4387411, -4590037, -4542421, -4716707, -4731074, -5026988, -5273281, -4959086, -4542978, -5115050, -5151642, -5208850, -5364863, -4978019, -4965042, -4609039, -5435551, -5065919, -4892035, -4706259, -4992359, -4873706, -4781783, -5015826, -4537630]
4076d537630l97806l39151J66098r4383o58341O64361N08422n18696M08767N13491l40210
4065d625078l58550r1739l62701r1749j54455N91990R2961L26344j23824J11091n73041
4054e258751p0514L8322O23043P6780l58294j28673L60291K68959o28366M47035n11322
4043e141490K86840j40189J20397J15759l46278k82993o7693N82778k26821m58267L32920
4032e225037K8784P8895K55882k88451M73464k64434k50j92257P7717m1232j27519L42270
4020d882168n89482N30663j05965K2916K71867k99733J24790q3194M19531l40198k41987
4009e172960k365O48524k07366M79972p70872K879M47825k10264l62902L13444l19845
3998e153930l9543L68157n46175M87048j04355j62006k91373L63067N20990j13488m47365
$$ y = [-4537630, -4935436, -5274587, -5108489, -5202872, -5861213, -5196852, -4688430, -5207126, -4798359, -4284868, -4625078, -4983628, -5075367, -5438068, -5529817, -5684272, -5092282, -4999321, -4672977, -4796801, -4685710, -5258751, -5329265, -5290943, -4667900, -4591120, -4949414, -5078087, -4717796, -4448837, -5077203, -4630168, -5141490, -4854650, -4994839, -4874442, -4758683, -5104961, -5387954, -5455647, -4872869, -5099690, -5557957, -5225037, -5196253, -5117358, -4861476, -5149927, -4676463, -4940897, -4941147, -5133404, -5055687, -5096919, -5224438, -4882168, -5471650, -4940987, -5046952, -5024036, -4752169, -5051902, -4927112, -5010306, -4590775, -4930973, -5172960, -5175325, -4526801, -4734167, -4254195, -5025067, -5022188, -4574363, -4784627, -5147529, -4834085, -5153930, -5193473, -4825316, -5371491, -4884443, -4988798, -5150804, -5442177, -5079110, -4558120, -4671608, -5118973]
3987e118973N23247K23964p14506K21250K43201n68067j27778j7353K57589J54770N6599
3976d866057J27100m26991N8834j77160L82584J71609l10234o0503L49047k10348J84127
3965d777992J0863M13001p64200O78357K757L0742l30769l33490l19181N86869O8264
3954d734779l69523K42096K02142m43706K27578M67608o87895M76354L21345k51718L53117
3943d197381o63967l1976k82290K85578K36210j97909k15548j97353j117552J284815
3933e097373K31300L79515l61162M67057p44364j77852M46368K17086j72807j3342k09993
3922e035567K87918j88032j35498k8280M16644m29462M09051m4965L2522j31939N1509
3911d796099J21012n53901k05614K34940L34225k94504m8882J6546N99004n50654L33174
$$ y = [-5118973, -4595726, -4371762, -5086268, -4865018, -4621817, -5189884, -5317662, -5335015, -5077426, -4922656, -4866057, -4738957, -5165948, -5107114, -5284274, -4901690, -4730081, -5040315, -5100818, -4751771, -4962119, -4777992, -4767129, -4354128, -5118328, -4439971, -4437214, -4406472, -4737241, -5070731, -5389912, -4803043, -4734779, -5104302, -4862206, -4660064, -5103770, -4876192, -4408584, -5096479, -4620125, -4298780, -4550498, -4197381, -4861348, -4893324, -5175614, -4890036, -4653826, -4851735, -5067283, -5264636, -6382188, -5097373, -4866073, -4486558, -4847720, -4380663, -5125027, -5302879, -4856511, -4639425, -4812232, -4825574, -5035567, -4747649, -4935681, -5071179, -5099459, -4682815, -5112277, -4703226, -4748191, -4715669, -4847608, -4796099, -4675087, -5228988, -5434602, -5199662, -4865437, -5159941, -5208823, -5192277, -4593273, -5143927, -4810753]
3900d810753K26873k48143K90691n60355l90334O17960O87027j071168N52915n38084
3890e243371J28019O5483l65727M41555p8523L76969n04818j13641J45204m9563J1239
3879e187174k34138L18385K74114n00454L06056k46121j11726O085M72871m28502K87918
3868e042686K61648k22193N93319l27828k53867L07405n7276j32610r6161J20888J56517
3857d692844j79579J72785j63221q2841j45697l9585q3942L75926k33144L1263q9815
3846e130694k01940Q08698o41590m5941j27424L74091M18302j48530J5561o32941L36576
3835d975832l43622L42003l15898K10115J31583k22374K6036j158M59205r2312k61309
3824e043563K37549k97908M1102K44930j04091l95653P45810l35277L58493l02312Q5329
$$ y = [-4810753, -4583880, -4832023, -4541332, -5101687, -5492021, -4874061, -4187034, -5258202, -4705287, -5243371, -5115352, -5049869, -5415596, -4974041, -5052564, -4675595, -5180413, -5294054, -5148850, -5198413, -5187174, -5421312, -5102927, -4828813, -5329267, -5023211, -5269332, -5381058, -5374973, -4902102, -5330604, -5042686, -4781038, -5003231, -4409912, -4737740, -4991607, -4684202, -4741478, -4874088, -4970249, -4849361, -4692844, -4872423, -4699638, -4862859, -4945700, -5091397, -5130982, -5214924, -4838998, -5072142, -5040879, -5130694, -5332634, -4523936, -5165526, -5211467, -5338891, -4964800, -4546498, -4695028, -4679467, -5312408, -4975832, -5319454, -4977451, -5293349, -5083234, -4951651, -5174025, -5147989, -5149147, -4689942, -4782254, -5043563, -4806014, -5103922, -5062820, -4817890, -4921981, -5317634, -4571824, -4907101, -4548608, -4850920, -4765591]
3813d765591l59332j80661M59910m55522M12355l91920O64073j13408J33482m0487o9777
3802d706878Q2744j00979R436j11790L25287j35949r5319L72562P734m62547j42468q8728
3790e046895P3225k92151n5341J95059O4382k77956J20518O63629m4782L7028j65038
3779d728322j47869N33645q11620M55138q8948P337l16925M40690J40222J50443m52764
3768d818973J14527J10543k93036k83912k43087K99579O3183j73187J56839j52885J15126
3757e105283J00052L29995p15441O6673l11796L23626N48861J36493m05184O3065J2152
3746d956787l23966M36317k32073J69539K85874J69820j60198j72324k29070k7993n4745
3735e095606L7551K65247M02146j82887p97896J3864J13540J8292N1663K51326K55445
$$ y = [-4765591, -5124923, -5305584, -4845674, -5301196, -4888841, -5280761, -4616688, -4730096, -4596614, -4637101, -4706878, -4624134, -4725113, -4715677, -4827467, -4502180, -4638129, -4733448, -4360886, -4353152, -4815699, -4958167, -5046895, -4973670, -5265821, -5321162, -5126103, -5061721, -5339677, -5219159, -4555530, -4600312, -4563284, -4728322, -4876191, -4342546, -5154166, -4699028, -4787976, -4780639, -5097564, -4656874, -4516652, -4366209, -4818973, -4704446, -4593903, -4886939, -5170851, -5413938, -5114359, -5051176, -5224363, -5067524, -5220409, -5105283, -5005231, -4675236, -5390677, -5324004, -5635800, -5312174, -4763313, -4626820, -5032004, -4968939, -4956787, -5280753, -4844436, -5076509, -4906970, -4621096, -4451276, -4611474, -4783798, -5012868, -5040861, -5095606, -5058055, -4792808, -4390662, -4573549, -5371445, -5357581, -5244041, -5225749, -5174086, -4922760, -4667315]
3724d667315o5239j78724L05295m94295J16966J71562l03624L53266K22495j78655L43340
3713d374928l47282M39721l08123J45930K12668J4951l25757j03247m87m73141K62855
3702d856840J00363k13948m7206j10516L01713m01027j98889N5127K06669q3570K91336
3691d956788J16678k13055J02812J54073L15887o1021J01223j83463n2861K38693m85864
3680d923686r7682q2175J74234N7400L79983n53690K79836n4280L94374L45433o33217
3669d713470M16205n22542J47784J05543q2727n62055N7391J28587L65259P0986K9884
3658d559155j11229o1732j60729k3364K11516k59524J24765n81427O06454N3704k00109
3647d960830M37168J14578k14673n03328J26148K49256l0241r722j3035L41O7944j98606
$$ y = [-4667315, -4732554, -4911278, -4605983, -5100278, -4983312, -4811750, -5115374, -4762108, -4539613, -4718268, -4374928, -4722210, -4282489, -4590612, -4444682, -4232014, -4217063, -4542820, -4646067, -4646554, -5119695, -4856840, -4756477, -4970425, -5017631, -5128147, -4826434, -5227461, -5426350, -5371223, -5164554, -5248124, -4956788, -4840110, -5053165, -4950353, -4796280, -4480393, -4541414, -4440191, -4623654, -4676515, -4437822, -4923686, -5021368, -5103543, -4929309, -4871909, -4491926, -5045616, -4765780, -4820060, -4425686, -4080253, -4713470, -4297265, -4819807, -4672023, -4566480, -4649207, -5211262, -5153871, -5025284, -4660025, -4589039, -4559155, -4670384, -4732116, -4892845, -4916209, -4704693, -4964217, -4839452, -5420879, -4814425, -4760721, -4960830, -4523662, -4409084, -4623757, -5127085, -5000937, -4751681, -4781922, -4791644, -4804679, -4804338, -4736394, -4935000]
3635d935000k47748L73251k029J68580l50468j99079r6944K05490N76102J37798l19272
3624d689319l89382N7591j54863M46811j53611k73607N79403O5230l23488J70384k02784
3613d867635q0305l86980j77216P18888K21890k17751j27461K61257l6581j5688m46285
3602e153867J092026n68866o46043N70663L3452j40436l5332L17971J12005j20480j15880
3591d654787q601J3476L49045m63293k31156R4336M67478k1686j11817j59484M65460
3580d261029l45734Q9229k28366m43052M67193j93138j3585L2806K48468k36544o6859
3569d950611p3351l68912j4779K62637l00242N88314P8795L01615n06643J36433O5731
3558d781013p2539n22o24170J43313L04099L67177j71809L38827L82170n13834o43159
$$ y = [-4935000, -5182748, -4809497, -4811526, -4642946, -4993414, -5192493, -5289437, -5083947, -4507845, -4370047, -4689319, -5078701, -5021110, -5175973, -4729162, -4882773, -5156380, -4576977, -4511747, -4835235, -4664851, -4867635, -4947940, -5334920, -5512136, -4793248, -4571358, -4789109, -4916570, -4655313, -4691894, -4707582, -5153867, -4061841, -4630707, -5276750, -4706087, -4672635, -4813071, -4848403, -4530432, -4418427, -4538907, -4654787, -4663388, -4649912, -4300867, -4764160, -4995316, -4900980, -4433502, -4455188, -4567005, -4726489, -4261029, -4606763, -4517534, -4745900, -5188952, -4721759, -4914897, -4928482, -4895676, -4647208, -4883752, -4950611, -5023962, -5392874, -5407653, -5145016, -5445258, -4856944, -4778149, -4476534, -4983177, -4846744, -4781013, -4853552, -4854074, -5478244, -5334931, -5030832, -4663655, -4835464, -4496637, -4114467, -4628301, -5271460]
3547e271460J96835l40353l85387R87724k83754l15265j09619j5469O12086j64727L05563
3536d783826N4570l40972j04302J45527J0509j06532M67643o57572M02873N4233P4795
3525d783054j56756K74394n12192K50853j46420m10685L21887q5311L11008K08836n30768
3514e258208k23117K99243M177k76178k59620L73825M73901m78011N26609j03979l31544
3503e252902j56725O79607P3081n21806K0628K25042P838J11569M0621J43794j37457
3492d766710M19869p54909M87745p72902N74304k4736r8523L46946n20836M16332m12283
3481e105703M43917K09180m47015j51705N74646l62729j84351k1889J09452L8457R5366
3470d802374o46360K89187O07052j08595J0501l55565J46812M25220j27938K74211l31729
$$ y = [-5271460, -5074625, -5414978, -5800365, -4812641, -5096395, -5411660, -5521279, -5536748, -4924662, -5089389, -4783826, -4729256, -5070228, -5174530, -5029003, -5018494, -5125026, -4657383, -5314955, -4912082, -4857849, -4783054, -4939810, -4665416, -5177608, -4926755, -5073175, -5483860, -5161973, -5247284, -4936276, -4727440, -5258208, -5481325, -5182082, -5177905, -5454083, -5713703, -5339878, -4865977, -5343988, -4817379, -4921358, -5252902, -5409627, -4730020, -4656939, -5178745, -5158117, -4933075, -4925237, -4813668, -4773047, -4629253, -4766710, -4346841, -5101750, -4614005, -5386907, -4812603, -4837339, -4935862, -4588916, -5109752, -4693420, -5105703, -4661786, -4452606, -4899621, -5051326, -4476680, -4839409, -5023760, -5045649, -4936197, -4897740, -4802374, -5448734, -5159547, -4552495, -4661090, -4650589, -5006154, -4859342, -4434122, -4562060, -4287849, -4619578]
3459d619578m03350l43400K910m34095L20544K4943P9031O42844k22502M49921P8476
3448d424256k96582p01080L35524O50036J51388j85823q6946k76818p2544M21735j71482
3437d656848k1657n08069L20452K04298m75302J38982k35493l794N38852o38504L31592
3426e005491q4492P19657j83618J0016K84265M00556j152213j94502M85169K27794m90004
3415d982863k66787O82923j90302L3346l0723J44655j37320k00549R2475K44744j56283
3404d766684L32516j64218j33155l58368q8134M99495p32583J96201J33372M81141j38010
3393d738427n95771J58038m89881K39596k17230M20024L08288j11829k27316N47415N02357
3382d204736k55756K14634k50254K83149o58487j37422k5778K63646l39965J00261P37097
$$ y = [-4619578, -5022928, -5366328, -5363418, -5797513, -5476969, -5452026, -5372995, -4730151, -4952653, -4502732, -4424256, -4720838, -5421918, -5086394, -4436358, -4284970, -4470793, -4557739, -4834557, -4907101, -4485366, -4656848, -4678505, -5186574, -4866122, -4661824, -5137126, -4998144, -5233637, -5237431, -4698579, -5337083, -5005491, -5089983, -4370326, -4553944, -4543928, -4259663, -3859107, -5011320, -5205822, -4720653, -4492859, -4982863, -5249650, -4566727, -4757029, -4723683, -4754406, -4609751, -4747071, -4947620, -4855145, -4610401, -4766684, -4434168, -4598386, -4731541, -5089909, -5178043, -4678548, -5411131, -5214930, -5081558, -4600417, -4738427, -5334198, -5176160, -5666041, -5426445, -5643675, -5223651, -4915363, -5027192, -5254508, -4707093, -4204736, -4460492, -4245858, -4496112, -4212963, -4871450, -5008872, -5034650, -4771004, -5110969, -5010708, -4273611]
3371d273611k44880m00480q1509m07586O8855P68471j61323j29532l09306K78013R4745
3360d798143J20076j60283j48817J31643L82257p09136Q59231p40870k0974N63976j22317
3349d643357m96215l2225j5732J78428J28504m41266N23488o1956n684p8736K26638k51228
3337d969341m28020L59992l96137j37088j42045P55127m39290J13778m5455P18264K75478
3326d334737l51441j90395J64931j56902m97694L53588K20301k39431K7075j43936L41383
3315d807258k11746l09965N64180L88883l00825k17795o48861K17578J31724r972J45451
3304e058606L76960j09676L56703m78099L62543k84307K56350k93646m13431Q83202n39147
3293d941154n5809j77778k35046j56260K23730K23540o4870J0936K75144j60518m0308
$$ y = [-4273611, -4518491, -4918971, -5000480, -5408066, -5339211, -4570740, -4732063, -4861595, -5170901, -4892888, -4798143, -4678067, -4838350, -4987167, -4855524, -4473267, -5182403, -4323172, -5064042, -5085016, -4521040, -4643357, -5139572, -5171797, -5187529, -5009101, -4880597, -5321863, -4798375, -4860331, -4866015, -4944751, -4718113, -4969341, -5397361, -5037369, -5433506, -5570594, -5712639, -4957512, -5396802, -5283024, -5328479, -4610215, -4334737, -4686178, -4876573, -4711642, -4868544, -5366238, -5012650, -4792349, -5031780, -5004705, -5148641, -4807258, -5019004, -5328969, -4764789, -4375906, -4676731, -4894526, -5543387, -5325809, -5194085, -5204057, -5058606, -4681646, -4791322, -4434619, -4912718, -4550175, -4834482, -4578132, -4871778, -5285209, -4402007, -4941154, -4996963, -5174741, -5409787, -5566047, -5342317, -5118777, -5183647, -5172711, -4897567, -5058085, -5098393]
3282e098393p7016N37372n9112j72557J70449L59829M74167R0922P12092j63289Q2135
3271c143401M47387j75003m04268l09109j65463p21292R3453J41646N84858j110994J7164
3260d745022k5257l45958L78852n4634k94075R9704K24837L46804J5342J22680M51108
3249c825619J09223J339031J057795J031810L52337k4125p74041o32967k95327j011993
3239b673876p15231o51787q8827n62248j8226q16484N48781L52424n97148n621K86661
3228d941582M12131l76825L40626m28086l78723Q25528M60500R58459M55236R36873Q27830
3217i08033J53884K90799p13273q08115q11115m70531q14146n34570Q477o76785q37005
3206f120413L81479Q6911M69549Q0734j29043k07972J533M16255j89667p3954l14921
$$ y = [-5098393, -5175409, -4638037, -4697149, -4869706, -4699257, -4339428, -3865261, -3774339, -3062247, -3225536, -3143401, -2696014, -2871017, -3275285, -3584394, -3749857, -4471149, -4377696, -4236050, -3651192, -4762186, -4745022, -4770279, -5116237, -4737385, -4792019, -5086094, -4986390, -4761553, -4414749, -4399407, -4276727, -3825619, -3716396, -2377365, -1319570, -287760, 64577, 40452, -733589, -1366556, -1661883, -2673876, -3389107, -4040894, -4129721, -4691969, -4710195, -5526679, -4977898, -4625474, -5222622, -5228243, -4941582, -4529451, -4906276, -4565650, -4993736, -5372459, -4546931, -4086431, -3127972, -2672736, -1735863, -908033, -754149, -463350, -1176623, -1984738, -2795853, -3266384, -4080530, -4615100, -4606623, -5283408, -6120413, -5738934, -5652023, -5182474, -5101740, -5230783, -5438755, -5437222, -5020967, -5210634, -5284588, -5599509]
3195e599509L28289P18078J4118N85518K84240j39140K16434K06026j02257l67379O1954
3184c793628r29545p40j98839j2407k14299m21505j78291L84551P6670n6888p844j70705
3172e523470L03539l67739P07300J19651M4820Q9281n85385P72897j81664P00348k73637
3161d194059o7646M7230o51433j94667q12887K79677M22801j80964k56687J76655k10441
3150e642421M23913L24863l64499k09649M58353K05704o55098K32527J47312J133061R4527
3139c851407l38645k75447K19943Q104j66817o46398p19013p74083L2129j093785J36073
3128g469346K75532P99990o38082K88439N44589K35610L51256J34588m020J13515R6426
3117e271503J32304j65814k87682j823N02728N10403j54820P8545K25382q3961n74376
$$ y = [-5599509, -5271220, -4553142, -4539024, -3953506, -3669266, -3808406, -3591972, -3385946, -3488203, -3855582, -3793628, -4723173, -4723913, -4922752, -4935159, -5149458, -5570963, -5749254, -5364703, -5288033, -5344921, -5352765, -5523470, -5219931, -5587670, -4880370, -4760719, -4715899, -4626618, -5212003, -4439106, -4620770, -3920422, -4194059, -4261705, -4214475, -4865908, -5060575, -5873462, -5593785, -5170984, -5351948, -5608635, -5431980, -5642421, -5218508, -4893645, -5258144, -5467793, -5009440, -4803736, -5458834, -5226307, -5078995, -3945934, -3851407, -4190052, -4465499, -4245556, -4237452, -4404269, -5050667, -5769680, -6543763, -6511634, -7605419, -7469346, -7193814, -6393824, -7031906, -6743467, -6198878, -5963268, -5612012, -5477424, -5481444, -5367929, -5271503, -5139199, -5305013, -5592695, -5594518, -5091790, -4581387, -4736207, -4657662, -4432280, -4516241, -5090617]
3106e090617p4754q91421m14693n88793n35874q224P03540M72305R3390r0042O93749p4966
3094e806400j17798O50742m49123n53227n9958k75508J81592M3994L03314N10295M68320
3083e103757M16447R20400O25656n99867l08545N22507Q8345k04956l62782o64443L85044
3072d285951j585914N18884p16488l37782k03769J017758Q87558Q26742m29119M62783
3062c845298m78895J08190K40258J819801J699557K420510K696507K899357K774972
3053A0334959M308482M598240J1892158K3701153L6612249M9248068M8574343L9169802
3045B28439454J7024037q539642k8934431m1937974m1617094l2756589k3707255j2550056
3037E5420450p194846l775658k932747l421452l927605j958430j444232J069610K378063
$$ y = [-5090617, -5165371, -6056792, -6471485, -7060278, -7596152, -7604376, -6900836, -6428531, -6335141, -6425183, -5731434, -5806400, -5924198, -5273456, -5722579, -6275806, -6335764, -6611272, -6429680, -6385686, -6082372, -5572077, -5103757, -4687310, -3766910, -3141254, -3741121, -4049666, -3527159, -3438814, -3643770, -4006552, -4670995, -4285951, -5871865, -5352981, -6069469, -6407251, -6611020, -5593262, -4705704, -3878962, -4308081, -3845298, -4324193, -4216003, -3975745, -2155944, -456387, 1964123, 4660630, 7559987, 10334959, 14643441, 19241681, 31133839, 54834992, 91447241, 140695309, 189269652, 228439454, 245463491, 236923849, 207989418, 166051444, 124434350, 91677761, 67970506, 55420450, 48225604, 44449946, 41517199, 38095747, 34168142, 32209712, 30765480, 31835090, 34213153]
3028C4213153M227897N580901O998777R931303J9788497M8653390Q5604358J28591016
3020C43589292J60243881J45063173J04110330K0510699n4220577j04129072j30027086
3013D85140640j16223532r2855760o5249651l7563268k3243771j3457304j2355361
3006A24191993j2343537j1638456j1040875r999614o701375l381252N602K724179N223303
2997G7039968J0978875K5916747O2556528J00756949J47422274J61079778J36425734
2990G22176853Q2461968m953834p3847517j21630390j37501641j13208103q8980675
2983B64516661n7707863l4822031k2065610j4961770j2642722j2696210j2728881j2953416
2975H3938158j1072302r294794o613631m654005k365486n67622L486163J0848844K4202052
$$ y = [34213153, 38441050, 44021951, 51020728, 60952031, 80740528, 129393918, 214998276, 343589292, 503833173, 648896346, 753006676, 773517375, 719296798, 615167726, 485140640, 368917108, 276061348, 210811697, 173248429, 150004658, 136547354, 124191993, 111848456, 100210000, 89169125, 79169511, 72468136, 69086884, 69092486, 71816665, 77039968, 88018843, 113935590, 176492118, 277249067, 424671341, 585751119, 722176853, 804638821, 799684987, 725837470, 604207080, 466705439, 353497336, 264516661, 206808798, 171986767, 149921157, 134959387, 122316665, 109620455, 96891574, 83938158, 72865856, 63571062, 56957431, 52303426, 49937940, 49370318, 52856481, 63705325, 87907377]
2966H7907377L7627049N3294992N2267884M1914278J8416834j2591087l3236082m7874058
2958A97727187m7175535l7675579k8325044j6522154j1430851o736508n244912l982861
2950D0633743l859772m439352l737979l868726l426838k788082k830690k524922q83137
2941A2274245o61080j346247j795054j042442q30057j028626j639241j018303j001540
2932A911655K0407r25815l75548j019005j10270m74182m4949q4484L10030O88078J115647
2921A011564l31385J123484R0257n39355n88095l53163m89351L34685j91932r97117k81613
2910a212021K61798Q67101j711381J310467J372957o44702M5089j108170j01357l63403
2900a283622q07043j15078l74639j40218r4766Q9276M83425j73045P66931k51572k65820
$$ y = [87907377, 125534426, 178829418, 231097302, 273011580, 291428414, 278837327, 245601245, 197727187, 150551652, 112876073, 84551029, 68028875, 56598024, 49861516, 44616604, 40633743, 36773971, 32334619, 28596640, 24727914, 21301076, 18512994, 15682304, 13157382, 12274245, 11613165, 10266918, 8471864, 7429422, 6599365, 5570739, 3931498, 2913195, 1911655, 1932062, 1006247, 630699, -388306, -498576, -972758, -1017707, -1102191, -792161, -104083, 1011564, 680179, 1803663, 1893920, 1354565, 766470, 413307, -76044, 258641, 66709, -930408, -1212021, -950223, -83122, -1794503, -484036, 888921, 244219, 289308, -818862, -920219, -1283622, -2090665, -2205743, -2580382, -2720600, -2815366, -2726090, -2242665, -2415710, -1648779, -1900351, -2166171]
2889b166171L70879n76022L17525l58054L19998J54398l1310L10740K64406Q53222K47681
2878b92708j62516k76262q87994r03968l30966q84021k29593k74140o8033l6346q4787
2867d431334M46237L91593k04352K72264M46010K6057m7516j62541m64671k28293N00841
2856c455705j41887K72509K6299j01132N10440J73792n25417n98414m06968n60762Q5468
2845d721777l6100j46471j6008j42279m956M07106m92739M54870Q49112K18298l34318
2834c965262J44646J89538k70426K38214o3347N02974m34693J7419j15600l5204J0905
2823c780836l3259j172581m0283m0269K10811K33606M09342j68303N02445K37748K99631
2812c341948k29748O9714m17455K6551j27970m0859N05290k70419K34140K93319J12411
$$ y = [-2166171, -1795292, -2371314, -2053789, -2411843, -2091845, -1937447, -1968757, -1658017, -1393611, -540389, -292708, -455224, -731486, -1619480, -2523448, -2854414, -3738435, -3968028, -4242168, -4310201, -4346547, -4431334, -3985097, -3593504, -3797856, -3525592, -3079582, -3053525, -3101041, -3263582, -3728253, -3956546, -3455705, -3597592, -3325083, -3298784, -3399916, -2889476, -2715684, -3241101, -3839515, -4246483, -4807245, -4721777, -4757877, -4904348, -4920356, -5062635, -5067591, -4660485, -5153224, -4698354, -3849242, -3630944, -3965262, -3820616, -3631078, -3901504, -3663290, -3726637, -3223663, -3658356, -3640937, -3756537, -3791741, -3780836, -3814095, -4986676, -5026959, -5067228, -4856417, -4622811, -4213469, -4381772, -3879327, -3641579, -3341948, -3571696, -3501982, -3919437, -3892886, -4020856, -4061715, -3556425, -3826844, -3592704, -3299385, -3186974]
2801c186974k05737M60922k72308q2575n86140n7704l17543O1960m90655J13012k06208
2790d769950N22755J382190P71167J031660L84164J07756l89129k96206o16893o56540
2780b529026p55253k09556J3829K20666m27704M66462Q8375N8327Q4110n61269r75064
2769d526103j42127R6826k14576j91168l7361M8005L82705J350929O80797N77157J194367
2758g80549l12978J48419p94658l63021m98785o10291q39102L37392q8711K01474o60390
2747d261200O78359J76479n58273K28957m85273j46020J55142k08899l07606l09341k03839
2736e241514p11220Q44670O03156L2263j37065J469899J8501j00805k32151j009256J87091
2725d276431P2517l04506j1720k17260M87882l50998L08646q83214K57418J52301J43210
$$ y = [-3186974, -3392711, -2931789, -3204097, -3286672, -3872812, -3930516, -4248059, -4186099, -4676754, -4563742, -4769950, -4247195, -2865005, -2093838, -1062178, -678014, -570258, -959387, -1255593, -1872486, -2529026, -3284279, -3493835, -3480006, -3259340, -3687044, -3220582, -3132207, -3073880, -2989770, -3551039, -4526103, -4668230, -4571404, -4785980, -4977148, -5014509, -4966504, -4583799, -3232870, -2552073, -1974916, -780549, -1093527, -945108, -1739766, -2102787, -2601572, -3211863, -4050965, -3713573, -3802284, -3600810, -4261200, -3582841, -3406362, -3964635, -3735678, -4220951, -4366971, -4211829, -4420728, -4728334, -5037675, -5241514, -5952734, -5108064, -4504908, -4472645, -4609710, -3139811, -3121310, -3222115, -3454266, -4463522, -4276431, -4203914, -4508420, -4520140, -4737400, -4249518, -4600516, -4291870, -5175084, -4917666, -4765365, -4622155]
2714d622155o8406J83902m47684l24612K1070J57174o81676M25727M01604r5278K12918
2703d837416l40861J35470J17824l5844k51982M11156k60901Q5134J83951k72930K91541
2692d774858K13036J16586l97373J18285k89271J15110j8443L1502n02719N69637r8598
2681d917106j40895L87222N91235L62388m42942o6889K29000P946m13079j25108j33419
2670d661647R1480j03988M6477r3311K76091M1119m78862M96448J56914j01173l32180
2659d662632p11798K36172j22503M01905n27066K98194j21863J66304o68510J09533O46360
2648d955904L83623p03133N32720j34017m3826l12657J67961K94340K6718j24398Q8078
2637d780495j080131N91748L17044j1560m6437l13294K02431J18004j97362M34192L79019
$$ y = [-4622155, -4690561, -4506659, -4954343, -5278955, -5257885, -5100711, -5782387, -5356660, -4955056, -5050334, -4837416, -5178277, -5042807, -4924983, -4960827, -5212809, -4801653, -5062554, -4977420, -4793469, -5066399, -4774858, -4561822, -4445236, -4842609, -4724324, -5013595, -4898485, -4916928, -4885426, -5388145, -4818508, -4917106, -5058001, -4670779, -4079544, -3717156, -4160098, -4226987, -3997987, -3990041, -4403120, -4528228, -4661647, -4570167, -4674155, -4627678, -4720989, -4444898, -4403779, -4882641, -4386193, -4229279, -4330452, -4662632, -5374430, -5138258, -5260761, -4858856, -5385922, -5087728, -5209591, -5043287, -5711797, -5602264, -4955904, -4572281, -5275414, -4742694, -4876711, -4920537, -5233194, -5065233, -4770893, -4744175, -4868573, -4780495, -5860626, -5268878, -4951834, -4963394, -5009831, -5323125, -5120694, -5002690, -5200052, -4765860, -4386841]
2626d386841m34680k2631l7621m90063l44241J14366Q0139K57179K45343l46051O34895
2615d730206n52231j0967K08821j31512n60678J81219M30398j28594M37030m03620k14752
2604e475092M2756O47307K6103j88734r8733k52034k77885n818L78543J10654K18958J4737
2592d859238j28113K08088K99065o70084L5057L81943J30816l16871m18559j70285k9480
2581e537661M53228l1745N96533K0844J01098j89877m29449k07851K32073K95776l67767
2570e064798L69980m4698j035455L68523l5818K28854P2511l41862M2954J84805K1123
2559e233881L10805j02617k26023P2169Q44595n68300M09925l22111J4597J67330m9923
2548d683434k82148J93997j39598n18826K84853l1486M8210j40800L5207J50489j29913
$$ y = [-4386841, -4821521, -4844152, -4881773, -5371836, -5716077, -5601711, -5521572, -5264393, -5019050, -5365101, -4730206, -5282437, -5293404, -5084583, -5216095, -5776773, -5595554, -5165156, -5293750, -4856720, -5260340, -5475092, -5432336, -4785029, -4758926, -4947660, -5046393, -5298427, -5576312, -5582130, -5203587, -5092933, -4873975, -4859238, -4987351, -4779263, -4480198, -5150282, -5115225, -4733282, -4602466, -4919337, -5337896, -5508181, -5537661, -5084433, -5116178, -4519645, -4498801, -4397703, -4587580, -5017029, -5224880, -4992807, -4697031, -5064798, -4694818, -4739516, -5774971, -5406448, -5442266, -5213412, -5140901, -5482763, -5439809, -5255004, -5233881, -4923076, -5025693, -5251716, -5179547, -4334952, -4903252, -4493327, -4815438, -4800841, -4633511, -4683434, -4965582, -4771585, -4911183, -5430009, -5145156, -5176642, -5128432, -5269232, -5234025, -5083536, -5213449]
2537e213449j76196k34361O29696P404k98933l24281K88843J42890P3346j64811J59480
2526e110372K58171L18596m99888J98472Q3621n380P2130L7591l26011m03891L67292
2515e009669n69848P45053J62275j52994m82248J35268N8989K87384k09098j85923J53406
2504e067405J25271m87074K13116l50229K77362N20392L06031J02308n06588l0045N4394
2493d842467j8114L88004l53375l65433K51573j92176n3309K78329k05700L66728L1603
2482d714337k56285K04855J43297l10640j12172K81336n21647j7236N11684m26314L10392
2471d907067j99177j2799Q91701m60542l88314M40561j06014j09331j22851L47482J92224
2460d434127o73049N34044l59943k29851l95261J54965K25701O13168o2586m80858j4565
$$ y = [-5213449, -5389645, -5624006, -4994310, -4986906, -5285839, -5610120, -5321277, -5178387, -5105041, -5269852, -5110372, -4852201, -4533605, -5033493, -4835021, -4751400, -4756780, -4684650, -4647059, -4973070, -5376961, -5009669, -5579517, -4834464, -4672189, -4825183, -5307431, -5172163, -5113174, -4825790, -5034888, -5220811, -5067405, -4942134, -5429208, -5216092, -5566321, -5288959, -4768567, -4462536, -4360228, -4866816, -4896861, -4842467, -4860581, -4472577, -4825952, -5191385, -4939812, -5131988, -5185297, -4906968, -5112668, -4745940, -4714337, -4970622, -4765767, -4622470, -4933110, -5045282, -4763946, -5285593, -5302829, -4791145, -5217459, -4907067, -5106244, -5119043, -4227342, -4687884, -5076198, -4635637, -4741651, -4850982, -4973833, -4626351, -4434127, -5107176, -4573132, -4933075, -5162926, -5558187, -5403222, -5177521, -4564353, -4626939, -5107797, -5122362]
2449e122362Q0682k72485L65397l73299J46012J03590J62392l94837p1272L94921m369
2438d985630K98729n8784m8064n1978n1560l9258j58090j2918R0139M56712n56669Q5891
2426e031480L41842j72170m43381L20904m0432n2651m24548K79138j34940k11692L75500
2415e193910J7995q5764N32811m64585O90814m19916K02285M31998l3496l17018J15622
2404d523164m81982j29885J19848J25967J21833k54682L28380J89945n07046L52804n09675
2393e167657o3416L4787J02734j10971K41171m3726J6761j21220j27625M97376r8951
2382d840737o56624J41659J59619L74017m24708n825N79624l24889n1424k29527M37139
2371d841676m54900p1201J38594L92410m48790j67860M82205J72696J7996j5167m8242
$$ y = [-5122362, -5041680, -5314165, -4948768, -5322067, -5176055, -5072465, -4910073, -5304910, -5376182, -4981261, -4985630, -4686901, -4745685, -4793749, -4845727, -4897287, -4936545, -5094635, -5107553, -5017414, -4560702, -5117371, -5031480, -4689638, -4861808, -5305189, -4984285, -5024717, -5077368, -5501916, -5222778, -5357718, -5569410, -5193910, -5175915, -5261679, -4728868, -5193453, -4502639, -4922555, -4720270, -4288272, -4321768, -4638786, -4523164, -5005146, -5135031, -5015183, -4889216, -4767383, -5022065, -4693685, -4503740, -5010786, -4657982, -5167657, -5231073, -5196286, -5093552, -5204523, -4963352, -5007078, -4990317, -5111537, -5239162, -4741786, -4840737, -5497361, -5355702, -5196083, -4822066, -5246774, -5252599, -4672975, -4997864, -5049288, -5278815, -4841676, -5296576, -5367777, -5229183, -4836773, -5285563, -5453423, -4971218, -4798522, -4780526, -4795693, -4843935]
2360d843935m42328K49708j81888L43696n46711N39015k9736m39055J29355r1196L37790
2349d975285q1125j04546j81559l976j0570N89806j39446j10290K91396m8716k01533
2338d975844J43510l36707L11285K48879k9185k6099p89597m44531J94709N07725J46942
2327e048913n36723K25759O2572k48347k07933K89985O0355P14028m40654l21962k33918
2316e685751k59785O43308J40011J76461K34924k71786K37492l37826M98856l20532K56160
2305d688468o53970j80270J26592J68326j6744J07780M94541j91576j67328M128j82846
2294e179835N95775q44804L31581K09551q7264j89570K16367K72740j16127p3507j90718
2283e055811L3360J54346Q1253j61591L5517J93748Q3202K06344k87900K88822K58484
$$ y = [-4843935, -5286263, -5036555, -5218443, -4874747, -5421458, -4882443, -4912179, -5351234, -5221879, -5313075, -4975285, -5056410, -5160956, -5342515, -5346491, -5357061, -4767255, -4906701, -5016991, -4725595, -4774311, -4975844, -4832334, -5169041, -4857756, -4608877, -4638062, -4664161, -5453758, -5898289, -5703580, -5195855, -5048913, -5585636, -5359877, -5297305, -5545652, -5753585, -5463600, -5403245, -4689217, -5129871, -5451833, -5685751, -5945536, -5302228, -5162217, -4985756, -4750832, -5022618, -4785126, -5122952, -4624096, -4944628, -4688468, -5342438, -5522708, -5396116, -5227790, -5244534, -5136754, -4642213, -4833789, -5001117, -4996989, -5179835, -4584060, -5428864, -5097283, -4887732, -4974996, -5164566, -4948199, -4675459, -4791586, -4865093, -5055811, -5022451, -4868105, -4786852, -4948443, -4912926, -4719178, -4635976, -4429632, -4717532, -4428710, -4170226]
2272d170226J13295j629049P23381N34821J15600k39736N16662j183486N29150l28919
2262e018507J9945j52869L02808l55930L62645N34059o4022p35730J37035L77444n48106
2251e141228L94928R8784o56783K94763M09398k13483j18490K75060o55129L77141K68300
2240d666739k24921L11230m16270k27529K11753K06474o6461n4236J01797J74208m12383
2229e063077Q09440j261025M99067J20131Q046k10312K03958K6726J65955k52294k33831
2218e187216M90629K15843k99815q8149l64589K26057M1855K8257j12313P9450j86223
2207e156214n36271M16993o5223L13660j28444K87753k26310m51624M4781J34690R1536
2196e274673J75312R20047n56029K17717K549J25587j13365k08403l18741M65355p5998
$$ y = [-4170226, -4056931, -5685980, -4962599, -4427778, -4312178, -4551914, -4035252, -5218738, -4689588, -5018507, -4998562, -5151431, -4848623, -5204553, -4841908, -4307849, -4371871, -5107601, -4970566, -4593122, -5141228, -4746300, -4647516, -5304299, -5009536, -4600138, -4813621, -4932111, -4657051, -5312180, -4935039, -4666739, -4891660, -4580430, -4996700, -5224229, -5012476, -4806002, -4872463, -4926699, -4824902, -4650694, -5063077, -4253637, -5514662, -5015595, -4895464, -4887418, -5097730, -4893772, -4867046, -4701091, -4953385, -5187216, -4696587, -4480744, -4780559, -4868708, -5233297, -5007240, -4965385, -4937128, -5049441, -4969991, -5156214, -5692485, -5275492, -5340715, -5027055, -5155499, -4867746, -5094056, -5545680, -5500899, -5366209, -5274673, -5099361, -4179314, -4735343, -4517626, -4515077, -4389490, -4502855, -4711258, -5029999, -4564644, -4640642]
2185d640642k10604L86643K71570l12725K59403o32635J67191K22348K88510m68949l89
2174d670279n03592R8609O34178m76656J06235o50539K31143O03827K58768k98211K16373
2163d450144k93674j83893L17116K75109J1548l59865m74359K56769p0707L68224N34923
2152d068953n86775k85180m607L6195j98574j22340N92936n4098o4960k14741K44274
2141d726823m09656L45503J21698k96904L28533k30753P92819k59690J16010l69168
2131d588431J450220J085724l11233l94572o50036j99511p29602l291k30778M25039l17034
2120d463505r6965L40677J5361o31424N93420m03842J57279n50009j09853N29439l38727
2109d958149J41870M32026K32434J713498m40948K56792m29264j33468n75599m85049
$$ y = [-4640642, -4851246, -4464603, -4193033, -4505758, -4246355, -4878990, -4711799, -4489451, -4200941, -4669890, -4670279, -5173871, -5075262, -4441084, -4917740, -4811505, -5462044, -5230901, -4627074, -4368306, -4666517, -4450144, -4743818, -4927711, -4610595, -4335486, -4323938, -4683803, -5158162, -4901393, -4972100, -4603876, -4068953, -4655728, -4940908, -4945515, -4909320, -5107894, -5230234, -4637298, -4691396, -4756356, -4971097, -4726823, -5136479, -4790976, -4669278, -4966182, -4637649, -4868402, -4075583, -4335273, -4219263, -4588431, -3138211, -2052487, -2363720, -2758292, -3408328, -3607839, -4337441, -4340732, -4571510, -4146471, -4463505, -4560470, -4219793, -4204432, -4835856, -4242436, -4646278, -4488999, -5039008, -5148861, -4619422, -4958149, -4816279, -4384253, -4151819, -2438321, -2879269, -2622477, -3051741, -3185209, -3760808, -4245857]
2099d245857k19206J40188K76822j160050L04621L53053k53791l15454M16551K8109N66386
2088d108628j63623N7131l4554m66753l37711l56006j0081M72888K61235j85608j76412
2077e048122l98624M75347K72520k57977m57120j71334J48031O43647l56712L05507J70962
2066d673875n01092j24417Q5456N40342K12641o80857K18689l40639M48413R8518P5250
2055d641571l96683L5876O967o8371J20004o1199o6174l00070K1597N53069j08709m15902
2043e321166k72400L45993L30664M180N835j80715K65626J02714k52778L12462m14526
2032e074111J50622J30213k10499M0825q3675L95234j53937M98841m98391J87845k28674
2021d845707l94111K59093m6160m9356j75631j9640q2619K44547M22023K77995j46399
$$ y = [-4245857, -4465063, -4324875, -4048053, -5208103, -4903482, -4550429, -4804220, -5119674, -4703123, -4675014, -4108628, -4272251, -4215120, -4249674, -4716427, -5054138, -5410144, -5420225, -4947337, -4686102, -4871710, -5048122, -5446746, -4971399, -4698879, -4956856, -5413976, -5585310, -5437279, -4793632, -5150344, -4844837, -4673875, -5174967, -5299384, -5213928, -4673586, -4460945, -5141802, -4923113, -5263752, -4815339, -4716821, -4641571, -5038254, -5002378, -4995411, -5063782, -4943778, -5004977, -5071151, -5371221, -5349624, -4796555, -4905264, -5321166, -5593566, -5247573, -4916909, -4912729, -4906894, -5087609, -4821983, -4719269, -4972047, -4659585, -5074111, -4923489, -4793276, -5003775, -4962950, -5046625, -4651391, -4805328, -4306487, -4804878, -4617033, -4845707, -5239818, -4980725, -5026885, -5076241, -5251872, -5271512, -5354131, -5109584, -4687561, -4409566, -4555965]
2010d555965o48127K78812j19771R9374K86282l90824l14525R2913K79016M64620r4912
1999d623107j60830j15985Q4536o87239M68329k8575L52937J43116k68033M37498j65709
1988d563062k13157o65344K07800O7323N85363j93182K9634J7505j79156M1390k4132
1977d889018K73152k23392J88337L4364K22475m04489j63475M75245n89851k81852J95240
1966e163264L12098j65888M36521M98553p76425K16178K44033m07037j95055L34269O8297
1955d597720l12129J046868r02310m54605M08345j62595N91716m33534j00091j51373
1945e067428K58677m8654L60957M0573K07958k59924l55494K5120o6166P53982q28327
1934d978726j17057m4609n3901K44343K2575P3263m58379O72125l05037J69035k59130
$$ y = [-4555965, -5204092, -4925280, -5045051, -4945677, -4659395, -5050219, -5364744, -5271831, -4992815, -4528195, -4623107, -4783937, -4899922, -4815386, -5502625, -5034296, -5062871, -4709934, -4566818, -4834851, -4397353, -4563062, -4776219, -5441563, -5233763, -5166440, -4581077, -4774259, -4744625, -4727120, -4906276, -4864886, -4889018, -4615866, -4839258, -4650921, -4616557, -4394082, -4798571, -4962046, -4486801, -5076652, -5358504, -5163264, -4851166, -5017054, -4580533, -4081980, -4858405, -4642227, -4398194, -4805231, -5000286, -4666017, -4597720, -4909849, -3862981, -4765291, -5219896, -4811551, -4974146, -4382430, -4815964, -4916055, -5067428, -4808751, -4857405, -4496448, -4455875, -4247917, -4507841, -4863335, -4838215, -4904381, -4150399, -4978726, -5095783, -5140392, -5194293, -4949950, -4927375, -4854112, -5312491, -4640366, -4945403, -4776368, -5035498]
1923e035498J13997o00017O30054K43327J75573M32540n5711m03687O0913O2753l48351
1912d724107L33046k91992L07942r07885L98304n48368o41000N06723J2158r8420O69221
1901d984378M91274m5598n13742J15370J03894k72165K04448K73561l17475P07163N2089
1890d185559l20524O4501j95797j59665K93922l6654J10342k76325q0552P255N9535q7625
1878d807146l02642k11454R14038l18520l54303K52615N6150J61146k81125O05224q82900
1867e168917K09084R1146L4931P85089m13940J23256k7027l52956l30383J65867J44756
1856d739094M6814K09211O1988n87858K16908m31618M51208J07353J5983O41134j67933
1845d175904o49908k98655k45644L22644Q083l96637N67696K36214J80758J03952m16810
$$ y = [-5035498, -4921501, -5521518, -4891464, -4648137, -4472564, -4040024, -4095735, -4499422, -4438509, -4375756, -4724107, -4391061, -4683053, -4375111, -5282996, -4884692, -5433060, -6074060, -5567337, -5555179, -5653599, -4984378, -4493104, -4538702, -5052444, -4937074, -4833180, -5105345, -4900897, -4627336, -4944811, -4237648, -4185559, -4506083, -4441582, -4637379, -4797044, -4503122, -4539776, -4429434, -4705759, -4786311, -4779056, -4719521, -4807146, -5109788, -5321242, -4407204, -4725724, -5080027, -4827412, -4771262, -4610116, -4891241, -4286017, -5168917, -4959833, -4868687, -4833756, -4048667, -4462607, -4339351, -4366378, -4719334, -5049717, -4883850, -4739094, -4692280, -4483069, -4421081, -5008939, -4792031, -5223649, -4772441, -4665088, -4649105, -4007971, -4175904, -4825812, -5124467, -5370111, -5047467, -5039384, -5436021, -4868325, -4632111, -4451353, -4347401, -4764211]
1834d764211N98417k22922k84327j45521j13429k45134k14189R26780k11727l14205L97153
1823d593315m87677l34151R81770k63720K34438p42910N44522p96640K98011j72792m8732
1812e381196L63180K8382j68326N65863J71351j84791K10995O136J60645j5847k14720
1801d458328p9520l51299P3222k43700l02936o32537J27045M80488j48321k82649L02218
1790e516317K6399k30242J45668K42694m13332k468K17587J32193q3179J40210J01536
1779e239251M08395P20537o14061R2070N74998r78110R3340k95578N18J81979K12884
1768d842279n01356j03557n1458o55375L84290j63860N26321r600L23913l3101l45682
1757e471744j97065N9519j91254O02296m01738J390455O0897k09349R1382j91891j26594
$$ y = [-4764211, -4165794, -4388716, -4673043, -4818564, -4931993, -5177127, -5391316, -4464536, -4676263, -4990468, -4593315, -5080992, -5415143, -4433373, -4697093, -4462655, -5205565, -4661043, -5457683, -5159672, -5332464, -5381196, -5018016, -4989634, -5157960, -4592097, -4420746, -4605537, -4394542, -4388406, -4227761, -4243608, -4458328, -4537848, -4889147, -4815925, -5059625, -5362561, -5995098, -5868053, -5387565, -5535886, -5818535, -5516317, -5489918, -5720160, -5574492, -5331798, -5745130, -5747598, -5530011, -5397818, -5480997, -5340787, -5239251, -4830856, -4110319, -4724380, -4632310, -4057312, -5035422, -4942082, -5237660, -5237142, -5055163, -4842279, -5343635, -5447192, -5498650, -6154025, -5769735, -5933595, -5407274, -5416874, -5092961, -5126062, -5471744, -5668809, -5609290, -5800544, -5198248, -5599986, -4209531, -4148634, -4357983, -4266601, -4458492, -4585086]
1746d585086j93535l61463J89840j39790K4112R4693k63207Q681n15674L88064j09004
1735e462369Q13774n97627M41743O97233m76371k81944M95667n85315O33595P24430
1725c597184K217884L660401l55562N33885j104146j530405j086061r05545o44897o66557
1715c478187n28351n14927o67760n99067l70928M28660K02771P54855M0589o2195J79239
1704d615301j02107l6514r3184O7917L36788O80721J945742N820546L752557L4609N22358
1693H314132m507650j566948j816117j115574j150558j148021j730101m96390q77196
1684f094423j164845P48355J68441Q85865j37147K92804l12249K62035N3775L21030m84332
1673e460691J24843K38687k01502J171043K953201Q32231N77598l17084j432337k94512
$$ y = [-4585086, -4778621, -5140084, -4950244, -5090034, -5065922, -4971229, -5234436, -5225755, -5741429, -5353365, -5462369, -4648595, -5246222, -4804479, -4107246, -4583617, -4865561, -4369894, -4955209, -4321614, -3597184, -1379300, 2281101, 1925539, 2459424, 1355278, -175127, -1261188, -2166733, -2811630, -3478187, -4006538, -4521465, -5189225, -5788292, -6159220, -5730560, -5527789, -4772934, -4732345, -4794540, -4615301, -4717408, -4753922, -4847106, -4779189, -4442401, -3761680, -1815938, 4004608, 7757165, 7791774, 8314132, 3806482, 2239534, 423417, -692157, -1842715, -2990736, -4720837, -5217227, -6094423, -7259268, -6510913, -6342472, -5456607, -5593754, -5300950, -5613199, -5351164, -5297389, -4976359, -5460691, -5335848, -5097161, -5298663, -4127620, -1174419, -342188, 235410, -81674, -1514011, -1808523]
1663a808523m57414j426784j60626q33845p51791l74388j058747n73640J227869j06991
1653f324880M47282N7323P78694m70897L64234r08515L84322O26616r356O08413N34990
1642c911774l39367L7132O35321k84482J68964Q558J157r7966j100208Q15456L3016N14348
1630c519845j935048m86224K07419M51845J077562j166809k17903j91445j99559O23516
1620e356491M00381L63104Q61082J484060M92978k8754l00369n3321k08544n44265Q6964
1609b803175o73605j086175r9768o96013P31607O50437R27219J865784m67763J446368
1599b05084O48980m7857o71334L17504j076722N09395O11722j25099o7268m24338L39856
1588a90245k77180j885106J91356m76756p70164o51838k366123j996422j742937j734618
$$ y = [-1808523, -2265937, -3692721, -3853347, -4687192, -5438983, -5813371, -6872118, -7445758, -6217889, -6324880, -5877598, -5820275, -5041581, -5512478, -5148244, -6056759, -5672437, -5045821, -5055177, -4446764, -3911774, -4251141, -4214009, -3578688, -3863170, -3694206, -3685648, -3684491, -3782457, -4882665, -4067209, -4034193, -3519845, -5454893, -5941117, -5733698, -5281853, -4204291, -5371100, -5589003, -5780448, -5980007, -5356491, -4956110, -4593006, -3731924, -2247864, -1754886, -1783640, -2084009, -2137330, -2345874, -2890139, -2803175, -3476780, -4562955, -4662723, -5358736, -4627129, -3976692, -3049473, -1183689, -1651452, -205084, 443896, 396039, -275295, 42209, -1034513, -525118, 86604, -38495, -105763, -530101, -190245, -467425, -2352531, -2161175, -2637931, -3408095, -4059933, -6426056, -8422478, -10165415, -11900033]
1578a1900033O38772J932893J66816L009036k50543j846258K749203K18558k119989R65444
1568f436101K42535n20910o36611n0857j287848N85882J379439J640557l12869J607018
1558c789765m72524M95461R27344j428059k725041l39582p6641k94173K615117R71656
1548d116207l31937J76935j746029j061210K533963M84716k343631k84138j444969q49699
1538h982206j609593K32801J615798K714035K471742K035126M15223J801218l589486
1529b895342L876816j595858J485196J33173j885847o21429k187536j878451k43460
1520e812738l779033j74559l862808L624366M749113L902755M226843K929724n589043
1511B14620J053304l541579L090306L487165Q200247J367418R916716M875586J2809701
$$ y = [-11900033, -11261261, -9328368, -9161552, -6152516, -6403059, -8249317, -5500114, -5281556, -7401545, -6436101, -6193566, -6714476, -7351087, -7401944, -8689792, -8103910, -6724471, -5083914, -5396783, -3789765, -4262289, -3766828, -2839484, -4267543, -6992584, -7332166, -7408807, -7702980, -5087863, -4116207, -4448144, -4271209, -6017238, -7078448, -4544485, -4059769, -6403400, -6687538, -8132507, -8982206, -10591799, -10358998, -8743200, -6029165, -3557423, -1522297, -1107074, 694144, -2895342, 981474, -614384, 870812, 1003985, -881862, -1503291, -3690827, -5569278, -5812738, -9591771, -9766330, -13629138, -10004772, -5255659, -1352904, 2873939, 5803663, 214620, 1267924, -2273655, 816651, 4303816, 12504063, 13871481, 23788197, 28663783, 41473484]
1502D1473484R679595J6502944K1510509M1935411J14147468M80053899L26011797
1495A051315107l0168084R5343346m33459199j43692760j78976358j21596645n3213348
1488A85552059k8665999n946102k372702p038488k0413179j2539825j3509997j3814344
1480H1251423j1847344Q58142j0275390J9590066N338504L2402564J4842426L4977037
1472A67137428M5949650R3224963L44740849J272723058n3501357K77209056l02804521
1465A844679126o54426153k25668554l43478773j68707634r3539906m4645735k1673497
1458B92538874k1109332k1507899l8057963j1956814l1100854k6568602k6615404j5645563
1450I9976443j1502901J014722J160192J0279459O215491J7011279J6589643O3489235
$$ y = [41473484, 51153079, 67656023, 89166532, 131101943, 245249411, 725303310, 1051315107, 1021147023, 1116490369, 683031170, 539338410, 360362052, 238765407, 185552059, 156886060, 150939958, 148567256, 141528768, 121115589, 108575764, 95065767, 81251423, 69404079, 70262221, 59986831, 79576897, 84915401, 117317965, 132160391, 167137428, 213087078, 306312041, 651052890, 1923775948, 1870274591, 2147483647, 1844679126, 1190252973, 964584419, 621105646, 452398012, 358858106, 314212371, 292538874, 271429542, 249921643, 211863680, 199906866, 168806012, 142237410, 115622006, 99976443, 88473542, 89488264, 90648456, 100927915, 107143406, 124154685, 140744328, 204233563]
1442B04233563K81198309N27699669q3086104J98177018l47720067k08719319j49786400
1435D21996669j37894138p1189283l6089686k1191557j2942108j2577100j4721760
1428A15391037j5115996n615872j1489910j0711794j2312918o059856j2533522j646114
1420C9905055n690653J28864m95969j098693o367316K4220o691235p83511o155492j601528
1410A1173742n030312l991714L93135J147643l242782M057598o142234M476628q16448
1401B025256K761319M32097Q25046J544705J012731R65726j141709l403345O54415j742671
1391C933570K284521P77703k647018j518204M03762k039798P55383J627050J184043k94307
1381D466705r34591j617692j451355q811K05112k000503K417248q87994K520133J142252
$$ y = [204233563, 485431872, 1013131541, 930045437, 1128222455, 780502388, 571783069, 421996669, 284102531, 212913248, 176823562, 155632005, 142689897, 130112797, 115391037, 100275041, 94659169, 83169259, 72457465, 60144547, 54084691, 41551169, 39905055, 34214402, 34343266, 33847297, 32748604, 26381288, 26405508, 19714273, 18930762, 12775270, 11173742, 6143430, 2151716, 2544851, 3692494, 449712, 4507310, -1634924, 2841704, 2025256, 4786575, 5218672, 6043718, 7588423, 8601154, 9566880, 8425171, 5021826, 5676241, 3933570, 6218091, 6995794, 4348776, 2830572, 3234334, 1194536, 1949919, 3576969, 4761012, 4466705, 3532114, 1914422, 463067, 454256, 659368, -1341135, 1076113, 188119, 2708252, 3850504]
1371C850504q97123j60544o84737P48204j596535o76562O38520q21435J430730M26593
1361B257615l107047K289361k8835J461909K438926J040342O36513k49322k889209k162296
1351A687957j011552j181593o95466q38577j330492r9367L7280l9463O93740P38950
1341b038583J543551L83263j814741J50367j232833N81985N10516J92843j189534J635862
1331a277304N82751O02154J01681Q0327k65019p44052j533565q21679j549450O292N92621
1320d225243p30301J36362k22985K56825J51124J098594J785044K59874n3401l76455
1310a920562j188567M94988N74456j1149k39898k32332l65215j90379j72384p24998P5015
1299c901025l27910r16455l44938L58539l98827R96321l68024J023694m27367O0672l2182
$$ y = [3850504, 2953381, 2792837, 2108100, 2856304, 1259769, 583207, 1221727, 400292, 1831022, 2257615, -849432, 1439929, 1411094, 2873003, 5311929, 6352271, 6988784, 6739462, 3850253, 1687957, 676405, -505188, -1200654, -2039231, -3369723, -3469090, -3431810, -3471273, -2777533, -2038583, -495032, -111769, -1926510, -1776143, -3008976, -2426991, -1916475, -1723632, -2913166, -1277304, -694553, -92399, 9282, 89609, -175410, -919462, -2453027, -3274706, -4824156, -4817864, -4225243, -4955544, -4819182, -5042167, -4785342, -4634218, -3535624, -1750580, -1490706, -1544107, -1920562, -3109129, -2614141, -2039685, -2050834, -2290732, -2523064, -2888279, -3078658, -3251042, -3976040, -3901025, -4228935, -5145390, -5490328, -5131789, -5530616, -4534295, -4902319, -3878625, -4305992, -4245320, -4277502]
1288d277502K8294N76855L68138m2971j69642k02241m15184J138528N38034J009948k98692
1277a746435M1662l53763j286999m11551m80143o69611L97542l14743M85195j12342M34887
1266d016301J483786L356926J414196P7910n24200j822200m25732j065563J50909r38071
1256b308340j09970K30814l2375N4147O67262J664398j037160k39771o26871j250360
1246b988226r18224j088731M16131q6412K41946m2957n42552J133345L142276P656773
1236F923369j470346L435993n798711k017129j345125j508741j77010L1757K9003j081396
1226b978336M81700L41687J43354K13163k88090l45144q65394l16677o90723K5757l92634
1215d671337n55581m62455j92783K81200P77671K770605J840073M58803J476062k620632
$$ y = [-4277502, -4249208, -3672353, -3304215, -3347186, -3516828, -3719069, -4134253, -2995725, -2457691, -1447743, -1746435, -1704773, -2058536, -3345535, -3757086, -4237229, -4906840, -4509298, -4824041, -4338846, -4451188, -4016301, -2532515, 824411, 2238607, 2316517, 1792317, -29883, -455615, -1521178, -1370269, -2308340, -2418310, -2187496, -2219871, -2165724, -1498462, 165936, -871224, -1110995, -1737866, -2988226, -3906450, -4995181, -4579050, -4665462, -4423516, -4466473, -5009025, -3875680, -733404, 6923369, 5453023, 8889016, 3090305, 1073176, -271949, -1780690, -1957700, -1925943, -1896940, -2978336, -2496636, -2154949, -2011595, -1798432, -2086522, -2431666, -3297060, -3613737, -4304460, -4278703, -4671337, -5226918, -5689373, -5882156, -5600956, -4823285, -2052680, -212607, 246196, 1722258, -898374]
1205h98374j234283n02545r85765j65104m11154N42628K31405k79639M39294l55493L90424
1194c228606p28182j27890j54749m60588L12765j59664j22747k01681L6350j95416k09698
1183e240106M42034M48168l1511L44605j34600M4406p936L3047j61726j84309M38123
1172d009805j04212N3652K20J67640j030044K32268L626R6892j82369n9279L7675J47154
1160d646582n06529n07077J70117K22247J65877P33668l95746O74734J60743k84743K01978
1149d011313L8077m8495j99084O2526k43078K71119l27858k4116J94713j53410k15501
1138d656420K96248O14484p32493Q0714L56483j44856n14107k65740j48948j34861k3908
1127e273404J34565M77890K9660J0981n55429L87390L03769K18828j48653J40712k88613
$$ y = [-898374, -2132657, -2635202, -3620967, -3786071, -4197225, -3654597, -3423192, -3702831, -3263537, -3619030, -3228606, -3956788, -4084678, -4239427, -4700015, -4387250, -4546914, -4669661, -4871342, -4834992, -5030408, -5240106, -4798072, -4349904, -4381415, -4036810, -4171410, -4127004, -4134940, -4101893, -4263619, -4447928, -4009805, -4114017, -4060365, -4060145, -3892505, -4922549, -4690281, -4686655, -4589763, -4772132, -4831411, -4793736, -4646582, -5153111, -5660188, -5490071, -5267824, -5101947, -4368279, -4764025, -4089291, -3928548, -4213291, -4011313, -3973236, -4021731, -4220815, -4158289, -4401367, -4130248, -4458106, -4482222, -4287509, -4440919, -4656420, -4360172, -3745688, -4478181, -4397467, -4040984, -4185840, -4699947, -4965687, -5114635, -5249496, -5273404, -5138839, -4660949, -4631289, -4620308, -5175737, -4788347, -4484578, -4265750, -4414403, -4273691, -4562304]
1116d562304p612j1789l72557L379M83539n6762J12019N78498o27507Q5569o7172k83966
1104d726665N13736m36292n42960k1952K78319k34948Q67739m27270R5655M3579l00295
1093d891354J24969J30050K50699K65871j77203L48190o93956Q6313j5804L18750n20467
1082d773942J48444l26298N0562Q908L96939k3470K26749m23463L4435k50200K63464
1071d667872J70953k35381j85731j64564J53585L53317K27352n9109N86385n46925j10204
1060d478194j78707J68764Q9955N295L7419j80212o9785n77324Q92975M283k57937P7440
1048d466028k399J47341K39505j82863k99849K67943m9353n14898L95221K48917j84711
1037d401174r9935k12530J1989l80464J12497M37924j05135Q94299n84608J1228M71331
$$ y = [-4562304, -4569916, -4581705, -4954262, -4950883, -4467344, -4524106, -4412087, -3833589, -4461096, -4375527, -4442699, -4726665, -4212929, -4649221, -5192181, -5214133, -4935814, -5170762, -4303023, -4730293, -4634638, -4591059, -4891354, -4766385, -4636335, -4385636, -4119765, -4296968, -3948778, -4642734, -4556421, -4572225, -4253475, -4773942, -4625498, -4951796, -4901234, -4892326, -4495387, -4518857, -4292108, -4715571, -4681136, -4931336, -4667872, -4496919, -4732300, -4918031, -5082595, -4929010, -4575693, -4348341, -4407450, -3821065, -4367990, -4478194, -4656901, -4488137, -4398182, -4392887, -4355468, -4535680, -4605465, -5182789, -4289814, -4285531, -4543468, -4466028, -4468427, -4321086, -4081581, -4264444, -4564293, -4296350, -4345703, -4860601, -4465380, -4216463, -4401174, -4501109, -4713639, -4701650, -5082114, -4969617, -4531693, -4636828, -3742529, -4327137, -4315909, -3844578]
1026c844578l50410l71134m53732P9844p20965j58683N70797J46430L14085n04576J56175
1015e136747M5512N4135K45951Q2360m01429j24123L97149m78691L92105j1352P11716
1004d223414r2235n08261J09561l05727J74008j61944N8917L95266K63652n57053k42896
993e090126M31732j090549l5519O59532N2063Q48563o85589l15748l53066R51214n44490
982e171983M12137J1159o4778O8158J71073m38575L11303l9305j59049q9194N0399l07835
970e246490P7802J45772l1560o05196J246810j44004j9273k79515L74608j67479J35841
959d512684N5353p7529k13192k75683R935m13812K15684J13018K68822k46235K5538p8920
947e129705o323J11082O68373k97060M55748n17682k63414k72623J02057O48636l38199
$$ y = [-3844578, -4194988, -4566122, -5019854, -4940010, -5660975, -5819658, -5248861, -5102431, -4788346, -5292922, -5136747, -5091235, -5037100, -4791149, -4708789, -5110218, -5234341, -4837192, -5315883, -4923778, -4935130, -4223414, -4315649, -4823910, -4714349, -5020076, -4846068, -5008012, -4949095, -4553829, -4290177, -4847230, -5090126, -4658394, -5748943, -5784462, -5124930, -5072867, -4224304, -4909893, -5225641, -5578707, -4627493, -5171983, -4759846, -4748687, -4813465, -4745307, -4574234, -5012809, -4701506, -4740811, -4899860, -4989054, -4938655, -5246490, -5168688, -5022916, -5054476, -5659672, -4412862, -4556866, -4576139, -4855654, -4481046, -4648525, -4512684, -4457331, -4534860, -4748052, -5023735, -5013800, -5427612, -5211928, -5098910, -4830088, -5076323, -5050785, -5129705, -5136028, -5024946, -4356573, -4653633, -4197885, -4715567, -4978981, -5251604, -5149547, -4500911, -4839110]
936d839110Q3960m3114L69647j82309k67354n05594j07266K73913j21609L77691k21402
925e182547m8492J50332R26010o41310J41600n67351N06617K20845m68053Q02629r34477
914e094197N29378j0670o03261K72828k082O06763J17542q3475n19081j73231k92124
903e251610j79022M23047K08758j35720l64050l03428L6509K82240Q7545J36451N82480
892d476800N0281l31300o6475J92885K93908k50165m46770J96175l36567Q9051J66250
881d919527m63999J98360L44164N87033j396247O32098P22706l20063n25061q3972J14505
870e110003j56786q343L92364j68376n7035K7373o56440L59043O80164M05346k05859
859d498552J72606l48586m8676k04130k3689O3355R8328L80494m87681k57277N94245
$$ y = [-4839110, -4755150, -4798264, -4428617, -4610926, -4878280, -5383874, -5491140, -5217227, -5338836, -4961145, -5182547, -5231039, -5080707, -4154697, -4796007, -4654407, -5221758, -4715141, -4494296, -4962349, -4159720, -5094197, -4564819, -4575489, -5178750, -4905922, -4908004, -4301241, -4183699, -4267174, -4786255, -4959486, -5251610, -5430632, -5007585, -4798827, -4934547, -5298597, -5602025, -5565516, -5283276, -5195731, -5059280, -4476800, -4426519, -4757819, -4824294, -4631409, -4337501, -4587666, -5034436, -4838261, -5174828, -5085777, -4919527, -5383526, -5185166, -4841002, -4253969, -5650216, -5018118, -4295412, -4615475, -5140536, -5224508, -5110003, -5266789, -5275132, -4882768, -5051144, -5108179, -5080806, -5737246, -5378203, -4698039, -4292693, -4498552, -4325946, -4674532, -4723208, -4927338, -4951027, -4887672, -4789344, -4408850, -4896531, -5153808, -4559563]
848d559563o37919K07074M8261K51050n17576K84706k78192L41367j3824J96723K05291
837d472602p07624n70715L53645N62043N4226m45644k12763M42857R4881m1746J12141
826d831301l15210K30756K77211J52085k59392j95028K44047m81855N16948o67035N2415
815e276359J34348l90161o5888L47803J65054K21833n99838N23543k68344j40360Q0030
804e268339K80378Q5319K54416l94175m00587L12372L82755N2231k51690N22966m23517
793d847871M05288p24133L1589L44192l72369K38796J7103j32413P3119k95276k88025
782e550000P69445k4461j15846j38993q4633J03045M13060n37610j32261o23894L22767
771e599381J58824O7986m6536N18933q8424m35130K18236J6141j06545l06504K43751m3593
$$ y = [-4559563, -5197482, -4990408, -4942147, -4691097, -5208673, -4923967, -5202159, -4860792, -4874616, -4677893, -4472602, -5180226, -5750941, -5397296, -4835253, -4781027, -5226671, -5439434, -4996577, -4901696, -4943442, -4831301, -5146511, -4915755, -4638544, -4486459, -4745851, -4940879, -4696832, -5178687, -4661739, -5328774, -5276359, -5142011, -5532172, -5598060, -5250257, -5085203, -4863370, -5463208, -4939665, -5208009, -5348369, -5268339, -4987961, -4902642, -4648226, -5042401, -5442988, -5130616, -4747861, -4695630, -4947320, -4424354, -4847871, -4442583, -5166716, -5135127, -4790935, -5163304, -4924508, -4907405, -5039818, -4966699, -5261975, -5550000, -4780555, -4805016, -4920862, -5059855, -5144488, -5041443, -4628383, -5165993, -5298254, -5922148, -5599381, -5440557, -5372571, -5419107, -4900174, -4988598, -5423728, -5205492, -5189351, -5295896, -5602400, -5358649, -5402242]
759e402242q3566L64632k61753l79579K11444M88689k40061K54099k12075k3170k94936
748e578518K21159J27174q7527j36294J61829o62470j00016N46836j78320N83851J67973
737d934323L59931q930K05619k44186q1115M42426m53784L00170n34977j09928k4236r6038
725e179371j01276K15293Q2762o85166J03131L91000j76476k04939K16286L1267K20656
714e086833j69058k34564Q6127L70400j05869M19151J01814J55205l08567m63388J80734
703e054848L51282j32002O77834J83128m51501K466l16812l48646K41358M36462k40822
692d652101k4265J14040o18843j44799N23277l29324j52441j21845L0669N6035k36884
681e556481M64119K30052k50703J71707l81770M57091M41069o86932L60962P5467m05330
$$ y = [-5402242, -5485808, -5121176, -5382929, -5762508, -5551064, -5062375, -5302436, -5048337, -5260412, -5283582, -5578518, -5357359, -5230185, -5317712, -5454006, -5292177, -5954647, -6054663, -5507827, -5686147, -5102296, -4934323, -4574392, -4583322, -4377703, -4621889, -4703004, -4260578, -4714362, -4414192, -4949169, -5059097, -5083333, -5179371, -5280647, -5065354, -4982592, -5667758, -5564627, -5173627, -5350103, -5555042, -5338756, -5307489, -5086833, -5255891, -5490455, -5404328, -5033928, -5139797, -4720646, -4618832, -4463627, -4772194, -5235582, -5054848, -4703566, -4835568, -4157734, -3974606, -4426107, -4423641, -4740453, -5089099, -4847741, -4411279, -4652101, -4676366, -4562326, -5181169, -5325968, -4802691, -5132015, -5284456, -5406301, -5375632, -5319597, -5556481, -5092362, -4862310, -5113013, -4941306, -5323076, -4865985, -4424916, -5111848, -4750886, -4675419, -5080749]
670e080749O42257p08786l17848L93331J14969N64487j020004J1987q2696J36848J56164
659e190040K95292k34350l83389Q8884j8992j61399K87936N9168Q7474O7871J17538n37656
647e521663p73900j38365n44378K076260J975031k571944J865240j925763p5780J33009
637e502253N03852J68217M44006n7534r7279m29055N72420L4069k22365L47289k40099
626d478732Q1773l12313j950324q33003L371224o08951j363017J199217m85639J52479
616e227286P2767K45856l50086j63803p15P06092K86908m91987L700J84907o29438K08202
604e154883P01157n06085O7708k35242j19355J90400q13235O8738N47174P16274m44247
593d981596J33591j85419p4393K05387j29063k71272l27825Q12309L28915K26137m65423
$$ y = [-5080749, -4438492, -5147278, -5465126, -5071795, -4956826, -4392339, -5412343, -5400356, -5483052, -5346204, -5190040, -4894748, -5129098, -5512487, -5423603, -5442595, -5603994, -5316058, -5256890, -5169416, -5101545, -4984007, -5521663, -6295563, -6433928, -6978306, -4902046, -2927015, -5498959, -3633719, -5559482, -5635262, -5502253, -4998401, -4830184, -4386178, -4443712, -4540991, -4970046, -4397626, -4363557, -4585922, -4238633, -4478732, -4396959, -4709272, -6659596, -7492599, -4121375, -4730326, -6093343, -4894126, -5379765, -5227286, -5154519, -4908663, -5258749, -5422552, -5423267, -4717175, -4430267, -4922254, -4918554, -4733647, -5363085, -5154883, -4453726, -4959811, -4892103, -5127345, -5246700, -5056300, -5869535, -5800797, -5253623, -4537349, -4981596, -4848005, -5033424, -5107817, -4902430, -5031493, -5302765, -5630590, -4818281, -4489366, -4263229, -4728652]
582d728652k51184m3386K11580J82078J6225l1130j61385L15039o59363j0701K01808O5503
570d893568j66522J0615j37834J63856N27207j58683J07507o10637j41287P25815j03281
559d676812l82421N793M9571K85499K37139O6829l26317j09940J0999l1599l35703j30776
547e337738k101J70900J15876J09149L6172k31216N0432J43427m26749J32495L17529
536d921824N32169l07897j5754n17857M51523M366k71630M08834L61232j5121m21660
525d713619m83905j13988K51452J83849N7662l74064j91233M32065O17792n74706k10199
514e118894M19760k03790j01278K56110j43122k41136K23358J4658J11163p73978R116
503e548033M80341J34986J17060J2524k22056l14514j96852M15254l43766J1842K91500
$$ y = [-4728652, -4979836, -5023222, -4811642, -4629564, -4613339, -4644469, -4805854, -4490815, -5150178, -5160879, -4959071, -4893568, -5060090, -5049475, -5187309, -5023453, -4496246, -4654929, -4547422, -5158059, -5299346, -4573531, -4676812, -5059233, -5053440, -5003869, -4718370, -4481231, -4414402, -4740719, -4850659, -4839660, -4871259, -5206962, -5337738, -5339839, -5168939, -5053063, -4943914, -4907742, -5138958, -5088526, -4945099, -5371848, -5239353, -4921824, -4389655, -4697552, -4713306, -5231163, -4779640, -4775274, -5046904, -4638070, -4276838, -4291959, -4713619, -5197524, -5311512, -5060060, -4876211, -4818549, -5192613, -5383846, -4951781, -4333989, -4908695, -5118894, -4699134, -4902924, -5004202, -4748092, -4891214, -5132350, -4908992, -4894334, -4783171, -5557149, -5548033, -5067692, -4932706, -4815646, -4803122, -5025178, -5339692, -5536544, -5121290, -5465056, -5453214, -5161714]
492e161714N35356l01455p60114P61283k18045L9975k45730k32468l0096p3825K85970
481e400863P4836M08983m00854K13811M07178l27124j85888J67642m93448J90231M95409
470d850087L5153L45320l81303j23045j51450l89267N81233l35214M34689j68771J02397
459d900345n74541L34879K19077L01487n64059M61821n10705M60545N43443p22976m81638
448e433012J00316K4138N76158k36901k87675p119O38372k76547k17291n4021n79920
437e753502M09077L42225m07728K15455k37853n21463Q27296l91386k16026L11332M92941
426d929632j48078M02793j36648J32939P1233n94506M28609N8875p1027k29213o1558
415e076213j67039J55899L9453L4229J55020o15030O26771q08045M51806M10173l86118
$$ y = [-5161714, -4626358, -4927813, -5687927, -4926644, -5144689, -5104714, -5350444, -5582912, -5613008, -5686833, -5400863, -5326027, -4917044, -5317898, -5104087, -4696909, -5024033, -5209921, -5042279, -5535727, -5345496, -4850087, -4814934, -4469614, -4850917, -4973962, -5125412, -5514679, -4933446, -5268660, -4833971, -5002742, -4900345, -5474886, -5140007, -4920930, -4619443, -5183502, -4721681, -5232386, -4771841, -4228398, -4951374, -5433012, -5332696, -5308558, -4732400, -4969301, -5256976, -5264095, -4625723, -4902270, -5119561, -5173582, -5753502, -5344425, -5002200, -5409928, -5194473, -5432326, -5953789, -5126493, -5517879, -5733905, -5422573, -4929632, -5077710, -4674917, -4811565, -4678626, -4607393, -5201899, -4773290, -4714415, -4785442, -5014655, -5076213, -5243252, -5087353, -5047900, -5013671, -4858651, -5473681, -4846910, -5654955, -5203149, -4792976, -5179094]
404e179094Q2168M3549m84959K94608L75936N1620J33844l75210j60795M61311r53556
393e710578P84068n14471j12213L66919m23896L11449M10353M05337p56921r1801j01417
382e433171l35466M37008l51622N31798o32536N85038J9176l54599O53019L31587j6255
371d566023m42590M2491K46463j14699k15100R5364j15837k39676N21845k74705j54525
360e216992R46055m85869r72801L49198P9873o37950O04826Q305J64552j5220L60841
349d815182m32418M60248O2306j01286p4721k95247J10573N2978r2895M27965N86822
338d110857l90573k71052j09126k1492M06441r1742K63862k72028p0513n70852k30057
327e467989K08496K52940J76093k92991O9792L12316n27753k3683R7081p0013l42481
$$ y = [-5179094, -5096926, -5053377, -5538336, -5243728, -4867792, -4816172, -4682328, -5057538, -5218333, -4757022, -5710578, -4926510, -5440981, -5553194, -5186275, -5610171, -5298722, -4888369, -4483032, -5239953, -5331754, -5433171, -5768637, -5331629, -5683251, -5151453, -5783989, -5198951, -5179775, -5534374, -4881355, -4549768, -4566023, -5008613, -4966122, -4719659, -4834358, -5049458, -4954094, -5069931, -5309607, -4787762, -5062467, -5216992, -4270937, -4756806, -5729607, -5380409, -5300536, -5938486, -5333660, -5325355, -5160803, -5176023, -4815182, -5247600, -4787352, -4725046, -4826332, -4901053, -5196300, -5085727, -5032749, -5125644, -4697679, -4110857, -4501430, -4772482, -4881608, -4903100, -4496659, -4588401, -4324539, -4596567, -4667080, -5237932, -5467989, -5259493, -5006553, -4830460, -5123451, -5053659, -4741343, -5269096, -5292779, -5195698, -5265711, -5608192]
316e608192Q12218j3419k6877j81307o6630k93100L71495Q3343K05285k83810N809m1698
304e036883M09806o24926L3223J45197N20708p4583L2527k34198j83234P9040K31586r6990
292d798727J18500j2203j82022K8632N29095O4404j255285o65N78909R2736j33265L98667
280d571224k41774n20147K19192j42011M57503l81938j76115J06435K30611M47036m98516
269e070948l48623L07567K67495k51879M15530J45990r5351k85588j49222k9553J82359
258d912223L41486q4567m53425k62120L64184j43981j10269L45971j78815N24700k35142
247d804201J27446q8207o22715K85736L36045P0884n2373n56177M37891k32726L79780
236d718617j27442J36940l27987J77133L54200m36435J81735K5914k55871L53146k07697
$$ y = [-5608192, -4795974, -4809393, -4836270, -5017577, -5084207, -5377307, -5005812, -4922469, -4717184, -5000994, -4995185, -5036883, -4627077, -5252003, -5218780, -5073583, -4552875, -4627458, -4594931, -4829129, -5012363, -4933323, -4701737, -4798727, -4680227, -4692430, -4874452, -4845820, -4316725, -4252321, -5507606, -5508271, -4929362, -4836626, -4969891, -4571224, -4812998, -5333145, -5113953, -5255964, -4798461, -5180399, -5356514, -5250079, -5019468, -4572432, -5070948, -5419571, -5112004, -4844509, -5096388, -4680858, -4534868, -4630219, -4915807, -5065029, -5094582, -4912223, -4570737, -4655304, -5108729, -5370849, -5006665, -5150646, -5260915, -4914944, -5093759, -4569059, -4804201, -4676755, -4764962, -5387677, -5101941, -4765896, -4695012, -4747385, -5303562, -4865671, -5098397, -4718617, -4846059, -4709119, -5037106, -4859973, -4505773, -4942208, -4760473, -4734559, -4990430, -4637284, -4844981]
225d844981l05997K93393n20868J92113j47308N52365q2715o3930J50549m87998j63064
214e428441M23112p8655L70078k86573J16502l33958L5398M54836N51312m08657J27827
203d457219l40224K12939k54004R3982k19530k20449r1241J40243l35409L50911M197Q0210
191e035594J31485j72819M48261j9240o6649k82755L24639J12320m65279k4746K63857
180d786520k44913k12919m1923K77786N62467n02117K05027r2020J32849J9154j11931
169d795060m8694K84209K2785j77457J83292k54421M87226l35782k56320j5939J76217
158d729944R8182m32448k2717O3856K1601Q7563m92768O01666q3482o22j74343J98975
146d864481j90508j15430p8410N05230m13116l0560k74398O08651j93574J75185q0723
$$ y = [-4844981, -5150978, -4857585, -5378453, -5186340, -5333648, -4781283, -4863998, -4927928, -4777379, -5265377, -5428441, -5005329, -5083984, -4713906, -5000479, -4883977, -5217935, -5182537, -4727701, -4176389, -4585046, -4457219, -4797443, -4584504, -4838508, -4744526, -4964056, -5184505, -5275746, -5135503, -5470912, -5120001, -5115804, -5035594, -4904109, -5076928, -4628667, -4647907, -4714556, -4997311, -4672672, -4560352, -5025631, -5050377, -4786520, -5031433, -5244352, -5286275, -5008489, -4446022, -4948139, -4743112, -4835132, -4702283, -4683129, -4795060, -4843754, -4559545, -4536760, -4714217, -4530925, -4785346, -4298120, -4633902, -4890222, -4906161, -4729944, -4631762, -5064210, -5086927, -5023071, -5001470, -4913907, -5406675, -4805009, -4888491, -4889113, -5063456, -4864481, -5054989, -5170419, -5248829, -4743599, -5156715, -5187275, -5461673, -4853022, -5046596, -4871411, -4952134]
135d952134l39314M6896L14444J01810M6463L39847k38953n9764J06604n94125O3652
124e164574J54207N16331K1728j48353l68877l13442P20866l19070L81281L0245J36477
113d353181j53623o04107L16592j17034J01111L77543P2908k25665l80672j37039L50313
102d752854o986j12001J01820P0976l18521J48567j25941j02000N43684j80342k00962
91d934560j2359j5228k32020j16737j58558N90712L17854k68761j73046R9496m19524P8915
79e243816p5041j36870O57231n4867n8061q2699K93781L9590p18594N27421K04036n66019
67e213908K67722O42619k21084m7827n13569J10113k50030R90714n76149l04055N79457
56d535997k87837n31418m07850O94576K61911J31577o3563l84005M94969K1661l12519
$$ y = [-4952134, -5291448, -5244552, -4930108, -4828298, -4781835, -4441988, -4680941, -4740705, -4634101, -5228226, -5164574, -5010367, -4494036, -4472308, -4620661, -4989538, -5302980, -4582114, -4901184, -4519903, -4489658, -4353181, -4506804, -5110911, -4794319, -4911353, -4810242, -4432699, -4359791, -4585456, -4966128, -5103167, -4752854, -4759840, -4871841, -4770021, -4699045, -5017566, -4868999, -4994940, -5096940, -4553256, -4733598, -4934560, -4946919, -4962147, -5194167, -5310904, -5469462, -4878750, -4560896, -4829657, -5002703, -4903207, -5322731, -5243816, -5318857, -5455727, -4798496, -4853363, -4911424, -4994123, -4700342, -4660752, -5379346, -4851925, -4647889, -5213908, -4946186, -4303567, -4524651, -4572478, -5086047, -4975934, -5225964, -4235250, -4811399, -5115454, -4535997, -4823834, -5355252, -5763102, -5068526, -4806615, -4675038, -4738601, -5122606, -4627637, -4605976, -4918495]
45d918495l21761k12860J80700k42077K77760K86051j05289J76150o7749K86756l96608
34e057422L12483m99608j54668j8673K31229J86739N7836l61509J67945L76027N0336
23d709285j28258R0207K21543p58997r1267K28263L74973j35533l14487j1505l42110
12e576456N20110N8556m57687M27182o0663M66491n56866O8701m1708L89406k66891n39159
0e568984J64133N44725N26530J99143j48436l37002m57027L78595k50367M405q6670J68213
-12d862742m87071j41972K45311r8283j50343M55177M16561k88317J47466j93592l19823
-23e277628j48666L6530M78400J50294l91640J33696k00470J17702j83775m83814M50910
-34e318461N59104J24398j95710j51962J13499K81940n78522k33385M96541K15374Q9941
$$ y = [-4918495, -5240256, -5453116, -5272416, -5514493, -5236733, -4950682, -5055971, -4879821, -4947570, -4660814, -5057422, -4744939, -5244547, -5399215, -5417888, -5186659, -4999920, -4942084, -5303593, -5135648, -4759621, -4709285, -4837543, -4747336, -4525793, -5284790, -5376057, -5147794, -4772821, -4908354, -5222841, -5234346, -5576456, -5056346, -4997790, -5455477, -5028295, -5088958, -4622467, -5179333, -5110632, -5152340, -4762934, -5029825, -5568984, -5404851, -4860126, -4333596, -4134453, -4282889, -4619891, -5076918, -4698323, -4948690, -4944285, -5030955, -4862742, -5349813, -5491785, -5246474, -5344757, -5495100, -5039923, -4623362, -4911679, -4764213, -4957805, -5277628, -5426294, -5389764, -4911364, -4761070, -5152710, -5019014, -5219484, -5101782, -5285557, -5769371, -5318461, -4759357, -4634959, -4830669, -4982631, -4869132, -4587192, -5165714, -5399099, -4902558, -4687184, -4597243]
-45d597243n33388K87716J65619j12579L7148o27782O6032q939o8205N2736N37218l03400
-57e105067K51700J49096q6888k50224j23176M37913m31364N07283m15488o83869Q46421
-68d903663n3940O0205k02359O15417m29820l12727N21549p5083l72492J23143j16624
-79e146394L26027j5384k55149l36143M11106k22677j10406L43870j72808J59468P387
-90e011103l4812r9018n1229M38425L78833r62745P30115k63273m24551m70805P55309
-101e014854m04460K04947O95325O6646L8024l36190j36306l50299N70850p5820L22742
-112d419395l35664j76260k400j40436J92775R2709k12233M02337j41148M50377o68402
-123d957740J89631k02696J84608M02018k88969k69365j14954J27705J71511k46732K98770
$$ y = [-4597243, -5130631, -4842915, -4677296, -4789875, -4752727, -5380509, -5314477, -5323416, -5391621, -5338885, -4801667, -5105067, -4853367, -4704271, -4791159, -5041383, -5164559, -4726646, -5158010, -4650727, -5066215, -5750084, -4903663, -4957603, -4897398, -5099757, -4484340, -4914160, -5226887, -4705338, -4780421, -5152913, -5029770, -5146394, -4820367, -4835751, -5090900, -5427043, -5015937, -5238614, -5349020, -5005150, -5177958, -5018490, -5011103, -5045915, -5144933, -5196162, -4757737, -4378904, -5341649, -4611534, -4874807, -5299358, -5770163, -5014854, -5419314, -5214367, -4519042, -4452396, -4414372, -4750562, -4886868, -5237167, -4666317, -4742137, -4419395, -4755059, -4931319, -4933719, -5074155, -4881380, -4788671, -5000904, -4598567, -4739715, -4289338, -4957740, -4768109, -4970805, -4786197, -4384179, -4673148, -4942513, -5057467, -4929762, -4758251, -5004983, -4706213]
-134d706213k75776j26784M48574j99589J9451k36649l33086M64257K4310J88922q9080
-145d821663n58218L61813k77864P59092k90516l28994P8955l0909K31985j5883J04157
-156d788045O564j27573m41513K76183M04782k42449L04728r25106M91684K14730K37972
-167d588043q7823m57163j6785l9551k09325l19524J43528L03939Q0931l0349K20504
-178d999661J70012n1989l57172L64227J49916n43657O16377l32494j23488K4239j07758
-189e191448q0784l68265j18824N12031l11529J56636K61392J98426k07660K12664L29533
-200d607828l9318l94546p1999J56427L17460n51779L05521l569K91343l06469K1214p1229
-212d954772J20101q0335J83639J52350j57255k72547R127P4510j75242N86385o65679K930
$$ y = [-4706213, -4981989, -5108773, -4660199, -4859788, -4840337, -5076986, -5410072, -4945815, -4921505, -4732583, -4821663, -5379881, -5018068, -5295932, -4536840, -4827356, -5156350, -5077395, -5108304, -4876319, -4892202, -4788045, -4781481, -4909054, -5350567, -5074384, -4669602, -4912051, -4607323, -5532429, -5040745, -4826015, -4588043, -4675866, -5133029, -5149814, -5189365, -5398690, -5718214, -5574686, -5270747, -5189816, -5220165, -4999661, -4829649, -4881638, -5238810, -4874583, -4724667, -5268324, -4651947, -4984441, -5107929, -5083690, -5191448, -5272232, -5640497, -5759321, -5247290, -5558819, -5402183, -5140791, -4942365, -5150025, -4937361, -4607828, -4647146, -5041692, -5113691, -4957264, -4639804, -5191583, -4886062, -4889631, -4598288, -4904757, -4883543, -4954772, -4834671, -4915006, -4731367, -4579017, -4736272, -5008819, -4999692, -4925182, -5100424, -4514039, -5179718, -5176788]
-224e176788P3903O7099R3314K73478m82461n72172M11116r8765M66740J09910n54142
-235e388768N0656L0390L75237j20637L17485k0552Q230l68238P4886k28999M88936k71107
-247e052481m29545N7746L78196m11295P01088r63502K40322M37793o4893l24940R8311
-258e333200j88458l55368M62489k7277L52163M1703l67274r2725J45860N67770j52882
-269d947199L41125k74072j68630K03856k34901p1068j36682L97530j32364k36931J9196
-280e240140L40137j29937L30332o05006O41060m3454K78458p44344j0610J18129Q2568
-291d982807M71249p25632l64984L59999J43862p63398M94514O20508L23995m55847J29302
-302d749239m99594L13177k90036k38905P26232k58253k62995K08433r5581O0724n50242
$$ y = [-5176788, -5102885, -5035786, -4942472, -4668994, -5151455, -5723627, -5312511, -5411276, -4944536, -4834626, -5388768, -5338112, -5307722, -4932485, -5053122, -4735637, -4756189, -4747959, -5116197, -5041311, -5270310, -4781374, -5052481, -5482026, -5424280, -5046084, -5457379, -4756291, -5719793, -5479471, -5041678, -5106571, -5431511, -5333200, -5521658, -5877026, -5414537, -5441814, -5089651, -5047948, -5415222, -5507947, -5362087, -4794317, -4947199, -4606074, -4880146, -5048776, -4844920, -5079821, -5150889, -5287571, -4890041, -5022405, -5259336, -5240140, -4900003, -5029940, -4699608, -5304614, -4663554, -4707008, -4428550, -5172894, -5183504, -5065375, -4982807, -4511558, -5237190, -5602174, -5242175, -5098313, -5861711, -5367197, -4746689, -4422694, -4878541, -4749239, -5248833, -4935656, -5225692, -5464597, -4738365, -4996618, -5259613, -5051180, -5146761, -5086037, -5636279]
-313e636279M71230M041L42159M1355o3701k55704j58334K25411l03472L0197N04456J3221
-325d785420l08975J96405J9433J41808m66718m38587L21778J02975L36195k57972o09328
-336e748406R09561j48756n53902K61185j55590j13686K57416K87213K80952l22747L27355
-347d719405p5351L12998l34504m0158k78467M99911n26507O45190m83476J2918m69689
-358e456540m3113N06546o63326K50183j24951j9837M54779K63857l40975j92086Q190
-369e357273p6287L45854k8309k33450o0024j52745J30437O18772Q0611q7863n0795p1297
-381d942369J30699j99918Q1279K29791O6314o97789K39362J540J46451O7587l74077
-392e251130l11086L63276J80282o4415o8557J85709N3868k1286k6140n99508L70420
$$ y = [-5636279, -5165049, -5161008, -4818849, -4777494, -4841195, -5096899, -5255233, -5029822, -5333294, -5303097, -4798641, -4785420, -5094395, -4897990, -4878557, -4736749, -5203467, -5642054, -5320276, -5217301, -4881106, -5139078, -5748406, -4838845, -4987601, -5541503, -5280318, -5435908, -5549594, -5292178, -5004965, -4724013, -5046760, -4719405, -4794756, -4481758, -4816262, -4856420, -5134887, -4634976, -5161483, -4516293, -4999769, -4986851, -5456540, -5499653, -4993107, -5656433, -5406250, -5531201, -5551038, -5096259, -4832402, -5173377, -5365463, -5357273, -5433560, -5087706, -5116015, -5349465, -5409489, -5562234, -5431797, -4813025, -4732414, -4820277, -4871072, -4942369, -4811670, -5011588, -4930309, -4700518, -4634204, -5331993, -5092631, -5091091, -4944640, -4877053, -5251130, -5562216, -5198940, -5018658, -5083073, -5151630, -4965921, -4912053, -4933339, -4959479, -5558987, -5188567]
-403e188567K53913j1880L5334J48571k503j8765j26693l89986K48034M47658m18297p7701
-415e100882k69092J35002J28523j44242K01299M4448r6844O33728n35310l91931K37321
-426e157980r1647l33581M85305J30911M7833O1373j20173m7939p05869P68483l92998
-437e356282j30291M78878j27656J65935l68916j61781L97724p1049L23183j86733j31457
-448e168445M25612J43540L1616j95790j65332l18621K49545m25321J18319L06215L0842
-459d967820p10566L42072J25015m09800m8119N31895K43672K26371n28931R3214Q5973
-470e017024J96119K0177q1892j2091q3051j79530J67511Q8477o1672l421M05891m49919
-482e010425L17747p466n60140l24401R20519P143l92019m31042M07505p1744M5997m7276
$$ y = [-5188567, -4934654, -4946534, -4911200, -4762629, -4765132, -4783897, -4910590, -5300576, -5052542, -4604884, -5023181, -5100882, -5369974, -5234972, -5106449, -5250691, -5049392, -5004944, -5101788, -4468060, -5003370, -5395301, -5157980, -5249627, -5583208, -5097903, -4966992, -4919159, -4857786, -4977959, -5025898, -5731767, -4963284, -5356282, -5486573, -5007695, -5135351, -4969416, -5338332, -5500113, -5102389, -5173438, -4850255, -5036988, -5168445, -4742833, -4599293, -4567677, -4763467, -4928799, -5247420, -4997875, -5423196, -5304877, -4998662, -4967820, -5678386, -5336314, -5211299, -5621099, -5669218, -5137323, -4893651, -4667280, -5196211, -5102997, -5017024, -4820905, -4800728, -4882620, -4894711, -4977762, -5157292, -4989781, -4901304, -4962976, -4966397, -4560506, -5010425, -4692678, -4700144, -5260284, -5584685, -4664166, -4657023, -5049042, -5480084, -5072579, -5144323, -5098326, -5145602]
-494e145602J01626m50034K65401o7200m4552M93199j22089n22673M94244J26322n36520
-505e407878L47253O8699Q0142K73465k47730n2531J27785J81790j10209p9365J71067
-516d647512n60120N4499N78005m06812O43800l57094k6924K71813M115l52922p6351
-527d875503L41957m24482m46755j58348N37762m75953N69722J21214p44427K92131K7054
-538e235628L52646L28148q43491n6904K80392m31757J63379J19872Q01795n35774j01792
-549e159114M64624n69817J01120K72195l23354J6750L45566k02457N25262n42992o21793
-560e694010K50010L21037L927K76904k91384q9284l83907J55471J95713j01282L82917
-571d973888j29815k5145j72642j05946j22685L35329M86028n845Q9996j72882k78538
$$ y = [-5145602, -5043976, -5494010, -5228609, -5295809, -5340361, -4847162, -4969251, -5491924, -4997680, -4871358, -5407878, -5060625, -4991926, -4911784, -4638319, -4886049, -4938580, -4810795, -4629005, -4739214, -4818579, -4647512, -5207632, -5153133, -4575128, -4981940, -4338140, -4695234, -4722158, -4450345, -4446230, -4799152, -4875503, -4533546, -4958028, -5404783, -5563131, -5025369, -5501322, -4931600, -4810386, -5554813, -5262682, -5235628, -4882982, -4554834, -5398325, -5455229, -5174837, -5606594, -5443215, -5323343, -4521548, -5057322, -5159114, -4694490, -5264307, -5163187, -4890992, -5214346, -5197596, -4852030, -5054487, -4529225, -5072217, -5694010, -5444000, -5122963, -5119036, -4842132, -5133516, -5222800, -5606707, -5451236, -5255523, -5356805, -4973888, -5103703, -5128848, -5301490, -5407436, -5530121, -5194792, -4708764, -4714609, -4624613, -4797495, -5076033]
-582e076033M9969K0721k83670J6301K12268l63034J19189J46223r978j20536k63825
-593e552405K86539N83811p16536K21248k09073m8423J79083J25433l65596o5039K62977
-604e297981M20869o04521K28672L37766Q5612n16206K77462o8375K30986J45323j15770
-615d876163l11343O5240m94804l26576M55167L61681o3125K25776l14271j1554K49257
-626e040715j27597m3357M4559k69763j50512M88903K62305l11111k13458j37730k09954
-637e708430M58727M53011q95698O50108J17606l35124O792M52252k1483k00688L4778
-648d988149n41236Q890O20700J53231k47284N01917o83579l1442k779j61781L63869
-659e007643k94725M83225k25443n9219p2101k44993K40904L14240n59044M43973o99218
$$ y = [-5076033, -5026064, -5005343, -5289013, -5272712, -5060444, -5423478, -5304289, -5158066, -5168044, -5288580, -5552405, -5265866, -4682055, -5398591, -5177343, -5386416, -5434839, -5255756, -5130323, -5495919, -5560958, -5297981, -4877112, -5481633, -5252961, -4915195, -4829583, -5345789, -5068327, -5136702, -4905716, -4760393, -4876163, -5187506, -5122266, -5617070, -5943646, -5488479, -5126798, -5189923, -4964147, -5278418, -5289972, -5040715, -5168312, -5211669, -5167110, -5436873, -5587385, -5098482, -4836177, -5147288, -5360746, -5498476, -5708430, -5249703, -4796692, -5692390, -5042282, -4924676, -5259800, -5253008, -4800756, -4822239, -5022927, -4988149, -5529385, -5520495, -4899795, -4746564, -4993848, -4491931, -5175510, -5206952, -5209731, -5371512, -5007643, -5302368, -4819143, -5044586, -5103805, -5175906, -5420899, -5179995, -4865755, -5424799, -4980826, -5680044]
-670e680044R93487K89869o15322j4806N86009q51236L26079m90696O07537j28213o3408
-681e040744l3986l71623L63986n76728L286O01421l23852j48109l3029P03732k88989
-692e144635k6488K49119j22662n79003M9395l2619L66394J86175N35014J78809m29956
-703d770457l93677j539L12110l58039Q8481o9862J16513k46931l2527K04566K10414
-714d940948o33059M43167j88368K68383J23358m66923l0628O7701M60478l02600M15836
-725d783603l16257N0916N1322O5299j36921j52784N09425m37824j15735L00637p4361
-736e039886k54807l0935k55283L18138l42444p464k91127P715N96306M22003l83926p0511
-748e332221M43782k02499j2438J73292M2193L5537m35973p03008P89788K49597L43596
$$ y = [-5680044, -4686557, -4396688, -5012010, -5026816, -4440807, -5292043, -4965964, -5456660, -4849123, -4977336, -5040744, -5074730, -5446353, -5082367, -5659095, -5655809, -5054388, -5378240, -5526349, -5559378, -4855646, -5144635, -5171123, -4922004, -5044666, -5623669, -5574274, -5606893, -5240499, -5054324, -4519310, -4340501, -4770457, -5164134, -5165673, -4853563, -5211602, -5123121, -5192983, -5076470, -5323401, -5355928, -5151362, -4940948, -5574007, -5130840, -5319208, -5050825, -4927467, -5394390, -5425018, -5357317, -4896839, -5199439, -4783603, -5099860, -5048944, -4997622, -4932323, -5069244, -5222028, -4712603, -5150427, -5266162, -4965525, -5039886, -5294693, -5325628, -5580911, -5262773, -5605217, -5612681, -5903808, -5896093, -5299787, -4877784, -5261710, -5332221, -4888439, -5090938, -5103376, -4930084, -4887891, -4852354, -5288327, -5991335, -5201547, -4951950, -4608354]
-759d608354m22853n9432k02745L9878m11933N42774l92439L80904k34454K76753O02768
-770d489133n73577K07775p27180j3374L77492k92232O2811J10218M67176n14492O40944
-781d743572k19300L69070n61245J27821j03979K16275m30223N00927l35818L39576o25596
-792e466064O81294j07163j58237l70253M58613O9033m38326m845m1484K56384Q2422
-803e038626j15852m6311J56465n56243K55568l16348O62123L26194l28724K15903p40021
-814e525872k41254O36110o71687L02928l7645j49690P21250j69068L38082Q33290m63931
-825d427487o10746o49875O37270j52762j64262k61115O95444k22311k34957M68459j52060
-836e074402l96042J94519j94078K41896K73118m45036K2894K2337j81405k34788M00666
$$ y = [-4608354, -5031207, -5090639, -5293384, -5253506, -5665439, -5122665, -5515104, -5134200, -5368654, -5091901, -4489133, -5062710, -4854935, -5582115, -5595489, -5217997, -5510229, -5447418, -5337200, -4870024, -5384516, -4743572, -4962872, -4593802, -5155047, -5027226, -5131205, -4914930, -5345153, -4844226, -5180044, -4840468, -5466064, -4784770, -4891933, -5050170, -5420423, -4961810, -4892777, -5331103, -5335948, -5377432, -5121048, -5038626, -5154478, -5200789, -5044324, -5600567, -5344999, -5661347, -4999224, -4673030, -5001754, -4785851, -5525872, -5767126, -5131016, -5802703, -5499775, -5537420, -5687110, -4965860, -5134928, -4796846, -3963556, -4427487, -5038233, -5688108, -5050838, -5203600, -5367862, -5628977, -4933533, -5155844, -5390801, -4922342, -5074402, -5470444, -5275925, -5470003, -5228107, -4954989, -5400025, -5377131, -5354794, -5536199, -5770987, -5370321]
-847e370321J688126j476764m12937Q02175l45307L2798q3450m7455k80579p425M14433
-858e086706J0635N28480m52212K13903k6393j72777J46k96429J84962M39675j39890q0866
-870d877472k09728m46448K25812K57500m84923K95890J37494L12484P3730m84349K78098
-881d921912l22327J72450p02940O32871l27381r9143K33195K45941n528j49190l8210
-892e282174r8639M49058k0475J52974n91492N57070j50282j1672j58765M5218R0829
-903e018350J56408j13223n72646L11702o5204l75572O11631k74481m7326k81256L75065
-914e293252l1868m71272N66385L40556J59097n10558j98193J019183r30286M36252o6475
-925d980431l30639o0546N71556r7286K56602n70151L50187R3230l02042n95185J81302
$$ y = [-5370321, -3682195, -5158959, -5571896, -4769721, -5115028, -5082230, -5165680, -5213135, -5493714, -5501139, -5086706, -5076071, -4547591, -4999803, -4785900, -4812293, -4985070, -4984924, -5281353, -5096391, -4656716, -4796606, -4877472, -5087200, -5533648, -5307836, -5050336, -5535259, -5239369, -5101875, -4789391, -4715661, -5200010, -4921912, -5244239, -5071789, -5774729, -5141858, -5469239, -5568382, -5335187, -5089246, -5094774, -5243964, -5282174, -5380813, -4931755, -4952230, -4799256, -5390748, -4833678, -4983960, -4995632, -5154397, -5109179, -5018350, -4861942, -4975165, -5547811, -5236109, -5301313, -5676885, -5065254, -5339735, -5387061, -5668317, -5293252, -5325120, -5796392, -5230007, -4889451, -4730354, -5240912, -5439105, -4419922, -5350208, -4913956, -4980431, -5311070, -5371616, -4800060, -4897346, -4640744, -5210895, -4860708, -4767478, -5069520, -5664705, -5483403]
-936e483403N42955p25726M62628J87640o38687l9776N72794N31621j11055J80129o51515
-947e172395j92242L72446m06323K17865K84767M1545j94432J22694l75063J89054n12591
-958e624675L49868o9817J57646j20345m08007N77904J44549K04445L65740l93236k2452
-969d838380J2228o49164K31770j10166k97737O01857P6289j65491l07887P0045M43784
-980d932852M75271k85778m54627m2230N52738q0338R8277n54895K97204k43444m6188
-991e216862K97986j38496n89637L68054n12546k1348O0928M88414K0893n02383l55083
-1002f100080R54935l29354J77979M28873j43476R7061J60947k32494L28394n03706K61329
-1013d899592J14127m34791n10537N30590L82227j76773j79001M1494K33267n09037M04989
$$ y = [-5483403, -4940448, -5666174, -5203546, -5015906, -5654593, -5694369, -5121575, -4589954, -4701009, -4520880, -5172395, -5364637, -4992191, -5398514, -5180649, -4895882, -4854337, -5048769, -4926075, -5301138, -5112084, -5624675, -5274807, -5344624, -5186978, -5307323, -5715330, -5137426, -4992877, -4788432, -4422692, -4815928, -4838380, -4826152, -5475316, -5243546, -5353712, -5651449, -5049592, -4973303, -5138794, -5446681, -5376636, -4932852, -4457581, -4743359, -5197986, -5240216, -4687478, -4767816, -4669539, -5224434, -4927230, -5170674, -5216862, -4918876, -5057372, -5647009, -5278955, -5791501, -5812849, -5751921, -5263507, -5242614, -5744997, -6100080, -5145145, -5474499, -5296520, -4867647, -5011123, -4914062, -4753115, -4985609, -4657215, -5160921, -4899592, -4785465, -5220256, -5730793, -5200203, -4817976, -4994749, -5173750, -5132256, -4898989, -5408026, -5003037]
-1024e003037p9237j40561M25090l84266k78561p6686j67541M43729j57043K5044j28123
-1035e521192n38680M08382O11597l63391k4614L20724l63429J09800J44923m17716M75405
-1046e158191J19030L34788k67236K98203j51297n58137L00588m2400Q1157N54707J67192
-1057d321596j066747k57925J07717j63754J004062k18762l41004m1405L13080n70806j388
-1068e558528P12296p15461M02088K31356M02337n74454P0175l16953J59752m50953M63860
-1079e174485j06515K9576k00989M38813k29269L19067L28627k94476K51596q63874L03152
-1090e198777K98650K68306n89683J1866k11984N88953m01125J83050L1758K87692k95447
-1101e026741l08673M53542j50914k8307l28796J0112J7819J67839q0188j69393L58529
$$ y = [-5003037, -5082274, -5222835, -4797745, -5182011, -5460572, -5537258, -5704799, -5261070, -5418113, -5393069, -5521192, -6059872, -5651490, -5039893, -5403284, -5427898, -5107174, -5470603, -5360803, -5215880, -5633596, -5158191, -5039161, -4704373, -4971609, -4673406, -4824703, -5382840, -5082252, -5124652, -5043495, -4488788, -4321596, -5388343, -5646268, -5538551, -5702305, -4698243, -4917005, -5258009, -5299414, -4986334, -5557140, -5558528, -4846232, -5561693, -5159605, -4928249, -4525912, -5100366, -5030191, -5347144, -5187392, -5638345, -5174485, -5281000, -5251424, -5452413, -5013600, -5242869, -4923802, -4595175, -4889651, -4638055, -5501929, -5198777, -4900127, -4631821, -5221504, -5209638, -5421622, -4832669, -5233794, -5050744, -5018986, -4731294, -5026741, -5335414, -4881872, -5032786, -5061093, -5389889, -5379777, -5361958, -5194119, -5274307, -5443700, -5085171]
-1112e085171j2605Q5895K39898j76610K22224n87234K92447o2605L14525n84711o1637
-1123e415584N07003l96035m35897N85868J73846k21476O32041n87032j20455O95317
-1133d582404n13029O1403K24579J5251n12351J87727O3077R2754l84503L44586J09189
-1144d893721L77405j01781l82355p04512R49515o16411n55905Q67392J15085l31146n5809
-1155e332243o8842L46800k74857L08906o35017N98156k30405J35094J86294p6290l60291
-1166e402695J08368K0319M25787k90980j34136m71831M58249o1331M98934j170335M48486
-1177e571165K7302Q0642p0902m9367K33774K96182j20624K76610j07587m10524L3577
-1188e382082j3659L20183k5273p2178k64612J33920k5650l83951J1120K76349j20923
$$ y = [-5085171, -5097776, -5011881, -4771983, -4948593, -4726369, -5313603, -5021156, -5083761, -4769236, -5353947, -5415584, -4908581, -5304616, -5740513, -5154645, -4980799, -5202275, -4570234, -5157266, -5277721, -4582404, -5095433, -5034030, -4809451, -4794200, -5306551, -5118824, -5055747, -4962993, -5347496, -5002910, -4893721, -4516316, -4618097, -5000452, -5704964, -4755449, -5371860, -5927765, -5060373, -4945288, -5276434, -5332243, -5401085, -5054285, -5329142, -5020236, -5655253, -5057097, -5287502, -5152408, -4966114, -5042404, -5402695, -5294327, -5274008, -4848221, -5139201, -5273337, -5745168, -5286919, -5348250, -4849316, -6019651, -5571165, -5543863, -5463221, -5534123, -5583490, -5349716, -5053534, -5174158, -4897548, -5005135, -5415659, -5382082, -5395741, -5075558, -5100831, -5173009, -5437621, -5303701, -5329351, -5713302, -5702182, -5425833, -5546756]
-1199e546756J88455P7147l40927J39656k70588M61105k1646L11943K02985j13624J96356
-1210d715894k72192N7346p08048P86797l67795M14303J63008l98217K27510p56552j01717
-1221e671451J046399J37513o86157K84142k3850m89231J81699m05759O39580J43364
-1231d843751j28176M55325m27579J42258k55833j31251J97766k3896J86345J15634k64323
-1242d977481k54144M42963k92472L31156J60102k23066Q6913m29100N31131J2153l45077
-1253d956922j51463J35693O6469l81875j4054M6218M13481o63755K18008l30841P09995
-1264d909046l80911j38148K84457K64724k45136J5099M4824l6799o2751N10319m39529
-1275e092897K19158m13381N01555l10942k51633M10749j63148k41954k01748J00380q2033
$$ y = [-5546756, -5358301, -5281154, -5622081, -5482425, -5753013, -5291908, -5313554, -5001611, -4798626, -4912250, -4715894, -4988086, -4930740, -5638788, -4851991, -5219786, -4805483, -4642475, -5040692, -4813182, -5569734, -5671451, -4625052, -4487539, -5173696, -4889554, -4913404, -5402635, -5220936, -5626695, -4987115, -4843751, -4971927, -4516602, -4944181, -4801923, -5057756, -5189007, -4991241, -5015137, -4828792, -4713158, -4977481, -5231625, -4788662, -5081134, -4749978, -4589876, -4812942, -4726029, -5155129, -4623998, -4611845, -4956922, -5108385, -4972692, -4906223, -5288098, -5302152, -5255934, -4842453, -5506208, -5288200, -5619041, -4909046, -5289957, -5428105, -5143648, -4878924, -5124060, -5108961, -5064137, -5100936, -5163687, -4653368, -5092897, -4873739, -5287120, -4785565, -5096507, -5348140, -4937391, -5100539, -5342493, -5544241, -5443861, -5525894]
-1286e525894J84198L54542l14385l11142M36326M18452l16647j31054L96957k14943P5661
-1297d947929m29476k33077J17893R00185m39555K57159p01711J38489j16396K30185
-1307e224233k20745L83298j50036k02268L55309j01409O2992L04212l49604K01531P9792
-1318d861161o32107M3643M7263L95361j58229k47365K28915k29250j15660N2396J15650
-1329e360544K7371O9900L57168l15195k83300k14487J49847K63672l929j83337L18931
-1340e173903N1849R2799k15300J93231J73450k08819J9795J07302j31421m43176m27550
-1351e961743L55306K05236R62802m62081m86469M19302m13172M77291k38369P306j00028
-1362e234619K55427k63637N02661m34830Q9303k64144M1425j02379j69671K20888l0082
$$ y = [-5525894, -5341696, -4987154, -5301539, -5612681, -5176355, -4757903, -5074550, -5205604, -4808647, -5023590, -4947929, -5377405, -5610482, -5492589, -4592404, -5031959, -4774800, -5476511, -5338022, -5454418, -5224233, -5444978, -5061680, -5211716, -5413984, -5058675, -5160084, -5097092, -4792880, -5142484, -4940953, -4861161, -5493268, -5449625, -5402362, -5007001, -5165230, -5412595, -5183680, -5412930, -5528590, -5476194, -5360544, -5333173, -5263273, -4906105, -5221300, -5504600, -5719087, -5569240, -5305568, -5309497, -5492834, -5173903, -5122054, -5029255, -5244555, -5051324, -4877874, -5086693, -5066898, -4959596, -5091017, -5534193, -5961743, -5606437, -5401201, -4438399, -4900480, -5386949, -4967647, -5380819, -4903528, -5141897, -5134591, -5234619, -4979192, -5242829, -4740168, -5174998, -5085695, -5349839, -5308414, -5410793, -5580464, -5359576, -5389658]
-1373e389658o88979M65219K4898P38769k59164J09K54998K13094o06490K86039P3144
-1384d888021k55974N77756m74201O5333l80180j23192j11963K34140K35262k6641k32173
-1395e379854N1231k43417N20249l26326L58950L27863J04823n914k31952l37246J4258
-1406e147335L27325P5115n0153l98404k39964k1313M1631j73082J66928k17780l6327
-1417e673359P25071k4673o23995N66634p6370K13820m33626K30135K38512m44729L32007
-1428d970573n95919L6347k0459O03964K55701k33806r7147j68314j90880M4083l51950
-1439e688953J02547J47492K8722m06602L03702O3120J98205J84138l16922K11316l08207
-1450e481442L20247k02363N35468m6728o98353L92903r3849n1223k69535Q11143L7782
$$ y = [-5389658, -6078637, -5613418, -5588520, -4849751, -5108915, -5108806, -4853808, -4640714, -5247204, -4961165, -4888021, -5143995, -4566239, -5040440, -4975107, -5355287, -5478479, -5590442, -5356302, -5121040, -5147681, -5379854, -5328623, -5572040, -5051791, -5378117, -5019167, -4691304, -4586481, -4592395, -4824347, -5161593, -5147335, -4820010, -4744895, -4795048, -5193452, -5433416, -5454729, -5413098, -5586180, -5419252, -5637032, -5673359, -4948288, -4972961, -5596956, -5030322, -5106692, -4892872, -5326498, -5096363, -4857851, -5302580, -4970573, -5566492, -5530145, -5550604, -4946640, -4690939, -4924745, -5021892, -5190206, -5381086, -5337003, -5688953, -5586406, -5438914, -5410192, -5816794, -5513092, -5449972, -5251767, -5067629, -5384551, -5173235, -5481442, -5161195, -5363558, -4828090, -4874818, -5573171, -5180268, -5274117, -5325340, -5594875, -4783732, -4745950]
-1461d745950n67944J0670M24637p07695J1968J5761L35574R8850N1734J99656M1799J9471
-1473d811469l91567L92291j36246m49163P29727l71944k26271J9033k9721J3678O87941
-1484d573711n82974j51310J49381l3783j91361L63326K13397j80594L99476l77778n21954
-1495e487885K66984P51O05382k97815k767L04444m95747p63338Q29006l38828m54833
-1506e834646P67740j103190N24992N00841n82316o7928J073698o20592j71346k93526
-1516e806273L06904O5061M29509k53932J18702l619j14278L38539m14496Q5041k81643
-1527e530485k4313M26294M22135m74285J25759k51221O2726M01595o83939l35523J99321
-1538e661936L73408k3753k41432L81296r2014J04740r09363j04781K58558N58380L62692
$$ y = [-4745950, -5313894, -5303224, -4878587, -5586282, -5574314, -5558553, -5222979, -5124129, -5072395, -4872739, -4830940, -4811469, -5203036, -4810745, -4946991, -5396154, -4666427, -5038371, -5264642, -5245609, -5275330, -5261652, -4573711, -5156685, -5307995, -5158614, -5192397, -5383758, -5020432, -4807035, -4987629, -4588153, -4965931, -5487885, -5220901, -5220150, -4614768, -4912583, -4915350, -4610906, -5106653, -5869991, -5040985, -5379813, -5834646, -5066906, -6170096, -5645104, -5144263, -5726579, -5794507, -4720809, -5341401, -5512747, -5806273, -5499369, -5434308, -5004799, -5258731, -5140029, -5143648, -5257926, -4919387, -5333883, -5248842, -5530485, -5554798, -5128504, -4706369, -5180654, -5054895, -5306116, -5243390, -4841795, -5525734, -5861257, -5661936, -5288528, -5312281, -5553713, -5172417, -5264431, -5159691, -6069054, -6173835, -5915277, -5356897, -4994205]
-1549d994205k77363k41108K0490L39578r7894K50415l11017M83812k31853j69706j86962
-1560e415813K93899L73192m60313J2218K97039n48101K1400J38960J46365k19858n08140
-1571e869152J55687L19884K02819l6105K74049p9715l45460N2492j56131N40357m26669
-1582e367944K32982l01292J0286j77938L60350Q3357N8204n7908k69902J89926L2005
-1593e207874L35558n43133O09175l04224j43178k68892l5007L91555N14352k50103l79560
-1604e281331M55711m21064l40011K40646j92211J7252J12339n1199L49587j02210P9650
-1615e132841J019654j032698L86933l10858K3600k91492N49000l04879J44951j4356
-1625d962986j25227K66544j63700L8583J44170j57005n62881O41793N0979n57165M01371
$$ y = [-4994205, -5271568, -5512676, -5492186, -5152608, -5250502, -5000087, -5311104, -4827292, -5059145, -5228851, -5415813, -5121914, -4748722, -5209035, -5196817, -4899778, -5447879, -5426479, -5287519, -5141154, -5361012, -5869152, -5713465, -5393581, -5190762, -5226867, -4952818, -5032533, -5377993, -5325501, -5481632, -4941275, -5367944, -5134962, -5436254, -5425968, -5603906, -5243556, -5160199, -5101995, -5159903, -5429805, -5239879, -5207874, -4872316, -5415449, -4806274, -5110498, -5253676, -5522568, -5557575, -5166020, -4651668, -4901771, -5281331, -4825620, -5246684, -5586695, -5346049, -5538260, -5521008, -5408669, -5459868, -5110281, -5212491, -5132841, -4113187, -5145885, -4758952, -5069810, -5046210, -5337702, -4788702, -5093581, -4948630, -4962986, -5088213, -4821669, -4985369, -4946786, -4802616, -4959621, -5522502, -4880709, -4829730, -5386895, -4985524]
-1636d985524K21463l12976m6731n50601L66528N70200j68672J9278J38650k70603p2878
-1647e091866q9579N8111M0537K70382l38072N95526N28673p98087n95734K43538N5745
-1658e120826K02141k71231M28271m86063k14219K63263J27233k82182n39630L68915
-1668e524328L10352l6030n78090M27882J15747L31014k94274j76757k91765M62459p8143
-1679e331933O5554L76274k46528L33901L35826p75707O07032o88650J86813k07434M30719
-1690d914133K40796l65892j98561K72850l4140m03546L99110j93566m43323N59673n1373
-1701e132105n14709M64781J0625j61117N51326m56412k61695J52426L12147m12260N66739
-1712d880254M2810M48172o63210k66967m97961Q13246k72009m45758k219L98458J01429
$$ y = [-4985524, -4764061, -5077037, -5123768, -5674369, -5307841, -4737641, -4906313, -4887035, -4748385, -5018988, -5091866, -5181445, -5123334, -5082797, -4812415, -5150487, -4554961, -4026288, -4824375, -5420109, -5176571, -5120826, -4918685, -5189916, -4761645, -5247708, -5461927, -5198664, -5071431, -5353613, -5893243, -5524328, -5213976, -5250006, -5828096, -5400214, -5284467, -4953453, -5247727, -5424484, -5716249, -5253790, -5331933, -5266379, -4890105, -5136633, -4802732, -4466906, -5242613, -4635581, -5324231, -5137418, -5344852, -4914133, -4673337, -5039229, -5237790, -4964940, -4999080, -5402626, -5003516, -5197082, -5640405, -5080732, -5132105, -5646814, -5182033, -5171408, -5332525, -4781199, -5237611, -5499306, -5346880, -5034733, -5446993, -4880254, -4837444, -4389272, -5052482, -5319449, -5817410, -5004164, -5276173, -5721931, -5724150, -5325692, -5224263]
-1723e224263k6229j78898J31336J6353M3460L4744n44486M76893K20401m70416l66670
-1734e887775L60573j76990M19823K60747K50107l05591Q5753j74886N6664l94885N33525
-1745d972935K15802J18515m54786l4885k86908J44340M1412m10003L78597j92960L04967
-1756e148844l96966J13057J8256l7041K15m1917M25530N0237m54031l84396K11685j08239
-1768e752454L94755j21839K2162J46692l62491M74703l4261j72437J31397J17081j79259
-1779e335951K57493k12270j70382J74883j97619j35434K14246K12953L52825J10268
-1789d728988m39354k03504k2583P8352j87316N49284k39204K74755N7040m084m06353
-1800e271955k92330M83779p1200j93992j08265L48394J52846J50526j94264j60438L80724
$$ y = [-5224263, -5250492, -5429390, -5298054, -5281701, -5238241, -5203497, -5747983, -5271090, -5050689, -5521105, -5887775, -5527202, -5704192, -5284369, -5023622, -4773515, -5079106, -4993353, -5168239, -5111575, -5506460, -4972935, -4757133, -4638618, -5093404, -5128289, -5415197, -5270857, -5229445, -5639448, -5260851, -5453811, -5148844, -5545810, -5432753, -5414497, -5451538, -5451323, -5493240, -5067710, -5017473, -5471504, -5855900, -5644215, -5752454, -5357699, -5479538, -5457376, -5310684, -5673175, -5198472, -5232733, -5405170, -5273773, -5156692, -5335951, -5078458, -5290728, -5461110, -5286227, -5483846, -5619280, -5405034, -5192081, -4839256, -4728988, -5168342, -5371846, -5394429, -5316077, -5503393, -4954109, -5193313, -4918558, -4861518, -4865602, -5271955, -5564285, -5080506, -5151706, -5345698, -5453963, -5105569, -4952723, -4802197, -4996461, -5156899, -4776175]
-1811d776175j83031j23114l6851K89321J34946l27841l7089n19054L53827P2484M7431
-1822e105146n79293J98868K1793J33678N6413J8563O1982l280P2130k14577O10978n84154
-1834e312045L90043K6740l19894m38479J82869k16379J5224J93263j29933L65858M95316
-1845d747417j35312l28572k64728J33950L64250m28839N85093j55726m23539K40233
-1855e160607j53424p727M51592N4372j68625L52103o94892J60460K90428J60042m74181
-1866e190459k1318o12844J69560L42755j61939o43159M63622M22462J34256K22631k61517
-1877e135950m67610k14764L02180k5556K48193K73137N42312p09192n33659M20066Q0830
-1888e220013j45243k43826K72387n46575P46291n5116j95516K66458K73898K28295n92357
$$ y = [-4776175, -4959206, -5082320, -5119171, -4829850, -4694904, -5022745, -5059834, -5578888, -5225061, -5152577, -5105146, -5684439, -5485571, -5463778, -5330100, -5273687, -5255124, -5193142, -5196422, -5124292, -5338869, -4727891, -5312045, -4922002, -4895262, -5215156, -5653635, -5470766, -5687145, -5671921, -5478658, -5608591, -5242733, -4747417, -4882729, -5211301, -5476029, -5342079, -4977829, -5406668, -4821575, -4977301, -5400840, -5160607, -5314031, -5321758, -4870166, -4815794, -4984419, -4632316, -5327208, -5166748, -4876320, -4716278, -5190459, -5211777, -5824621, -5655061, -5312306, -5474245, -6117404, -5653782, -5231320, -5097064, -4874433, -5135950, -5603560, -5818324, -5516144, -5541700, -5293507, -5020370, -4478058, -5187250, -5720909, -5300843, -5220013, -5365256, -5609082, -5336695, -5883270, -5136979, -5192095, -5387611, -5121153, -4847255, -4618960, -5211317]
-1899e211317M35916m62419p6593J1820l31005K27205n82512N06014l3594M32633K17784
-1910d866068l77882l70197J79482N7301K37177o9677o1091k389J79559M0062r2382k61142
-1922e407247L02153K02287k13081k60176k6220J22355j08999K40532m787j76071R99554
-1933d329700m21770l31828l37005K58694Q1842Q0182l73088l79993N04837j49727l32721
-1944e730277M66991m138O5075j08160N4555L02925q50136O43153j50643j03952l29808
-1955e744415K86081q8370L01897J118q3083k57828K72078j66621J18694j24169j5512
-1966e500130Q9180k4127L42151k89701j37892N10010k82623K9558K5149L38350m9115
-1977d949190m70992L97096j31967n7512J67313l01613N9736j6100n00010M45390P4301
$$ y = [-5211317, -4775401, -5237820, -5314413, -5302593, -5633598, -5406393, -5988905, -5482891, -5516485, -5083852, -4866068, -5243950, -5614147, -5434665, -5377364, -5140187, -5209864, -5270955, -5273344, -5093785, -5053723, -5146105, -5407247, -5105094, -4902807, -5115888, -5376064, -5402284, -5279929, -5388928, -5148396, -5153183, -5329254, -4329700, -4751470, -5083298, -5420303, -5161609, -5079767, -4999585, -5372673, -5752666, -5247829, -5397556, -5730277, -5263286, -5267424, -5202349, -5310509, -5255954, -4953029, -5803165, -5160012, -5310655, -5414607, -5744415, -5458334, -5546704, -5244807, -5243689, -5326772, -5584600, -5312522, -5479143, -5360449, -5484618, -5500130, -5410950, -5435077, -5092926, -5382627, -5520519, -5010509, -5293132, -5263574, -5238425, -4900075, -4949190, -5420182, -5023086, -5155053, -5212565, -5045252, -5346865, -5287129, -5303229, -5803239, -5357849, -5283548]
-1988e283548K95619l44938m30682J00474J0683J02634O2018M55361r9245J33503J07832
-1999d890289l43159j08686N51758p9625J59261k77758j31952j41157k8629L76811m31154
-2010e344579l8798n6572L53939p75061L25459L85121k4651j50603j00978K08407l65140
-2021e583456J85126P6433L24387j21433M20395k0575k92796n6p12084N07480k54716
-2032e471295j57164k7136L72364N311m65558M80461o4448j79773L08233l47380K45480
-2043e300905Q54391m78714l43485J26608j0441k62001l65350O63755k68852O56708j68898
-2054d897184k62104K48311m02721P05797o59662R7275J24101j40374m45384K02479l90192
-2065e819658l5493K51334j52024l10882O60333L55035n40547K38288j77805n89344P78391
$$ y = [-5283548, -4987929, -5332867, -5763549, -5663075, -5652392, -5549758, -5487740, -5032379, -5131624, -4998121, -4890289, -5233448, -5342134, -4790376, -4870001, -4710740, -4988498, -5120450, -5261607, -5290236, -4913425, -5344579, -5383377, -5439949, -5086010, -5861071, -5535612, -5150491, -5175142, -5325745, -5426723, -5218316, -5583456, -5398330, -5321897, -4997510, -5118943, -4698548, -4719123, -5011919, -5011975, -5724059, -5216579, -5471295, -5628459, -5655595, -5283231, -5277920, -5743478, -5263017, -5327465, -5507238, -5199005, -5546385, -5300905, -4446514, -4925228, -5268713, -5142105, -5152546, -5414547, -5779897, -5116142, -5384994, -4728286, -4897184, -5159288, -4910977, -5313698, -4607901, -5267563, -5170288, -5046187, -5186561, -5631945, -5429466, -5819658, -5855151, -5603817, -5755841, -6066723, -5406390, -5051355, -5591902, -5353614, -5531419, -6120763, -5342372]
-2076e342372k60705M79303k53886J76950j47376j19006k62779N0768O2462J05877O7135
-2087e443629k72595m3002J38514j10974Q8839k59252J007491l03333K2316j08116o5356
-2098e349097L20968l62760J88978K8667K54888j44414J64790q08680P82591J31025n57830
-2109e350874K81804K9780j56529J59635j79082j97062J12982j65904l260P7709l51713
-2120e742514L67290L4441M9357L37832l9103J41543m03177K71486q7779q2025K87732
-2131d864917q7024J453k07990m6268k93741M52570n2125k37897p077k70525J56865M8450
-2143e408226N4018J1061k96384K54352O3161l4742N78321p07106J25149O84049J68266
-2154d508081j489283N06863L01416K22044K63308l70500M98751j85450p14532N12987
$$ y = [-5342372, -5603077, -5123774, -5377660, -5200710, -5348086, -5467092, -5729871, -5679103, -5616641, -5510764, -5443629, -5716224, -5759226, -5620712, -5731686, -5642847, -5902099, -4894608, -5197941, -5175625, -5283741, -5349097, -5028129, -5390889, -5201911, -5173244, -4918356, -5062770, -4897980, -5706660, -4924069, -4793044, -5350874, -5069070, -5039290, -5195819, -5036184, -5215266, -5412328, -5299346, -5465250, -5468510, -5390801, -5742514, -5375224, -5340783, -5291426, -4953594, -4992697, -4851154, -5254331, -4982845, -5070624, -5152649, -4864917, -4951941, -4950488, -5158478, -5204746, -5498487, -5045917, -5098042, -5335939, -5343016, -5613541, -5456676, -5408226, -5354208, -5343147, -5639531, -5385179, -5322018, -5356760, -4778439, -5485545, -5360396, -4676347, -4508081, -5997364, -5490501, -5189085, -4967041, -4703733, -5074233, -4575482, -4760932, -5475464, -4962477]
-2164d962477K12866m61053K09035J21264k56261n54213N67011n75952O87312k07916
-2174e220384n85394Q02302r2424j74039m85941P11465J03296n80969L34968j95169N606
-2185e376683J11388L31124n15972M66338N40403n34583q54k05355j2158K3870j50388
-2196e322870l58754M27952J89367k33015j55006R8485K23456l64727l80095N66487k21935
-2207e530655Q87448k58624o71055j90426L97820j73065K7565k66692J44403L9928N12021
-2218e081332k35695M36163k38563K57705k65309m05934L99431n40090L26184L13947
-2228e033493k96355L07948l2734j29050l4262L8349o864l59616N1673o26550N62990
-2239e557964O32338l18578l77768O03367n91439O5716o9825j41414N11709j38274K74632
$$ y = [-4962477, -4749611, -5210664, -5001629, -4880365, -5136626, -5690839, -5123828, -5699780, -5012468, -5220384, -5805778, -5003476, -5095900, -5269939, -5755880, -5044415, -4941119, -5522088, -5187120, -5382289, -5376683, -5265295, -4934171, -5450143, -4983805, -4443402, -4977985, -4978839, -5184194, -5196352, -5172482, -5322870, -5681624, -5253672, -5064305, -5297320, -5452326, -5353841, -5130385, -5495112, -5875207, -5308720, -5530655, -4643207, -4901831, -5572886, -5763312, -5365492, -5538557, -5510992, -5777684, -5633281, -5593353, -5081332, -5317027, -4880864, -5119427, -4861722, -5127031, -5532965, -5133534, -5673624, -5347440, -5033493, -5329848, -5021900, -5054634, -5183684, -5217946, -5179597, -5186461, -5546077, -5494404, -6120954, -5557964, -4925626, -5244204, -5621972, -5018605, -5610044, -5544328, -5614153, -5755567, -5243858, -5382132, -5107500]
-2250e107500n40904K78265J87009l041J02881K99831k32085n25625o841L37189K38526
-2261d972295l16633N44838p30933L97968o16299j45362R0982M61141j13376J84558k38189
-2272e453600J48233J92242j58114o14187N02689K55364j13242j54684j72897r0190L11577
-2283e346809k26922K56313j97204K69048l96702j52090L97326r948j21375L59251J07524
-2294e061588l90651k45131K13850K9725J60794k33961k3127O96953n88896K35382j59137
-2305e365787l17498J11930k36060M10314N73806n51594P3477P13687l06475j32533L795
-2316e022938k81881K27990j5723o1513L64803m55788o92564O080P84000l12164R9074
-2327e360624L33842l56339K25020k86346L89086l85405K76584M82036j49095j92256K7019
$$ y = [-5107500, -5648404, -5370139, -5183130, -5186171, -5083290, -4783459, -5015544, -5541169, -5548010, -5210821, -4972295, -5288928, -4744090, -5475023, -5077055, -5693354, -5838716, -5747734, -5286593, -5399969, -5215411, -5453600, -5305367, -5113125, -5271239, -5885426, -5382737, -5127373, -5240615, -5395299, -5568196, -5658386, -5346809, -5573731, -5317418, -5514622, -5245574, -5642276, -5794366, -5397040, -5406988, -5528363, -5169112, -5061588, -5452239, -5697370, -5483520, -5453795, -5293001, -5526962, -5550089, -4853136, -5442032, -5206650, -5365787, -5683285, -5571355, -5807415, -5397101, -4823295, -5374889, -5301412, -4587725, -4894200, -5026733, -5022938, -5304819, -5076829, -5092552, -5154065, -4789262, -5245050, -5937614, -5931534, -5147534, -5459698, -5360624, -5026782, -5383121, -5158101, -5444447, -5055361, -5440766, -5164182, -4682146, -4831241, -5023497, -4996478]
-2338d996478l6707n61539O43280m36334M98626l52036m28591L48024M4105P6972m0258
-2349e240936Q9614J14628j21025m15053N56924p33181M54756k41773K9635K01645O4860
-2360e239906n6644k10477q5292j4314n26256M23405N55878k00716l76216o9836L14321
-2371e486053L06009k05924K09924M1704K59966l60039m69021O6118J03176p4605J97589
-2382e411156j47530K05758L72531k6877l94465K68516L0259k16148j33467p7384L43321
-2393e186642K97969p51894L24250r3756J24782k866k78709L20555N34351k54298k65953
-2404e232211J92289p17824N6350L38562j30806L14853l63563M47953K10133l28037l6199
-2415e248500J52929L08224l46682n23977M10795M77914k42603N39090q75990K34517
$$ y = [-4996478, -5033185, -5594724, -4951444, -5387778, -4889152, -5241188, -5669779, -5321755, -5277650, -5200678, -5240936, -5151322, -5036694, -5157719, -5572772, -5015848, -5749029, -5294273, -5536046, -5506411, -5304766, -5239906, -5296550, -5507027, -5592319, -5606633, -6132889, -5709484, -5153606, -5354322, -5730538, -5800374, -5486053, -5180044, -5385968, -5176044, -5134340, -4874374, -5234413, -5703434, -5637316, -5534140, -5608745, -5411156, -5558686, -5352928, -4980397, -5007274, -5401739, -5133223, -5102964, -5319112, -5452579, -5529963, -5186642, -4888673, -5640567, -5316317, -5410073, -5285291, -5288157, -5566866, -5246311, -4711960, -4966258, -5232211, -5039922, -5757746, -5701396, -5362834, -5493640, -5178787, -5542350, -5094397, -4884264, -5212301, -5248500, -5095571, -4787347, -5134029, -5658006, -5247211, -4769297, -5011900, -4472810, -5348800, -5114283]
-2425e114283k33902J80477K32372l58242J32328n21797r7958n7463J18415J49227O11325
-2436d959501k66233K08754m66253J51682K04151n90517j418P4213j66814K15745M73186
-2447e123005l01460K54833J80284O1828J5910K46480l85927j64230j17811m13670N07319
-2458e239449m25529L10759j47285l11385P52144l27471k57198L25590j18396K17119
-2468e221101J09562L22236p015l932o51859N08031l393k03286K92654j1191k41553n56734
-2480e667581K43076k28669M27092K57411p1267j43070l97025L02362m15898n97105M85058
-2491e805616l6763L60575J46418p609k8220j35114j7578j19187J90109J76505j52931
-2502e429411O88785L35923J13311j009540j03391J78303j89139l83529M11198o6527
$$ y = [-5114283, -5348185, -5167708, -4935336, -5293578, -5161250, -5683047, -5781005, -5838468, -5720053, -5570826, -4959501, -5225734, -5016980, -5483233, -5331551, -5127400, -5717917, -5719335, -5645122, -5811936, -5596191, -5123005, -5424465, -5169632, -4989348, -4927520, -4911610, -4665130, -5051057, -5215287, -5333098, -5746768, -5239449, -5664978, -5354219, -5501504, -5812889, -5060745, -5388216, -5645414, -5319824, -5438220, -5221101, -5111539, -4789303, -4796318, -4800250, -5452109, -4944078, -4947471, -5150757, -4858103, -4869294, -5110847, -5667581, -5424505, -5653174, -5226082, -4968671, -5039938, -5183008, -5580033, -5277671, -5693569, -6290674, -5805616, -5842379, -5481804, -5335386, -5342995, -5371215, -5506329, -5523907, -5643094, -5452985, -5276480, -5429411, -4740626, -4404703, -4291392, -5300932, -5404323, -5226020, -5415159, -5798688, -5387490, -5454017]
-2512e454017K66675p63386N61785j08678l7544q5585N8495r3492o1713J03938M94925
-2523e118597k01833n12327J12312l11529O02079K70651k10024L77095l69064J81815K6469
-2534e152953k94764r6777P3992K36957l29321L52205l03510r5171L53435J07902L44695
-2545d803310q1990k42892l3241K46181q7122n65422j16405L89315r202K55370o30088
-2556e678806p15579Q00835M26831m29203K61561L50893p47612n6860N87891q03288M10767
-2567e592570J01439J7143k41954l02223M83826j0907l0299K34284K45914p67703O24685
-2578e238365j60940k27228n47760Q14869K11171p1658m8682l5316k36423L44932n32184
-2589e727584O05528M3627k83418m71012J171722o81777j924n89231L66922Q901M5930
$$ y = [-5454017, -5187342, -5950728, -5388943, -5497621, -5535165, -5620750, -5562255, -5655747, -5717460, -5613522, -5118597, -5320430, -5832757, -5720445, -6031974, -5429895, -5159244, -5369268, -4992173, -5361237, -5179422, -5152953, -5447717, -5544494, -5470502, -5233545, -5562866, -5210661, -5514171, -5609342, -5255907, -5148005, -4803310, -4885300, -5128192, -5161433, -4915252, -5002374, -5567796, -5684201, -5294886, -5304088, -5048718, -5678806, -6394385, -5593550, -5166719, -5595922, -5334361, -4983468, -5731080, -5787940, -5200049, -6003337, -5592570, -5491131, -5473988, -5715942, -6018165, -5534339, -5545246, -5575545, -5341261, -5095347, -5863050, -5238365, -5399305, -5626533, -6174293, -5359424, -5148253, -5219911, -5268593, -5303909, -5540332, -5195400, -5727584, -5122056, -5078429, -5361847, -5832859, -4661137, -5342914, -5344838, -5934069, -5567147, -5558246, -5512316]
-2600e512316K15220l04071k21626L44965n10429M84964L78814P8931l40209k77612l08115
-2611e971484N5299L63000L60071m78592K89639L25684j48443k28431j34780M62762o93672
-2622e798947p5936L51111O66700m79436k58269Q10437p43419L0707j80965L84216l40952
-2633e634753O3491J50602k12195R51r1174K73480m2103K6298J73356J33993l63518L96565
-2645e125007J52215k41458k06975L87366O5428l63403O4495K33709l12635k35941L10437
-2656e271769p8781n5236j04862O5166J86404l3252K1925L8040j16755J74900j11335
-2667e285555j22105K4879j97144l59211M41725k40646J74637J56160m83026O53493j79085
-2678e415878K01411l53915j53650N4376L41608J24387o61393J83881R05364l82996k77540
$$ y = [-5512316, -5297096, -5601167, -5822793, -5477828, -5988257, -5503293, -5124479, -5045548, -5385757, -5663369, -5971484, -5916185, -5553185, -5193114, -5671706, -5382067, -5056383, -5204826, -5433257, -5568037, -5105275, -5798947, -5874883, -5523772, -4857072, -5336508, -5594777, -4784340, -5527759, -5497052, -5678017, -5293801, -5634753, -5571262, -5420660, -5632855, -5631904, -5723078, -5449598, -5491701, -5465403, -5292047, -5158054, -5521572, -5125007, -4972792, -5214250, -5421225, -5033859, -4968431, -5331834, -5267339, -5033630, -5346265, -5582206, -5271769, -5350550, -5405786, -5510648, -5445482, -5259078, -5292330, -5270405, -5232365, -5349120, -5174220, -5285555, -5407660, -5382781, -5579925, -5939136, -5497411, -5738057, -5563420, -5407260, -5890286, -5236793, -5415878, -5214467, -5568382, -5722032, -5667656, -5326048, -5201661, -5863054, -5679173, -4773809, -5156805, -5434345]
-2689e434345K86703j62130n50681P73146p3410r6975J19221l45357J37517j87395j5044
-2700e548750N9593n41429O49594j35419j6203j93321j38694K6857M80329k01118L54494
-2711e204067n27245l03434O03234j77864L25156n32726q3027N56314J92567J49210n90549
-2722e592431p6961q7866J69831N41651K00928q92509o7149N41640
$$ y = [-5434345, -5147642, -5309772, -5860453, -5087307, -5160717, -5257692, -5138471, -5483828, -5346311, -5533706, -5548750, -5489157, -6030586, -5380992, -5516411, -5532614, -5725935, -5864629, -5837772, -5357443, -5558561, -5204067, -5731312, -6034746, -5431512, -5609376, -5284220, -5816946, -5899973, -5343659, -5151092, -5001882, -5592431, -5669392, -5757258, -5587427, -5045776, -4844848, -5737357, -5804506, -5262866]
-2730e262866  $$ checkpoint
##PAGE= N=2
##DATA TABLE=(X++(I..I)), XYDATA
13653e31826O86075j20426K16371l23141J75193n1529O0561N79465p67152J024938n74833
13642C73696m4619p9114K84807J5956k95740n9539j46918O7442k3083m9435J5256l84873
13630c26164M07599n0011l85257M62634J72808o04440N47274k524n26864O33867j24339
13619B04583j18947l31547K6725K36345J17943k2569J672J2834p28872P59346j82739Q6015
13607F0789K9304k44423O70142p74388k16627O34549r7417m35781K73451K19778n68269
13596d48892L82314j63516K19641K50222L83819l37429L50690m41179m82012P94632r8183
13585D10107o6068k26478j72841L98414j65443l59433K65975k45257M28658P29948j51001
13574H46581p8694m32705J08229j50744r2867q5537N27267p43042k00256J28033L69870
$$ y = [-531826, 154249, 33823, 250194, -72947, 102246, 50717, 111278, 690743, -76409, 948529, 373696, 329077, 249963, 534770, 550726, 254986, 195447, 48529, 115971, 92888, 43453, 58709, -326164, 81435, 31424, -353833, 108801, 281609, -322831, 224443, 221919, -304945, 328922, 204583, 85636, -245911, -219186, 17159, 135102, 112533, 114205, 127039, -601833, 157513, -25226, 60789, 90093, -154330, 515812, -258576, -475203, 159346, 61929, -373852, -100401, 119377, -448892, -66578, -230094, -10453, 239769, 623588, 286159, 636849, 195670, -286342, 508290, 410107, 344039, 117561, -55280, 343134, 177691, -181742, 84233, -161024, 267634, 997582, 846581, 767887, 335182, 443411, 292667, 199800, 114263, 641530, -101512, -301768, -173735, 196135]
13563A96135k62898o425N07185l63726j28576Q7005O6182M07978o11008J7469O0561n7993
13551h8111P24097k04340M771l92468j91643J51990k74749K16913P52016O48194m40391
13540I06279q52945J46355j68931k03300N71384K3825M62597n09282j38396k06306N35175
13529E66455k82463r8552j52535M21655q7608J46598j03172k136l2307l04864j45087
13518g4016m04933M62527n6589P14728m49579m96370Q4784J06451K03711J36971L01231
13507E28916j28581j8415n04747l60482P22360l27101M61265O4843k42670N17988l10964
13496D02412L39322o82775j22118K05803l28075P0874P69M66560K08287n50153K49090
13485B59996k02333L89381n14072P39490n3383o71197J11101M23788p2503k88433K71861
$$ y = [196135, -66763, -73188, 433997, 70271, -58305, 28700, 94882, 502860, -108148, -90679, -30118, -88111, 635986, 431646, 436417, 43949, -147694, 4296, -270453, -53540, 698476, 1346670, 906279, 53334, 199689, 30758, -172542, 398842, 422667, 885264, 375982, 237586, 31280, 566455, 283992, 185440, 32905, 454560, 366952, 513550, 410378, 408242, 375935, 71071, -74016, -478949, -16422, -73011, 641717, 192138, -304232, -219448, -112997, 90714, 227685, 528916, 400335, 381920, -122827, -483309, 239051, -88050, 373215, 438058, 195388, 713376, 402412, 741734, 58959, -63159, 142644, -185431, -114557, -113788, 352772, 561059, 10906, 259996, 57663, 447044, -67028, 672462, 619079, -52118, 58983, 482771, 410268, 121835, 393696]
13474C93696Q9288m40169J4245L55348j3984K3164L81084m21888J87647l61218l04434
13463i7221M48854j56541q2242L29794n57391N709J51908M9314R2337O8266m423K08213
13451D56577L60143Q12463j278532L866n34310N04748L81801k3423P6520m92663K294
13440B69484N48183n62779P5197j63682M98272j98570K54334m76911L79891K5849J44065
13429G93333j94742k98389l11807k41689M35490J94839K94645M79578p78885J01590n46834
13418g2871k9107N56078n52390P34118k58507O7622J94861J22440K53642o08871k61157
13407A45858q4610K28547K36487k33807J43751j02084L23303p61568N79771J65775k88131
13396C53292J37808j06362m56613J36233M07412Q957P5635j56620j16143J97163L78301
$$ y = [393696, 482984, 42815, 57060, 412408, 398424, 421588, 802672, 380784, 568431, 207213, -97221, 351633, 195092, 112850, 442644, -114747, -109038, 42870, 92184, 184521, 252787, 248364, 456577, 816720, 1629183, 350651, 354517, -179793, 324955, 706756, 683333, 759853, 267190, 269484, 817667, 254888, 330085, 166403, 664675, 466105, 720439, 243528, 623419, 649268, 793333, 598591, 300202, -11605, -253294, 182196, 377035, 671680, 1151258, 372373, 473963, -72871, -101978, 454100, -98290, 635828, 377321, 444943, 639804, 762244, 1015886, 407015, 145858, 61248, 289795, 526282, 292475, 436226, 334142, 657445, -104123, 475648, 641423, 353292, 491100, 384738, -71875, 64358, 471770, 480727, 556362, 399742, 283599, 480762, 859063]
13385H59063J82344j67632l87144J85882p6902m94772L54333N5500O8652n34355j30171
13374h5202R76609j82293l56473J26482k13263K93742n62963K59359O92491N4638m62415
13363E40712J88528l38556K45204k819J0406k08111M96655k67177j44472Q4128j14909
13352D89589P6353M6719O8816Q6492m8599J09452k72454k1644n2815j91575M00680k40951
$$ y = [859063, 1041407, 873775, 486631, 672513, 595611, 100839, 455172, 510672, 579324, 44969, -85202, 891407, 709114, 352641, 479123, 265860, 559602, -3361, 255998, 948489, 1003127, 540712, 729240, 390684, 635888, 633069, 643475, 435364, 932019, 664842, 520370, 604498, 489589, 565942, 612661, 681477, 767969, 719370, 828822, 556368, 534724, 481909, 290334, 691014, 450063]
$$ [...]
-2730f36335  $$ checkpoint
##END NTUPLES=
##END=
