##TITLE= S#286193
##JCAMP-DX= 5.00 $$ JEOL NMR v1.10
##DATA TYPE= NMR SPECTRUM
##DATA CLASS= NTUPLES
##NUM DIM= 1
##ORIGIN= DELTA_NMR
##OWNER= NMR
##SPECTROMETER/DATA SYSTEM= DELTA_NMR
##.OBSERVE FREQUENCY= 7.5568234259928E+01
##.OBSERVE NUCLEUS= ^13C
##.DELAY= (5.14E+01,5.14E+01)
##.ACQUISITION MODE= SIMULTANEOUS
##.FIELD= 7.0586013
##.FILTER WIDTH= 8.6618213122048E-01
##.ACQUISITION TIME= 1.7334272
##.SPINNING RATE= 17
##.OBSERVE 90= 9.5
$$ ------------------------
$$ JEOL SPECIFIC PARAMETERS
##$FILENAME= C:\NMR/eb2-7.jdf
##$TITLE= S#286193
##$AUTHOR= NMR
##$CREATION=  6-FEB-2018 07:54:42
##$REVISION=  6-FEB-2018 08:02:03
##$CONTENT= CARBON NMR EXPERIMENTn
##$INSTRUMENT= DELTA_NMR
##$SITE= Center College ECP+ 300
##$NODENAME= nmr2
##$DIMENSIONS= 1
##$STORAGE= FLOAT
##$X_FORMAT= COMPLEX
##$X_CURR_POINTS= 32768
##$X_START= 225.07631 $$ppm
##$X_STOP= -25.06868 $$ppm
##$X_TITLE= 13C                            
##$X_ZERO_POINT= 0.39976
##$X_FREQ_FLIP= FALSE
##$X_POINTS= 32768
##$X_PRESCANS= 4
##$X_DOMAIN= 13C
##$X_OFFSET= 100 $$ppm
##$X_FREQ= 75.56823 $$MHz
##$X_SWEEP= 18.90359 $$kHz
##$X_RESOLUTION= 0.57689 $$Hz
##$SOLVENT= CHLOROFORM-D
##$TEMP_GET= 22.3 $$dC
##$ACQ_DELAY= 51.4 $$us
##$DIGITAL_FILTER= FALSE
##$FILTER_FACTOR= 1
##$FILTER_WIDTH= 9.446 $$kHz
##$FILTER_MODE= BUTTERWORTH
##$TRANSITION_RATIO= 0.9
##$ORDERS
##$FACTORS
##$LOCK_STRENGTH= 566
##$LOCK_LEVEL= 200
##$LOCK_GAIN= 26
##$LOCK_OSC_OFFSET= 25.6519 $$kHz
##$LOCK_PHASE= 187 $$deg
##$LOCK_OSC_STATE= 2H OSC ON
##$X_ANGLE= 30 $$deg
##$X90= 9.5 $$us
##$X90_HI= 9 $$us
##$X90_LO= 35 $$us
##$X_90_WIDTH= 9.5 $$us
##$X_PULSE= 3.16667 $$us
##$RELAXATION_DELAY= 1 $$s
##$SCANS= 100
##$PROBE_ID= 1412
##$ITERATIONS= 1
##$FIELD_STRENGTH= 7.0586 $$T
##$TEMP_SET= 25 $$dC
##$SPIN_SET= 15 $$Hz
##$SPIN_GET= 17 $$Hz
##$HE_LEVEL= 73 $$%
##$N2_LEVEL= 91 $$%
##$CHANGER_SAMPLE= 0
##$ADC_CARD= 16/1MHz/20
##$EXPERIMENT= single_pulse_dec
##$OBS_NOISE= WAUGH
##$IRR_NOISE= WALTZ
##$TRI_NOISE= WALTZ
##$QUA_NOISE= WAUGH
##$OBS_PWIDTH= 1 $$us
##$IRR_PWIDTH= 50 $$us
##$TRI_PWIDTH= 1 $$us
##$QUA_PWIDTH= 1 $$us
##$IRR_DOMAIN= 1H
##$IRR_FREQ= 300.52966 $$MHz
##$RECVR_GAIN= 15
##$IRR90= 9.2 $$us
##$TRI90= 10 $$us
##$QUA90= 10 $$us
##$IRR90_HI= 10 $$us
##$QUA90_HI= 10 $$us
##$IRR90_LO= 50 $$us
##$TRI90_LO= 10 $$us
##$QUA90_LO= 10 $$us
##$IRR_OFFSET= 5 $$ppm
##$MOD_RETURN= 1
##$TOTAL_SCANS= 100
##$X_ACQ_DURATION= 1.73343 $$s
##$DELAY_OF_START= 1 $$s
##$ACTUAL_START_TIME= 886751390
##$CLIPPED= FALSE
##$DC_BALANCED= FALSE
##$TRI90_HI= 10 $$us
##$SPIN_LOCK_90= 100 $$us
##$SPIN_LOCK_ATTN= 24.4 $$dB
##$DEUT_GRAD_SHIM_90= 213 $$us
##$DEUT_GRAD_SHIM_ATTN= 9 $$dB
##$IRR_CODE= 146
##$LOCK_STATE= LOCK ON
##$AUTOLOCK_LEVEL= 200
##$SAWTOOTH_RANGE= 4
##$LOCK_STATUS= IDLE
##$LOCK_SETTLE_POINT= 4096
##$LOCK_ACHIEVE_POINT= 0
##$SPIN_ACTION= SPIN ON
##$SPIN_STATE= SPIN ON
##$SPIN_STATUS= SPIN ON
##$SPIN_GAS_SOURCE= AIR
##$TEMP_ACTION= TEMP OFF
##$TEMP_STATE= TEMP OFF
##$TEMP_STATUS= TEMP OFF
##$TEMP_COMP= 0
##$TEMP_DELAY= 0 $$s
$$ [...]
##$VT_PID_STD_WB_H_CBL= 10
##$VT_PID_STD_WB_H_CBH= 0
##$VT_PID_STD_WB_H_HC= 2.4
##$VT_PID_STD_WB_H_HL= 70
##$VT_PID_STD_WB_M_PB= 1.5
##$VT_PID_STD_WB_M_TI= 30
##$VT_PID_STD_WB_M_TD= 5
##$VT_PID_STD_WB_M_CBL= 9.9
##$VT_PID_STD_WB_M_CBH= 2.3
##$VT_PID_STD_WB_M_HC= 2.5
##$VT_PID_STD_WB_M_HL= 70
##$VT_PID_STD_WB_L_PB= 1.3
##$VT_PID_STD_WB_L_TI= 29
##$VT_PID_STD_WB_L_TD= 5
##$VT_PID_STD_WB_L_CBL= 20
##$VT_PID_STD_WB_L_CBH= 20
##$VT_PID_STD_WB_L_HC= 0.6
##$VT_PID_STD_WB_L_HL= 100
##$VT_PID_LONG_0_H_PB= 1.5
##$VT_PID_LONG_0_H_TI= 30
##$VT_PID_LONG_0_H_TD= 5
##$VT_PID_LONG_0_H_CBL= 9.9
##$VT_PID_LONG_0_H_CBH= 2.3
##$VT_PID_LONG_0_H_HC= 2.5
##$VT_PID_LONG_0_H_HL= 70
##$VT_PID_LONG_0_M_PB= 1.5
##$VT_PID_LONG_0_M_TI= 30
##$VT_PID_LONG_0_M_TD= 5
##$VT_PID_LONG_0_M_CBL= 9.9
##$VT_PID_LONG_0_M_CBH= 2.3
##$VT_PID_LONG_0_M_HC= 2.5
##$VT_PID_LONG_0_M_HL= 70
##$VT_PID_LONG_40_H_PB= 1.5
##$VT_PID_LONG_40_H_TI= 30
##$VT_PID_LONG_40_H_TD= 5
##$VT_PID_LONG_40_H_CBL= 9.9
##$VT_PID_LONG_40_H_CBH= 2.3
##$VT_PID_LONG_40_H_HC= 2.5
##$VT_PID_LONG_40_H_HL= 70
##$VT_PID_LONG_40_M_PB= 1.5
##$VT_PID_LONG_40_M_TI= 30
##$VT_PID_LONG_40_M_TD= 5
##$VT_PID_LONG_40_M_CBL= 9.9
##$VT_PID_LONG_40_M_CBH= 2.3
##$VT_PID_LONG_40_M_HC= 2.5
##$VT_PID_LONG_40_M_HL= 70
##$SAMPLE_ACTION= LOADED
##$SAMPLE_STATE= LOAD
##$SAMPLE_STATUS= LOADED
##$AUTOSHIM_MODE= AUTOSHIM OFF
##$AUTOSHIM_DELAY= 3600 $$s
##$AUTOSHIM_TRACK= AUTOSHIM OFF
##$SHIM_MAX_RECALL= MAX FOUND
##$SHIM_NAMES= SHIM_Z0
##$SHIM_Z0= 9202
##$SHIM_Z1= 5122
##$SHIM_Z2= -38
##$SHIM_Z3= -2829
##$SHIM_Z4= -240
##$SHIM_Z5= 46
##$SHIM_Z6= -33
##$SHIM_X= -14
##$SHIM_XZ= 16
##$SHIM_XZ2= 0
##$SHIM_XZ3= 0
##$SHIM_X2= -7
##$SHIM_X2Z= -40
##$SHIM_X3= 0
##$SHIM_Y= 1608
##$SHIM_YZ= 13
##$SHIM_YZ2= 10
##$SHIM_YZ3= 0
##$SHIM_Y2= -11
##$SHIM_Y2Z= -20
##$SHIM_Y3= 0
##$NUM_SCANS= 1
##$END_TIME= 886751680
##$LOCAL_TIME= 886751680
##$PROBE_ATN= 0
##$PROBE_TUNE= 3853
##$PROBE_MATCH= 5069
##$PROBE_COARSE= NONE
##$LF_TUNE_DIAL= 0
##$LF_MATCH_DIAL= 0
##$HF_TUNE_DIAL= 0
##$HF_MATCH_DIAL= 0
##$PASS_RIPPLE= 0.01 $$dB
##$STOP_RIPPLE= 60 $$dB
##$PROBE_RECOVERY= 0 $$us
##$AF_DELAY_RATIO= 0
##$VERSION= 4.3.3
##$X_ACQ_TIME= 1.73343 $$s
##$DEAD_TIME= 0 $$us
##$DELAY= 0 $$us
##$PHASE_PRESET= 3 $$us
##$UNBLANK_TIME= 2 $$us
##$INITIAL_WAIT= 1 $$s
##$NORMALIZED= TRUE
$$ END OF JEOL SPECIFIC PARAMETERS
$$ -------------------------------
##NTUPLES= NMR SPECTRUM
##VAR NAME= FREQUENCY,    SPECTRUM/REAL, SPECTRUM/IMAG, PAGE NUMBER
##SYMBOL=   X,            R,             I,             N
##VAR TYPE= INDEPENDENT,  DEPENDENT,     DEPENDENT,     PAGE
##VAR FORM= AFFN,         ASDF,          ASDF,          AFFN
##VAR DIM=  32768, 32768, 32768, 2
##UNITS= PPM,     ARBITRARY UNITS, ARBITRARY UNITS, 
##FIRST=  2.25076309295504E+02, -3.55020060227221E+01, -2.53569690751799E+01, 1
##LAST=  -2.50686752434227E+01, 7.92292220662406E+01, 5.52881373712275E+01, 2
##FACTOR=  7.63405208102439E-03, 1.16904149845917E-03, 1.16904149845917E-03, 1
##PAGE= N=1
##DATA TABLE=(X++(R..R)), XYDATA
$$ [...]
5759i393582k327880N3023771J8546696p6673263o8137906J05493597M6600470L0567220
$$ -9393582 -11721462 41302309 59849005 -16824258 -84962164 20531433 67131903 97699123
5751I7699123j67672474P9401972j22185600J51920285k6499592n8581308j5195883
$$ 97699123 -69973351 9428621 -112756979 39163306 12663714 -45917594 -61113477
5744f1113477P8817042k7034893L7751592l8626833K3522505O7119010r3674636k0854835
$$ -61113477 17703565 -9331328 28420264 -10206569 13315936 80434946 -13239690 -34094525
5736c4094525m4248782L4676343n4989814O2906622Q6603720q1117339k6234712r393539
$$ -34094525 -78343307 -43666964 -98656778 -35750156 50853564 -30263775 -56498487 -65892026
5728f5892026J00211394j1450539o8702870J2698553l5994472O5797408m5356015O905964
$$ -65892026 34319368 22868829 -45834041 -33135488 -69129960 -3332552 -48688567 -41782603
5720d1782603N5125005K4696952j04023204J04371832J565880N592023o9832594K9628638
$$ -41782603 13342402 38039354 -65983850 38387982 39953862 45545885 -24286709 5341929
5712E341929R330598n1431027J46844719j51544719P0516819L7993970r219210J1149701
$$ 5341929 14672527 -36758500 110086219 -41458500 29058319 67052289 57833079 68982780
5704F8982780q800853q8579469P2445008k4863252K5221933p6222074j5847575J7171298
$$ 68982780 60181927 -28397542 44047466 19184214 44406147 -31815927 -47663502 -30492204
5696c0492204k1476808l072861L4833180n29337J36313648j58155271M0505780p9981864
$$ -30492204 -51969012 -55041873 -20208693 -20738030 115575618 -42579653 -2073873 -82055737
5688h2055737P4577597M8193683j08081844O0896976K8517281n2435034O2325697o7298233
$$ -82055737 -7478140 40715543 -67366301 -6469325 22047956 -30387078 31938619 -35359614
5680c5359614P168368M0009009p040735N1643001n2994676M8653522K1430070p638822
$$ -35359614 -28191246 11817763 4777028 56420029 3425353 52078875 73508945 65870123
5672F5870123q548142J0657276j32451669J37285718p7518096M8890209j1462460p162897
$$ 65870123 57321981 67979257 -64472412 72813306 -4704790 44185419 32722959 25560062
5664B5560062O6527281j1210424k3749278r2046702K7507090J15221637j01922384
$$ 25560062 92087343 80876919 57127641 -34919061 -7411971 107809666 5887282
5657E887282M4374998o4156928k666498L8248905L469412J9008955j0153315n3899997
$$ 5887282 50262280 -13894648 -16561146 21687759 25157171 44166126 34012811 -19887186
5649a9887186P9928981k7001657l7110415J2827130O2126729l7911841l9098599O4342901
$$ -19887186 60041795 33040138 -4070277 8756853 70883582 32971741 -6126858 58216043
5641E8216043l0535706P5167101j41421812P8287123J4461272m2158954k3260521J1202721
$$ 58216043 27680337 102847438 -38574374 39712749 54174021 12015067 -11245454 -42733
5633d2733P6610660j27298990J8517782J56769648p6227114O926502o3684827p2062355
$$ -42733 76567927 -50731063 -32213281 124556367 48329253 55255755 -8429072 -80491427
5625h0491427P0947626l0926219q9317944P3258087J9909777k2001536M7375354L6757030
$$ -80491427 -9543801 -40470020 -129787964 -56529877 -36620100 -58621636 -11246282 25510748
5617B5510748n1110457k0419588J16651723o5664870k9769240k9584283q8624253
$$ 25510748 -25599709 -46019297 70632426 4967556 -24801684 -54385967 -143010220
5610a43010220J20669034O776057L5245560n7253417P8714121P454370n955844J9972011
$$ -143010220 -22341186 -15565129 19680431 -37572986 41141135 48595505 42639661 62611672
5602F2611672J5468651k5806550K3584337j23009502n5758456N9566524J938061P2468062
$$ 62611672 78080323 52273773 75858110 -47151392 -102909848 -43343324 -41405263 31062799
5594C1062799R127676q3724393M9680782K0154178O89541m1584942l153480M5950778
$$ 31062799 40190475 -43533918 6146864 26301042 26990583 -14594359 -17747839 28202939
5586B8202939k5750142p1266370m0802881O4784377J6272401K7307339l4320352k0202953
$$ 28202939 2452797 -68813573 -109616454 -44832077 -28559676 -1252337 -35572689 -55775642
5578e5775642J17059257q2812671Q0593835j9841487p3785134M1087426k3520831J9035028
$$ -55775642 61283615 -21529056 59064779 39223292 -34561842 6525584 -16995247 2039781
5570B039781o92445r484646L4582159L6523392M343063J2191820p5167859K6306519
$$ 2039781 1347336 -8137310 26444849 62968241 67311304 79503124 4335265 30641784
5562C0641784k0650528M265155L7379515q3756407Q572850P5890395K2824135r9317918
$$ 30641784 9991256 14256411 51635926 -32120481 -23547631 52342764 75166899 -24151019
5554b4151019o360339P4418166j12813816N6026582J513216n2222796L4676241O522618
$$ -24151019 -30511358 43906808 -68907008 -12880426 -11367210 -63590006 -28913765 -22391147
5546b2391147m9322381N1822805q6685266R6987444l2347387Q0763124j10475744P1133179
$$ -22391147 -71713528 -19890723 -106575989 -9588545 -41935932 38827192 -71648552 -515373
5538e15373o4452690m7564450N4505952M8437675j6528723l3584738l5925009j9483156
$$ -515373 -64968063 -112532513 -58026561 -9588886 -26117609 -59702347 -95627356 -115110512
5530a15110512J70573517n4093280k5294577J0006479K8284724l0906748o7429253
$$ -115110512 55463005 1369725 -23924852 -13918373 14366351 -16540397 -83969650
5523h3969650P9220428q949979m2230803N1161342K6021672r5404438M2447041j1181550
$$ -83969650 -4749222 -13699201 -55930004 -4768662 21253010 -74151428 -31704387 -42885937
5515d2885937L2561155K4400716l3671789K7779891m7356652Q7377516j2693751m0249043
$$ -42885937 -10324782 14075934 -19595855 8184036 -39172616 48204900 35511149 -4737894
5507d737894M2479073j00242414L2320137k6481068J5930395Q3817873m6884400r7245370
$$ -4737894 37741179 -62501235 -30181098 -56662166 -40731771 43086102 -3798298 -101043668
5499a01043668P0194185n316113k5368162N6702808M6892369Q388221j3817511n8757116
$$ -101043668 -30849483 -36165596 -61533758 -4830950 42061419 50449640 36632129 -22124987
5491b2124987R395751q7461869L8508317l7188698J49762234k2555721l2676005n3665219
$$ -22124987 -12729236 -100191105 -61682788 -98871486 50890748 28335027 -4340978 -58006197
5483e8006197Q7364227n5340567O051163K0965591L4557945j2982593j7335537m0457416
$$ -58006197 29358030 -25982537 -19931374 1034217 35592162 22609569 5274032 -35183384
5475c5183384N160289m8847463j0411368J85514460j30556715N7876133r7589588
$$ -35183384 -30023095 -78870558 -89281926 96232534 -34324181 23551952 -74037636
5468g4037636J27825854j06250201M304029L2896764o982041M7342536j3715218j17451602
$$ -74037636 53788218 -52461983 -48157954 -15261190 -22243231 25099305 11384087 -106067515
5460a06067515P7775023J8701586o145873N6659337o1814906M9095198n9072899L5010094
$$ -106067515 -28292492 -9590906 -15736779 40922558 -20892348 28202850 -30870049 4140045
5452D140045l6731020p005611n2423252N3363036L0607741J8741417n926856j19713194
$$ 4140045 -32590975 -39596586 -92019838 -38656802 -8049061 10692356 4765500 -114947694
5444a14947694N6537544Q9091437r089961l6684483J963396m2319334O626189J2279860
$$ -114947694 -58410150 30681287 21591326 -15093157 -13129761 -55449095 -48822906 -36543046
5436c6543046K0728075N9797966j5267195k0015023N6674566j17634735n4135366R0893869
$$ -36543046 -15814971 43982995 28715800 8700777 65375343 -52259392 -106394758 -15500889
5428a5500889P28922Q870042Q872194j3766197m4860461P2615862J8587960Q105330
$$ -15500889 -14771967 -5901925 2970269 -10795928 -55656389 16959473 35547433 43652763
5420D3652763J7603694k6190951l4252851l0922502m2436790k2884761N1400439J52376310
$$ 43652763 61256457 35065506 812655 -30109847 -72546637 -95431398 -44030959 108345351
5412A08345351j12721716M4094359p1482031M5578845J6665577n564019L536511j2103860
$$ 108345351 -4376365 39717994 -31764037 13814808 30480385 24916366 28452877 16349017
5404A6349017p4003141m825672q866405J09383522j32480518J20944136q2090104R7320051
$$ 16349017 -57654124 -62479796 -71346201 38037321 -94443197 26500939 -55589165 41730886
5396D1730886j21464061l292880J05424204J6067947p0897978K7043160l3079726k5188603
$$ 41730886 -79733175 -83026055 22398149 38466096 -32431882 -5388722 -38468448 -63657051
5388f3657051J23270320p1602267Q6026653j32048738K3574854J2736879P3841827
$$ -63657051 59613269 -11988998 74037655 -58011083 -34436229 -21699350 52142477
5381E2142477p8550796J6882663k4506184N4208237p5254569n555943Q5655045R146558
$$ 52142477 -26408319 -9525656 -34031840 20176397 -55078172 -60634115 25020930 34167488
5373C4167488l3727678K5349274j42941563j4943867P4566917o2174560K26196824
$$ 34167488 439810 25789084 -117152479 -132096346 -57529429 -119703989 106492835
5366A06492835q1084064o3376927K2254436m7712167k4206908Q2488122o7364011
$$ 106492835 25408771 -37968156 -15713720 -63425887 -87632795 -5144673 -72508684
5359g2508684J27268580o9929429k6785389N70211n9108476R9120402J1528199k1056579
$$ -72508684 54759896 -15169533 -41954922 -41384711 -100493187 -1372785 10155414 -10901165
5351a0901165L2112953o0122566p0875073J93060842o2159890m8635485k0444504O5739183
$$ -10901165 21211788 -38910778 -109785851 83274991 21115101 -27520384 -47964888 17774295
5343A7774295N6402327j66538180P4688353l0694362J0804490M2599551l363618q951349
$$ 17774295 74176622 -92361558 -17673205 -48367567 -37563077 5036474 1672856 -7278493
5335g278493L4557282M050777o723627K2587166j11558841j1072687J8353615J62347557
$$ -7278493 27278789 31329566 24605939 47193105 -64365736 -75438423 -57084808 105262749
5327A05262749j36354226K3267800j9648329R4454475r2585118M4324232M023449k3171155
$$ 105262749 -31091477 -7823677 -27472006 66982469 -25602649 18721583 22745032 -426123
5319d26123K6877087l1378550Q123667k9963260M6971230J5801160R2086442j15649260
$$ -426123 26450964 -4927586 3196081 -26767179 20204051 36005211 128091653 12442393
5311A2442393J4418357m485522r286367j3496072k0898624M5640271k3101437m986445
$$ 12442393 26860750 22375228 13088861 -407211 -21305835 24334436 1232999 -3753446
5303c753446N4128391O5251943p8388060k3415972K4239500l3937015L3997955l4165434
$$ -3753446 50374945 115626888 37238828 13822856 38062356 4125341 38123296 3957862
5295C957862n4701249O222564k3181485J56373345j52020363J51888395j2244760J3265517
$$ 3957862 -50743387 -44520823 -67702308 88671037 -63349326 88539069 76294309 89559826
5287H9559826n9968262j7939068k3711737j0750606K2844933q929648o1924249O0261272
$$ 89559826 29591564 11652496 -12059241 -22809847 35086 -8894562 -70818811 -10557539
5279a0557539J8346897j630166N5627980N81180p1168471L5290371l8807782k2538530
$$ -10557539 7789358 6159192 61787172 62368352 -8800119 26490252 -12317530 -34856060
5271c4856060K1805253P206341K354271O262388j4012831n511781l7610715R9783875
$$ -34856060 -13050807 -5844466 -3490195 2772193 -11240638 -16752419 -54363134 45420741
5263D5420741l4611095m742714n3177691K5640074O0415354M8941080j17667720Q5601210
$$ 45420741 10809646 6066932 -47110759 -21470685 38944669 87885749 -29781971 55819239
5255E5819239m8650012R4937607j46545912p205912L8532101j1688713J00100802o6502284
$$ 55819239 7169227 102106834 -44439078 -51644990 -13112889 -24801602 75299200 8796916
5247H796916N2016577l7065356L2266075k564055l7707387o5029495L6598724N6745355
$$ 8796916 60813493 23748137 56014212 53450157 15742770 -49286725 -12688001 44057354
5239D4057354p397191r5021244O6939626n52111k0429146J7793421J6310918j4937879
$$ 44057354 36660163 -58361081 8578545 8026434 -12402712 5390709 21701627 6763748
5231F763748m0357312k3934102J27536487q906538j20792048R2216903r298989j5146957
$$ 6763748 -33593564 -57527666 70008821 61102283 -59689765 32527138 23228149 8081192
5223H081192j5816658k5830823P7674365l4561149Q9055938q0606655j6837011J262769
$$ 8081192 -7735466 -33566289 44108076 9546927 98602865 17996210 1159199 2421968
5215B421968K452537N8058996l5672651m9166823R7341779j00418273P3261531n9371752
$$ 2421968 4874505 62933501 27260850 -21905973 75435806 -24982467 48279064 -11092688
5207a1092688k6545706J03061907q6595197J03368708q3631303j7999829L9152586
$$ -11092688 -37638394 65423513 -21171684 82197024 -1434279 -19434108 19718478
5200A9718478j5030979o0520849P7402660k855744q3386783M5806119K4803756l6981821
$$ 19718478 4687499 -55833350 21569310 18713566 -64673217 -18867098 5936658 -31045163
5192c1045163L08336O5878096q2035769M8097672k3298464l0309999J20373404J2576499
$$ -31045163 -30736827 35141269 -46894500 1203172 -22095292 -52405291 67968113 80544612
5184H0544612o9812445m230803M9944740L1809210j09192473m5856721N6214278K2945835
$$ 80544612 10732167 6501364 56446104 88255314 -20937159 -66793880 -10579602 12366233
5176A2366233j0548009N203641N0345203J11670649p8660950o4639826J3075599l1770531
$$ 12366233 1818224 7021865 57367068 169037717 90376767 25736941 38812540 7042009
5168G042009R591556J9181352N054137j30643470M0421856J9067269m160934P7854416
$$ 7042009 16633565 35814917 40869054 -89774416 -49352560 -30285291 -34446225 43408191
5160D3408191p2333893J06756942L9653997q8560662n4460076l9134299j4679195N2570358
$$ 43408191 -28925702 77831240 117485237 28924575 -25535501 -64669800 -79348995 -26778637
5152b6778637J5106353l1368900L808124o167592O4208764j6150880N5075676j24009496
$$ -26778637 -11672284 -43041184 -39233060 -45400652 18808112 2657232 57732908 -66276588
5144f6276588O3339175Q73471l2527736Q778823j7780597N2987981o1551794O9065509
$$ -66276588 -2937413 -2063942 -34591678 -25812855 -43593452 9394529 -52157265 16908244
5136A6908244p5201103j752617J18535414j50292763J15227427K5183808m0214020
$$ 16908244 -58292859 -60045476 58489938 -91802825 23424602 48608410 8394390
5129H394390p3569697R8934536r6911190L7704581l524909N3303443m9858073j38876
$$ 8394390 -65175307 33759229 -63151961 -25447380 -28972289 24331154 -25526919 -25665795
5121b5665795Q090170r0593649M0770560J75608940j18236801P0986510o8130291n4702836
$$ -25665795 -17575625 -108169274 -67398714 108210226 -10026575 60959935 -7170356 -61873192
5113f1873192L8499524J3885210Q947584k69456L1246990n8250669L946512O0616401
$$ -61873192 -23373668 -9488458 -540874 -810330 30436660 -27814009 -23867497 36748904
5105C6748904q6533362K5719154J42170243n5800030j91663320J05486201j8487810
$$ 36748904 -49784458 -24065304 118104939 62304909 -129358411 -23872210 -42360020
5098d2360020J15936454m5494306l5606026R1122919j3591830l8602251o8829945L7609303
$$ -42360020 73576434 28082128 -7523898 83599021 70007191 31404940 -37425005 184298
5090A84298l3491699k5408646J6965873j2234946p6212494J73811038j29000M3794683
$$ 184298 -33307401 -58716047 -41750174 -53985120 -130197614 43613424 43484424 87279107
5082H7279107m8340208o6712922m9064768J16384748n3548081n4983892K0099645O3117861
$$ 87279107 38938899 -27774023 -76838791 39545957 -14002124 -68986016 -48886371 14231490
5074A4231490m8333903K5709252J1813626M7319320L4892551o2147072K4301980l3961679
$$ 14231490 -34102413 -8393161 3420465 50739785 85632336 23485264 47787244 13825565
5066A3825565p5975089K5573337O8938307K7284391O2651618l7109138j25497355M490752
$$ 13825565 -62149524 -36576187 32362120 59646511 122298129 85188991 -40308364 -35817612
5058c5817612M5573074J19313763m1041758o0313843j39572527J36995817l2629999
$$ -35817612 9755462 129069225 88027467 27713624 -111858903 25136914 -7493085
5051g493085p246500j5164709Q7776276O6744831n2001527K4545925r9639120k5691106
$$ -7493085 -14739585 -29904294 57871982 124616813 72615286 97161211 -2477909 -28169015
5043b8169015K9594768J10105670j24044770k5110376N8332273q1455420M9842995
$$ -28169015 1425753 111531423 -12513347 -37623723 20708550 -60746870 -10903875
5036a0903875r1032203J41993473j9302805L0030186l7213837L8118079j34647385
$$ -10903875 -101936078 40057395 20754590 50784776 13570939 51689018 -82958367
5029h2958367J31791083m2713059K6407622j12824781K7746865j3947528Q0265884
$$ -82958367 48832716 6119657 32527279 -80297502 -52550637 -66498165 13767719
5022A3767719k5696872q9181744J76535320p7227535L9135047l2976158K9666350r123827
$$ 13767719 -11929153 -101110897 75424423 -1803112 37331935 4355777 34022127 24898300
5014B4898300m9893387l6669465J6671459L6141618K3274769J8154205j12064518M2656860
$$ 24898300 -24995087 -61664552 -44993093 -8851475 14423294 32577499 -79487019 -36830159
5006c6830159K0754898N3900626O876292p3061309j9529046P0700802j67808251L9537370
$$ -36830159 -16075261 37825365 44701657 -28359652 -47888698 22812104 -144996147 -105458777
4998a05458777O8248505L4232341l8844776k7803008O2330394o8797075K6857104R1439259
$$ -105458777 -37210272 -2977931 -41822707 -69625715 -7295321 -76092396 -49235292 42203967
4990D2203967o1658590L9024807j01034462J03453613k682053r3507235O7595109L3974816
$$ 42203967 -19454623 19570184 -81464278 21989335 19307282 -74199953 -6604844 27369972
4982B7369972O194231m7778786j1792426R1634677r2942459L224476M4840891j6848780
$$ 27369972 33564203 -14214583 -26007009 65627668 -27314791 -24090315 20750576 3901796
4974C901796j9622866O5086975j0723446l5205503l2442776L3254388K4847407n7947329
$$ 3901796 -15721070 49365905 38642459 3436956 -29005820 4248568 29095975 -28851354
4966b8851354K4259379N9986133j3147863j12645917O4494544q6656900J57779848
$$ -28851354 -4591975 55394158 42246295 -70399622 -5905078 -92561978 65217870
4959F5217870j31180444K3750656Q1428369o1904582J2989174M2166932n2290045J1021532
$$ 65217870 -65962574 -42211918 39216451 -22688131 -9698957 32467975 -19822070 -8800538
4951h800538J9178671j07309081R8910215l0471116K5902667j17134530R8624447N1878242
$$ -8800538 10378133 -96930948 1979267 -28491849 -2589182 -119723712 -21099265 30778977
4943C0778977n5200030J0785146K0843131l8981096L2240977K3029200M8639694n9237451
$$ 30778977 -24421053 -13635907 7207224 -31773872 467105 23496305 72135999 12898548
4935A2898548j4697291m5629485M0923319k7325036k3014677Q2294619m8123383K6276988
$$ 12898548 -1798743 -47428228 -6504909 -33829945 -56844622 25449997 -22673386 3603602
4927C603602J7070524r533598q498058k6569608M9400179k2103132m1023788J7118357
$$ 3603602 20674126 11140528 2642470 -23927138 25473041 3369909 -37653879 -20535522
4919b0535522Q8411221j14572254P841193M095658J25575141j09082212J5873920L4047549
$$ -20535522 67875699 -46696555 -38855362 -34759704 90815437 -18266775 -2392855 31654694
4911C1654694n2918035N8815586L0391715q7295575o8907347J41878340j3196614k4397425
$$ 31654694 -21263341 37552245 67943960 -19351615 -88258962 53619378 40422764 16025339
4903A6025339j15389107O356565m895628J06909074K9702818j93348846O1696735
$$ 16025339 -99363768 -93007203 -97902831 9006243 38709061 -154639785 -92943050
4896i2943050J07047925q7246448P6686363M0161420q5844090O0264972l51310q537322
$$ -92943050 14104875 -73141573 3544790 43706210 -42137880 18127092 17775782 9238460
4888I238460q8985131R509715P1142011n0899131J16114754l5052492K0968451O5750819
$$ 9238460 -79746671 -70236956 905055 -49994076 66120678 31068186 52036637 117787456
4880A17787456p5638530J9711143J8765348o081281m9732908j9208230L9082495m5125091
$$ 117787456 42148926 61860069 80625417 74544136 24811228 5602998 44685493 -439598
4872d39598p899683J02456794j59759606J71020324l7251420K7660533j4372921M5948634
$$ -439598 -8339281 94117513 -65642093 105378231 68126811 95787344 81414423 127363057
4864A27363057r4730478o6063016M0653955o1031189L1858347M4171615j08636716
$$ 127363057 32632579 -33430437 7223518 -53807671 -21949324 22222291 -86414425
4857h6414425J4936396M9343412o1460964K8545939R9127065j15285953J55484038
$$ -86414425 -71478029 -22134617 -83595581 -55049642 44077423 -71208530 84275508
4850H4275508q7591972j1905412n1895969R8785873l2352947j6903603p2989655R3700552
$$ 84275508 -3316464 -15221876 -67117845 31668028 -684919 -17588522 -90578177 3122375
4842C122375J3120811q2872254R349582M2096263N9800710m7625390L4596514k7183166
$$ 3122375 16243186 -66629068 -57279486 -15183223 44617487 -3007903 31588611 4405445
4834D405445q8457474R8682386P6141216n6639655l0954193j5141586k8190107l2001287
$$ 4405445 -84052029 14630357 90771573 34131918 3177725 -11963861 -40153968 -72155255
4826g2155255j6582148O0729935L9939344o4859595k9771941R8573825o5346656R865314
$$ -72155255 -88737403 -28007468 11931876 -52927719 -82699660 15874165 -49472491 -39607177
4818c9607177j3950739O4612184l1358008R0648429j51565113M5159859p2192404M3714929
$$ -39607177 -53557916 11054268 -20303740 70344689 -81220424 -36060565 -108252969 -64538040
4810f4538040N0901391K5783204J7196647j5323194m838387M9455550o9848861n2792808
$$ -64538040 -13636649 12146555 29343202 14020008 9181621 58637171 -11211690 -64004498
4802f4004498l0179442J76311768m8177378l8265424O1388846p7697883L466865O5216609
$$ -64004498 -94183940 82127828 33950450 -4314974 57073872 -20624011 -17157146 48059463
4794D8059463J1480904j4233179n836234j902319l7848578O0267914r085760p2251641
$$ 48059463 59540367 45307188 39470954 37568635 -279943 59987971 50902211 -21349430
4786b1349430J29573465j5205136m4681232k5872207M6218382m7226135k0933354N3267206
$$ -21349430 108224035 93018899 48337667 22465460 68683842 21457707 524353 53791559
4778E3791559k9110062K4713258R035291q4073858J29386599k7969434n0238245R578618
$$ 53791559 24681497 49394755 58430046 -25643812 103742787 75773353 25535108 35113726
4770C5113726l1013569O1471997j9379609J7104095m1863940K7054183j65942708
$$ 35113726 4100157 65572154 46192545 63296640 21432700 48486883 -117455825
4763a17455825J21923976N0023520j08190035Q8665655J6929544p537744L50090l0454539
$$ -117455825 4468151 54491671 -53698364 34967291 51896835 44359091 44709181 14254642
4755A4254642o517964K707680J06003259j22889248K7647966J6771426q0909338O0043376
$$ 14254642 7736678 10444358 116447617 -6441631 21206335 37977761 -42931577 17111799
4747A7111799M3160223j15850391N1409323P3700227o6318609P0704282n6430605M653991
$$ 17111799 60272022 -55578369 -4169046 69531181 3212572 73916854 17486249 22140240
4739B2140240Q3169480j08932355m7477234n3703351L9712555J14017686j00084317
$$ 22140240 105309720 -3622635 -51099869 -104803220 -65090665 48927021 -51157296
4732e1157296j2800146P453188J3512918O9259435j6586694L8277262r8630105J1302521
$$ -51157296 -63957442 -56504254 -42991336 26268099 9681405 47958667 -50671438 -39368917
4724c9368917n5058615l097610j6886976o83465J28728368k2673577J7970385n2892296
$$ -39368917 -94427532 -97525142 -114412118 -115095583 13632785 -9040792 8929593 -43962703
4716d3962703n7720588J18109511j3787015N2699282m0936639l6692730M0784237l2007782
$$ -43962703 -101683291 16426220 2639205 55338487 14401848 -22290882 18493355 -13514427
4708a3514427q4153336Q2523671J21794499k9032113q5013162J9794634J965585L4760261
$$ -13514427 -97667763 -15144092 106650407 77618294 -7394868 12399766 14365351 49125612
4700D9125612m3772088O1287016m2886085k4963555M9783886L0435298j09667822n2277375
$$ 49125612 5353524 66640540 23754455 -1209100 48574786 79010084 -30657738 -82935113
4692h2935113P7738219P3662767K7296716k65907850J73425062P2571655n7413283R814149
$$ -82935113 -5196894 68465873 95762589 -170145261 3279801 75851456 18438173 28252322
4684B8252322J309716o8047106j6968801o032524O904375J0099269j0685890L6544023
$$ 28252322 29562038 -38485068 -55453869 -61486393 -54582018 -44482749 -55168639 -18624616
4676a8624616P0630157r3699514k6949108P1010785J7908390L3132233q4171762M06506
$$ -18624616 52005541 -41693973 -68643081 2367704 20276094 53408327 -30763435 -30356929
4668c0356929n738419N859267o9381883J46326761m9160604L5505383n2021936J08519074
$$ -30356929 -36095348 -30236081 -99617964 46708797 -2451807 33053576 -18968360 89550714
4660H9550714j08478839Q512124p592167R3350296J7568346r3724614L054519o3899407
$$ 89550714 -18928125 -10416001 -18008168 75342128 92910474 -814140 2240379 -61659028
4652f1659028L4400993O4218907L2267838p0537478q1061670R5084699j628418P5443654
$$ -61659028 -27258035 36960872 69228710 -1308768 -82370438 12714261 11085843 86529497
4644H6529497L1275168j13577314L3269694j15195743J29671731k8030030j21921248
$$ 86529497 117804665 4227351 37497045 -77698698 51973033 23943003 -97978245
4637i7978245Q6340503P3531087K3935015n5722774l3074151P660241k9940703J02630965
$$ -97978245 -11637742 61893345 85828360 30105586 -2968565 4691676 -25249027 77381938
4629G7381938O138459j07726067J5200746j1811648M4609624O554694J8905141j33220060
$$ 77381938 83520397 -24205670 -9004924 -20816572 23793052 30347746 49252887 -83967173
4621h3967173J39032695l5710400p5688354Q9453449j5080540q5364615J27675394
$$ -83967173 55065522 19355122 -56333232 33120217 18039677 -67324938 60350456
4614F0350456m2063101k658679r221286N1081711k1219167m5580968j6350965K4268718
$$ 60350456 18287355 15628676 6407390 57489101 36269934 -9311034 -25661999 -1393281
4606a393281l9671455N7343180j17645653N1031389j9465234L1610743j1442542J27760410
$$ -1393281 -41064736 16278444 -101367209 -50335820 -69801054 -38190311 -49632853 78127557
4598G8127557p7750977j9717212K0982498K1000410j31882432J52535370o5005771
$$ 78127557 376580 -19340632 1641866 22642276 -109240156 43295214 -21710557
4591b1710557P4656726j9769692k3187603p9052995K3606P6812895J9546102L0997303
$$ -21710557 52946169 33176477 9988874 -69064121 -69040515 7772380 27318482 58315785
4583E8315785J219849n8234338K6432131k021894j9653472l4282885J16303295l2959005
$$ 58315785 59535634 1301296 27733427 25711533 6058061 -28224824 88078471 55119466
4575E5119466p3921391p3119380M3277450K4674418M0877173j619142J4448132o0729042
$$ 55119466 -18801925 -91921305 -48643855 -23969437 16907736 15288594 29736726 -30992316
4567c0992316P4654876m6270246K2324484m511757r394950K4322585n6162512m0779511
$$ -30992316 43662560 -2607686 19716798 15205041 5810091 30132676 -26029836 -66809347
4559f6809347k4086231N480944N1924952n919946O99348J2126158M892507o879548
$$ -66809347 -90895578 -85414634 -33489682 -39409628 -38710280 -26584122 -21691615 -28571163
4551b8571163L1234258j2733549k0751009n2523666J76569351j08838221j2420406
$$ -28571163 2663095 -10070454 -30821463 -83345129 93224222 -15613999 -28034405
4544b8034405o3050116J16314987n2548310J1202076K2501003K7813276J6099779l4333832
$$ -28034405 -91084521 25230466 -27317844 -16115768 6385235 34198511 50298290 15964458
4536A5964458O3350679j515806J7666854j52014457J25007017p3529611j3135216O01976
$$ 15964458 79315137 77799331 95466185 -56548272 68458745 -5070866 -18206082 -17604106
4528a7604106L7202267q7087730Q4626951J08064076q6294784J0228955n3334372j3031134
$$ -17604106 19598161 -67489569 17137382 125201458 38906674 49135629 -4198743 -17229877
4520a7229877N6119268M9694755q0920356k6612559j2906343l5279738R0855802l4765870
$$ -17229877 38889391 88584146 7663790 -18948769 -31855112 -67134850 23720952 -11044918
4512a1044918P00986Q9499662j5469220m3081747j61455700K02625211m2046919M3065578
$$ -11044918 -10343932 79155730 63686510 20604763 -140850937 61774274 19727355 62792933
4504F2792933J6881795j17812742p545527J023409J44981731n397765k16380131J46940040
$$ 62792933 79674728 -38138014 -45683541 -44660132 100321599 94923834 -121456297 25483743
4496B5483743j0665754M651524M1684181j5562690K3055752o201432q3429548L0212537
$$ 25483743 14817989 19469513 61153694 45591004 68646756 62445324 -20984224 9228313
4488I228313o488669k808827M0519299o0611200l4345150j8915331N1432231l4199048
$$ 9228313 2739644 -69183 40450116 -20161084 -54506234 -73421565 -21989334 -56188382
4480e6188382P3340058o5101887J7983143J02768824r3713703o2990522J10606298
$$ -56188382 17151676 -47950211 -29967068 72801756 -20911947 -83902469 26703829
4473B6703829J3669222j05883116L3614452n417421p3389346R3880629N0774266o1876179
$$ 26703829 40373051 -65510065 -31895613 -37313034 -110702380 -16821751 33952515 -27923664
4465b7923664N6901495r8686424R9957889l5540608m4148775J5941379K8529637n134457
$$ -27923664 28977831 -69708593 30249296 -5291312 -49440087 -33498708 -4969071 -10103528
4457a0103528n1257941l8115189P2179662j1231628R7320321j9932085m1070667m2388714
$$ -10103528 -61361469 -99476658 -27296996 -38528624 58791697 38859612 -2211055 -44599769
4449d4599769R8947353k1262572o2474406J6445720o5633242N2207791j8749639K3943139
$$ -44599769 54347584 33085012 -29389394 -12943674 -78576916 -26369125 -45118764 -21175625
4441b1175625O6117492P132436j4328904p3550942J4444157j3388476j5583393J09328923
$$ -21175625 44941867 52074303 37745399 -35805543 -21361386 -34749862 -50333255 58995668
4433E8995668K2442491p1595759l0649539L9126280k4582694j295016m1243769J22819768
$$ 58995668 81438159 9842400 -20807139 18319141 -6263553 -7558569 -48802338 74017430
4425G4017430l8109819o4645363R069727k3532886K8492351N0312407n243345n9627691
$$ 74017430 35907611 -28737752 -19668025 -43200911 -14708560 35603847 30360502 -29267189
4417b9267189L7472060j21654045P5168205O7909490o3080737o113237J13819472j2201123
$$ -29267189 8204871 -113449174 -38280969 29628521 -33452216 -39565453 74254019 62052896
4409F2052896j18825067P6883719o5538643R1772623j3590447N0886391o9952512l7181646
$$ 62052896 -56772171 20111548 -45427095 46345528 32755081 83641472 13688960 -23492686
4401b3492686P5596668p2506837K7903950M4812706L3775724J062671n2343227Q3322648
$$ -23492686 52103982 -20402855 7501095 52313801 86089525 87152196 34808969 118131617
4393A18131617q7566625r4765100J47654328K1814518l6500877J1473670j25861617
$$ 118131617 30564992 -64200108 83454220 105268738 68767861 80241531 -45620086
4386d5620086N1926059n7293637R9326605J9787199k0039332K2336513p5119758L3257101
$$ -45620086 6305973 -50987664 48338941 68126140 48086808 70423321 -4696437 28560664
4378B8560664q2950770J6853188K364699N185595K4172625j15922449J17986795m9754398
$$ 28560664 -54390106 -37536918 -35172219 -29986624 -5813999 -121736448 -3749653 -53504051
4370e3504051n12423P8442736K8928974L3098698m000681j28533032K109732M3273284
$$ -53504051 -54016474 24426262 53355236 86453934 82453253 -46079779 -43970047 -696763
4362f96763m2315001N8749484K7394622j6250890q3080980N2039423O9168881m5686478
$$ -696763 -43011764 15737720 43132342 26881452 -56199528 -4160105 65008776 19322298
4354A9322298L3863844P9196698p2324789J084912n7194216k3962076M1421927j08752767
$$ 19322298 53186142 132382840 60058051 61142963 3948747 -20013329 21408598 -87344169
4346h7344169J02556153l0985178l4859153L6616131O1176727j15462219P4273332
$$ -87344169 15211984 -15773194 -50632347 -14016216 47160511 -68301708 5971624
4339E971624j0361728O2847829m7882312j4173168r4571736J70379408q9466533l2028117
$$ 5971624 -4390104 58457725 10575413 -3597755 -98169491 72209917 -17256616 -49284733
4331d9284733R1609014n3485364m0199544O6469032Q1829658p5229134m9415035Q1297706
$$ -49284733 42324281 -11161083 -51360627 15108405 96938063 21708929 -27706106 53591600
4323E3591600n3484574l9859902J6260093n8317902P6285975j9872291L8038953P1222468
$$ 53591600 107026 -39752876 -23492783 -81810685 -5524710 -25397001 12641952 83864420
4315H3864420k002391j45247150k1211857K08236567P6702895k01924768k3302017
$$ 83864420 81862029 -63385121 -84596978 123639589 200342484 -1582284 -24884301
4308b4884301m8708539N8245450n4607577R2869708m0797031Q9422828j02432029R2847311
$$ -24884301 -73592840 -15347390 -69954967 22914741 -17882290 71540538 -30891491 61955820
4300F1955820m1142571p2855434P0078996L2155891o583480l1818171j05659778k0643523
$$ 61955820 20813249 -52042185 18036811 50192702 43609222 11791051 -93868727 -114512250
4292a14512250J25666742n7058834J63978503q6241047L8995783J2302878o4736282
$$ -114512250 11154492 -45904342 118074161 31833114 70828897 83131775 18395493
4285A8395493L8046577R527231p9303215j2355882O521176k3070499K4357407K8836402
$$ 18395493 56442070 65969301 -13333914 -25689796 -19168620 -42239119 -17881712 10954690
4277A0954690J2377871L6821222j35244955M5072840p185790K1061333L617579J03744412
$$ 10954690 23332561 60153783 -75091172 -30018332 -37204122 -16142789 -12525210 91219202
4269I1219202j04410978p7824370J6618431j5800829M3904760R5167654p9446592k1315152
$$ 91219202 -13191776 -91016146 -74397715 -90198544 -46293784 48873870 -30572722 -51887874
4261e1887874k3043863O8986787j7357360N9223300q3656378O1150315R9729989r7100487
$$ -51887874 -74931737 -5944950 -23302310 35920990 -47735388 13414927 113144916 16044429
4253A6044429j39301967L3237079P4560130J4916492M6847562L225757m9945752K7659488
$$ 16044429 -123257538 -90020459 -15460329 -543837 46303725 49529482 -416270 27243218
4245B7243218m908851J0784597k3802205m5869402J2533154J00400947m4164082p3645770
$$ 27243218 22334367 33118964 9316759 -36552643 -24019489 76381458 32217376 -41428394
4237d1428394L4135231N2313703j56551403O5196325l0646285O7405847R080263J8937836
$$ -41428394 -7293163 45020540 -111530863 -46334538 -76980823 -9574976 -494713 18443123
4229A8443123n0121548o8937626L1250522O3028626O4878882m2412200o2151151Q0231366
$$ 18443123 -31678425 -100616051 -69365529 -6336903 58541979 16129779 -46021372 34209994
4221C4209994q7424411l3609502R5140260j6363642R2358157l6964980o4840913J0788678
$$ 34209994 -53214417 -86823919 8316341 -8047301 84310856 47345876 -17495037 -6706359
4213f706359P1020744j8482116k3086093r503095L7372583p8123344N2527942m0424535
$$ -6706359 64314385 45832269 22746176 13243081 50615664 -27507680 25020262 -15404273
4205a5404273j2693380R2982513n1048550P7629136l4561723j3724427j61872615
$$ -15404273 -28097653 64884860 13836310 91465446 56903723 43179296 -118693319
4198a18693319J67101149o1152714k7334692j1303940J630677k4963360N8156014M6841990
$$ -118693319 48407830 -12744884 -40079576 -51383516 -49752839 -74716199 -16560185 30281805
4190C0281805j26782163L7131665j0421353L982802j3077305M0226231l8622296M9911228
$$ 30281805 -96500358 -59368693 -69790046 -65807244 -78884549 -38658318 -77280614 -27369386
4182b7369386R1769815j95167479J05490708n131774M7140243J899121K2379764j33057773
$$ -27369386 64400429 -130767050 -25276342 -30408116 16732127 18631248 41011012 -92046761
4174i2046761M6105256q0366010J43559810P40103K885273l6581551J0552258m6933251
$$ -92046761 -45941505 -126307515 17252295 17992398 20877671 -15703880 -5151622 -52084873
4166e2084873j9010666R3576800M4678310j39482861l7780879N9186410N457690K1226431
$$ -52084873 -71095539 22481261 67159571 -72323290 -110104169 -50917759 -45460069 -24233638
4158b4233638K1944046K7511703O0692763j56562311K8186083J20198581r7165511
$$ -24233638 -2289592 25222111 85914874 -70647437 -42461354 77737227 -19428284
4151a9428284n7707082R2375458p8545616m3806578J25654073j7352451L4256083J7084565
$$ -19428284 -77135366 15240092 -63305524 -107112102 18541971 1189520 35445603 52530168
4143E2530168n8454366o9450570J61797635j26886637k5470812P6244701O85083N117233
$$ 52530168 -5924198 -75374768 86422867 -40463770 -65934582 10310119 10995202 16112435
4135A6112435K7409715q6958778J01227759l2668872N0116668n5811458J7655386p936037
$$ 16112435 43522150 -43436628 57791131 25122259 75238927 19427469 37082855 29146818
4127B9146818L7522624m6173612O5886549o5920865n1180831k9173026O1844268K1028998
$$ 29146818 66669442 20495830 86382379 20461514 -30719317 -59892343 1951925 22980923
4119B2980923j6605266O8821874l6231049q6361478N7859965q213088K0043367q3610409
$$ 22980923 6375657 75197531 38966482 -47394996 10464969 2251881 22295248 -61315161
4111f1315161J1282755j229555R483539j26196703P7404348J52867271N7592987k60392259
$$ -61315161 -50032406 -51261961 -41778422 -167975125 -90570777 62296494 119889481 -140502778
4103a40502778J49014777m2402930q17830O0415337M0005987j11916404n7352764
$$ -140502778 8511999 -33890931 -34708761 25706576 65712563 -46203841 -103556605
4096a03556605J09141248k8135131J4128788l58901l0024932K5547796P7022585o9956255
$$ -103556605 5584643 -22550488 -8421700 -8780601 -38805533 -13257737 63764848 -6191407
4088f191407r5525807J09212575l2657769K2196831P8047699j37153561K5010531M5491924
$$ -6191407 -101717214 7495361 -25162408 -2965577 75082122 -62071439 -37060908 8431016
4080H431016J16361120j15387591M6495102n7476692n9427212j6751221J08383794
$$ 8431016 124792136 9404545 55899647 -1577045 -61004257 -77755478 30628316
4073C0628316j2577805j8691453L746342J2161273K382015m7224209O3880137l5367404
$$ 30628316 18050511 -640942 3105400 15266673 17648688 -29575521 34304616 -1062788
4065a062788L2144244j0848558j9318544J2553422o1026702k0855116J58113722o0746201
$$ -1062788 31081456 20232898 914354 13467776 -47558926 -68414042 89699680 28953479
4057B8953479J5133730n9233874p617125P3568133l4879358K7565317q3492841J4759138
$$ 28953479 44087209 -15146665 -22763790 50804343 15924985 43490302 -40002539 -25243401
4049b5243401Q3793705l100N965117p2690215R475170M5891488k5506573L7380904
$$ -25243401 58550304 58547204 64512321 -8177894 1297276 47188764 21682191 59063095
4041E9063095L1705835j25494458L7813848m7952018L4234436o18383j5547667M7501038
$$ 59063095 90768930 -34725528 3088320 -44863698 -10629262 -11247645 -26795312 20705726
4033B0705726L0236802L6077876n7051676k0085616m8383832L5746088j3891186Q9157662
$$ 20705726 50942528 87020404 29968728 9883112 -38500720 -2754632 -16645818 72511844
4025G2511844o2318775L2718642k596547k9727805M1350765j01049070J04789358r7547463
$$ 72511844 10193069 42911711 40315164 10587359 51938124 -49110946 55678412 -41869051
4017d1869051J02041753J3291556n4803830M4023495n9366658R0433632r9217139J7289240
$$ -41869051 60172702 73464258 18660428 62683923 3317265 93750897 -5466242 11822998
4009A1822998L447918l0796867Q8219688j33265245N5310682k9487589K5985307J45581736
$$ 11822998 15270916 -15525951 72693737 -60571508 -5260826 -34748415 -8763108 136818628
4001A36818628p9170111M0500314r1400571o6668313k5272791L9162547m959519O3892187
$$ 136818628 57648517 98148831 6748260 -59920053 -85192844 -46030297 -50989816 12902371
3993A2902371M2279946p7638616J6798493P9410383n7629509l209189N166516r2974991
$$ 12902371 55182317 -22456299 -5657806 73752577 16123068 12913879 18080395 -74894596
3985g4894596J31367615l5093213l9577259n6464780J15776268q2406849M7387775k438798
$$ -74894596 56473019 21379806 -18197453 -74662233 41114035 -41292814 6094961 3656163
3977C656163r642496q4004062J44053374k9241027j7579683l5404542l8312029O9200726
$$ 3656163 -5986333 -89990395 54062979 24821952 7242269 -28162273 -66474302 2726424
3969B726424K9601126o088361r8907759L4964706N1514430q3113283N3586J24344441
$$ 2726424 32327550 26239189 -72668570 -37703864 13810566 -69302717 -69249131 55095310
3961E5095310p5013397L2514306L696970j7937781K3010271O9807289r485646o8250307
$$ 55095310 -19918087 12596219 16293189 -1644592 21365679 91172968 81687322 13437015
3953A3437015J08244958j10012887K837253q793006L1043723o3376960R4560317m2785186
$$ 13437015 121681973 11669086 14506339 5713333 36757056 -26619904 67940413 25155227
3945B5155227N2270571q6442416R8408351j26409651N9847888q752653J4423228o6042955
$$ 25155227 77425798 -9016618 89391733 -37017918 22829970 14077317 28500545 -37542410
3937c7542410O781223J2903296k7942431J5262817M7395955L1510738p4824723Q3172581
$$ -37542410 -30761187 -17857891 -45800322 -30537505 16858450 48369188 -26455535 56717046
3929E6717046q3759244j7504525M9058141p9237269O7331632J2595812K5738863n5907012
$$ 56717046 -27042198 -44546723 4511418 -74725851 -7394219 5201593 30940456 -24966556
3921b4966556J35243103r3157705J241460J2725549k8885336N833764k7252389J03001531
$$ -24966556 110276547 17118842 18360302 31085851 2200515 8034279 -19218110 83783421
3913H3783421j01422597M2630537m0377341k8124110J29181110m9769191M443802n8254469
$$ 83783421 -17639176 24991361 -15385980 -43510090 85671020 35901829 40345631 -17908838
3905a7908838L2688037q5144782j7277799J11573568p0297698J18576862j18898566
$$ -17908838 14779199 -70365583 -87643382 23930186 -46367512 72209350 -46689216
3898d6689216j9468414l7033711N2524968R776296P3506937k9829167p4939112J8695995
$$ -46689216 -66157630 -103191341 -50666373 -40890077 32616860 2787693 -72151419 -53455424
3890e3455424j645916Q4808305o9133234J23565845l3905773q5150101M9461091m0726355
$$ -53455424 -55101340 29706965 -39426269 84139576 50233803 -34916298 14544793 -26181562
3882b6181562L7422466L2870155o516162m471379m9025305o1770376O2105959n2624721
$$ -26181562 11240904 44111059 37594897 33123518 -15901787 -77672163 -15566204 -68190925
3874f8190925N7002775l8237361J31889957j10857550P0316292K4443154j15248799
$$ -68190925 -11188150 -49425511 82464446 -28393104 41923188 66366342 -48882457
3867d8882457n5481099J02182749K0818232n6753003N5471558l8329400N938060q8169168
$$ -48882457 -104363556 -2180807 18637425 -38115578 17355980 -20973420 -15035360 -103204528
3859a03204528O2855597M8879471J97487085j35781621K6598402o0287593p6528598
$$ -103204528 -40348931 8530540 206017625 70236004 96834406 36546813 -39981785
3852c9981785N7726831L0987682N8827115q8726198K9890020n0560234L560474j1338904
$$ -39981785 17745046 48732728 107559843 18833645 48723665 -1836569 1723905 -9614999
3844i614999Q1237774o1264437M4257614j11373766K7793938J6810961m9938750q147299
$$ -9614999 71622775 10358338 54615952 -56757814 -28963876 -12152915 -62091665 -70238964
3836g0238964P5760022N4920324q1311938m373506P2550990r8852925L8043591j01523656
$$ -70238964 5521058 60441382 -20870556 -25244062 47306928 -51545997 -13502406 -115026062
3828a15026062L6804450j6150584j37599040N83799987j31685941j22832735K9950277
$$ -115026062 -78221612 -94372196 -231971236 351828751 220142810 97310075 127260352
3821A27260352p6314545J4996535J2355370n4562822J23934333k7279504j16925444
$$ 127260352 50945807 65942342 78297712 23734890 147669223 120389719 3464275
3814C464275O8556477Q9052324L512658o0073787M60676112K35630698o35673596
$$ 3464275 72020752 161073076 164585734 104511947 565188059 800818757 165145161
3807A65145161j86936710k4381415O5225699j7228798L6036869M3774964J399941r1874844
$$ 165145161 -21791549 -46172964 19052735 1823937 37860806 81635770 83035711 -8839133
3799h839133J4477904m535543l0530479Q7536815L7508293J15863993n15183455J30964265
$$ -8839133 5638771 1103228 -29427251 58109564 95617857 211481850 -303701605 -172737340
3791a72737340m5084808J65984748L0203942j23947102J21743008J9427713m5099739
$$ -172737340 -217822148 -51837400 -21633458 -145580560 -23837552 -4409839 -49509578
3784d9509578k1781211p8339580J52743708L3343403L3767969o1739588N3042736p8260809
$$ -49509578 -71290789 -149630369 3113339 36456742 70224711 8485123 61527859 -16732950
3776a6732950L2837120o8157016k8780414M4908368P4275587p3825473J29278463
$$ -16732950 16104170 -52052846 -80833260 -35924892 38350695 -35474778 93803685
3769I3803685j16510107j0976004Q1011820l9973067O9788771j11222721L9771161M938056
$$ 93803685 -22706422 -33682426 47329394 7356327 77145098 -34077623 5693538 10631594
3761A0631594j17351607K5219833L6962115n6320187M0901728j678327P1298390n0063783
$$ 10631594 -106720013 -81500180 -44538065 -100858252 -59956524 -61634851 9663539 -40400244
3753d0400244J5468962N9279813j5903266o9572201O3901292l6583169K0333876R7532793
$$ -40400244 -24931282 34348531 18445265 -51126936 12774356 -23808813 -3474937 94057856
3745I4057856j65579622L9641619o7337446P1504323J24393799p6620631q164372O2660154
$$ 94057856 -71521766 -31880147 -99217593 -27713270 96680529 20059898 11895526 74555680
3737G4555680p733249q4968101R1611274J5118914o1436886K3155954j3630396j800446
$$ 74555680 66822431 -18145670 73465604 88584518 27147632 50303586 36673190 34872744
3729C4872744j73614348J65668728M4690541P7775086j60809276N5537605l7586808
$$ 34872744 -138741604 26927124 71617665 149392751 -11416525 44121080 6534272
3722F534272l7978444Q0823609o1778504J3401170q1466990R9296337l1620468K1586362
$$ 6534272 -31444172 49379437 -12399067 1002103 -80464887 18831450 -12789018 8797344
3714H797344O4588238n0646403m8651162L822237j5104336J871274m1997878Q6252586
$$ 8797344 73385582 22739179 -25911983 -22089746 -37194082 -35322808 -77320686 8931900
3706H931900N8543435k0121951q9780107q6363168J39830365m8286984L2393719N7159432
$$ 8931900 67475335 47353384 -42426723 -128789891 11040474 -37246510 -4852791 52306641
3698E2306641n8570849m8313091k3743190N2059024J14275556j04123277Q2567874o082441
$$ 52306641 -6264208 -54577299 -78320489 -26261465 88014091 -16109186 66458688 60376247
3690F0376247p0792181l3650222l280860J02072872r3332887N3973672j5134204M1755079
$$ 60376247 -10415934 -44066156 -47347016 54725856 -38607031 15366641 232437 41987516
3682D1987516r8337041J65222550n8499869N8575677j52735428O9370953j7342193
$$ 41987516 -56349525 108873025 50373156 108948833 -43786595 25584358 8242165
3675H242165k3214882j2887991j229135Q642514K3344971L5671106K8472969m7536661
$$ 8242165 -14972717 -27860708 -29089843 -20447329 2897642 38568748 67041717 19505056
3667A9505056l0594444J0079265m5766104P1792283j14840549O9200217K0234558k1917148
$$ 19505056 -11089388 -1010123 -46776227 25016056 -89824493 -20624276 -389718 -22306866
3659b2306866M0300114q9004917R6299853J9484775l2112497l2217170l4487933M356367
$$ -22306866 17993248 -71011669 25288184 44772959 12660462 -19556708 -54044641 -49688274
3651d9688274L4112970k4953220j7661552P2870626k9444058N2358945o3032868K4824212
$$ -49688274 -15575304 -40528524 -58190076 14680550 -14763508 37595437 -25437431 -613219
3643f13219j8761346k8295552J13776908q2883882Q848649J1729535j248263k2153730
$$ -613219 -19374565 -47670117 66106791 -16777091 -7928442 3801093 2552830 -19600900
3635a9600900Q3827466j11270538o417432Q6411524m3349731K783923J8117356k6184382
$$ -19600900 64226566 -47043972 -53461404 32950120 -10399611 -7615688 10501668 -15682714
3627a5682714j5184535N9957247j5142848j7076709L2677483J8445458r2102846J08486745
$$ -15682714 -30867249 29089998 13947150 -3129559 29547924 47993382 -44109464 64377281
3619F4377281o7460359K4441287K3658632q734510r8069667J46281439j53176621M7234906
$$ 64377281 -3083078 21358209 45016841 36282331 -61787336 84494103 -68682518 -21447612
3611b1447612M5819271J2651596o6517650n04720L9743263M8634246k1039787l950244
$$ -21447612 24371659 37023255 -29494395 -29999115 9744148 58378394 37338607 33388363
3603C3388363m4581761L688869j8114048n6519437N9671288m5892493O3858427l6272266
$$ 33388363 -11193398 -7504529 -25618577 -82138014 -22466726 -68359219 -4500792 -40773058
3595d0773058P0746203L8569754k0377848M1929454j03890685L4308335j1902262m4040434
$$ -40773058 29973145 68542899 48165051 90094505 -13796180 20512155 8609893 -35430541
3587c5430541o596373R696919O7551063m8624195k2298955l0155070J07636353J9734840
$$ -35430541 -42026914 -32329995 35221068 -13403127 -35702082 -65857152 41779201 61514041
3579F1514041m7650400L4602402q3506853K4952197p4239430M344344L2542716k2314298
$$ 61514041 13863641 48466043 -35040810 -10088613 -84328043 -79983699 -47440983 -69755281
3571f9755281M7556511O1440082r1752717M8808472r4576029P2731752J2133592P595918
$$ -69755281 -22198770 39241312 -52511405 -3702933 -98278962 -25547210 -13413618 -5817700
3563e817700k2748360Q164132O2492196m3894972j7751484l1204883O6722579l4400789
$$ -5817700 -28566060 -20401928 42090268 -1804704 -19556188 -50761071 15961508 -18439281
3555a8439281L1373528n9330534n1888111M5468845P1401733O5049937k9356417k7171468
$$ -18439281 12934247 -46396287 -98284398 -52815553 18586180 83636117 54279700 27108232
3547B7108232m717677k9868784N9294603j21745944N7900054l1096905Q9801379j08731199
$$ 27108232 22390555 -7478229 51816374 -69929570 -12029516 -43126421 46674958 -62056241
3539f2056241M4028405L9928243P951863R713881m8496652P8858936j7119816r0063018
$$ -62056241 -18027836 21900407 29852270 39566151 -8930501 69928435 52808619 -37254399
3531c7254399Q5690269l8589043p0745252k8014058J17104310O583003n8504315M7306955
$$ -37254399 48435870 9846827 -60898425 -88912483 28191827 34774830 -23729485 23577470
3523B3577470P3773224n3044392q3058466K288859N3613710K6629038m4682828M4220039
$$ 23577470 97350694 44306302 -38752164 -36463305 17150405 43779443 -903385 43316654
3515D3316654n1657521o0238077Q0266602n7860075O3225282l207559o8839806R1822530
$$ 43316654 -8340867 -68578944 11687658 -46172417 17052865 13845306 -54994500 36828030
3507C6828030o1971155M3612124n7262413k567279O6263188n8238529J08926942p4363594
$$ 36828030 -25143125 18468999 -38793414 -41360693 24902495 -33336034 75590908 1227314
3499A227314p4675750M8204773J3783455k8255138j8834528M0136713n416074Q4972820
$$ 1227314 -73448436 -25243663 -11460208 -39715346 -58549874 -18413161 -23829235 61143585
3491F1143585R166821l7980867l4327405N5778306m5037423n0222313L4505812m5146526
$$ 61143585 70310406 32329539 -1997866 53780440 8743017 -41479296 -6973484 -52120010
3483e2120010J05625874k7346419r654782k0459319Q1691176k8773286j5669450j2163328
$$ -52120010 53505864 26159445 16504663 -3954656 77736520 48963234 33293784 21130456
3475B1130456N8564734n9854876o6845226J33853843j58290639L7936789J08543303
$$ 21130456 79695190 19840314 -47004912 86848931 -71441708 -33504919 75038384
3468G5038384k2904038q4701392Q5491307j3194498j01346843J17493373o8307604
$$ 75038384 52134346 -32567046 52924261 39729763 -61617080 55876293 -12431311
3461a2431311K9824972n965445m2463348n0999668M4899415P1182373j11889469J14635170
$$ -12431311 17393661 11428216 -31035132 -82034800 -37135385 34046988 -77842481 36792689
3453C6792689o2495464m724505j4753357O954132R676525K2153101k4609775P697069
$$ 36792689 -25702775 -30427280 -45180637 -38226505 -28549980 -6396879 -31006654 -23309585
3445b3309585j9684801l6086993L3615281J196155k9682309M8497536M4695549n5907213
$$ -23309585 -42994386 -79081379 -45466098 -44269943 -73952252 -25454716 19240833 -36666380
3437c6666380p471318l6787949O6125018R178076n031888l2720751q425138l612106
$$ -36666380 -44137698 -80925647 -14800629 -5622553 -10654441 -43375192 -51800330 -55412436
3429e5412436l5768152J7737200o346163J15614900q41268j6706618r3290319m5491418
$$ -55412436 -91180588 -73443388 -79789551 35825349 34984081 18277463 -75012856 -120504274
3421a20504274J37413160M067807j12277365P9963728k5672759j1308845J04568632
$$ -120504274 16908886 20976693 -91300672 -11336944 -37009703 -48318548 56250084
3414E6250084p8138342P4621155m9984955j11753599J01333860L1380877p2598164
$$ 56250084 -21888258 52732897 2747942 -109005657 -7671797 23709080 -48889084
3407d8889084k6448689J48655297J4526725o3346567l0393588P9556750p8789520N4709552
$$ -48889084 -75337773 73317524 87844249 24497682 -5895906 73660844 -5128676 49580876
3399D9580876o7656124L3057761N316301r4932285O9672075M6566290m3600618N25958
$$ 49580876 -18075248 14982513 20298814 -74633471 -4961396 41604894 -1995724 -1469766
3391a469766o725690N7776852N3213335j64709907o0774902J86734009j50543839K5438174
$$ -1469766 -8195456 49581396 102794731 -61915176 -122690078 64043931 -86499908 -61061734
3383f1061734J02184476n9804239p3301475M646304J66817798m0281616n9766029m8861355
$$ -61061734 41122742 -18681497 -91982972 -87336668 79481130 39199514 -20566515 -69427870
3375f9427870Q0845725P4292110j78952454O7049653N5171545l8001340O7765552m0422985
$$ -69427870 11417855 85709965 -93242489 -26192836 28978709 -9022631 58742921 18319936
3367A8319936O9460831j15930596L8152667J12614883l4876510j34052317J42936499
$$ 18319936 87780767 -28149829 10002838 122617721 87741211 -46311106 96625393
3360I6625393k3922337n6957991R8005061l8488412K1937125m1045886j07453704
$$ 96625393 72703056 15745065 113750126 75261714 97198839 56152953 -51300751
3353e1300751J15966329m8532900l9025396L5306383l7228615K6287276k149996K6454674
$$ -51300751 64665578 16132678 -22892718 12413665 -24814950 1472326 -677670 25777004
3345B5777004J2214059q3593296J02926821j11113687M3756521K9761510j06924437
$$ 25777004 37991063 -45602233 57324588 -53789099 -10032578 19728932 -87195505
3338h7195505R1652330l7490202P2143816j11217788M8207010O7177629l6183091J0407357
$$ -87195505 4456825 -33033377 39110439 -72107349 -23900339 43277290 7094199 17501556
3330A7501556K9549132k1833771L5278545q4431993M1602489o6150191R137906J5902082
$$ 17501556 47050688 25216917 60495462 -23936531 17665958 -48484233 -39346327 -23444245
3322b3444245L2410115k8096586J20017234q1207801L8762763n0917884J5641416O549456
$$ -23444245 8965870 -19130716 100886518 19678717 58441480 7523596 23165012 29714468
3314B9714468k485375k3563553K8478583p494442N949682l8718227l8702112Q1953448
$$ 29714468 27229093 3665540 32144123 24649681 30599363 -8118864 -46820976 35132472
3306C5132472p3624595J04794350n0801428K0530226o8777165K5416541j4314595r071642
$$ 35132472 -38492123 66302227 15500799 36031025 -32746140 -7329599 -21644194 -30715836
3298c0715836K5851202n7834447M4368154J6159109J2021287Q080636j5436252j386139
$$ -30715836 -4864634 -62699081 -18330927 -2171818 9849469 17930105 2493853 1107714
3290A107714n4217399O7721879o606103q0452013J37678236k8465154M6749053j60428514
$$ 1107714 -53109685 14612194 8006091 -72445922 65232314 36767160 83516213 -76912301
3282g6912301L1123953J1447265M1013795l8649582M9864319j00839293k4497509N1251638
$$ -76912301 -45788348 -34341083 6672712 -31976870 17887449 -82951844 -107449353 -56197715
3274e6197715N0134770J0263140p779428L2880017L7825779q1703943j5110366J0447379
$$ -56197715 -6062945 4200195 -3579233 29300784 67126563 -14577380 -29687746 -19240367
3266a9240367n0590062K7593338L4754309j2128121l6080310N1545579j8593753M2222055
$$ -19240367 -69830429 -42237091 -7482782 -19610903 -55691213 -4145634 -22739387 19482668
3258A9482668j2790914l8458627J2106668l4046523P2291293N7595158k6964874m5146536
$$ 19482668 6691754 -31766873 -19660205 -53706728 18584565 76179723 49214849 4068313
3250D068313n0105580N69748Q1519951r2589434j0382778P1106628j32080560J07128499
$$ 4068313 -46037267 -45467519 36052432 -56537002 -66919780 4186848 -127893712 -20765213
3242b0765213P176266L8760562N093698j9686291Q92118J0828171q9676296J47871016
$$ -20765213 -13588947 25171615 30265313 10579022 11471140 22299311 -67376985 80494031
3234H0494031m745518j14246243n467395j2103362J31661876j58551776J03733884
$$ 80494031 75748513 -38497730 -43965125 -56068487 75593389 -82958387 20775497
3227B0775497J5927779N607414j5427872M2347351n8614553R637898n0285034J03747438
$$ 20775497 36703276 42310690 26882818 69230169 10615616 20253514 -30031520 73715918
3219G3715918k8532623j9344814j15458544J8392445J15853420l6940316M4333389
$$ 73715918 45183295 25838481 -89620063 -71227618 44625802 7685486 52018875
3212E2018875r1538255M7974442N3467396j05228980q73431q160330L8168686m4123385
$$ 52018875 -39519380 8455062 61922458 -43306522 -44179953 -52340283 -14171597 -58294982
3204e8294982J3029610m1541968j1274503J20667973P3010145K350170k12545348J6764952
$$ -58294982 -45265372 -86807340 -98081843 22586130 95596275 97946445 -114598903 -97833951
3196i7833951P3718276K1344702J8100535n4705371P2125720m2341820r412211N9760832
$$ -97833951 -24115675 -2770973 15329562 -39375809 32749911 -9591909 -19004120 40756712
3188D0756712N2531011p5665460l9672162k371198J7952210j2299981r9389140J21501150
$$ 40756712 93287723 17622263 -22049899 -24421097 -6468887 -18768868 -118158008 3343142
3180C343142p6724060N2993771k6343571O8869811L3988112q1228435M5936849J1610179
$$ 3343142 -73380918 -20387147 -46730718 22139093 56127205 -25101230 20835619 32445798
3172C2445798p350009n8324611M6575197N9820965j05521242N6520480k4958369r865403
$$ 32445798 25095789 -33228822 13346375 73167340 -32353902 24166578 -791791 -10657194
3164a0657194K9606115j0816361O1710272M0687937m2636158M304971o4543276J23655581
$$ -10657194 18948921 8132560 69842832 110530769 67894611 72199582 7656306 131311887
3156A31311887j63384463J40236236o3430618r1072346J06783263m4189501m8502088
$$ 131311887 -32072576 108163660 44733042 -46339304 60443959 16254458 -32247630
3149c2247630N1672953M7144083n0298697J7098399Q19610q4424595M7651815L0099312
$$ -32247630 19425323 66569406 16270709 33369108 34188718 -50235877 -2584062 27515250
3141B7515250k9062777o1166927N732547n297653J06540105r0896994N0843364k179478
$$ 27515250 -1547527 -62714454 -56981907 -62279560 44260545 -46636449 4206915 2027437
3133B027437L7700424j47139283M6408736j0108833Q8998885n2830634Q0539661r1942738
$$ 2027437 39727861 -107411422 -61002686 -71111519 17887366 -34943268 45596393 -46346345
3125d6346345l6438218M5488815k3181594K5025603M6569314K0127870p3675570m10517
$$ -46346345 -82784563 -37295748 -60477342 -35451739 11117575 31245445 -42430125 -42840642
3117d2840642l3393365K2156980J54996128o0647470j9056440j9088040r525689N7812604
$$ -42840642 -76234007 -54077027 100919101 40271631 21215191 2127151 -7398538 50414066
3109E0414066r1331141J7583445J03513242n4427116J1360885p7770073Q2208866K8501619
$$ 50414066 -40917075 -23333630 80179612 25752496 37113381 -40656692 41552174 70053793
3101G0053793q982775O079805L9685768m4973021o2258622J5139080k5448526k3313078
$$ 70053793 61071018 67150823 106836591 61863570 -395052 14744028 -10704498 -34017576
3093c4017576M6804305R9953638r2990150n890328k3830570N3274528j75864L3067958
$$ -34017576 12786729 112740367 19750217 13859889 -9970681 43303847 43127983 76195941
3085G6195941r4654063R6424223j4675578p0559608j9816936N807714L664497M4436970
$$ 76195941 -18458122 77966101 63290523 -7269085 -27086021 -21278307 -17613810 26823160
3077B6823160J3245941n7554207L4881803O455542n0585565Q600991M4628569L4686422
$$ 26823160 40069101 -17485106 17396697 23852239 -26733326 -18132335 26496234 61182656
3069F1182656j44287514J37463769j12280774M6513199k6442171N9180409m3892048
$$ 61182656 -83104858 54358911 -57921863 -11408664 -37850835 21329574 -22562474
3062b2562474q732830K3005394m7599654J59865151j28938298L0655884O2226647m1710916
$$ -22562474 -31295304 -8289910 -55889564 103975587 -24962711 5693173 67919820 26208904
3054B6208904r419829p9678576O5687353o161810M2460607j7587307m732587p4356683
$$ 26208904 16789075 -62889501 2797852 -3363958 39096649 21509342 16776755 -57579928
3046e7579928P1988439K4884670O9739769r6768705P612546k2374940L1870269k0882880
$$ -57579928 14408511 39293181 109032950 12264245 19876791 -2498149 29372120 8489240
3038H489240l6964356J23743904j13221425J05960127L8353714p1258126k1922466
$$ 8489240 -28475116 95268788 -17952637 88007490 126361204 55103078 33180612
3031C3180612l4525567q027228n08627k1060121M6454997M1762003j12366290K3617060
$$ 33180612 -1344955 -9372183 -9880810 -30940931 15514066 57276069 -55090221 -31473161
3023c1473161J08997293p2508153K5104665o1974914O8178059q1804018l588624n6329393
$$ -31473161 77524132 5015979 30120644 -31854270 36323789 -45480229 -49068853 -105398246
3015a05398246L7842902P5957510k3151808Q2630534j32863042O0503877m2478511
$$ -105398246 -67555344 8402166 -14749642 67880892 -64982150 -4478273 -46956784
3008d6956784J33657443o3994016K6694149q4435976P7069445j06499170j8133731
$$ -46956784 86700659 22706643 49400792 -35035184 42034261 -64464909 -82598640
3001h2598640J8164590P0763874o164451o654262P3224786n7225082L3753654j29877522
$$ -82598640 -64434050 6329824 165373 -6488889 66735897 9510815 43264469 -86613053
2993h6613053M9117178O3210439J2433611r3783144J9233271K5296075k0782714P1835805
$$ -86613053 -37495875 25714564 38148175 -55634969 -36401698 -11105623 -31888337 39947468
2985C9947468K1084541k2041389l518703l0810161K4005219N5121242q2346947k2471130
$$ 39947468 61032009 38990620 35471917 4661756 28666975 83788217 1441270 -21029860
2977b1029860J6989994N1790430p354056r2070758N5040500Q4503313n2438636q712214
$$ -21029860 -4039866 47750564 40396508 -51674250 3366250 87869563 35430927 26718713
2969B6718713m3582093M2613495k5445851L4976768M0332432j12316488P5367574m7120025
$$ 26718713 -16863380 25750115 304264 35281032 75613464 -36703024 38664550 -8455475
2961h455475N1091229k1339200J0392266j9781748o5564103R961344n283501L4082830
$$ -8455475 42635754 21296554 31688820 11907072 -53657031 -43695687 -48979188 -14896358
2953a4896358R7397344n8550979l2759635l6487403Q7248164J2490332o7141237k60320
$$ -14896358 82500986 23950007 -8809628 -45297031 41951133 54441465 -12699772 -12960092
2945a2960092L4142594j5368263q8275365P0400739j11140098J09622930n0631951
$$ -12960092 21182502 5814239 -82461126 -12060387 -123200485 -13577555 -64209506
2938f4209506J18172837o6053997r8223346J30342403j02927398R2346413o9960200
$$ -64209506 53963331 -12090666 -110314012 20028391 -82899007 9447406 -60512794
2931f0512794J265670O3084575m7758054J1240718j6181924K5548144j315884j4769669
$$ -60512794 -59247124 3837451 -43920603 -32679885 -48861809 -23313665 -24629549 -39399218
2923c9399218L5759169l7276153N6344270n8457338l2440104J05213362l6250425o7097895
$$ -39399218 -3640049 -40916202 15428068 -43029270 -75469374 29743988 -6506437 -73604332
2915g3604332K01754578j59597871K1148923N6901248k991494q1968799N1325817l7556507
$$ -73604332 128150246 -31447625 -10298702 46602546 43611052 -38357747 12968070 -24588437
2907b4588437O4921717K2978736p6623775j427773J10132545q9572707Q2380835l0797983
$$ -24588437 40333280 63312016 -13311759 -14739532 95393013 5820306 88201141 57403158
2899E7403158k3123754m9068005p1051777J91262301j59516538N3010437K2269740
$$ 57403158 34279404 -14788601 -85840378 105421923 -54094615 -1084178 21185562
2892B1185562J8473351m3508287O7579446m2749131J2013841M3249857p8912309L6183055
$$ 21185562 39658913 -3849374 63730072 20980941 32994782 76244639 -2667670 33515385
2884C3515385k9663575j5807545n9657831P4843596j3576956J1664865K8239380o2391731
$$ 33515385 3851810 -11955735 -71613566 3230030 -10346926 1317939 29557319 -32834412
2876c2834412L7993259m9003997J06065066k3297550N153647n9946534P8299935j18534012
$$ -32834412 5158847 -43845150 62219916 38922366 44076013 -15870521 62429414 -56104598
2868e6104598J6505126O9124627j11051996J43147829j49377185L7915375J2730325
$$ -56104598 -39599472 29525155 -81526841 61620988 -87756197 -49840822 -37110497
2861c7110497K3647375l0994047P2109727N2253417l2710613q0765294j2242176L1295559
$$ -37110497 -13463122 -44457169 27652558 79905975 47195362 -33569932 -45812108 -14516549
2853a4516549l778744r37534M884884L1561508q8086279M6404097r037407P7979564
$$ -14516549 -18295293 -19232827 -14347943 17213565 -70872714 -24468617 -33506024 44473540
2845D4473540q2753645O9526154j1144978m7945639q9776831N5503379O5783419q127280
$$ 44473540 -38280105 31246049 20101071 -27844568 -117621399 -62118020 3665399 -4461881
2837d461881k6732067J18001278q4361271p723633k0542199N3282805m7592447J5501101
$$ -4461881 -31193948 86807330 2446059 -5277574 -25819773 27463032 -20129415 -4628314
2829d628314j0486023p860403K983988K1842189n4121330J40830838r4829420o272048
$$ -4628314 -15114337 -22974740 -19990752 1851437 -52269893 88560945 -6268475 -12540523
2821a2540523n805997r536201P609168J1235879P962064k7198854R9778209r9417773
$$ -12540523 -18346520 -27882721 -20273553 -9037674 -1075610 -28274464 71503745 -27914028
2813b7914028M7123946J3682583M6910051n4131676K1928708j01128068N1416528m9785139
$$ -27914028 19209918 32892501 79802552 25670876 47599584 -53528484 -2111956 -51897095
2805e1897095P5488487m6918061J06027468M9582944j30830369J7871709M607883q1813711
$$ -51897095 23591392 -23326669 82700799 132283743 1453374 19325083 23932966 -57880745
2797e7880745N1978583o584320j05275453P2241071K0058759J4354081O9073798m0777350
$$ -57880745 -5902162 -12486482 -117761935 -45520864 -25462105 -11108024 57965774 17188424
2789A7188424m6873830O2381695l5686909M2813058k1347478n3576838r963390k9406659
$$ 17188424 -29685406 32696289 -2990620 39822438 18474960 -35101878 -45065268 -74471927
2781g4471927O1588250J2070424J6217446N1891675n1863292N1708817o7648442K7226220
$$ -74471927 -12883677 -813253 15404193 67295868 15432576 67141393 -507049 26719171
2773B6719171l9656187R7934447q4583378J5229938q5478552Q3900061m0933148N3645922
$$ 26719171 -12937016 84997431 414053 15643991 -69834561 14065500 -26867648 26778274
2765B6778274p3770852J09172360p338286p5127386N7453184m5294761Q2577202M2606847
$$ 26778274 -46992578 62179782 54841496 -20285890 37167294 -8127467 74449735 117056582
2757A17056582j07245798O9412904j45076129n3607502J29174978J0160947q2531391
$$ 117056582 9810784 79223688 -65852441 -119459943 9715035 19875982 -62655409
2750f2655409R1037668M3896188l824115o1727575O1652664n216016j7227044n3377530
$$ -62655409 28382259 72278447 68454332 6726757 68379421 63163405 45936361 -7441169
2742g441169j4206674N1496881j9345627k9623845J1833576l7640980J5299567R3554657
$$ -7441169 -21647843 29849038 10503411 -19120434 -7286858 -44927838 -29628271 63926386
2734F3926386K1302223j32897150M6834937N5376082j07133171J36663728o2864080
$$ 63926386 85228609 -47668541 -833604 54542478 -52590693 84073035 21208955
2727B1208955p4753562K7163502N1140099n5040908N2628883j11488170J86409697
$$ 21208955 -53544607 -26381105 24758994 -30281914 22346969 -89141201 97268496
2720I7268496n5844597j02374487l5844665J59526916K5573555p0326790P072730o0384995
$$ 97268496 41423899 -60950588 -96795253 62731663 88305218 17978428 25051158 -35333837
2712c5333837m0450841J0658227l626684J58268122r8099863K7498155n6800603J0421778
$$ -35333837 -75784678 -65126451 -68753135 89514987 -8584876 18913279 -37887324 -27465546
2704b7465546l5298940J7588415M686689r265323P6240201P649319o3962851Q110889
$$ -27465546 -62764486 -45176071 -40489382 -49754705 26485496 34134815 -29828036 -21717147
2696b1717147j3368221J0905196J18468351Q9758412k21228258K4754306j1460417
$$ -21717147 -35085368 -24180172 94288179 184046591 -37181667 -12427361 -23887778
2689b3887778Q4745993q3066825l2216433N1180533K2795867M7355401K8413633k1650528
$$ -23887778 60858215 -22208610 -54425043 -3244510 19551357 66906758 95320391 73669863
2681G3669863j10463008O0850740J1151939L2338111j04069075K640319M7656415l054422
$$ 73669863 -36793145 24057595 35209534 67547645 -36521430 -33881111 13775304 10720882
2673A0720882n1494828k9118438R5034658J00871938q8832755K6386958r6151947j6556256
$$ 10720882 -40773946 -69892384 25142274 126014212 37181457 63568415 -32583532 -49139788
2665d9139788N3995850M6793739j09880789O7530492j3039760j19933420P1001625
$$ -49139788 4856062 51649801 -58230988 9299504 -3740256 -123673676 -52672051
2658e2672051l0079078Q4664388L5483059k0858843J2061693r1753930L1123822N0430488
$$ -52672051 -82751129 1913259 37396318 16537475 28599168 -63154762 -32030940 18399548
2650A8399548l3660788J0832079p8093365R638192M4157128O6614699m8466433m952197
$$ 18399548 -15261240 -4429161 -82522526 -72884334 -28727206 37887493 -10578940 -15531137
2642a5531137J3579566L8789871o6933808j6050877J00508882m944262r1583204J3976687
$$ -15531137 -1951571 36838300 -30095508 -46146385 54362497 49418235 -42164969 -28188282
2634b8188282n8747121M5429951l1513111N4081042P507778J0560376K5486201m4030761
$$ -28188282 -86935403 -41505452 -73018563 -18937521 -11429743 -869367 24616834 -19413927
2626a9413927m456696P0419335o2421126K6035179J6881787j32426934P4347379Q45396
$$ -19413927 -23870623 46548712 -15872414 10162765 27044552 -105382382 -31035003 -30189607
2618c0189607J09083626l7983848k5134823j06257146J10919722L027978l0050258J096471
$$ -30189607 78894019 40910171 15775348 -90481798 20437924 23465902 -6584356 -5487885
2610e487885l0918561M3079364M104994K932874K7890507L1491975O653750j08722688
$$ -5487885 -36406446 6672918 10777912 13710786 41601293 73093268 79747018 -28975670
2602b8975670J2677412N42341o8376968J26434300K1869290j11689652J74731677
$$ -28975670 -16298258 -15755917 -84132885 42301415 64170705 -47518947 127212730
2595A27212730j37372284M1461674L2705465q9958037R689066O9173271r3750221L1270371
$$ 127212730 -10159554 31302120 64007585 -25950452 -16261386 52911885 -40838336 -9567965
2587i567965J1799504J25378392r7010965o9699055R8567769j16674273J31154991
$$ -9567965 2231539 127609931 30598966 -39100089 59467680 -57206593 73948398
2580G3948398o1215945j7705592R66837J6339113l7526426m9642120P5165793L3365238
$$ 73948398 12732453 -4973139 -4006302 12332811 -25193615 -74835735 330058 33695296
2572C3695296K0225779j19023413J06168390j08824262J24547177o6159212O1589840
$$ 33695296 53921075 -65102338 41066052 -67758210 56788967 -9370245 52219595
2565E2219595k6659713k530601r0344868P5532117k9952677n2178975O0192489R079259
$$ 52219595 25559882 23029281 -67315587 8216530 -21736147 -73915122 -13722633 -4643374
2557d643374j0101457O922890j1036397Q203116j6453380M5977264k1209623j8802090
$$ -4643374 -14744831 -7821941 -18858338 -10655222 -27108602 18868662 -2340961 -21143051
2549b1143051N771268j6333347l2453340L3842457m4623878K3499120L5140157m3502830
$$ -21143051 -15371783 -31705130 -64158470 -30316013 -74939891 -51440771 -16300614 -59803444
2541e9803444N9027607m3378581n6407087Q7191391o2660743K4277616k7165354M0785521
$$ -59803444 -775837 -44154418 -100561505 -13370114 -76030857 -51753241 -78918595 -38133074
2533c8133074K4109253n17017o1018209Q8465077j25070622J39748783j11774755K7501315
$$ -38133074 -14023821 -14540838 -75559047 12906030 -112164592 27584191 -84190564 -56689249
2525e6689249k5702572R0794049R571039L5368742L1554809k823166l4637954L1573629
$$ -56689249 -82391821 8402228 17973267 53342009 84896818 82073652 47435698 79009327
2517G9009327j00318140M9265950p4839647L6903617l5354923k6261882N4538161J0802652
$$ 79009327 -21308813 27957137 -46882510 -9978893 -45333816 -71595698 -17057537 -6254885
2509f254885o719590P839836k370345k7694195j6778799l3343060r3202291J14436460
$$ -6254885 -12974475 -5134639 -7504984 -35199179 -51977978 -85321038 -178523329 -64086869
2501f4086869m6194716J2306120K5815860l3394241p0008840J42994826n1208671
$$ -64086869 -110281585 -97975465 -72159605 -105553846 -175562686 -32567860 -83776531
2494h3776531J25838790n5535472j2225287l381338K3453069m3166799M164361R1565838
$$ -83776531 42062259 -13473213 -25698500 -29079838 -5626769 -48793568 -44629207 46936631
2486D6936631r771886k7896422K1515855O3838651j46956939O0560533O510566J3671991
$$ 46936631 37164745 9268323 30784178 94622829 -52334110 8226423 14736989 28408980
2478B8408980M3570800L1168300k7992905p810468n4682869K6882106j7285596J1181236
$$ 28408980 71979780 103148080 75155175 67344707 12661838 39543944 22258348 33439584
2470C3439584l0316536J7169400l4488064j4790127K1517803R6272252j04841909
$$ 33439584 3123048 20292448 -14195616 -28985743 -7467940 88804312 -16037597
2463a6037597J17838692n7858873m1398322M5149998o3269530m2635819J45351810
$$ -16037597 101801095 43942222 2543900 47693898 -15575632 -58211451 87140359
2456H7140359j42816312P8066600Q575418p9846044J1052178o1680091J54309129j2118559
$$ 87140359 -55675953 22390647 30966065 -48879979 -37827801 -99507892 54801237 42682678
2448D2682678p4720927L9239164J404589j8455986j6940219M1866085M3006297n4063894
$$ 42682678 -32038249 7200915 8605504 -9850482 -26790701 15075384 58081681 4017787
2440D017787K7480272l0335561q83763o2949806J9518637R2654290j12323149j2345704
$$ 4017787 31498059 1162498 278735 -62671071 -43152434 49501856 -62821293 -75166997
2432g5166997Q8575472j10303652K0876037M6945179K7243564M2480519M5405470q0655459
$$ -75166997 13408475 -96895177 -76019140 -29073961 -1830397 40650122 86055592 5400133
2424E400133q4015682N3237743n0045064J30242211p9373276J46679515j60670278
$$ 5400133 -78615549 -25377806 -75422870 54819341 -24553935 122125580 -38544698
2417c8544698P4136270N1528409m9755585J0954684M7833660M127405o2688978j02295203
$$ -38544698 35591572 87119981 37364396 48319080 96152740 100280145 37591167 -64704036
2409f4704036K3946996K6283296k16596j26323576J63201110J1193677J368137m0430086
$$ -64704036 -40757040 -14473744 -14690340 -141013916 22187194 33380871 34749008 -5681078
2401e681078M9022965R582356k9409735k992314n3092906j05702786P6821548K1899633
$$ -5681078 43341887 52924243 23514508 20522194 -32570712 -138273498 -61451950 -39552317
2393c9552317O2552392p4100687q7639334J65890460n5626835J05197089j04466691
$$ -39552317 23000075 -51100612 -138739946 27150514 -28476321 76720768 -27745923
2386b7745923N3437636Q692690o0709762l983873L3978020K1477484M367329K6021201
$$ -27745923 25691713 34384403 -26325359 -30309232 3668788 25146272 29513601 55534802
2378E5534802k4897131o5156290j6520444J23985563j05534263Q3344344o7023200
$$ 55534802 30637671 -34518619 -51039063 72946500 -32587763 50756581 -16266619
2371a6266619k4075780O6601278l4863378j5133377K3077792q8130722O3570413j639720
$$ -16266619 -40342399 26258879 -8604499 -23737876 -660084 -88790806 -25220393 -26860113
2363b6860113l0002003p296028l5808093R6808383l4890656M8656685O0407545r6267828
$$ -26860113 -56862116 -64158144 -99966237 -3157854 -38048510 10608175 71015720 -25252108
2355b5252108M0365635j8299534q8879718Q5958429q6370867R4254003n50589P530015
$$ -25252108 15113527 -3186007 -92065725 -6107296 -92478163 1775840 1225251 8755266
2347H755266L4698359o1045489n430890N7785881q6332853P6946557n8498291K4512890
$$ 8755266 43453625 -17591864 -23022754 34763127 -51569726 25376831 -33121460 -8608570
2339h608570M2117087j008741j28628179J80781716K7890049l5876027q7079749L8191592
$$ -8608570 33508517 32499776 -96128403 84653313 112543362 76667335 -10412414 27779178
2331B7779178p6932771R9780922l673791n1874246O109736j10443445J19242679Q7785809
$$ 27779178 -49153593 50627329 46953538 -4920708 1189028 -109254417 9988262 97774071
2323I7774071l9029091m0187689o7825749N9565335l8724080j5825931K9749691Q0237853
$$ 97774071 58744980 18557291 -49268458 10296877 -28427203 -44253134 -14503443 65734410
2315F5734410k1738683l3832938o2631000r973940J02908650m0888829K1668436k6456296
$$ 65734410 43995727 10162789 -52468211 -62442151 40466499 -422330 21246106 -5210190
2307e210190M760870M1705826n4714390k6730255K6304520J9360776j1990167j9080526
$$ -5210190 -449320 41256506 -13457884 -40188139 -13883619 5477157 -6513010 -25593536
2299b5593536p4834762M9239577j1835176N1347496j9515322K9103132K5441241m1466278
$$ -25593536 -100428298 -51188721 -63023897 -11676401 -31191723 -2088591 23352650 -18113628
2291a8113628J7934149l1675481J3353132K7700690k4103128n857064J3340100j4876129
$$ -18113628 -179479 -31854960 -18501828 9198862 -14904266 -20761330 -7421230 -22297359
2283b2297359O7838145n0149523K5750381k2356433N3867943L5930888l7421629L1818583
$$ -22297359 45540786 -4608737 21141644 -1214789 52653154 88584042 51162413 82980996
2275H2980996o7586135l7494810P972236j7300364L9941079L9599074p2123969K925052
$$ 82980996 15394861 -22099949 -14127713 -31428077 8513002 48112076 -24011893 -21086841
2267b1086841L0748069P805792n8046060R2008617k0707184m3131955M6516585j9345964
$$ -21086841 9661228 17467020 -40579040 51429577 30722393 -12409562 34107023 14761059
2259A4761059k2018320O8627068j60159147O9495065n8431130Q3902046M1654025l3829935
$$ 14761059 -7257261 61369807 -98789340 -29294275 -87725405 -3823359 37830666 4000731
2251D000731l1115414n4202707L6052148L3386013j4995018O8931303K6320148M181169
$$ 4000731 -27114683 -81317390 -45265242 -11879229 -26874247 42057056 68377204 72558373
2243G2558373p4575775j7997761q4952354P1267218l7462361P1164380j1028848J5048535
$$ 72558373 -2017402 -20015163 -104967517 -33700299 -71162660 1720 -11027128 4021407
2235D021407n0979136M5292755q1324813Q9690471j1747793N4441120n2865353M7621944
$$ 4021407 -46957729 -1664974 -82989787 6700684 -5047109 49394011 -3471342 44150602
2227D4150602j44052421K6884014J9414240J9023645j7322415N8472067P0132475o6364393
$$ 44150602 -99901819 -73017805 -53603565 -34579920 -51902335 6569732 76702207 10337814
2219A0337814q4817047J02307319o6931843l7140394L4131022Q2334997J4667513J5282858
$$ 10337814 -74479233 27828086 -39103757 -76244151 -42113129 40221868 54889381 70172239
2211G0172239r5176624m3524873R718253K7634317p306280N0606478r350877n2368769
$$ 70172239 -25004385 -68529258 -58811005 -31176688 -38482968 12123510 2772633 -49596136
2203d9596136r8169018J26136514P3783538m686972j8107785L7825971q5410145j22332357
$$ -49596136 -147765154 -21628640 52154898 47467926 29360141 67186112 -18224033 -140556390
2195a40556390R7233834o1711772O2790859M982845K0062736J4845994o8795201O3164880
$$ -140556390 -43322556 -105034328 -42243469 -37260624 -17197888 -2351894 -71147095 -7982215
2187g982215M197404Q0396790j05836041l1254333O5966094n9167611r660661O190838
$$ -7982215 -3784811 76611979 -29224062 -60478395 5487699 -53679912 -63340573 -57149735
2179e7149735K8214246J1311779m2341882J6912028R1414905k376290p0433429o7991665
$$ -57149735 -28935489 -17623710 -59965592 -43053564 48361341 45985051 -24448378 -92440043
2171i2440043J60122105k7752916j4965493p0657021O6783303j88114814J79020179
$$ -92440043 67682062 39929146 24963653 -45693368 21089935 -167024879 11995300
2164A1995300m5833967Q1473663r967743o0290768K9466381j3276327r4531485J00639011
$$ 11995300 -33838667 47634996 37667253 -22623515 6842866 -6433461 -100964946 -325935
2156c25935M9581411j4253753j06027236Q1394064m0420675L0464389p3324336Q7132456
$$ -325935 49255476 35001723 -71025513 10368551 -30052124 412265 -72912071 14220385
2148A4220385j8758494J22052498r4938844L8105723n4537348j2320259M6348927n1993167
$$ 14220385 -4538109 117514389 22575545 60681268 6143920 -6176339 40172588 -11820579
2140a1820579L9782854r6266093J9542276J14156226J3449734j60720749j1136055
$$ -11820579 27962275 -68303818 -48761542 65394684 78844418 -81876331 -93012386
2133i3012386J30148723o20050L0965229j81016074J45918131o9949431N12932L7821610
$$ -93012386 37136337 36516287 67481516 -113534558 32383573 -37565858 -37052926 768684
2125G68684m0870654j62917J993843M0065254n4263794n1385543k4046193K22458322
$$ 768684 -40101970 -40264887 -38271044 1794210 -52469584 -103855127 -127901320 94557002
2117I4557002M8618474l5888367j06192514j7840592Q2128964q9597216j1606280N7278942
$$ 94557002 143175476 107287109 1094595 -16745997 65382967 -24214249 -35820529 21458413
2109B1458413L1439177j14213695N6835316o3905279L5897404P980711M7373210j2205270
$$ 21458413 52897590 -61316105 -4480789 -68386068 -32488664 -24507953 22865257 10659987
2101A0659987J8280304L2965157l9847986r4433615N8392036k899839Q449468o8208769
$$ 10659987 28940291 61905448 22057462 -72376153 -13984117 -16883956 -8434488 -76643257
2093g6643257k0784813r095874R2683258l8106959O928409j36247288n24596L57717860
$$ -76643257 -97428070 -106523944 -13840686 -51947645 -45019236 -181266524 -181791120 175926740
2085A75926740L6729979o1351581j50541769l3979172R5708289j6222396j4932388
$$ 175926740 212656719 151305138 763369 -33215803 62492486 46270090 31337702
2078C1337702N0545784M6608419p5098508j3661460n194955J4841216K53874916K03115317
$$ 31337702 81883486 128491905 53393397 39731937 34536982 49378198 303253114 506368431
2070E06368431L1215234l10955950j17550902n0628997o34265J1108643L5239090L8516198
$$ 506368431 537583665 226627715 109076813 58447816 57813551 68922194 104161284 142677482
2062A42677482l2991419k4489860j9458899M3651966J0002568P6110206q9123436P5215962
$$ 142677482 109686063 85196203 65737304 109389270 119391838 195502044 106378608 181594570
2054A81594570l15030027J06946892N2527642j23094004L2012019N8973382l2614169
$$ 181594570 -133435457 -26488565 26039077 -97054927 -65042908 -6069526 -38683695
2047c8683695k4295228m588212Q6146680m1439696J4989498l4709282O4191807k1966163
$$ -38683695 -62978923 -67567135 18579545 -22860151 -7870653 -42579935 21611872 -354291
2039c54291P7005819L3063629r2715632l3081832J0175067o0157584K0589223L5592061
$$ -354291 76651528 109715157 16999525 -16082307 -5907240 -66064824 -45475601 -9883540
2031i883540p6771462K05400138m4944298o6063275K2724733j2532518N8905066Q75584
$$ -9883540 -86655002 118745136 73800838 7737563 30462296 17929778 76834844 77710428
2023G7710428k4301950r1251446m2724426P584498N7405228j18955581J30807751k5622945
$$ 77710428 53408478 -37842968 -80567394 -72982896 -15577668 -134533249 -3725498 -29348443
2015b9348443P6302134J9819593j68322937P4235562J1425779K9648211q7203019J9344950
$$ -29348443 46953691 66773284 -101549653 -27314091 -15888312 13759899 -73443120 -54098170
2007e4098170M4608315l3149807K2192151j3236666J9930366K0098401N2168401J2777872
$$ -54098170 -9489855 -42639662 -20447511 -33684177 -13753811 6344590 58512991 71290863
1999G1290863R1773j89860617R5705233R8523636k0388638p0976633Q622446M8177651
$$ 71290863 71382636 -118477981 -22772748 75750888 55362250 -15614383 -6991937 41185714
1991D1185714j5358525L6891970r3293886M9197822n5437021R0794618o0895494L9891100
$$ 41185714 25827189 62719159 -30574727 18623095 -36813926 53980692 -6914802 32976298
1983C2976298r0116173K1425780Q5209564m4970369m7413475N419411l734524m2276082
$$ 32976298 -57139875 -35714095 49495469 4525100 -42888375 -37468964 -41203488 -83479570
1975h3479570J32595737n1534889Q9181735j51419897O5706971j1382256p9179825
$$ -83479570 49116167 -2418722 86763013 -64656884 1050087 -10332169 -89511994
1968h9511994O9857118j20435J5355076O7229620k8960554n8571955k0753096J04118564
$$ -89511994 -19654876 -19775311 -4420235 62809385 33848831 -24723124 -45476220 58642344
1960E8642344l8035750P8564564j40148979j2942376m2579206O2163238N5901490L5327685
$$ 58642344 20606594 99171158 -40977821 -53920197 -96499403 -34336165 21565325 56893010
1952E6893010M3584442m9828187K1549535L169078L7910758j34868261j1688075P0300002
$$ 56893010 100477452 50649265 72198800 75367878 113278636 -21589625 -33277700 37022302
1944C7022302j0559562M4371915o6201757M8565952k6242299M2152607L1178575M9883111
$$ 37022302 26462740 70834655 4632898 53198850 26956551 69109158 100287733 150170844
1936A50170844j41811491P662821M6726575m6426791K8157744M752593j8946693K8024345
$$ 150170844 8359353 16022174 62748749 16321958 44479702 49232295 30285602 58309947
1928E8309947p481806l011882r6164514M4469165k0347901R2421182r9489128l8004089
$$ 58309947 50828141 47816259 -48348255 -3879090 -24226991 68194191 -31294937 -69299026
1920f9299026O8848022K8982687J6036565o2369776m761544p3399746J24045254n8545058
$$ -69299026 -451004 28531683 44568248 -17801528 -22563072 -95962818 28082436 -30462622
1912c0462622L6134656k6243619K4175079j8353998P8121594n0094799j3991053K7638812
$$ -30462622 5672034 -20571585 3603494 -14750504 63371090 13276291 -714762 26924050
1904B6924050J2111095P912663j16524696P9648833j4276268q2330520J00944582J0592657
$$ 26924050 39035145 46947808 -69576888 10071945 -4204323 -86534843 14409739 25002396
1896B5002396N0429220M525531l8778411n9645792j3096183J03624590j66766285P6365572
$$ 25002396 75431616 79957147 41178736 -18467056 -31563239 72061351 -94704934 -18339362
1888a8339362K7669487m3607977L648715O7326178j27724588N0733758Q0207310L9760182
$$ -18339362 9330125 -34277852 -30629137 36697041 -91027547 -40293789 39913521 79673703
1880G9673703q7717515K8066989J2825908n1482972O151283o282715j5530046M9413836
$$ 79673703 -8043812 20023177 32849085 -18633887 -12482604 -18765319 -34295365 15118471
1872A5118471L8797718k1752547m2109488L1417259m0613799Q7530857O2952988q5981222
$$ 15118471 53916189 32163642 -9945846 21471413 -19142386 68388471 131341459 45360237
1864D5360237o3410427O6778664p1174124P5586571j7831005L367337p6398416m8709639
$$ 45360237 -18050190 48728474 -22445650 53140921 35309916 38677253 -37721163 -86430802
1856h6430802O8666783P142345M6421185k1495112o0744965P8129198K6662242j68143719
$$ -86430802 -17764019 -10621674 35799511 14304399 -46440566 31688632 58350874 -109792845
1848a09792845Q4846390L4278809K3004022j33635232L8310708k4872362k2732231
$$ -109792845 -24946455 9332354 32336376 -101298856 -62988148 -87860510 -110592741
1841a10592741J52469802q2337290O8134351l7541486k0197189O7620938Q2935734
$$ -110592741 41877061 -40460229 27674122 -9867364 -30064553 37556385 120492119
1834A20492119k35204665K7240685J53261745m0714443q0609757J15473142p5397189
$$ 120492119 -114712546 -87471861 65789884 25075441 -55534316 59938826 -15458363
1827a5458363J11041495j27015682M5371100M1848868m7220814N2359108k5707175
$$ -15458363 95583132 -31432550 13938550 55787418 8566604 60925712 35218537
1820C5218537K6208936r1723538K5186796K5351814j0020504L4669524n7505348l5041731
$$ 35218537 61427473 -30296065 -5109269 20242545 10222041 44891565 -12613783 -47655514
1812d7655514P5699441l4135823l7435635K8659803O7914508n7429479L152162l6404115
$$ -47655514 28043927 -6091896 -43527531 -14867728 53046780 -4382699 -1230537 -37634652
1804c7634652Q0338827o6825237K734449J8839581N78423L6824178o0723218o106105
$$ -37634652 42704175 -24121062 -21386613 -2547032 -1968609 34855569 -25867649 -31973754
1796c1973754q510891k0149964R1388258k8574259o7896867L596837J20942145o4003031
$$ -31973754 -40484645 -60634609 30753649 2179390 -65717477 -62120640 58821505 -5181526
1788e181526l479964p4857608J5412417Q0256810l8623128L0847544n9453767Q9980616
$$ -5181526 -8661490 -83519098 -68106681 12150129 -26472999 4374545 -55079222 34901394
1780C4901394m9073406O972235J3347307j7896264q274975J9695065M3026729k6005253
$$ 34901394 -14172012 -7199777 6147530 -11748734 -20023709 -328644 42698085 16692832
1772A6692832J1092746K444251N5270330m7595081q724552O6925194j06107351k078020
$$ 16692832 27785578 30229829 85500159 37905078 29180526 96105720 -10001631 -12079651
1764a2079651m6966700Q3026143l6771898K9131181j1257222N032696J1569025M0064906
$$ -12079651 -59046351 23979792 -12792106 16339075 5081853 10114549 21683574 61748480
1756F1748480k8602088n5116245N3525565l6262850n679388m9936872M7482255O657335
$$ 61748480 33146392 -21969853 31555712 -4707138 -10386526 -60323398 -12841143 -6183808
1748f183808k3413130l5286634l884447J7328254L1315044p4784943J51470384j02578341
$$ -6183808 -29596938 -64883572 -68768019 -51439765 -20124721 -94909664 56560720 -46017621
1740d6017621M0345723m9632186N9599617p3326822M3877616N1264387o4691917N4749462
$$ -46017621 -5671898 -55304084 4295533 -69031289 -25153673 26110714 -38581203 16168259
1732A6168259J1714447l7125269K5254263j1620465m8015674L9576077L3668435K901407
$$ 16168259 27882706 -9242563 16011700 4391235 -43624439 -4048362 29620073 32521480
1724C2521480k3404218l1917247K5446817M5085647r4904055R6326225j7591232p5741893
$$ 32521480 9117262 -22799985 2646832 47732479 -47171576 49154649 31563417 -44178476
1716d4178476P9076184j06719299O1549326J5255536k9589102m1852574N4803924n1850088
$$ -44178476 34897708 -71821591 -10272265 4983271 -24605831 -66458405 -11654481 -63504569
1708f3504569P0958154j1508257o635554m5608624J12291513l9578928q2287646R4265097
$$ -63504569 7453585 -4054672 -10690226 -56298850 55992663 16413735 -65873911 28391186
1700B8391186j29878439J15989920j8377230k2705567n3475667P4754614R304534k4349104
$$ 28391186 -101487253 14502667 -3874563 -26580130 -80055797 -5301183 4003351 -20345753
1692b0345753Q0430965l4254691n9898048M4775071j36250210J24827966N4349328
$$ -20345753 60085212 25830521 -34067527 10707544 -125542666 -714700 53634628
1685E3634628k6538075p4369715N9365857j2865634l8497897N5213056k0216364L2064441
$$ 53634628 27096553 -47273162 12092695 -772939 -39270836 15942220 -4274144 27790297
1677B7790297r9060611R8211542p3792969J1018029J7320498Q868973P1117095r4246326
$$ 27790297 -71270314 26941228 -46851741 -35833712 -18513214 -9644241 61472854 -32773472
1669c2773472L362407n569884J2793925m0478836j0407627L2828573R6397926j32288264
$$ -32773472 -29411065 -34980949 -22187024 -62665860 -73073487 -40244914 56153012 -76135252
1661g6135252O5635631R3379804j30727302O2917202l9227905J02621664r6671086
$$ -76135252 -10499621 82880183 -47847119 15070083 -24157822 78463842 -18207244
1654a8207244P7209727o8132433p4451076j8292059O3332584L9738998j2153199M7636328
$$ -18207244 59002483 -9129950 -83581026 -101873085 -38540501 1198497 -10954702 36681626
1646C6681626M921376P955460r54426p1856892Q8489854l3538739M857400m3527040
$$ 36681626 41603002 49558462 48604036 -23252856 65236998 31698259 36555659 -6971381
1638f971381K8026555j5411600k4975182q9447742J35323655M4384589l3903025N9203094
$$ -6971381 21055174 5643574 -19331608 -108779350 26544305 70928894 37025869 96228963
1630I6228963q4485642M836722j205461O2517030l0019490j37638149R4957361J2192740
$$ 96228963 11743321 16580043 15374582 77891612 47872122 -89766027 5191334 17384074
1622A7384074K9780944p6057640N9998601j6780239P8542942j08693299l0302983M8212911
$$ 17384074 47165018 -28892622 31105979 14325740 92868682 -15824617 -46127600 2085311
1614B085311O0204879l1886350k4922415K4754468n7124258m055811M0721232Q0391536
$$ 2085311 62290190 30403840 5481425 30235893 -26888365 -30944176 9777056 90168592
1606I0168592l5948620k9532359l2520028m7993239N5025024M1848830p532778j8325610
$$ 90168592 54219972 24687613 -7832415 -55825654 -800630 41048200 33515422 15189812
1598A5189812K8259715n8376861O3584300p6492980m908016o3881271J18150268m7401480
$$ 15189812 43449527 -14927334 48656966 -27836014 -32744030 -96625301 21524967 -25876513
1590b5876513o0269630R7258777r0345991P7665172k57499j9667578M0683930n2202350
$$ -25876513 -86146143 11112634 -79233357 -1568185 -1825684 -21493262 19190668 -33011682
1582c3011682J147879K9551214M5398143j34929526J22865963p206681n0780242j51754
$$ -33011682 -31863803 -2312589 43085554 -91843972 31021991 23815310 -26964932 -27116686
1574b7116686M1134667j1389547K4176741m2319643k1824584M4172612l8989793O1632329
$$ -27116686 14017981 2628434 26805175 -15514468 -37339052 6833560 -32156233 29476096
1566B9476096M4720176o3911532o9137537N0112863Q5020630j74997661K11687257
$$ 29476096 74196272 10284740 -58852797 -8739934 76280696 -98716965 112970292
1559A12970292p2089758J0796592m4487482J3941098J8496384p142110j3940294Q3987210
$$ 112970292 40880534 51677126 7189644 21130742 39627126 32485016 18544722 102531932
1551A02531932o5931166k434738p3795408J08128593l4136561n719063J0771621J6072772
$$ 102531932 36600766 34166028 -39629380 68499213 34362652 28643589 39415210 55487982
1543E5487982n7081183K210284j2173460J4760508m3442705J04187281j25756331O2569072
$$ 55487982 -1593201 617083 -11556377 3204131 -40238574 63948707 -61807624 761448
1535G61448L3125179L020220P107266l6804304O615452J2995547j3164655L6744576
$$ 761448 33886627 36906847 44014113 7209809 13825261 26820808 13656153 50400729
1527E0400729r9814393K96297K2786885L4175458j6785415l8455942L1673588J06198000
$$ 50400729 -49413664 -49117367 -26330482 7844976 -8940439 -47396381 -15722793 90475207
1519I0475207j24002897O2537977q8228005k0695888N0191700K2122949K3786448o119586
$$ 90475207 -33527690 29010287 -59217718 -79913606 -29721906 -7598957 16187491 10067905
1511A0067905k2331395K7628302m5188182r3285055N591199J17804531Q347142N442815
$$ 10067905 -12263490 15364812 -29823370 -123108425 -117517226 287305 8634447 14077262
1503A4077262m2379692P1921343n8491860M2346988M9432063q256421j16393987k3049572
$$ 14077262 -28302430 43618913 -14872947 27474041 76906104 68649683 -47744304 -70793876
1495g0793876J13522758M33588r3022826O4128599O2091695k7090773j3570285P0577235
$$ -70793876 42728882 43162470 -49860356 14268243 76359938 49269165 35698880 106276115
1487A06276115m9679927l5828510J0277258Q747540K5143716r2753475j1492640M876780
$$ 106276115 56596188 20767678 31044936 39792476 64936192 -27817283 -39309923 -34433143
1479c4433143M6072316K8723939m1207122M5128873m9339630k0690855O2206866m008855
$$ -34433143 11639173 40363112 -844010 44284863 -5054767 -25745622 36461244 32452389
1471C2452389o3908933R647304K4840244J5951640m9862504o9450959J27704887l6908725
$$ 32452389 -31456544 -21809240 3031004 18982644 -30879860 -100330819 27374068 -9534657
1463i534657J1428066o0841738J12730008q5093060M6446003J8420389k2870117k8284663
$$ -9534657 1893409 -58948329 53781679 -31311381 15134622 33555011 10684894 -17599769
1455a7599769l0338789O3364695q0957085P0768632m9434702O5893692J6261938m2935538
$$ -17599769 -47938558 15426137 -65530948 5237684 -44197018 21696674 37958612 -4976926
1447d976926Q2728656j00364383o9477370J47387209m2136271o228436P7008832o1498784
$$ -4976926 77751730 -22612653 -92090023 55297186 13160915 6932479 83941311 22442527
1439B2442527n5600303M4743662Q1412837r5512379M647471k0184503N7724692r8780246
$$ 22442527 -33157776 11585886 92998723 -2513656 2133815 -18050688 39674004 -59106242
1431e9106242J9962074M1517590k3538100N0640943q3699943O0027544N7151300j44555506
$$ -59106242 -39144168 2373422 -21164678 29476265 -54223678 5803866 62955166 -81600340
1423h1600340K5223806M9612638l8312622O8722493l7909403J9367897o8023265L8499050
$$ -81600340 -56376534 -6763896 -45076518 23645975 -14263428 5104469 -62918796 -24419746
1415b4419746k8340852j2646512M588639n0434600L3541756O9249595k0125159r0750372
$$ -24419746 -52760598 -65407110 -60818471 -111253071 -77711315 -8461720 -28586879 -119337251
1407a19337251J47358267j1735836j03108548P1675863P2063421n3469959k5901536
$$ -119337251 28021016 16285180 -86823368 -15147505 56915916 3445957 -22455579
1400b2455579L6024182j00003584K6946245J5733991J25830990l4285475l001143J0687282
$$ -22455579 13568603 -86434981 -59488736 -43754745 82076245 47790770 44789627 55476909
1392E5476909j502140j4315437r2468386J08646720p733129o4023885l9872451R6728643
$$ 55476909 53974769 39659332 -52809054 55837666 48104537 -15919348 -55791799 40936844
1384D0936844m7517444N8544565L024061J118791n9010850P2113641r5501321P2319390
$$ 40936844 -6580600 51963965 54988026 56106817 -2904033 69209608 -26291713 46027677
1376D6027677j07512716J48617860r4363260K2034952j7430341n0758092R8656232
$$ 46027677 -61485039 87132821 -7230439 14804513 -2625828 -53383920 45272312
1369D5272312q8588563O2150205L3260891j6880351o4704204R2584709k6500903q665517
$$ 45272312 -43316251 18833954 52094845 35214494 -29489710 63094999 36594096 27928579
1361B7928579o7374421J2113763J04332959j19058206J6584732k437972k2866991K2494267
$$ 27928579 -39445842 -27332079 77000880 -42057326 -25472594 -27910566 -50777557 -28283290
1353b8283290O3378199l4796589M1947037o9188150o1753302J5687300N5564793K9788599
$$ -28283290 35094909 298320 42245357 -26942793 -88696095 -73008795 -17444002 12344597
1345A2344597r608931j6193214j6440865N1029309l407957l3821131k0820180J35047368
$$ 12344597 2735666 -13457548 -29898413 21130896 17722939 -16098192 -36918372 98128996
1337I8128996j55704571O4940789n1916559K962270M7063163N6941911J7279994j00800900
$$ 98128996 -57575575 7365214 -44551345 -41589075 5474088 62415999 79695993 -21104907
1329b1104907J6576427M5755026J1999351m6251780j15951j1030180o542297N9664552
$$ -21104907 -4528480 41226546 53225897 6974117 6858166 -4172014 -10714311 48950241
1321D8950241j02325520Q3669912m435007N0420963k7035280l3049469O849434p2605282
$$ 48950241 -53375279 30294633 25859626 76280589 49245309 16195840 23045274 -49560008
1313d9560008J06275352r2555298K1755231O3736179k4958308n6616345k1787158N9527960
$$ -49560008 56715344 -35839954 -14084723 49651456 24693148 -31923197 -53710355 5817605
1305E817605k4814773P0255339k6902420q9476882M031599R1440364m3154145N3439405
$$ 5817605 -18997168 51258171 24355751 -65121131 -61089532 30350832 -12803313 40636092
1297D0636092p8798722P8485307K5111024p5405172P9251868m8562241N8916340o2586149
$$ 40636092 -38162630 40322677 65433701 -9971471 69280397 20718156 79634496 17048347
1289A7048347m6665915K699588L0180548l7751865J1152628p758997M6111452l4540960
$$ 17048347 -29617568 -26917980 3262568 -34489297 -23336669 -31095666 15015786 -19525174
1281a9525174l5384827J44005963q3119543j05922906R4284491J236466m4587106n4375451
$$ -19525174 -54910001 89095962 5976419 -99946487 -5661996 -4425530 -49012636 -103388087
1273a03388087o776513J36764343j34033641L9749896K6015260M8673752j1926334
$$ -103388087 -110164600 26599743 -107433898 -67684002 -41668742 7005010 -4921324
1266d921324Q4931650m9953028q5921782K9969195P1537616n2908575P8256731p5071914
$$ -4921324 80010326 30057298 -55864484 -25895289 45642327 -7266248 70990483 -4081431
1258d081431l6949489R569665Q3013986J1175950l8301997k8234693J12173055o7230180
$$ -4081431 -41030920 -31461255 51552731 62728681 24426684 -3808009 108365046 41134866
1250D1134866r5910741Q1899479n589973M9273196q8929842j1395348Q0590517l3573122
$$ 41134866 -54775875 27123604 21533631 70806827 -18123015 -29518363 51072154 17499032
1242A7499032j4810322M6177965k528150m4462949K6364014O7479011q6386591m5379756
$$ 17499032 2688710 48866675 46338525 1875576 28239590 95718601 9332010 -36047746
1234c6047746K5026194L080670N4915001o8182404n4468391O1464860K6449404m4449642
$$ -36047746 -11021552 -7940882 46974119 -21208285 -75676676 -14211816 12237588 -32212054
1226c2212054K1087425P8409395L4007326q1237187L5446389o5686924J4528860k4170910
$$ -32212054 -11124629 67284766 101292092 20054905 55501294 -10185630 4343230 -19827680
1218a9827680l8680719K4443596J29502122l6282017j5058690J6868301q878266J0128657
$$ -19827680 -58508399 -34064803 95437319 59155302 44096612 60964913 52086647 62215304
1210F2215304J7985688J3236069j4247049j04400897Q5302893j12315766P3442288
$$ 62215304 80200992 93437061 79190012 -25210885 60092008 -52223758 21218530
1203B1218530p1330019J06044691k5987498J02433151j54210188Q8344695n7935305
$$ 21218530 -50111489 55933202 29945704 132378855 -21831333 66513362 8578057
1196H578057l1582863P1764564l3062491L429403n9224092L0840561n4331879J3607493
$$ 8578057 -23004806 48759758 15697267 19126670 -40097422 -9256861 -63588740 -49981247
1188d9981247J14779142r6537190R9152164p411321O779968k1052912q117652n4230276
$$ -49981247 64797895 -31739295 67412869 60001548 66781516 45728604 37610952 -16619324
1180a6619324j4803513K2750477q1075449R2810875J2503927l3906323O5408362k7659089
$$ -16619324 -31422837 -8672360 -89747809 3063066 15566993 -18339330 47069032 19409943
1172A9409943l731387j5214299P2518989p9180753Q0767011j44430133M3744023M0350483
$$ 19409943 15678556 464257 72983246 -6197507 74569504 -69860629 -26116606 14233877
1164A4233877o4500618L9212876l3984638P2810045n4361247M1336114j8539628k7332850
$$ 14233877 -50266741 -11053865 -45038503 27771542 -26589705 14746409 -3793219 -31126069
1156c1126069p707424R6601298r6684465K3784970k6127405m2223455Q9831055j4684751
$$ -31126069 -38833493 57767805 -38916660 -15131690 -41259095 -83482550 6348505 -8336246
1148h336246m1569202m3145096R5238717O8549755r5945111J7336743J0933156j7815345
$$ -8336246 -49905448 -93050544 2188173 70737928 -25207183 -7870440 3062716 -14752629
1140a4752629J6189762J3707074k3677228o1390274N8721722p683463P7138245j04674013
$$ -14752629 1437133 15144207 -8533021 -69923295 -11201573 -18885036 58253209 -46420804
1132d6420804M8717249J8527583O5923824m2362235j24960766R3113220o2877180N7427467
$$ -46420804 2296445 20824028 86747852 44385617 -80575149 12538071 -50339109 7088358
1124G088358N6788656j0538213n1379959N8697579j26264028R6456114k3671622j0395856
$$ 7088358 63877014 53338801 1958842 60656421 -65607607 30848507 7176885 -3218971
1116c218971Q2788053r4031340O5653379k4109811n1525933N8793320p3093556M7563925
$$ -3218971 79569082 -14462258 51191121 27081310 -24444623 34348697 -38744859 8819066
1108H819066k6803246R324871L0095536p3650534O0398101Q701994k6249507N618360
$$ 8819066 -17984180 -8659309 21436227 -52214307 8183794 16885788 -9363719 -3745359
1100c745359l8171722J02926854r4331375m757601K8333566M1908560l1702350l6769090
$$ -3745359 -41917081 61009773 -33321602 -38079203 -9745637 32162923 460573 -36308517
1092c6308517L1050656O2610741p7661868M6127694L8817748j10743174J03024198
$$ -36308517 -5257861 57352880 -20308988 25818706 64636454 -46106720 56917478
1085E6917478j1937159O7629460j69484644L0935927J9478108L9737757p5588959L3464548
$$ 56917478 44980319 112609779 -56874865 -25938938 -6460830 33276927 -42312032 -8847484
1077h847484R1327562p9503265M6834960j0105042J8305535j35979603P3829941k627923
$$ -8847484 82480078 2976813 49811773 39706731 58012266 -77967337 -4137396 -6765319
1069f765319j0239461q0780328J23259239l8813395M1831112m8561593P0236725r8307714
$$ -6765319 -17004780 -97785108 25474131 -13339264 28491848 -20069745 50166980 -48140734
1061d8140734N1167303l4811071O1075451j30573661N316506R5687576K2861782q1030864
$$ -48140734 3026569 -31784502 29290949 -101282712 -95966206 -278630 22583152 -58447712
1053e8447712O7838976m9135328J01149026M06119k2464386r451502m3019878m4849988
$$ -58447712 9391264 -39744064 61404962 61811081 39346695 29895193 -13124685 -57974673
1045e7974673R0311025m020901K677731k110444j2088455n9901213M459286L0278104
$$ -57974673 32336352 28315451 30993182 28882738 16794283 -43106930 -38647644 -8369540
1037h369540O7828776p4790676L701444j09271K1609563k5663682O3313994j6528985
$$ -8369540 59459236 -15331440 -11629996 -11739267 9870296 -15793386 47520608 30991623
1029C0991623k0096712m7783858q680307n9554575K9539299m644370J11505846q4284330
$$ 30991623 10894911 -36888947 -45569254 -105123829 -75584530 -80228900 31276946 -53007384
1021e3007384j513580j2370763J18532274j17912387R5797583j2750081J01909328
$$ -53007384 -54520964 -66891727 51640547 -66271840 29525743 16775662 118684990
1014A18684990j90108366K3736336O2991519k4838727j5735185K6451210q15587q89904
$$ 118684990 -71423376 -47687040 15304479 -9534248 -25269433 1181777 366190 -523714
1006e23714o2016904R8737569N411265l5495469k1259103j7656201L3897613l5971189
$$ -523714 -62540618 36196951 41608216 6112747 -15146356 -32802557 1095056 -34876133
998c4876133p5511529R2657839P1394992j16279524O5711375k8936966L3159816R1239847
$$ -34876133 -110387662 -17729823 53665169 -62614355 3097020 -25839946 7319870 98559717
990I8559717l9358829p7232411N4272027m6735378q129362O051081j8640965l1825411
$$ 98559717 59200888 -18031523 36240504 -10494874 -18624236 -12573155 -31214120 -63039531
982f3039531O9184174p6520058J16603998m5498910K9217458R552070L0754237p7604324
$$ -63039531 6144643 -70375415 46228583 729673 29947131 39499201 70253438 -7350886
974g350886M5416607J5776789k167096l6167817j1374507L520593r911366q869722
$$ -7350886 38065721 53842510 51675414 15507597 4133090 7653683 -2257683 -11127405
966a1127405j0579853Q8296996p0446718j357078l174006j6746217L1335620l9879599
$$ -11127405 -21707258 66589738 -3856980 -5214058 -8388064 -25134281 6201339 -33678260
958c3678260K2958637Q1903445j14362367N6500625k1369410m2642172L5880464M728915
$$ -33678260 -10719623 71183822 -43178545 13322080 -8047330 -50689502 -14809038 -10080123
950a0080123Q8786069o2297719n2059595p8157647N8567126M5616002Q7107240o9560558
$$ -10080123 78705946 16408227 -35651368 -113809015 -55241889 -9625887 77481353 7920795
942G920795n5683792O9263868q1564584K7423445M2084678O11733N3540053k1706945
$$ 7920795 -47762997 21500871 -60063713 -32640268 9444410 10056143 63596196 41889251
934D1889251k0681392j43798137M2454124M2150748N8247294J9358241j4919496q8243293
$$ 41889251 21207859 -122590278 -80136154 -37985406 20261888 39620129 24700633 -63542660
926f3542660O1857559J9317181K0833090K1832392j60821638J02573586K1537077o6410977
$$ -63542660 -1685101 17632080 38465170 60297562 -100524076 2049510 23586587 -42824390
918d2824390N9480263n7840916O7432197q1683151L8086148Q0696917r6381923K3415094
$$ -42824390 16655873 -41185043 26247154 -55435997 -17349849 63347068 -33034855 -9619761
910i619761O6928450p4296433O174630l1309874O940361O4603851J2147961J8844945
$$ -9619761 57308689 -16987744 -10813114 -42122988 -35182627 29421224 41569185 60414130
902F0414130q3459410L8868447p4067831l5087938J27387447L6911403n5209736l6875130
$$ 60414130 -23045280 15823167 -58244664 -93332602 34054845 70966248 15756512 -21118618
894b1118618m0567075Q1265111k5649480J0976416j6925852Q3444792r3110926p0802568
$$ -21118618 -61685693 19579418 -6070062 4906354 -12019498 71425294 -21685632 -92488200
886i2488200J0147829k8891692Q3326599J04761251j2269922n9213774P5493691p3194325
$$ -92488200 -82340371 -111232063 -27905464 76855787 64585865 5372091 80865782 7671457
878G671457R710312J280230r3005m0025008J07703282q6076084m0000903m3901685
$$ 7671457 17381769 18661999 18568994 -21456014 86247268 171184 -39829719 -83731404
870h3731404Q5115928N6872503o6313011J7824590K650699J1018292j1833277k8080549
$$ -83731404 1384524 58257027 -8055984 9768606 12419305 23437597 11604320 -16476229
862a6476229q022055l0366179J02480021j71634590J12702436p7615143j7887480j8864628
$$ -16476229 -24498284 -54864463 47615558 -124019032 -11316596 -88931739 -106819219 -125683847
854a25683847Q8857238O5213355J2941442r7753378R8371947r1838663J44346629
$$ -125683847 -36826609 28386746 41328188 -56425190 41946757 -49891906 94454723
847I4454723j66021886K626204J08569291q7085164K5859471n340786L4827477K5171146
$$ 94454723 -71567163 -68940959 39628332 -47456832 -21597361 -26938147 7889330 33060476
839C3060476l4331931L1441553L1958011j0943683J2028406o736422n3459219R141725
$$ 33060476 -1271455 30170098 62128109 51184426 63212832 56476410 3017191 12158916
831A2158916k6774292l1841046M5968850k9373267n3127182J29003848p4936676q5378119
$$ 12158916 -14615376 -46456422 -487572 -29860839 -82988021 46015827 -28920849 -114298968
823a14298968J23870821M6822810m6042768k937867k3703133k5575378M6522987p6910324
$$ -114298968 9571853 56394663 10351895 7414028 -16289105 -41864483 4658504 -72251820
815g2251820R0203394K5718511m0873860q4945656N5488263J32909449r6055508n0527586
$$ -72251820 17951574 43670085 2796225 -82149431 -26661168 106248281 10192773 -40334813
807d0334813J34268783j29355152M7293710o8350328J01619737q2624466J09356846
$$ -40334813 93933970 -35421182 11872528 -56477800 45141937 -37482529 71874317
800G1874317m7072308K5781807r9894773l817883p311808L5721937P1361911j09562472
$$ 71874317 24802009 50583816 -49310957 -53128840 -60440648 -24718711 46643200 -62919272
792f2919272J3262284R8103775r2641777R7362203m4014943O663382k9293373Q6639881
$$ -62919272 -49656988 48446787 -44194990 53167213 9152270 15815652 -13477721 73162160
784G3162160r7108335l2977972N2310308O559426M9781890m2619581K3426116o9662791
$$ 73162160 -23946175 -56924147 -4613839 1945587 51727477 9107896 32534012 -37128779
776c7128779Q9444746K6968782l8812608k7714975l1921651P4313710n0599306L8376191
$$ -37128779 52315967 79284749 40472141 12757166 -19164485 55149225 4549919 42926110
768D2926110j5343726l0986140l170617J9195654j9690442k8935096N2296071j8638067
$$ 42926110 27582384 -3403756 -6574373 12621281 -7069161 -36004257 16291814 -2346253
760b346253O6738493r6014888J6730402l7875105J70387360j56459651P804752P0428768
$$ -2346253 64392240 -31622648 -14892246 -52767351 117620009 -38839642 -31034890 39393878
752C9393878j09211153P1539539m2323083P3411727M687381j21833428Q0009140P1167401
$$ 39393878 -69817275 1722264 -40600819 32810908 37498289 -84335139 -4325999 66841402
744F6841402k2142023j4240681L1801438k4885215L229495k6226046J07667455j53823025
$$ 66841402 44699379 30458698 62260136 37374921 40604416 14378370 122045825 -31777200
736c1777200P8239797k7001420K0038567l761050k4758516l0558530O3395614N51693
$$ -31777200 46462597 19461177 39499744 35738694 10980178 -19578352 43817262 44368955
728D4368955m6708269M1662382l0574462j5047647P569523m4759170J8184868r479338
$$ 44368955 -2339314 39323068 8748606 -6299041 1270482 -43488688 -25303820 -34783158
720c4783158l7727414J9613130Q5348270j08983516P8193691Q069610k977220l4129404
$$ -34783158 -72510572 -52897442 32450828 -76532688 1661003 9730613 6753393 -27376011
712b7376011L7161834K7889026p7394652M3495476m670450k3523282l926176N4792151
$$ -27376011 9785823 37674849 -39719803 3775673 -894777 -24418059 -28344235 26447916
704B6447916o3901514J05900885j28287651M2261269J8176395k1441486K415063k5546221
$$ 26447916 -37453598 68447287 -59840364 -17579095 597300 -20844186 -18429123 -43975344
696d3975344J08717542o5843370M2540394n0869710K1443078j5365215M5610523j50392039
$$ -43975344 64742198 -1101172 41439222 -9430488 12012590 -3352625 42257898 -108134141
688a08134141K00956592j27271791K6463542N1657404j38374328J41655581r4231175
$$ -108134141 92822451 -34449340 -7985798 43671606 -94702722 46952859 -47278316
681d7278316J34192790m2075347j5385433N064200K1141000L0164792j7542370j10938826
$$ -47278316 86914474 44839127 29453694 34517894 55658894 85823686 68281316 -42657510
673d2657510Q5497533P601149n1619327j3563908j8838077K0152673O0097598m6612799
$$ -42657510 42840023 50441172 -1178155 -14742063 -33580140 -13427467 46670131 57332
665E7332K740380Q192738n2819239K4297735M8024613m1930280p301543O3885991p3228836
$$ 57332 2797712 10990450 -41828789 -17531054 30493559 -11436721 -18738264 45147727 -28081109
656b8081109j2134561M8795852m4990717L1691644K6605611l4969716l0204332q328998
$$ -28081109 -40215670 8580182 -36410535 -4718891 21886720 -13082996 -43287328 -51616326
648e1616326P21657K0510214K2684625P860193m8448311J71956882j17509470j2062437
$$ -51616326 -50894669 -30384455 -7699830 160363 -48287948 123668934 6159464 -5902973
640e902973j3014643J21080267j14033348Q1010694o6452357j02144866R1399872N7009517
$$ -5902973 -18917616 102162651 -11870697 69139997 2687640 -99457226 -8057354 48952163
632D8952163m3926432r8246769J33257771J2828246q081098k341750p7727685P1641160
$$ 48952163 5025731 -93221038 40036733 52864979 44783881 42442131 -35285554 36355606
624C6355606p9836861Q1318115q9966418M2599259j15696855J00454575k1636077Q7557022
$$ 36355606 -43481255 37836860 -52129558 -9530299 -125227154 -24772579 -46408656 41148366
616D1148366M9137982o1012689J02960707j39131109R8376686n4282307Q607313j12521513
$$ 41148366 90286348 29273659 132234366 -6896743 91479943 37197636 45804949 -66716564
608f6716564R6151829o3028333K1950774j4734510L4446106N2840541L9626983m1383002
$$ -66716564 29435265 -33593068 -11642294 -26376804 8069302 60909843 100536826 59153824
600E9153824l8187480N6828502m5998019n3002548M440652K523478K2127888m7594165
$$ 59153824 20966344 77794846 31796827 -21205721 -16765069 -14241591 7886297 -39707868
592c9707868K7936191o2159453P4527902p7503975J14870252j41473859P1990645O822768
$$ -39707868 -11771677 -73931130 596772 -76907203 37963049 -103510810 -31520165 -24697397
584b4697397k8560769L8199617l3947066J2450924N6956448n0120090n8493940O9568116
$$ -24697397 -53258166 -15058549 -49005615 -36554691 20401757 -29718333 -88212273 -18644157
576a8644157P7117584K5422625j05547811O3291788p5078679K497606R0879191p8430593
$$ -18644157 58473427 83896052 -21651759 41640029 -33438650 -30941044 59938147 -18492446
568a8492446l2317234N9622287K9041486m2351682L8786032R405787l4916533O7157699
$$ -18492446 -50809680 8812607 37854093 -4497589 34288443 43694230 8777697 75935396
560G5935396K7064674j48362677O5237197l8292785l3462649J6285884N8558537r9831705
$$ 75935396 103000070 -45362607 19874590 -18418195 -51880844 -35594960 22963577 -76868128
552g6868128Q2782389L0242211n9905059N4535854l2268909o800361k7121748m8833866
$$ -76868128 5914261 36156472 -23748587 30787267 -1481642 -8282003 -35403751 -84237617
544h4237617M8830981J8437743L3731110r1351822J18590330l2050296n680737K8490782
$$ -84237617 -35406636 -16968893 16762217 -74589605 44000725 11950429 6269692 34760474
536C4760474j952596n0203258P11029k035166K7150021k3222900P4958130m0371838
$$ 34760474 32807878 -17395380 -16684351 -18719517 8430504 -14792396 60165734 19793896
528A9793896J0086076k87180O244972l3313102O0122805k9372168Q440440l1191610
$$ 19793896 29879972 29592792 35837764 2524662 62647467 33275299 41715739 10524129
520A0524129r585136L6698557m048784M9979631Q223894J2413112j13979482l2321001
$$ 10524129 938993 37637550 33588766 83568397 91792291 104205403 -9774079 -42095080
512d2095080O2038282m5641331j2838551N9282883l296110k304497q5350296M6923091
$$ -42095080 19943202 -25698129 -38536680 20746203 17450093 15145596 -70204700 -23281609
504b3281609P2389331q6531956J39009342p5966949o4534678O6106446o5122671n487313
$$ -23281609 49107722 -37424234 101585108 25618159 -38916519 27189927 -37932744 -43420057
496d3420057J3372974K6177099k6811676L0239079l6549943j2690231m0471201Q8475396
$$ -43420057 -30047083 -3869984 -30681660 -442581 -36992524 -49682755 -90153956 -1678560
488a678560j1206219L6282601o0202741L8780077m9271768r607189K64676P3536653
$$ -1678560 -12884779 23397822 -36804919 1975158 -47296610 -56903799 -56639123 16897530
480A6897530o7534795M6571122l4340891M3972145N161631n7241280R5222025j8558520
$$ 16897530 -50637265 -4066143 -38407034 5565111 10726742 -46514538 48707487 30148967
472C0148967n86812l6942082k1994824J3341818M6621141M7843804j23003394O9139526
$$ 30148967 29562155 -7379927 -29374751 -16032933 30588208 78432012 -44571382 24568144
464B4568144o7949412O7231099k5009711N0596166l8147246M9619143o6040842J5558290
$$ 24568144 -43381268 23849831 -1159880 49436286 11289040 60908183 -5132659 10425631
456A0425631K8922623m9980504m0252977J18457427o9583931o6578078O1404272r4139546
$$ 10425631 39348254 -10632250 -50885227 67572200 -2011731 -68589809 -7185537 -101325083
448a01325083J18608877J9996128m893595j00998169L3230507K0168502Q9691542J6238807
$$ -101325083 17283794 37279922 32386327 -68611842 -35381335 -15212833 74478709 90717516
440I0717516m5962036m5576597j14632889R2615056P662044J5045527N3650545o3895470
$$ 90717516 44755480 -821117 -115454006 -22838950 -15176906 -131379 53519166 -10376304
432a0376304R5632377j33705931J25664972p7381917K251074n3218391Q9378531J1280764
$$ -10376304 85256073 -48449858 77215114 -166803 2084271 -51134120 38244411 49525175
424D9525175p1849723N4923825q6114675Q8767154N2565931p4616486o583717l4514315
$$ 49525175 -22324548 32599277 -53515398 35251756 87817687 13201201 6617484 -27896831
416b7896831N1092532o488165l3715101L3507221p424559k4525383O5180210m7942343
$$ -27896831 23195701 16707536 -17007565 16499656 9075097 -15450286 49729924 1787581
408A787581j0877104j0295838k5537241J04337334M521543j18942601O4354907N8339280
$$ 1787581 -9089523 -19385361 -44922602 59414732 63936275 -55006326 9348581 67687861
400F7687861r1713546k2757399K3126071R9486472r0153755Q6898105l7191063m968338
$$ 67687861 -24025685 -46783084 -23657013 75829459 -14324296 72573809 35382746 30414408
392C0414408m2338085o1271994J35362984l2911771O650446L0715063k1362107o4924338
$$ 30414408 -11923677 -73195671 62167313 29255542 35905988 66621051 45258944 -19665394
384a9665394l324970L406403M0171479Q985096j15442411J15649969r6193310N2438520
$$ -19665394 -22990364 -19583961 20587518 29572614 -85869797 29780172 -66413138 -13974618
376a3974618K8497378J5564905n989921Q0696112j05803921L2439604m8208144m7151672
$$ -13974618 14522760 30087665 24097744 104793856 -1010065 31429539 -16778605 -63930277
368f3930277j2076347m3815205K4253926J30879339l1804889M5702778l522958l7900970
$$ -63930277 -76006624 -119821829 -95567903 35311436 3506547 49209325 45686367 7785397
360G785397k4283842L4186970l2172577K7629536n02881j07690655M9699960R2684700
$$ 7785397 -16498445 17688525 -14484052 13145484 12642603 -95048052 -45348092 47336608
352D7336608j14755286j2205720J69218202o7905713l0157128J00226404j05920693
$$ 47336608 -67418678 -79624398 89593804 21688091 -8469037 91757367 -14163326
345a4163326m8714775M8948270O2710706n8713629P029866o3297747O2391888J478842
$$ -14163326 -62878101 -13929831 48780875 -9932754 -2902888 -66200635 -3808747 -2329905
337b329905m4074864M6635592J9031582n7712721J05270518n4302114n1443595J4021427
$$ -2329905 -46404769 230823 19262405 -38450316 66820202 12518088 -38925507 -24904080
329b4904080J5355706O3295518j9717073p3604545j1780641L0867483j9402068J7831881
$$ -24904080 -9548374 53747144 34030071 -39574474 -51355115 -20487632 -39889700 -22057819
321b2057819L1855387r4416669J18192083M81392K738609k4726834k5726406K8210930
$$ -22057819 9797568 -84619101 33572982 34054374 36792983 12066149 -13660257 14550673
313A4550673L4744240j1900804o1528892K6122868k1657325K2679896M0666133n8236739
$$ 14550673 49294913 37394109 -24134783 1988085 -19669240 3010656 43676789 -14559950
305a4559950L4118515l1142010P1295546j0204346p1040128O6061562J5005949l5670466
$$ -14559950 19558565 -11583445 59712101 49507755 -21532373 44529189 59535138 23864672
297B3864672L5943900q4528595N2793574p7629126J27645385k1928214N0455447j57115292
$$ 23864672 59808572 -24720023 28073551 -49555575 78089810 56161596 106617043 -50498249
289e0498249K6710166Q4797052k0847423l1504532k5879014N5799454L5112846q6461190
$$ -50498249 -23788083 61008969 40161546 8657014 -17222000 38577454 73690300 -12770890
281a2770890P5118475o0793063N2379767q2247962J06044119m5859212o2044049O7498045
$$ -12770890 62347585 1554522 53934289 -28313673 77730446 31871234 -30172815 37325230
273C7325230m8070013O7345897l1099816r309796l5397933J05008312k2581148p9080137
$$ 37325230 -10744783 56601114 25501298 16191502 -19206431 85801881 63220733 -15859404
265a5859404j1876847k5160713P6919413k7642506j3073301M6884476m2158119o1531530
$$ -15859404 -27736251 -52896964 24022449 -3620057 -16693358 30191118 -11967001 -73498531
257g3498531R7919773m0059848k7206719O1274707n4287621P2370930j19088406K9135852
$$ -73498531 24421242 -15638606 -42845325 18429382 -35858239 36512691 -82575715 -53439863
249e3439863r137145N5376219L4210316L0102626q5667333O2993978o7323962O1710733
$$ -53439863 -62577008 -7200789 27009527 57112153 -28555180 34438798 -32885164 28825569
241B8825569K629267r4308367R6117744n9221795K2588149J5663359k2800678K968438
$$ 28825569 31454836 -62853531 33264213 -25957582 -3369433 12293926 -10506752 -7538314
233g538314O9692506n0702785N3421410n7136417j3168745J20191018j39561068K0367897
$$ -7538314 62154192 11451407 64872817 7736400 -5432345 114758673 -24802395 -4434498
225d434498J483452K8793573J6768028J6709365n5639131L0172062J9335663n4292056
$$ -4434498 -2951046 25842527 42610555 59319920 3680789 33852851 53188514 -1103542
217a103542M6519959k6370808J2702576j3972085l1798232K2479109j06915507L4386581
$$ -1103542 45416417 19045609 31748185 17776100 -14022132 8456977 -98458530 -64071949
209f4071949J37632299o2838903l5321031J0392298k1741567L0074323N4826039j96973586
$$ -64071949 73560350 10721447 -24599584 -14207286 -35948853 -5874530 48951509 -148022077
201a48022077K52544085j5813832j10769153N1842055K8569356o9055219P967876j4724692
$$ -148022077 104522008 88708176 -22060977 29781078 58350434 -10704785 -2736909 -17461601
193a7461601N2996678K4473797r9731415J37461322n2348672k1569328k1795747m4036923
$$ -17461601 35535077 60008874 -39722541 97738781 45390109 23820781 2025034 -42011889
185d2011889J42034113q2749799J3938422n1176763l736853R874370p9838121O5135644
$$ -42011889 100022224 17272425 31210847 -19965916 -23702769 -13828399 -93666520 -28530876
177b8530876J4488476O8985705m8379229Q4618544m9531084j10602351J10911512l5869693
$$ -28530876 -14042400 54943305 6564076 91182620 41651536 -68950815 41960697 6091004
169F091004m629466k6406983L5877153p0025038l1050262N2945997j3674152Q6638405
$$ 6091004 1461538 -24945445 10931708 -59093330 -90143592 -37197595 -50871747 35766658
161C5766658K2942304m5787641K5655954m7731065m4970109K0090270q2369459J06656736
$$ 35766658 58708962 12921321 38577275 -9153790 -54123899 -34033629 -116403088 -9746352
153i746352j15062266J23158487j9136523M607237n2111264O0654120p84038P9876940
$$ -9746352 -124808618 -1650131 -20786654 -16179417 -68290681 -7636561 -8420599 71456341
145G1456341q4628586R695768l7396471j8585994K7024317j6404892j9224921O089816
$$ 71456341 -13172245 -3476477 -40872948 -59458942 -32434625 -48839517 -68064438 -61974622
137f1974622J75319853j22549220Q2002883m4983143j03118153k597899J22931408
$$ -61974622 113345231 -9203989 72798894 27815751 -75302402 -77900301 45031107
130D5031107k7194824r0374250K4695156J7780371O3785672P2317871j01706975M6986274
$$ 45031107 17836283 -72537967 -47842811 -30062440 33723232 106041103 4334128 51320402
122E1320402k7861210l4489716m5745377L0036348o1743858O3646334j1239119K9626759
$$ 51320402 23459192 -11030524 -56775901 -26739553 -88483411 -24837077 -36076196 -6449437
114f449437J8174097m6270878J10282642l0869910o8821380k2824781k9407462k565495
$$ -6449437 11724660 -34546218 75736424 44866514 -23954866 -46779647 -76187109 -78752604
106g8752604K1440699J9852008K9843680M701696J5710924K4069269P9268683j45839504
$$ -78752604 -57311905 -37459897 -7616217 -2914521 12796403 36865672 116134355 -29705149
98b9705149L1260842L5501085m9737665k8802929k44591P8742574M7142548l9375364
$$ -29705149 1555693 37056778 -12680887 -41483816 -41728407 37014167 84156715 44781351
90D4781351q0108338P0376453m7438903K6607068p1633752J66774080j19336365p0394903
$$ 44781351 -35326987 35049466 -12389437 14217631 -57416121 109357959 -9978406 -80373309
82h0373309P2302593l1215729K2101796N8761675L669047P241957j25508307m8119256
$$ -80373309 -8070716 -39286445 -17184649 41577026 45246073 52488030 -73020277 -121139533
74a21139533K9906972N085663J15885232N964721O754337j3588628j23145662J16780854
$$ -121139533 -91232561 -86146898 29738334 35703055 42457392 28868764 -94276898 22503956
66B2503956p4093031M7821624P3237809R947758j32588470L2394852m0549693P5561610
$$ 22503956 -51589075 -3767451 69470358 79418116 -53170354 -20775502 -61325195 14236415
58A4236415M0012939q0911578J14909127j11880471k1608830L8060138J4905798l3847983
$$ 14236415 54249354 -26662224 88246903 -23633568 -45242398 -7182260 7723538 -26124445
50b6124445N2208726N1163688o1758611M8563027j08441929J4301091L2828489J9926025
$$ -26124445 26084281 77247969 15489358 64052385 -44389544 -30088453 2740036 22666061
42B2666061q0052781J6146673L0681584j0574878n38897O3903205p180693m6495084
$$ 22666061 -57386720 -41240047 -10558463 -21133341 -21672238 42230967 35050274 -11444810
34a1444810P8984218m0199423q306117n3670724K9292399J5464007j07440630J02935219
$$ -11444810 67539408 27339985 19033868 -34636856 -5344457 10119550 -97321080 5614139
26E614139p987990Q8313849p4025537j5334167M209330K3912625J0269815n6393280
$$ 5614139 -2373851 85939998 11914461 -3419706 789624 24702249 34972064 -21421216
18b1421216K9262960J0914835m8716188Q2077324j33967784L0332291K8454182P2274742
$$ -21421216 7841744 18756579 -29959609 52117715 -81850069 -51517778 -23063596 49211146
10D9211146k6439524k0732603m1020348J9824447J2991421q5378305O8516380J6390710
$$ 49211146 22771622 2039019 -38981329 -19156882 -6165461 -91543766 -23027386 -6636676
2f636676P0988794r2413350N2167080q8166218k6115808P0416074l7862689K6676391
$$ -6636676 64352118 -28061232 24105848 -64060370 -90176178 -19760104 -57622793 -30946402
-6c0946402L0462293L2322741N256285k0462184J3997522r2373243J42782302o4236823
$$ -30946402 -484109 31838632 37094917 16632733 30630255 -61742988 81039314 16802491
-14A6802491j4177089k0842549k1658674M7790421j00299726J66603834o3193948l3093746
$$ 16802491 2625402 -18217147 -39875821 7914600 -92385126 74218708 11024760 -22068986
-22b2068986J2562361L7893397p8830423K2020965J08788906j35980867L9631367j7462689
$$ -22068986 -9506625 28386772 -50443651 -28422686 80366220 -55614647 -15983280 -33445969
-30c3445969K045339n0037489J04498816q4268454q399586P4654906L2570209k6981381
$$ -33445969 -31400630 -81438119 23060697 -61207757 -69607343 5047563 37617772 10636391
-38A0636391j6919096r743824J04230099j17000882J3304309Q8583622p0464150L41874
$$ 10636391 -6282705 -16026529 88203570 -28797312 -15493003 73090619 2626469 2968343
-46B968343K8461510k6719784Q437738l8546264K9770903K4360604L2026631q8456122
$$ 2968343 31429853 4710069 13147807 -25398457 4372446 28733050 60759681 -27696441
-54b7696441M6107744P974604N2708206l6414140N598912m1093293O1783008j6851338
$$ -27696441 18411303 26385907 79094113 42679973 48278885 7185592 68968600 52117262
-62E2117262k0144908m140754l0148622o6296468Q2244608P5240737J2482102j19364427
$$ 52117262 31972354 27831600 -2317022 -68613490 13631118 88871855 101353957 -18010470
-70a8010470O4170536O7276095j24953628O5620706o8992842R4562676r8045652r700153
$$ -18010470 46160066 113436161 -11517467 54103239 -14889603 79673073 -18372579 -28072732
-78b8072732P772434p7767188O3036531P5665152n3024751k7122223O0189013L6875395
$$ -28072732 -20300298 -98067486 -35030955 40634197 -12390554 -39512777 20676236 57551631
-86E7551631k205333n8201576k8983552Q88640P1418865M168455p7346311N6650534
$$ 57551631 55346298 -2855278 -31838830 -30950190 40468675 44637130 -32709181 23941353
-94B3941353q7580276P8223117n9947004J0809255J8618697J14770980j02480305L0533480
$$ 23941353 -63638923 14584194 -45362810 -34553555 -15934858 98836122 -3644183 26889297
-102B6889297L6862179o3304630M095161P6500626r0156714K3696312n0722299k0720811
$$ 26889297 63751476 446846 4542007 81042633 -9114081 14582231 -36140068 -56860879
-110e6860879Q4701995j8922569l5605700L3949736L8782366K5713826k289599n6006279
$$ -56860879 27841116 8918547 -26687153 7262583 46044949 71758775 69469176 13462897
-118A3462897O8279399j32250081L612127R2597854J4409123j00867081K1187757J3343725
$$ 13462897 81742296 -50507785 -46895658 45702196 60111319 -40755762 -19568005 -6224280
-126f224280K4336094k3873137M9830809j9438028k946251J417472L1609497q9605200
$$ -6224280 18111814 -5761323 44069486 24631458 21685207 23102679 54712176 -34893024
-134c4893024L4899919j5084886r490770L3456072n1954624K7631591J1295808m640598
$$ -34893024 6895 -15077991 -24568761 8887311 -43067313 -15435722 -4139914 -8780512
-142h780512P2464859j87705048O7565297N7756862o6643790N4184299L6826840p8412179
$$ -8780512 63684347 -124020701 -56455404 1301458 -65342332 -11158033 25668807 -52743372
-150e2743372l3878535N5731187P5929918o3866250P4909346n5562364n6174279R972612
$$ -52743372 -86621907 -30890720 45039198 -18827052 56082294 519930 -55654349 -45681737
-158d5681737M9162178m9651062J19220146Q9880m0871794o7924M3113903n2445355
$$ -45681737 3480441 -46170621 73049525 73139405 32267611 32199687 75313590 22868235
-166B2868235J0744634O1794455q0335211k6262908O0110758M398493p5186310N1337964
$$ 22868235 33612869 95407324 15072113 -11190795 48919963 53318456 -21867854 29470110
-174B9470110J0274093N5286275j1210911o6810243L5059318n5909744O2037793j48982482
$$ 29470110 39744203 95030478 83819567 17009324 52068642 -3841102 58196691 -90785791
-182i0785791J39589044k8852499n1817871J4126900J14395995r2111744r2285403
$$ -90785791 48803253 19950754 -31867117 -17740217 96655778 4544034 -87741369
-189h7741369Q2607547m6665806R154613J0789485n808819k8340957k2688516J14506413
$$ -87741369 -5133822 -51799628 -42645015 -31855530 -37664349 -66005306 -88693822 25812591
-197B5812591m6326761R173007k4664117M4783783N8103972j12950931p6989587P0729048
$$ 25812591 -20514170 -11341163 -36005280 8778503 66882475 -46068456 -123058043 -52328995
-205e2328995k0226762N5291854m1924757J4611385j8259290L7318403J03209390
$$ -52328995 -72555757 -17263903 -59188660 -44577275 -62836565 -25518162 77691228
-212G7691228j24813400j2541997J793795k7754734P6269495j4664184o0871957N8173277
$$ 77691228 -47122172 -59664169 -57870374 -85625108 -9355613 -24019797 -84891754 -26718477
-220b6718477K675145p427732o3065030P5472920K5665426j6535515L5360445J4370239
$$ -26718477 -24043332 -31471064 -94536094 -19063174 6602252 -9933263 25427182 39797421
-228C9797421j37716079Q0526138M7189958r7265587J24966556l9432807L6073019
$$ 39797421 -97918658 -17392520 29797438 -67468149 57498407 18065600 54138619
-235E4138619r5555939P5668239j14713019J40858836n2773045J8123196m9269962
$$ 54138619 -41417320 34250919 -80462100 60396736 7623691 25746887 -23523075
-242b3523075P1258547q6988097J04493614n0806248k2582839Q9340240o3292885m4903215
$$ -23523075 47735472 -39252625 65240989 14434741 -8148098 81192142 17899257 -27003958
-250b7003958O2347613l7158821l1225005M1546993j2338516o039490j786266k0660052
$$ -27003958 35343655 -1815166 -33040171 8506822 -3831694 -9871184 -11657450 -32317502
-258c2317502K4641493M423578N8785181p8601118J50383187j08310577p147141J6840672
$$ -32317502 -7676009 -3252431 55532750 -23068368 127314819 19004242 11857101 28697773
-266B8697773m7580216J885985P453100k7837783J1337863O5214549j4499063N0445127
$$ 28697773 -18882443 -16996458 -9543358 -37381141 -26043278 39171271 24672208 75117335
-274G5117335o1862965j4644197P0548018j01958002O1203070L7699112n745645m7738189
$$ 75117335 13254370 -1389827 69158191 -32799811 28403259 66102371 60356726 12618537
-282A2618537O0498231j6775258m7581150J1874423N669592R131228j5742846M9087063
$$ 12618537 73116768 56341510 8760360 20634783 26304375 35435603 19692757 68779820
-290F8779820r0124170M8179954k6603955O5025653p155776p6925650J93153O635775
$$ 68779820 -21344350 26835604 231649 65257302 58101526 -18824124 -18630971 -11995196
-298a1995196m3434569O4987382m5535626N5656978l0858934L1051404j2102580M5834036
$$ -11995196 -55429765 9557617 -35978009 19678969 -11179965 19871439 7768859 53602895
-306E3602895n1657969L284349N4421052q3750560k0252472K1384652q1232675J58810868
$$ 53602895 1944926 5229275 59650327 -24100233 -44352705 -22968053 -104200728 54610140
-314E4610140r7217557P4306730p5532916N1135368k5522018L6595113k7323113o465098
$$ 54610140 -42607417 31699313 -43833603 7301765 -18220253 18374860 -8948253 -15413351
-322a5413351O1247042j7200091l0284358O3218052j0963369j44857438O1690286Q8660944
$$ -15413351 45833691 28633600 -1650758 61567294 50603925 -94253513 -32563227 56097717
-330E6097717o4600078l0635747m3118314K5529609P7069007L6338181p672630p9204784
$$ 56097717 -8502361 -39138108 -82256422 -56726813 20342194 56680375 49007745 -30197039
-338c0197039Q2432714p086106r4461175n4788858P6297311j5435430M0979424n8380819
$$ -30197039 52235675 45149569 -49311606 -104100464 -27803153 -43238583 -2259159 -60639978
-346f0639978M3142357R23656M8803334K432318j17173837O3415043n58125L9962r254863
$$ -60639978 -17497621 -16573965 32229369 34661687 -82512150 -19097107 -19655232 -19615270 -28870133
-355b8870133k7463931k4200141Q0473557J488329K9573101q7629288R0227161l2229585
$$ -28870133 -56334064 -80534205 -60648 1427681 31000782 -56628506 33598655 1369070
-363A369070p9892885O9790835N500923m3235627R5385866J0540952o4243537R2057217
$$ 1369070 -78523815 -8732980 -3232057 -46467684 48918182 59459134 -4784403 87272814
-371H7272814o9857157l7945491O9616363p3920622O3083333j59194o4614677J5028009
$$ 87272814 17415657 -20529834 49086529 -24834093 38249240 38090046 -26524631 -11496622
-379a1496622j9482285Q2279816r140005j5396319N3993615j8558700m8762151n2999829
$$ -11496622 -30978907 51300909 42160904 26764585 80758200 62199500 13437349 -39562480
-387c9562480m0199599N3028384L3753558K4638309J2822638o3987571K6816875K288670
$$ -39562480 -79762079 -26733695 7019863 31658172 44480810 -19506761 7310114 9598784
-395I598784q2709981O4961703o4998805J64945936o8653551o2520484j1873166J577444
$$ 9598784 -73111197 -8149494 -73148299 91797637 23144086 -39376398 -51249564 -49672120
-403d9672120P0152867m8956319J5399246l1366068M7368412J6350112p673555n2461697
$$ -49672120 20480747 -28475572 -13076326 -44442394 2926018 19276130 11602575 -40859122
-411d0859122k030163Q6042897j0090174k6091960J3387972r4663936J13866473r981451
$$ -40859122 -42889285 43153612 33063438 6971478 20359450 -74304486 39561987 29580536
-419B9580536l1911745o1168856L8796089O6181786P3266843j28223706J9776113m614405
$$ 29580536 -2331209 -63500065 -24703976 41477810 114744653 -13479053 6297060 1682655
-427A682655J6274243m1981019m6046788k001848O6256358M409027k1056089N242259
$$ 1682655 17956898 -24024121 -70070909 -72072757 -5816399 -1407372 -22463461 -17221202
-435a7221202m5395267K5300495J08796304o2612953o434382k8664176M6076797l5979349
$$ -17221202 -62616469 -37315974 71480330 8867377 2432995 -26231181 19845616 -16133733
-443a6133733k4664417l1780823J18111656q891663k0495773m8313234J01530332p2371673
$$ -16133733 -40798150 -72578973 45532683 36641020 16145247 -32167987 69362345 -3009328
-451c009328j1113651N5388141N5648343l8047750j7677930O699640m9555682N6775260
$$ -3009328 -14122979 41265162 96913505 58865755 41187825 47887465 -1668217 55107043
-459E5107043l6808933N216439j7603869j672317O1764209K9206303j56900734q694501
$$ 55107043 18298110 23514549 5910680 4238363 66002572 95208875 -61691859 -70386360
-467g0386360J20400662p8467261J02405593j33289449J21584753r1270522O7271054
$$ -70386360 50014302 -28452959 73952634 -59336815 62247938 -29022584 38248470
-474C8248470K753997j50711501L9541854L6505351N3185798L5783840r7053459j4965064
$$ 38248470 41002467 -109709034 -70167180 -33661829 19523969 55307809 -41745650 -56710714
-482e6710714M3947816L1357196J2258507p4731074J11429366n4069435j44343574
$$ -56710714 -12762898 18594298 30852805 -43878269 67551097 13481662 -130861912
-489a30861912J59416336r1205048N7004775O1121043j36163503J18221284o1327426
$$ -130861912 28554424 -62650624 -5645849 55475194 -80688309 37532975 -23794451
-496b3794451r766275K6222866R7948521j21164979K0596811m115441n1671684J8092407
$$ -23794451 -33560726 -7337860 90610661 -30554318 -9957507 -14072948 -65744632 -47652225
-504d7652225j5435423J43059334r4021541p879984q6794127J35105198k9709503K5512010
$$ -47652225 -63087648 79971686 -14049855 -21929839 -108723966 26381232 -3328271 22183739
-512B2183739n1546123Q2237148r181430o7059289M3368183o7845164Q489047J3267673
$$ 22183739 -29362384 52874764 43693334 -23365955 20002228 -47842936 -39353889 -26086216
-520b6086216J00941498p7109577j8265863m0000279Q0939817M9502773M642540m5938571
$$ -26086216 74855282 -2254295 -20520158 -60520437 20419380 69922153 74564693 28626122
-528B8626122J6289054J715870m8456306l1581440k0177443P4227666m0991263o1054229
$$ 28626122 44915176 46631046 -1825260 -33406700 -53584143 20643523 -20347740 -81401969
-536h1401969N6992010l4643665N844739M7302042R993625p276432P4001280j08870918
$$ -81401969 -24409959 -59053624 -53208885 -5906843 4086782 -3189650 70811630 -38059288
-544c8059288m320817l4480662Q1940084m3750438n7983338J43142023R3667253r2699089
$$ -38059288 -42380105 -76860767 5079317 -38671121 -96654459 46487564 140154817 47455728
-552D7455728k6516601L8158431j4853935q3036084P3023695N0050977r5278384m2196316
$$ 47455728 20939127 59097558 44243623 -38792461 34231234 84282211 -10996173 -53192489
-560e3192489O0670137k608413J4120810o3450563J30605977N1729204j28255709o436161
$$ -53192489 7477648 4869235 18990045 -44460518 86145459 137874663 9618954 3182793
-568C182793j6229041j969925p771850J8746906K4746162K578303q856435m3621111
$$ 3182793 -13046248 -15016173 -22788023 -4041117 20705045 23283348 14426913 -29194198
-576b9194198L3787268M9697447m1900166l1938378N6154352m1748623r0684241J02353679
$$ -29194198 4593070 54290517 12390351 -19548027 36606325 -5142298 -95826539 6527140
-584F527140Q115742J0583693m1035052j9098028J46355195j50080198J9241574J01655458
$$ 6527140 14642882 25226575 -15808477 -34906505 111448690 -38631508 -19389934 82265524
-592H2265524j29418082P2177949r9664323O8728814M5613465l6731248L5865145p7068677
$$ 82265524 -47152558 25025391 -74638932 -5910118 39703347 2972099 38837244 -38231433
-600c8231433M6029543n2541957l0419826Q2638065M9372573m817883o4573712n2455878
$$ -38231433 7798110 -44743847 -75163673 7474392 56846965 52029082 -12544630 -65000508
-608f5000508L6989106N316304O0325417n7489361J7009216k5810633r6855478P4188836
$$ -65000508 -28011402 -22695098 37630319 -19859042 -2849826 -28660459 -125515937 -51327101
-616e1327101j959307P7448451m7550097J00924309j8317484j48141057N940361Q937657
$$ -51327101 -53286408 24162043 -23388054 77536255 59218771 -88922286 -82981925 -74044268
-624g4044268M4015604J0971754O932008M271843M525778o8356456Q7567715n5781030
$$ -74044268 -30028664 -19056910 -12124902 -7853059 -3327281 -71683737 15883978 -39897052
-632c9897052N2963152j4008607P4410012j8270087j27387542N1472145l4296830j7537218
$$ -39897052 13066100 -942507 73467505 55197418 -72190124 -20717979 -55014809 -72552027
-640g2552027K9254918R3765526q9453787q47563Q8627116N872961l3189174q656762
$$ -72552027 -43297109 50468417 -38985370 -39832933 48794183 54667144 21477970 12821208
-648A2821208K2051622n3521490R794429Q42609n2125055O0513248m4446489r788830
$$ 12821208 34872830 -18648660 -8854231 -8011622 -60136677 376571 -44069918 -53858748
-656e3858748J53369139j4955651l0818665j14365755J17798081j8462753j7466093
$$ -53858748 99510391 84554740 53736075 -60629680 57168401 38705648 21239555
-663B1239555M260417l4535570J5855254q4932820N4176074R6043050j43087781J0190341
$$ 21239555 25499972 -9035598 6819656 -78113164 -23937090 72105960 -70981821 -60791480
-671f0791480O6844499j249790k372866j9082096Q0781235j06962240L3366680k785014
$$ -60791480 6053019 4803229 2430363 -16651733 64129502 -42832738 -9466058 -12251072
-679a2251072o2621493Q573308J0466120l1929986M9527833k65555N2062743o0610031
$$ -12251072 -74872565 -66299257 -55833137 -87763123 -38235290 -38500845 13561898 -47048133
-687d7048133M1038567o838948P1808778l2310965o8991846j496262N7359300p041845
$$ -47048133 -6009566 -12848514 58960264 26649299 -42342547 -43838809 13520491 6478646
-695F478646j8777711p6119521O2444910R1753129n5387356P7549168k1315213n4029499
$$ 6478646 -12299065 -88418586 -25973676 65779453 10392097 87941265 66626052 12596553
-703A2596553O368545Q2830302j21865975M0029660p4235739P4051644K939122m9271675
$$ 12596553 18965098 101795400 -20070575 19959085 -54276654 19774990 22714112 -26557563
-711b6557563N9727752l05396L2251262p8772675N7290150m7078736J8589937p023886
$$ -26557563 33170189 32864793 65116055 -13656620 43633530 -3445206 15144731 8120845
-719H120845J1975017m9231572m5718444Q3987761J9097164O9741420q4453095K7347422
$$ 8120845 20095862 -29135710 -74854154 9133607 28230771 97972191 13519096 40866518
-727D0866518n8176679j5632629L7564456j4286088L2672908j5673913j183050j6100559
$$ 40866518 -17310161 -32942790 4621666 -9664422 23008486 7334573 6151523 -9949036
-735i949036j04748369K17089162o0470483N466796j2213458j18450015J63627718n780576
$$ -9949036 -114697405 102391757 41921274 47388070 35174612 -83275403 80352315 74571739
-743G4571739r7621727J4843000N5084204n4900754L1256302l7290343L2925137J2902552
$$ 74571739 -23049988 -8206988 46877216 -8023538 23232764 -14057579 18867558 31770110
-751C1770110L079619J9331310o4309674p0959712O8124805M1219369R328578J4284394
$$ 31770110 34849729 54181039 -10128635 -81088347 -12963542 28255827 37584405 51868799
-759E1868799o7635148J3918193O485029m1417396L8160844P1272992p4009814J4810428
$$ 51868799 -15766349 -1848156 4636873 -36780523 1380321 72653313 -1356501 13453927
-767A3453927j8322633n3963213O5262921K1267360J1905901M5531806j34357450M5580042
$$ 13453927 -4868706 -58831919 6431002 27698362 39604263 85136069 -49221381 -3641339
-775c641339N2649897n4548261L8376272n765310n248699j8166927N7777711m7048379
$$ -3641339 49008558 -5539703 32836569 27071259 21822560 3655633 61433344 14384965
-783A4384965o6815814P6832929m3505887J190926O1056101m7832389J9246727j514373
$$ 14384965 -52430849 24402080 -19103807 -17912881 43143220 -4689169 14557558 13043185
-791A3043185l0043078p3651486J25868190j5780617k8310626O808086l3119965N460938
$$ 13043185 -16999893 -90651379 35216811 19436194 -8874432 -2066346 -35186311 -29725373
-799b9725373O4507575j10649014K9856054O6423699N814571r5128348J50435322
$$ -29725373 34782202 -75866812 -46010758 20412941 26227512 -68900836 81534486
-806H1534486j06459378m7972369J17961289l7689296n7076651J10817638m1923042
$$ 81534486 -24924892 -72897261 45064028 7374732 -49701919 61115719 19192677
-813A9192677l9872152M8033L5360232N6114013J9403207j39427850R0090028k9945121
$$ 19192677 -20679475 -20631442 14728790 70842803 90246010 -49181840 40908188 10963067
-821A0963067K1593375q5334019K4212466M0394240N829722M8715090k0515770j4545852
$$ 10963067 32556442 -52777577 -28565111 11829129 17658851 66373941 45858171 31312319
-829C1312319M4307028l9311089J2739342n7303256n8812196N233285J6253066J14257453
$$ 31312319 75619347 36308258 49047600 -8255656 -67067852 -61834567 -45581501 68675952
-837F8675952j01736547M9164703k4828412r96502M9397666Q0060673j09992855O3872831
$$ 68675952 -33060595 16104108 -8724304 -9720806 39676860 119737533 9744678 73617509
-845G3617509j07822167q3133229M4040221M6680428o6950574J01490114p3706337
$$ 73617509 -34204658 -117337887 -73297666 -26617238 -93567812 7922302 -65784035
-852f5784035J19743532k3191505r489502R364369p0912159R2009067j2212277q0741315
$$ -65784035 53959497 30767992 21278490 30642859 -40269300 51739767 39527490 -41213825
-860d1213825l7091924K8571651l0035793J22869574l9454052m0533657K8346354O7935548
$$ -41213825 -78305749 -49734098 -79769891 43099683 3645631 -36888026 -8541672 59393876
-868E9393876K0261246K00250j11741368K8150096J0507654K6796264k1491090r461744
$$ 59393876 79655122 79855372 -31885996 -3735900 6771754 33568018 12076928 2615184
-876B615184N4348001j7177572o4805520P2165655j0435432j0790515k6440053p221276
$$ 2615184 56963185 39785613 -25019907 47145748 36710316 25919801 -520252 -7741528
-884g741528K5921909K1305659m9187142j4017570R8293393j6016376p0236801L229598
$$ -7741528 18180381 39486040 -9701102 -23718672 74574721 58558345 -11678456 -8448858
-892h448858K6202875j60995150M7366583K8688438K6349562j365084J8395238K7747610
$$ -8448858 17754017 -143241133 -95874550 -67186112 -40836550 -42201634 -23806396 3941214
-900C941214K4128098j14501620J9263225P0902792l5287743L7056067O9986426K891990
$$ 3941214 28069312 -86432308 -67169083 3733709 -31554034 5502033 75488459 78380449
-908G8380449j34611899j1921900K1896914J06426181l5448294J7497068k1931095
$$ 78380449 -56231450 -68153350 -46256436 60169745 24721451 42218519 20287424
-915B0287424L6299492l614665K0200128K3901381k3488148N9742923j38798521O4519128
$$ 20287424 56586916 52972251 73172379 97073760 73585612 133328535 -5469986 59049142
-923E9049142q9800161l1184901Q1293883K3410917j1441766m8227229L7234208l6923465
$$ 59049142 -30751019 -61935920 19357963 42768880 31327114 -16900115 20334093 -16589372
-931a6589372J7638488M7328824j3226748r8517492O2326907j12535079M4326909M9731278
$$ -16589372 1049116 48377940 35151192 -63366300 -1039393 -113574472 -69247563 -19516285
-939a9516285j04992997J04344614l846759o413203R3562654j11510115K4635599J0684129
$$ -19516285 -124509282 -20164668 -24011427 -30424630 63138024 -48372091 -23736492 -13052363
-947a3052363k6700158O9921141k0303227J351831K7274838l0835984N5793769m6057377
$$ -13052363 -39752521 30168620 9865393 11217224 38492062 7656078 63449847 17392470
-955A7392470j2563061J8050136j6828930O3818718k5144828j04162467Q2168799M479250
$$ 17392470 4829409 22879545 6050615 69869333 44724505 -59437962 22730837 27210087
-963B7210087k1092035K73267K1803149M8548314l1946367n4073581j0157582J5573365
$$ 27210087 6118052 6391319 28194468 76742782 44796415 -9277166 -19434748 -3861383
-971c861383P053409j1692926J1380270N0438709m7732741j3521187N6741468n9237340
$$ -3861383 3192026 -8500900 2879370 53318079 5585338 -7935849 48805619 -10431721
-979a0431721M6438136Q317372J7036992k0008918K0973143j10865556J44614963
$$ -10431721 36006415 44323787 61360779 41351861 62325004 -48540552 96074411
-986I6074411j07915212M5409263l0577654L6075389l7973936q79960K5248056p7374807
$$ 96074411 -11840801 33568462 2990808 39066197 1092261 212301 25460357 -51914450
-994e1914450J2081334L9415260N0791908o985713j7311797J5059892q9912803M7299568
$$ -51914450 -39833116 -417856 50374052 43388339 26076542 41136434 -48776369 -1476801
-1002a476801k8397399P633660o7208680Q0919703l1882170j2080656M9596054j8263387
$$ -1476801 -29874200 -22240540 -89449220 -8529517 -40411687 -52492343 -2896289 -21159676
-1010b1159676o57088L5094917O857425p122819k4927190O2033338n1422589j298224
$$ -21159676 -21816764 13278153 20135578 13012759 -11914431 50118907 -1303682 -2601906
-1018b601906K3182613J2288771j4521015O2074232n6453201j901761K8774703o3409879
$$ -2601906 20580707 32869478 18348463 80422695 23969494 22067733 50842436 -12567443
-1026a2567443M0274231Q3650515n7779154l5525849R9592873q1301668p9903514P7953974
$$ -12567443 27706788 111357303 53578149 18052300 117645173 36343505 -43560009 34393965
-1034C4393965k879250l352777l3938988M4530170n3737911j989790P9224375m6916621
$$ 34393965 31514715 28161938 -5777050 38753120 -14984791 -16974581 62249794 15333173
-1042A5333173o7257245L6578220Q2163877j00425127M8802431J5450792o4810919
$$ 15333173 -51924072 -15345852 66818025 -33607102 15195329 30646121 -34164798
-1049c4164798R1587518j05789351K4386612K8693774J6711712n5580975M2240192
$$ -34164798 57422720 -48366631 -23980019 4713755 21425467 -34155508 8084684
-1056H084684N7047116j31761356M1996589P9279409k804884n8015581M8972511K4366700
$$ 8084684 65131800 -66629556 -24632967 54646442 51841558 -6174023 42798488 67165188
-1064F7165188j71173360Q2413425J1000481N0148364j9189488m5947027m6867140
$$ 67165188 -104008172 -21594747 -10594266 39554098 20364610 -25582417 -72449557
-1071g2449557J15818427j24481982J20734176M0572968o3941332r2976385M9794420
$$ -72449557 43368870 -81113112 39621064 80194032 16252700 -76723685 -26929265
-1078b6929265J08460268j42832333k9053010J53349685J4242033j05493518J7193418
$$ -26929265 81531003 -61301330 -90354340 62995345 77237378 -28256140 -11062722
-1085a1062722M5815632m2258720O1883263q6594982O7077011m6008636k8320301P6906477
$$ -11062722 34752910 -7505810 54377453 -32217529 34859482 -11149154 -39469455 37437022
-1093C7437022J0541036j34480276Q4747815O9299157l5452551q5933381k9350997
$$ 37437022 47978058 -86502218 -1754403 67544754 32092203 -53841178 -83192175
-1100h3192175J46796517j11998277J4274355n3656763m4364524P2856986J07728440
$$ -83192175 63604342 -48393935 -34119580 -87776343 -132140867 -59283881 48444559
-1107D8444559m2197717n2348114k9677952m463202j4751953P0061463l1020781R364036
$$ 48444559 6246842 -46101272 -75779224 -80242426 -94994379 -24932916 -55953697 -46589661
-1115d6589661J863577q344912j4773026O5341069j0570092L6301398J25935828j95056492
$$ -46589661 -44726084 -53070996 -67844022 -2502953 -13073045 23228353 149164181 -45892311
-1123d5892311J3948420k2381333q995575M1456289N8767101k8533475R6690465j56423343
$$ -45892311 -31943891 -54325224 -63320799 -21864510 36902591 8369116 105059581 -51363762
-1131e1363762M4002590P5102681O377960j967704l0245721o2481825j3151997m8001829
$$ -51363762 -7361172 67741509 74119469 72151765 41906044 -20575781 -33727778 -81729607
-1139h1729607K7003678K0395956J09825631J2042936p2523119K4373827o3571897m289095
$$ -81729607 -54725929 -34329973 75495658 87538594 15015475 39389302 -24182595 -28471690
-1147b8471690K6564399Q9038926p7624154p6427626L0426367K2653013N1892423J8285291
$$ -28471690 -1907291 87131635 9507481 -66920145 -36493778 -13840765 38051658 56336949
-1155E6336949n9444263R238749K7881084k9900107L0651696m0692387R588951m4405058
$$ 56336949 -3107314 6131435 34012519 4112412 34764108 -5928279 3660672 -40744386
-1163d0744386l7057104J08847237o3958447R7313973j5494712l6006933n729787k7988805
$$ -40744386 -77801490 31045747 -32912700 64401273 48906561 12899628 7169841 -20818964
-1171b0818964L713171J5840495K3271028k9659091p908294j09777296J19802909Q115546
$$ -20818964 -17105793 -1265298 22005730 -7653361 -15561655 -125338951 -5536042 2579504
-1179B579504K2478145j6577996l8299411Q1570511j18033635M0252641N8642988n339512
$$ 2579504 25057649 8479653 -29819758 51750753 -66282882 -26030241 32612747 27273235
-1187B7273235o7290244Q6964990p2912863n311130L0973160M5271557p515399j22868969
$$ 27273235 -40017009 46947981 -25964882 -31276012 -302852 44968705 37453306 -85415663
-1195h5415663J15429081j7472148P2643517j40664689O8896230L8195310L4313395
$$ -85415663 30013418 12541270 85184787 -55479902 13416328 51611638 85925033
-1202H5925033q3315213k7621614k7309606J6721101J8261098k9029781K2153438O984344
$$ 85925033 2609820 -25011794 -52321400 -35600299 -17339201 -46368982 -24215544 -17231200
-1210a7231200r1878120J02637234J12871310o6805740n1396423j604475J0339017O849935
$$ -17231200 -109109320 -6472086 106399224 39593484 -11802939 -13407414 -3068397 3781538
-1218C781538l5871260M106906O534939J38494747q7526616n5631346L9352978J7661833
$$ 3781538 -32089722 -27982816 -21447877 117046870 29520254 -26111092 13241886 30903719
-1226C0903719J836291K1668407m6869802N4153845J9677544K816986j5970217m4159550
$$ 30903719 32740010 54408417 7538615 61692460 81370004 84186990 68216773 24057223
-1234B4057223L215942J0570309L1857109m0557981n5621312J5100987L3575022j6324413
$$ 24057223 27273165 37843474 69700583 29142602 -26478710 -11377723 22197299 5872886
-1242E872886L8604395j1536537J7465668n6696503K7562884m0881406M6573462L8516554
$$ 5872886 44477281 32940744 50406412 -6290091 21272793 -19608613 26964849 65481403
-1250F5481403j36485587m1822877Q2307348m6410939O8832683q980427N8465604j1669783
$$ 65481403 -71004184 -112827061 -30519713 -76930652 -8097969 -17078396 41387208 29717425
-1258B9717425l4273681K9193460L2941321o7385329n9777677K00162746j17074582
$$ 29717425 -4556256 24637204 57578525 -9806804 -69584481 130578265 13503683
-1265A3503683M1602973j16390207P2580178L6504384P027876l7216858k4954059Q0215901
$$ 13503683 55106656 -61283551 11296627 47801011 54828887 17612029 -7342030 72873871
-1273G2873871j12833455O8774559P6658582j36854215N2927741R8795646j21855747
$$ 72873871 -39959584 28814975 105473557 -31380658 21547083 120342729 -1513018
-1280a513018l0060920M5481539M5383504j32636965M9963194n778458j3283499J572593
$$ -1513018 -31573938 13907601 59291105 -73345860 -23382666 -29161124 -42444623 -40872030
-1288d0872030J0737896M0141610o2806185K7320395N9370470l9454226O5869049p6203539
$$ -40872030 -30134134 10007476 -52798709 -25478314 33892156 -5562070 60306979 -15896560
-1296a5896560l1725841M5937750j1341619m4944565J32956981n7675040k8117165
$$ -15896560 -47622401 -1684651 -13026270 -57970835 74986146 17311106 -10806059
-1303a0806059k0046656O3817444q3835873J35154761K920841n5945776K813319q8775105
$$ -10806059 -30852715 32964729 -50871144 84283617 87204458 31258682 34072001 -54703104
-1311e4703104R6409230m1051987N6099026j1296737k1587436j0538140j5111047K3096908
$$ -54703104 41706126 654139 56753165 45456428 23868992 13330852 -1780195 21316713
-1319B1316713k5688618o9141254J70312463q7657232k0841914L8571978m4145582
$$ 21316713 -4371905 -73513159 96799304 9142072 -11699842 26872136 -17273446
-1326a7273446P5784953m5628781k4124642N1593392j05309759l8682578J44620138
$$ -17273446 58511507 12882726 -11241916 40351476 -64958283 -103640861 40979277
-1333D0979277n6978175Q1300694j4545324L563459q5594378l5457669J10041734j9674638
$$ 40979277 -15998898 65301796 50756472 54319931 -31274447 -66732116 43309618 23634980
-1341B3634980K5502832l7666384j086011o6568394N300543M3219242M0689652o4843763
$$ 23634980 49137812 11471428 10385417 -56182977 -50882434 -7663192 33026460 -31817303
-1349c1817303N6337338j3179419O7613614j86935512J63245055j77144161J08189061
$$ -31817303 24520035 11340616 78954230 -107981282 55263773 -121880388 -13691327
-1356a3691327o114910N2047320p6369616n7330152K4796243M6977582K8026732j581213
$$ -13691327 -19806237 32241083 -44128533 -101458685 -76662442 -29684860 -1658128 -3239341
-1364c239341J6614766q415057l1938909K7174905p3737223O7370968k6728927L360401
$$ -3239341 13375425 4960368 -26978541 196364 -73540859 -6169891 -32898818 -29538417
-1372b9538417O4381199p7356701M1867903r7522709Q5626623L0399596q648133K7899546
$$ -29538417 34842782 -42513919 -646016 -98168725 -12542102 17857494 9209361 37108907
-1380C7108907o0595744j4228186L3697390k1942043p2045668J06490322N2736067
$$ 37108907 -23486837 -37715023 -4017633 -25959676 -98005344 8484978 61221045
-1387F1221045p4887890L2752076n2925306J4409606J9404440L70801k1265372J2158064
$$ 61221045 -13666845 19085231 -33840075 -19430469 -26029 344772 -20920600 -8762536
-1395h762536L5550919n4687725l0715519J05468890j02223184O5938959K0549482
$$ -8762536 26788383 -27899342 -58614861 46854029 -55369155 10569804 31119286
-1402C1119286j9538938Q5147318q2749605k6603386o549949M2983462n4629613K5871256
$$ 31119286 11580348 96727666 13978061 -12625325 -19175274 23808188 -30821425 -4950169
-1410d950169q1674812J04293008O9637129n9769117q3850153J30241364l917938
$$ -4950169 -86624981 17668027 87305156 27536039 -56314114 73927250 70009312
-1417G0009312j04379435K7984890l2587838M2144054m5221384J4627134M2696339
$$ 70009312 -34370123 -6385233 -38973071 3170983 -42050401 -27423267 15273072
-1424A5273072M1177679q0304659J4201858r362064k3775639N2806664m5407780M9593470
$$ 15273072 56450751 -23853908 -9652050 -19014114 -42789753 10016911 -35390869 14202601
-1432A4202601m3086578J8164537K9223298o7955986O6784356m7401514o3183439
$$ 14202601 -28883977 -10719440 18503858 -49452128 17332228 -30069286 -93252725
-1439i3252725J24302973j31781509R1596221k9433817k6953827J15891120q0897754
$$ -93252725 31050248 -100731261 -9135040 -38568857 -65522684 50368436 -30529318
-1446c0529318M0001667L3643k4061001L0193597p8502324j5706034L1587330n7423876
$$ -30529318 9472349 9505992 -14555009 15638588 -62863736 -78569770 -46982440 -104406316
-1454a04406316J05332874j2877268K5787019o1263170Q7086096k174533L2849888
$$ -104406316 926558 -11950710 13836309 -47426861 39659235 37484702 70334590
-1461G0334590j15463446N5305808m9265111J5962523j2855626m5846059L8629615
$$ 70334590 -45128856 10176952 -39088159 -23125636 -35981262 -81827321 -43197706
-1468d3197706J55809557r2979187P9934164r7465052L7881089j30974852J92800766
$$ -43197706 112611851 19632664 99566828 2101776 39982865 -90991987 101808779
-1475A01808779q0406853l8142550M6519378j5830702j01132468J12016657l4081510
$$ 101808779 21401926 -16740624 29778754 13948052 -87184416 24832241 -9249269
-1482i249269k007484K9306514J4351950j10179793J03758514l1018138p6772531
$$ -9249269 -11256753 18049761 32401711 -77778082 25980432 -5037706 -81810237
-1489h1810237J82521147j10820306N046521m086070M186936q3281450Q8181351M9247443
$$ -81810237 100710910 -10109396 -5062875 -9148945 -4962009 -88243459 -62108 49185335
-1497D9185335r8830685l7723866N1797920m2828182N9497984o81681L2957935l3315583
$$ 49185335 -49645350 -87369216 -35571296 -78399478 -18901494 -19583175 13374760 -19940823
-1505a9940823J6357109j3053377k697476J2987765k5889277l5323035J20323301
$$ -19940823 -3583714 -16637091 -19334567 -6346802 -32236079 -67559114 52764187
-1512E2764187j09126943p227349P4487920l8746512N8165597N595336q0040990L2290568
$$ 52764187 -56362756 -63590105 10897815 -27848697 30316900 35912236 -44128754 -11838186
-1520a1838186O4623165m4255705k0479248N8664852m7281774l7745641L9473635l0516073
$$ -11838186 52784979 8529274 -11949974 46714878 -566896 -38312537 1161098 -29354975
-1528b9354975J6383746k4281651K7085832L2008765m9724588Q2997756n1144176L7443900
$$ -29354975 -12971229 -37252880 -10167048 21841717 -27882871 55114885 3970709 41414609
-1536D1414609n4070638M2074112m8474447N3243378n8865162p2563393P0602269J3379504
$$ 41414609 -12656029 29418083 -19056364 34187014 -24678148 -97241541 -26639272 -13259768
-1544a3259768m049687K9113379K4444692K2270922k5480533M9848547n3973510l7719555
$$ -13259768 -17309455 11803924 36248616 58519538 33039005 82887552 28914042 -8805513
-1552h805513k0786116J4284391Q630427N7647740p6998132j151829R2646806n2630722
$$ -8805513 -29591629 -15307238 -6676811 50970929 -26027203 -27179032 65467774 12837052
-1560A2837052L1757936L3149597j01362849M779050O5131782J4117615n6722525n2612452
$$ 12837052 44594988 77744585 -23618264 -18839214 46292568 60410183 3687658 -48924794
-1568d8924794M546151O1703881Q5802553q6224289o7072320Q681872N5245650L7892951
$$ -48924794 -44378643 17325238 103127791 16903502 -50168818 -41486946 13758704 51651655
-1576E1651655o7030208l8706233J6801342O4654143M0027757r1877954l8856196L6387826
$$ 51651655 -15378553 -54084786 -37283444 27370699 67398456 -24479498 -63335694 -26947868
-1584b6947868Q5406322m0871717m8928588P9258964r2891310n2312627R0258768K993700
$$ -26947868 58458454 17586737 -31341851 47917113 -44974197 -97286824 -7028056 -4034356
-1592d034356j8798450J8939660Q0695951o994280m3653904j29131333J07501016j2595836
$$ -4034356 -22832806 -3893146 76802805 69808525 26154621 -102976712 4524304 -8071532
-1600h071532J2875518L5827229l9655439L991155l0737789j3310280J10010832o2640584
$$ -8071532 4803986 40631215 975776 4966931 -25770858 -39081138 70929694 8289110
-1608H289110L9562659k2552449M1612618n9982042k5971746M8276684J1866691o5046620
$$ 8289110 47851769 25299320 66911938 6929896 -19041850 29234834 41101525 -23945095
-1616b3945095J2710292N5848170K0667643j05604957n5335770R8065459O4176332
$$ -23945095 -11234803 44613367 65281010 -40323947 -95659717 2405742 66582074
-1623F6582074j19546562P7809011m6135064R3226806j27596415O5371935L655060
$$ 66582074 -52964488 24844523 -21290541 71936265 -55660150 9711785 13366845
-1630A3366845l7777892o0921393M2883110P8795938l8234401j6987028O0355595n6967872
$$ 13366845 -24411047 -85332440 -42449330 36346608 -1887793 -18874821 41480774 -15487098
-1638a5487098l039740P5352895j04495151j397848m933689J29520808p4435476m3791225
$$ -15487098 -18526838 56826057 -47669094 -49066942 -54000631 75520177 1084701 -42706524
$$ [...]
-3284D0454990  $$ checkpoint
##END NTUPLES=
##END=
