##TITLE= S#299320
##JCAMP-DX= 5.00 $$ JEOL NMR v1.10
##DATA TYPE= NMR SPECTRUM
##DATA CLASS= NTUPLES
##NUM DIM= 1
##ORIGIN= DELTA_NMR
##OWNER= NMR
##SPECTROMETER/DATA SYSTEM= DELTA_NMR
##.OBSERVE FREQUENCY= 3.00529655924288E+02
##.OBSERVE NUCLEUS= ^1H
##.DELAY= (2.195E+02,2.195E+02)
##.ACQUISITION MODE= SIMULTANEOUS
##.FIELD= 7.0586013
##.FILTER WIDTH= 1.81675738660864
##.ACQUISITION TIME= 3.6339712
##.SPINNING RATE= 16
##.OBSERVE 90= 9.2
$$ ------------------------
$$ JEOL SPECIFIC PARAMETERS
##$FILENAME= C:\NMR/eb2-9.jdf
##$TITLE= S#299320
##$AUTHOR= NMR
##$CREATION=  6-FEB-2018 08:12:02
##$REVISION=  6-FEB-2018 08:19:21
##$CONTENT= PROTON NMR EXPERIMENT
##$INSTRUMENT= DELTA_NMR
##$SITE= Center College ECP+ 300
##$NODENAME= nmr2
##$DIMENSIONS= 1
##$STORAGE= FLOAT
##$X_FORMAT= COMPLEX
##$X_CURR_POINTS= 16384
##$X_START= 12.50103 $$ppm
##$X_STOP= -2.50012 $$ppm
##$X_TITLE= 1H                             
##$X_ZERO_POINT= 0.33329
##$X_FREQ_FLIP= FALSE
##$X_POINTS= 16384
##$X_PRESCANS= 0
##$X_DOMAIN= 1H
##$X_OFFSET= 5 $$ppm
##$X_FREQ= 300.52966 $$MHz
##$X_SWEEP= 4.50857 $$kHz
##$X_RESOLUTION= 0.27518 $$Hz
##$SOLVENT= CHLOROFORM-D
##$TEMP_GET= 20.6 $$dC
##$ACQ_DELAY= 0.2195 $$ms
##$DIGITAL_FILTER= FALSE
##$FILTER_FACTOR= 1
##$FILTER_WIDTH= 2.254 $$kHz
##$FILTER_MODE= BUTTERWORTH
##$TRANSITION_RATIO= 0.9
##$ORDERS
##$FACTORS
##$LOCK_STRENGTH= 593
##$LOCK_LEVEL= 200
##$LOCK_GAIN= 26
##$LOCK_OSC_OFFSET= 25.6519 $$kHz
##$LOCK_PHASE= 187 $$deg
##$LOCK_OSC_STATE= 2H OSC ON
##$X_ANGLE= 45 $$deg
##$X90= 9.2 $$us
##$X90_HI= 10 $$us
##$X90_LO= 50 $$us
##$X_90_WIDTH= 9.2 $$us
##$X_PULSE= 4.6 $$us
##$RELAXATION_DELAY= 4 $$s
##$SCANS= 2
##$PROBE_ID= 1412
##$ITERATIONS= 1
##$FIELD_STRENGTH= 7.0586 $$T
##$TEMP_SET= 25 $$dC
##$SPIN_SET= 15 $$Hz
##$SPIN_GET= 16 $$Hz
##$HE_LEVEL= 73 $$%
##$N2_LEVEL= 91 $$%
##$CHANGER_SAMPLE= 0
##$ADC_CARD= 16/1MHz/20
##$EXPERIMENT= single_pulse.exp
##$OBS_NOISE= WAUGH
##$IRR_NOISE= WALTZ
##$TRI_NOISE= WALTZ
##$QUA_NOISE= WAUGH
##$OBS_PWIDTH= 1 $$us
##$IRR_PWIDTH= 50 $$us
##$TRI_PWIDTH= 1 $$us
##$QUA_PWIDTH= 1 $$us
##$RECVR_GAIN= 4
##$IRR90= 9.2 $$us
##$TRI90= 10 $$us
##$QUA90= 10 $$us
##$IRR90_HI= 10 $$us
##$QUA90_HI= 10 $$us
##$IRR90_LO= 50 $$us
##$TRI90_LO= 10 $$us
##$QUA90_LO= 10 $$us
##$MOD_RETURN= 1
##$TOTAL_SCANS= 2
##$X_ACQ_DURATION= 3.63397 $$s
##$DELAY_OF_START= 1 $$s
##$ACTUAL_START_TIME= 886752701
##$CLIPPED= FALSE
##$DC_BALANCED= FALSE
##$TRI90_HI= 10 $$us
##$SPIN_LOCK_90= 100 $$us
##$SPIN_LOCK_ATTN= 24.4 $$dB
##$DEUT_GRAD_SHIM_90= 213 $$us
##$DEUT_GRAD_SHIM_ATTN= 9 $$dB
##$IRR_CODE= 146
##$LOCK_STATE= LOCK ON
##$AUTOLOCK_LEVEL= 200
##$SAWTOOTH_RANGE= 4
##$LOCK_STATUS= IDLE
##$LOCK_SETTLE_POINT= 4096
##$LOCK_ACHIEVE_POINT= 0
##$SPIN_ACTION= SPIN ON
##$SPIN_STATE= SPIN ON
##$SPIN_STATUS= SPIN ON
##$SPIN_GAS_SOURCE= AIR
##$TEMP_ACTION= TEMP OFF
##$TEMP_STATE= TEMP OFF
##$TEMP_STATUS= TEMP OFF
##$TEMP_COMP= 0
##$TEMP_DELAY= 0 $$s
##$TEMP_LIMIT_HI= 150 $$dC
##$TEMP_LIMIT_LO= -100 $$dC
##$TEMP_MELTING= -63 $$dC
$$ [...]
##$VT_PID_STD_WB_H_CBL= 10
##$VT_PID_STD_WB_H_CBH= 0
##$VT_PID_STD_WB_H_HC= 2.4
##$VT_PID_STD_WB_H_HL= 70
##$VT_PID_STD_WB_M_PB= 1.5
##$VT_PID_STD_WB_M_TI= 30
##$VT_PID_STD_WB_M_TD= 5
##$VT_PID_STD_WB_M_CBL= 9.9
##$VT_PID_STD_WB_M_CBH= 2.3
##$VT_PID_STD_WB_M_HC= 2.5
##$VT_PID_STD_WB_M_HL= 70
##$VT_PID_STD_WB_L_PB= 1.3
##$VT_PID_STD_WB_L_TI= 29
##$VT_PID_STD_WB_L_TD= 5
##$VT_PID_STD_WB_L_CBL= 20
##$VT_PID_STD_WB_L_CBH= 20
##$VT_PID_STD_WB_L_HC= 0.6
##$VT_PID_STD_WB_L_HL= 100
##$VT_PID_LONG_0_H_PB= 1.5
##$VT_PID_LONG_0_H_TI= 30
##$VT_PID_LONG_0_H_TD= 5
##$VT_PID_LONG_0_H_CBL= 9.9
##$VT_PID_LONG_0_H_CBH= 2.3
##$VT_PID_LONG_0_H_HC= 2.5
##$VT_PID_LONG_0_H_HL= 70
##$VT_PID_LONG_0_M_PB= 1.5
##$VT_PID_LONG_0_M_TI= 30
##$VT_PID_LONG_0_M_TD= 5
##$VT_PID_LONG_0_M_CBL= 9.9
##$VT_PID_LONG_0_M_CBH= 2.3
##$VT_PID_LONG_0_M_HC= 2.5
##$VT_PID_LONG_0_M_HL= 70
##$VT_PID_LONG_40_H_PB= 1.5
##$VT_PID_LONG_40_H_TI= 30
##$VT_PID_LONG_40_H_TD= 5
##$VT_PID_LONG_40_H_CBL= 9.9
##$VT_PID_LONG_40_H_CBH= 2.3
##$VT_PID_LONG_40_H_HC= 2.5
##$VT_PID_LONG_40_H_HL= 70
##$VT_PID_LONG_40_M_PB= 1.5
##$VT_PID_LONG_40_M_TI= 30
##$VT_PID_LONG_40_M_TD= 5
##$VT_PID_LONG_40_M_CBL= 9.9
##$VT_PID_LONG_40_M_CBH= 2.3
##$VT_PID_LONG_40_M_HC= 2.5
##$VT_PID_LONG_40_M_HL= 70
##$SAMPLE_ACTION= LOADED
##$SAMPLE_STATE= LOAD
##$SAMPLE_STATUS= LOADED
##$AUTOSHIM_MODE= AUTOSHIM OFF
##$AUTOSHIM_DELAY= 3600 $$s
##$AUTOSHIM_TRACK= AUTOSHIM OFF
##$SHIM_MAX_RECALL= MAX FOUND
##$SHIM_NAMES= SHIM_Z0
##$SHIM_Z0= 9202
##$SHIM_Z1= 5122
##$SHIM_Z2= -38
##$SHIM_Z3= -2829
##$SHIM_Z4= -240
##$SHIM_Z5= 46
##$SHIM_Z6= -33
##$SHIM_X= -14
##$SHIM_XZ= 16
##$SHIM_XZ2= 0
##$SHIM_XZ3= 0
##$SHIM_X2= -7
##$SHIM_X2Z= -40
##$SHIM_X3= 0
##$SHIM_Y= 1608
##$SHIM_YZ= 13
##$SHIM_YZ2= 10
##$SHIM_YZ3= 0
##$SHIM_Y2= -11
##$SHIM_Y2Z= -20
##$SHIM_Y3= 0
##$NUM_SCANS= 1
##$END_TIME= 886752722
##$LOCAL_TIME= 886752722
##$PROBE_ATN= 0
##$PROBE_TUNE= 0
##$PROBE_MATCH= 2077
##$PROBE_COARSE= NONE
##$LF_TUNE_DIAL= 0
##$LF_MATCH_DIAL= 0
##$HF_TUNE_DIAL= 0
##$HF_MATCH_DIAL= 0
##$PASS_RIPPLE= 0.01 $$dB
##$STOP_RIPPLE= 60 $$dB
##$PROBE_RECOVERY= 0 $$us
##$AF_DELAY_RATIO= 0
##$VERSION= 4.3.3
##$X_ACQ_TIME= 3.63397 $$s
##$DEAD_TIME= 0 $$us
##$DELAY= 0 $$us
##$PHASE_PRESET= 3 $$us
##$UNBLANK_TIME= 2 $$us
##$INITIAL_WAIT= 1 $$s
##$NORMALIZED= TRUE
$$ END OF JEOL SPECIFIC PARAMETERS
$$ -------------------------------
##NTUPLES= NMR SPECTRUM
##VAR NAME= FREQUENCY,    SPECTRUM/REAL, SPECTRUM/IMAG, PAGE NUMBER
##SYMBOL=   X,            R,             I,             N
##VAR TYPE= INDEPENDENT,  DEPENDENT,     DEPENDENT,     PAGE
##VAR FORM= AFFN,         ASDF,          ASDF,          AFFN
##VAR DIM=  16384, 16384, 16384, 2
##UNITS= PPM,     ARBITRARY UNITS, ARBITRARY UNITS, 
##FIRST=  1.2501033903057E+01, 1.07408722785646E+03, 6.13799711980518, 1
##LAST=  -2.50011824950436, -2.51241760552051E+02, 1.16092017910539E+02, 2
##FACTOR=  9.1565355261926E-04, 6.97674877212882E-03, 6.97674877212882E-03, 1
##PAGE= N=1
##DATA TABLE=(X++(R..R)), XYDATA
$$ [...]
5292b7996071Q267072M017596M0620167j8705703m820023j1354533P345779M1112487
5284C8486771k343972J0042976k6325433l413872K602271m749099q402840j7356816
5276a1460014o651501M441516L778440j1144698j552197l581594K6616271K2270883
5268B2717106m930892J07998l4141430J9301696K905517J0590766l174315l2633372
5260a9256926L015767p438149J4254275Q895567o520609K2020214N745517K3380111
5252D4095767r994994o175564j5279970K4011524K123416J7012003l7729458k7003985
5244h941261j2309019k779023L4011147j3632142l30902j4306960m921603L0070313
5236F860550j5697063J6471125l2423297J6870360l366503J7768087j7672137q112160
$$ y = [-27996071, -19728999, -15711403, 24908764, 6203061, 1383038, -9971495, -2625716, 38486771, 36142799, 46185775, 19860342, 16446470, 19048741, 14299642, 5896802, -11460014, -18111515, -13669999, -9891559, -21036257, -22588454, -26170048, 446223, 22717106, 17786214, 17894212, -16247218, 3054478, 5959995, 16550761, 13376446, -19256926, -16241159, -23679308, -9425033, -529466, -7050075, 14970139, 20715656, 44095767, 34100773, 27925209, 12645239, 36656763, 38780179, 55792182, 18062724, -8941261, -21250280, -24029303, 9981844, -3650298, -3981200, -18288160, -23209763, 6860550, -8836513, 7634612, -24788685, -7918325, -11284828, 6483259, -11188878, -19301038]
5228a9301038j7903063J6441371J7584135J8351804R253741k249215K815369R785204
5220C4778308n380983J3885781j6160623J3224757j3299483j0968319k1221116k1145691
5212b6287369M97078J2533336P661727J2013087j1389809J5713297N625346K5223015
5204D1589708l939121R905157j6023504K4137161j0893349n3418l0330782l2512609
5196a8120757J1387225m900619L8571500j7245139m433128r036883O224084L0805708
5188C3251991R356759P054770p255367J475340k971398l32759k9332487o619253l961009
5179F66587J5833057K4408434l1977444J45937l5571400L7464187L2912858J7577300
5171F1459516j098740m9968591j5260125N105518J0597946K7508034m3373444j0505372
$$ y = [-19301038, -37204101, -20762730, -3178595, 15173209, 24426950, 22177735, 24993104, 34778308, 29397325, 43283106, 27122483, 40347240, 27047757, 16079438, -5141678, -26287369, -25790291, -13256955, -5595228, 6417859, -4971950, 10741347, 16366693, 41589708, 37650587, 47555744, 31532240, 55669401, 44776052, 44722634, 14391852, -18120757, -6733532, -11634151, 26937349, 9692210, 5259082, -3777801, 2446283, 33251991, 42608750, 49663520, 42408153, 43883493, 40912095, 40579336, 11246849, 4627596, 666587, 16499644, 40908078, 8930634, 9076571, -26494829, 10969358, 43882216, 61459516, 60360776, 10392185, -4867940, 237578, 10835524, 38343558, -5029886, -15535258]
5163a5535258m2282431J4431534J0540704K4008863N729627K281433p659927o304004
5155a4789459P136023j671369L0324671n473226k127171k7256229m2437823J6436863
5147c9857720j0457280N3966792r767201l690009j2593320j5328552M0304269R467283
5139A2044262L1339781o587839j0466687p299302j7640680Q12830r987260J3090160j15211
5130E190054L256152j5372776k1036698J8721659J802216O3872708k2129627J2899622
5122D7203310m0370339J856814K9829292P19121J1534038m8749501k1046471P801065
5114a1222671J3530007L2349196k7040414j9096424j1211896K4491051L7737439J5453124
5106E4989412l0788442k3507927k2852234K4900926K1890448k973105j9510347k4322097
$$ y = [-15535258, -57817689, -43386155, -32845451, -8836588, -3106961, -825528, -8485455, -14789459, -7653436, -9324805, 20999866, 15526640, 13399469, -13856760, -56294583, -39857720, -50315000, 3651792, -6115409, -9805418, -22398738, -37727290, 2576979, 12044262, 43384043, 36796204, 26329517, 19030215, 1389535, 2202365, -7784895, 5305265, 5190054, 8446206, -6926570, -27963268, -9241609, -7439393, 56433315, 34303688, 47203310, 6832971, 8689785, 38519077, 39238198, 50772236, 2022735, -19023736, -11222671, 2307336, 34656532, 7616118, -11480306, -22692202, 1798849, 39536288, 54989412, 24200970, 693043, -22159191, 2741735, 24632183, 21659078, 2148731, -22173366]
5098b2173366j2371038L5938174q981610L5994783j2610877J4807006L0876843l4464246
5090B7015669K3133830n9459161L3873130J9832907J1577630k848661q5368135l8853888
5082g1096679k095445M3711121Q0717435j1317332l1965848n8065929j9367384O4852835
5074d627226N2367202M4121755j3412173n8759113k1432181k6651900K3159661K1404542
5066A6170567J8369893M951885m612412o5239963j268132n4784367P8860277L9011513
5058C1459261L7758981n193976j12352372j2813247k6669890Q8961661P3540116j1732943
5050F2957591j5756264r6285708J2312896K8864081O3158585M3346200j6457721k9329694
5042E2809966k8532243k6103662J1730320k785144K1177331Q30105j3061478m9787265
$$ y = [-22173366, -34544404, 1393770, -7587840, 28406943, 15796066, 30603072, 61479915, 27015669, 50149499, -9309662, 24563468, 44396375, 55974005, 53125344, -32242791, -71096679, -73192124, -29481003, 51236432, 39919100, 7953252, -50112677, -69480061, -4627226, 47739976, 91861731, 78449558, 19690445, -1741736, -28393636, -5233975, 16170567, 34540460, 39492345, 34879933, -30360030, -31628162, -86412529, -7552252, 31459261, 69218242, 64024266, -48328106, -61141353, -87811243, 1150418, 74690534, 62957591, 47201327, -49084381, -36771485, -7907404, 55251181, 98597381, 82139660, 52809966, 24277723, -1825939, 9904381, 7119237, 28296568, 29126673, 16065195, -33722070]
5034c3722070k7882067k7519395O6771761M1637919M0273417k2411210p4368093P539566
5026b9680172K978058R1279008K3218383m1903029l8975778r0129140N2896538n316747
5018c5632879N7648181l1362598k3233724j5682296K838679K8440755J1060153J4499004
5010H575275J2613345J3688400P388704l0243349j0595430k9014313M8694246J899688
5002B3006566K1761627n1072998l6057426l295796K6834455M8642878Q412504l2707897
4994E523913q921119k1675941N7231112n536933R895912m4603646j3178621J3038295
4986h227028J9116452J3420231k9917591j9931851q854174L1078729L2510326N654571
4978C4849665k794657l7422272J9419189r592145L4955798r291712m563167k38794
$$ y = [-33722070, -61604137, -89123532, -22351771, 19286148, 59559565, 37148355, -37219738, -29680172, -26702114, 64576894, 87795277, 45892248, 6916470, -83212670, -30316132, -35632879, 22015302, -9347296, -32581020, -48263316, -45424637, -16983882, -5923729, 8575275, 21188620, 34877020, 42265724, 12022375, 1426945, -27587368, 21106878, 23006566, 44768193, -6304805, -42362231, -45658027, -18823572, 29819306, 38231810, 5523913, -3397206, -25073147, 32157965, 26621032, 36516944, -8086702, -21265323, -8227028, 10889424, 24309655, -5607936, -25539787, -34393961, -3315232, 29195094, 34849665, 32055008, -5367264, 14051925, 4459780, 39415578, 30123866, 25560699, 25321905]
4970B5321905j5786540J6647738j5986792Q627988N536902J0493337J7249987p615345
4962D4489180j2589482q446027q566613J9395926n337631n573074k5887234k4567623
4954b7082578j909880j990748J4205801j1746638k976977j9522193J2267936N048076
4946c3707201K1138632M614264j2689168Q13520j7967050K7137735M174375J5512979
4938I028086l837726k3212038P867762o648395L7676855M944667J0688766k0096077
4930A6411900p447967p731010J8171583k79638P424330k7561723o724715k1837955
4922b9575195J4475729n814447J9140579j0294331O069293k031020O49641J8849981
4914A1470230J708773K0755965J115850r468343M576308k9213676K4733912j8271323
$$ y = [25321905, 9535365, 26183103, 10196311, 18824299, 24361201, 34854538, 52104525, 44489180, 31899698, 23453671, 14887058, 34282984, 28945353, 23372279, -2514955, -27082578, -28992458, -30983206, -16777405, -28524043, -31501020, -51023213, -38755277, -33707201, -12568569, -7954305, -20643473, -19829953, -37797003, -10659268, -6484893, 9028086, 5190360, -18021678, -10153916, -16802311, 20874544, 25819211, 36507977, 16411900, 8963933, 1232923, 19404506, 19124868, 26549198, -1012525, -7737240, -29575195, -15099466, -20913913, -1773334, -12067665, -5998372, -8029392, -7379751, 11470230, 13179003, 33934968, 35050818, 25582475, 30158783, 945107, 25679019, 7407696]
4906G407696K2902603j8823736p538349j7944474l717657N456656J6126620O551978
4898A0421337k018005n694687j4696450J5791407N277159K4865680N701241q081390o7099
4889C1499193n626256J6124429K1905220n757247R972135l2354143Q015168k531615
4881D1246884L517197o98562l0735759j9872292q406668j0513190K2412007k7984445
4873c1034828M701704k4492437J0059162Q785129J2409266m831216J1995391j4818235
4865b7226064L2104598j8115860J0629060k1300095j689522R945193P396676n468620
4857a3724634o415254l2108536K0813250n740489L1786831r536024l023342p212548
4849b5160746J4041717P822862K3230452k2081946J3558866j0098139K7284949J3989523
$$ y = [7407696, 30310299, 11486563, 3948214, -13996260, -17713917, -12257261, 3869359, 10421337, 8403332, 2708645, -11987805, 3803602, 9080761, 33946441, 39647682, 31566292, 31499193, 25872937, 41997366, 63902586, 58145339, 68117474, 35763331, 43778499, 41246884, 44764081, 44065519, 13329760, -6542532, -14949200, -25462390, -3050383, -31034828, -26333124, -50825561, -40766399, -31981270, -19572004, -24403220, -12407829, -27226064, 4878534, -13237326, -2608266, -23908361, -25597883, -15652690, -8256014, -13724634, -20139888, -52248424, -31435174, -37175663, -5388832, -14924856, -17948198, -25160746, -11119029, -3296167, 19934285, -2147661, 11411205, 1313066, 28598015, 42587538]
4841D2587538k197364r051830j3541432p330549K5157701j6767455J9246107m6723780
4833h621064j871800l2611479j568672j0011676J046147n830059Q224097j3071513Q809782
4824e5506237r816126K0590430J3865248K8687075M718927J2126668k1780915J1009286
4816C894356k1093164J5028378j3513973L271166j2326032o869767j9549086L142924
4808d8015198j6590958L4235029q746563L2234043j6987991J2556441j202352J1333797
4800a183752O723051n451150n783282j482799P665476P420608p914912j4808899j6829458
4791c1645117J5084581J5723488L4263747q521553m607188k2018145K238863J2982725
4783A3501401O581485N228904j2624185m878590q833417q292576j3497892L118791N329616
$$ y = [42587538, 40390174, 31338344, 17796912, 10466363, 35624064, 18856609, 38102716, -8621064, -10492864, -43104343, -44673015, -54684691, -53638544, -59468603, -51244506, -64316019, -55506237, -65322363, -44731933, -30866685, -2179610, 2539317, 14665985, -7114930, 3894356, -17198808, -2170430, -15684403, -12413237, -24739269, -31609036, -51158122, -48015198, -64606156, -30371127, -39117690, -6883647, -23871638, -11315197, -12517549, -1183752, 5539299, 88149, -5695133, -7177932, 487544, 7908152, -6760, -14815659, -31645117, -16560536, -837048, 33426699, 24905146, 20297958, -1720187, 518676, 13501401, 20082886, 25311790, 12687605, 7809015, -1024402, -9316978, -22814870, -19696079, -14366463]
4774a4366463L7331102j544613P981023m0347107J852464K874934M1250504J5114974
4766E0146818k238902l0566457j7247464k65606K2417306J2584704Q810857j2541685
4758C1099571Q488060r647987J7493526j8646942J2368580j2747966J5876129j3452737
4750C0830234r185990l0214162n817222q002276J8981419j0857024N277079j8390441
4742b7378383J3721641O420805J1176522J344745j1007371R636607k028810J2802225
4734A4687981j7275972j6952097j3475269n582136K2411213m192896J1845849j7174274
4726b5707601R288365J0229848J3822481K0374494l323992J7600806j0192840N024563
4718C7116124k4076626j0875078r228595O160871M948426j3303282k4383200j8769178
$$ y = [-14366463, 22964639, 21420026, 29401049, -10946058, -9093594, -6218660, 35031844, 50146818, 47907916, 17341459, 93995, -171611, 22245695, 34830399, 43641256, 31099571, 39587631, 29939644, 47433170, 28786228, 41154808, 28406842, 44282971, 30830234, 21644244, -8569918, -14387140, -22389416, -3407997, -14265021, -8987942, -27378383, -13656742, -7235937, 3940585, 5285330, -5722041, 3914566, 1885756, 14687981, -2587991, -19540088, -33015357, -38597493, -16186280, -20379176, -8533327, -25707601, -16419236, -6189388, 7633093, 28007587, 24683595, 42284401, 32091561, 37116124, 13039498, 2164420, -7064175, -903304, 4045122, -9258160, -33641360, -52410538]
4710e2410538J17497L3629634J4017467K1252361k5276284K109884k832768J5008445
4702E615698J6927732j5442169O246043k0744546J1434224q935688j1438515j310584
4694a7647805o508776L4472110O239355J6226961k1896588m808545J649143J8523626
4686B6249481J8384791j1374050o950347l0158913O251864j0953309J721994o198462
4678a3026951q629242J9265564J212602J0092536j0201215j5288250J9978067N767526
4670I170637L5399992j1104882j5511014j6824501j4857520K4163924m778911R158843
4662A4816568k2182965k521344j701680J0354999L6653o669979l938774k954894J8316981
4653C555565m793718L602313j8203795r764017J0870184o201446K6270693j3144121
$$ y = [-52410538, -52293041, -18663407, -4645940, 16606421, -8669863, -6559979, -9392747, 5615698, 22543430, 7101261, 13347304, -7397242, 4036982, -4898706, -16337221, -17647805, -24156581, 10315529, 16554884, 32781845, 10885257, 6076712, 7725855, 26249481, 44634272, 33260222, 26309875, -3849038, 2402826, -8550483, -6828489, -13026951, -21656193, -2390629, -1178027, 8914509, -1286706, -16574956, 3403111, 9170637, 44570629, 33465747, 17954733, 1130232, -13727288, 10436636, 5657725, 14816568, -7366397, -9887741, -11589421, -1234422, -1197769, -7867748, -11806522, -14761416, 3555565, -1238153, 2364160, -15839635, -25603652, -14733468, -20934914, 5335779, -7808342]
4645g808342J6851599Q78458N806631P386514q376356M979120J5966383O645681K2258853
4636F4588541l4564810j1711627l6894603Q773160J4907382J3679427n053150l0068153
4628a6343833k2999969o265243K0547579K0717204J5837933p664788q401828k505801
4620g078746k758020J8472944o762171J9510901n398794P442668p003260j6101155j469086
4611a144719M91941K0299960J4073847r084764j2669523k3267992P941419J8991401
4603A5631570J5114076N469117k8128371l606832q421914K9715132P520089L718546
4595C7011413j4296400j3249268J0928831o1660J5188947j6732404m05029m095068N134875
4586A9424237M077454j4930537o366758k649667J7218837J5483924l228830j9628887
$$ y = [-7808342, 9043257, 9921715, 15728346, 23114860, 14738504, 19717624, 35684007, 42329688, 64588541, 30023731, 18312104, -18582499, -9809339, 5098043, 18777470, 13724320, -16343833, -39343802, -45609045, -25061466, -4344262, 11493671, 3828883, -4572945, -7078746, -9836766, 8636178, 1874007, 21384908, 15986114, 23428782, 16425522, 324367, -1144719, -652778, 19647182, 33721029, 24636265, 11966742, -11301250, -3359831, 15631570, 30745646, 36214763, 8086392, 4479560, -3942354, 25772778, 33292867, 37011413, 22715013, 9465745, 20394576, 20332916, 35521863, 18789459, 18384430, 14289362, 19424237, 23501691, 8571154, 2204396, -445271, 16773566, 32257490, 29028660, 9399773]
4578I399773k0304112P7713J9389608K0406915m838775j8283581k6415823l371520
4570b3939802J5232481J0064359J1246487j5050834n579941L655400o872830K2362725
4562A1118045k2524691J9012031j0676449P968665L221605k0986484M363282j2181335
4554b0685331J2029685J2519746p362758N769999j4415335N996713J0108112P20154
4546D680985P020130r545641n032550P257236m089444R162015o592487j3052029N024577
4537e167208j0469499K0535205P477691l111834P700322l2135033J1710544o338215
4529i798027J3254482J6738082k6353701j330677l3427871N324648J5290126N389240
4521a4913698J3843553j6349711n968834J2656515J778758K8209262j0306468o46226
$$ y = [9399773, -10904339, -10826626, 8562982, 28969897, 24131122, 5847541, -20568282, -23939802, -8707321, 1357038, 12603525, -2447309, -8027250, -4371850, -11244680, 11118045, -11406646, 7605385, -3071064, 4897601, 8119206, -12867278, -8503996, -20685331, -8655646, 3864100, -3498658, 2271341, -12143994, -6147281, 3960831, 4680985, 11701115, 2155474, -2877076, 4380160, 290716, 9452731, 2860244, -10191785, -5167208, -15636707, 4898498, 12376189, 9264355, 16964677, -15170356, -3459812, -9798027, 3456455, 20194537, -6159164, -7489841, -40917712, -35593064, -20302938, -14913698, -1070145, -17419856, -23388690, -10732175, -8953417, 19255845, 8949377, 8303151]
4513H303151j498726p186997J2670934j6709646q316136p933905k878639J5130795J627071
4504f792098p613051M646825p556639L3643851P821150O139900o498789k5818168J3639863
4495A1612844j0266119O787635k4956569l3928108j4783877j1959424J2141037r16224
4487f6268805j1896712j713152M511474K8150108L0820204L474076J3509778j4466866
4479a3879895K9025640J1369383J5599790r709419l0485768j1288393r722800J6152700
4471b938762n2223p187387k0927123o406461l542881K4335176O3832J5905057j1002259
4462a1753031J327897J288576r402186P618928j5181738P272641k619450n622780m84388
4453b7555531k0597371N150242l37098J2018594P945840p613861q858056P29784o965984
$$ y = [8303151, 6804425, -382572, 12288362, -4421284, -12737420, -20671325, -23549964, -8419169, -6792098, -14405149, -9758324, -17314963, 16328888, 24150038, 30289938, 23791149, -2027019, 11612844, 1346725, 8134360, -16822209, -50750317, -65534194, -77493618, -65352581, -66268805, -78165517, -79878669, -75367195, -47217087, -16396883, -12922807, 586971, -13879895, 15145745, 26515128, 42114918, 32405499, 1919731, -9368662, -19091462, -2938762, -2990985, -10178372, -31105495, -37511956, -41054837, -16719661, -16655829, -750772, -11753031, -10425134, -9136558, -18538744, -10919816, -26101554, -18828913, -21448363, -27071143, -27555531, -48152902, -43002660, -43339758, -31321164, -23375324, -30989185, -39847241, -39117457, -46083441]
4444d6083441K8895752k1563483J6347301l3729040J0746876j20107J7239801P548524
4436b0717817k567618j2875448M758884K175540K6683802J2180463K032606p0660j6191629
4427d591877M447200J0199470K655962L2784803k4099734K4939788l7628619J1516434
4419B0223427j3433654R509513L903842j707015k4358319j0632720m4649103J0481923
4411e0662106k7811874J9698974j5446252r15560r156525l008052M161467J7935856
4403f5204072J0386417K9090094N397814J8069540l287833Q013594m371188J9528120
4395A7622486j3049634K6964414l5329284K4610171l2278603K2198615r855521O149975
4387G032619K940987k064167Q971800O726190m795400N595442k3099415N448679j4915339
$$ y = [-46083441, -17187689, -38751172, -22403871, -56132911, -45386035, -45506142, -28266341, -20717817, -23285435, -36160883, -31401999, -29226459, -2542657, 9637806, 11670412, 11599752, -4591877, -144677, 10054793, 12710755, 45495558, 21395824, 46335612, 8706993, 20223427, 6789773, 16299286, 20203128, 18496113, -5862206, -16494926, -61144029, -50662106, -78473980, -58775006, -74221258, -75136818, -84293343, -87301395, -83139928, -65204072, -54817655, -25727561, -20329747, -2260207, -5548040, 2465554, -1905634, 17622486, 4572852, 31537266, -3792018, 20818153, -11460450, 10738165, 882644, 7032619, 9973606, 7909439, 16881239, 23607429, 18812029, 24407471, 1308056, 6756735, -8158604]
4378h158604N519890m951809p864307o295230j3584178l540165m5118O348175J7623202
4369a4948144Q620603J3341733p522276J629703o052979J4826200R430614R889027p264061
4360B1950420k3615436j5811007k6033693J0530876j5701078J4708336k9424226n129654
4352f8525462l0481475l61300n50488J9492939J0243869J1844785j3462210P757490
4344f4041852n707381L7731729J5210801K6070845j0361054j2519922j2448721N104532
4336b0961023P146212J0408323k4822458j1114958l6163559Q278283m967956K1744431
4328e0452705L609085J1987409N607714J6450494J1329248K4697884J6564591K8573901
4320F8367621J2728832M396545j3246888j8378846q974949k642614N251285j2554295
$$ y = [-8158604, -2638714, -7590523, -15454830, -21750060, -35334238, -38874403, -38919521, -32571346, -14948144, -6327541, 7014192, -508084, 1121619, -4931360, 9894840, 19325454, 29214481, 21950420, -1665016, -17476023, -43509716, -32978840, -48679918, -33971582, -63395808, -68525462, -99006937, -99368237, -99918725, -80425786, -70181917, -58337132, -71799342, -64041852, -69749233, -32017504, -16806703, 9264142, -1096912, -13616834, -26065555, -20961023, -13814811, -3406488, -28228946, -39343904, -75507463, -67229180, -72197136, -50452705, -46843620, -34856211, -29248497, -12798003, -1468755, 23229129, 39793720, 68367621, 81096453, 85492998, 72246110, 53867264, 44892315, 42249701, 47500986, 34946691]
4312C4946691j3528956l0510631o36800o125795K3805015L676174J3545943M656929
4304B9828570J0154955J0323879L590577n636381K772238p589604J9544776j5810818
4296D7178192K077358l9409470p461846j5056186J6718002R509341L850018j0324334
4288G081075j5971883j1003147P814262J023853K3944735k0337489R737649m0082334
4280c7793279N150463j8114109J4680729Q919752J870321L004979j3337779K524484
4272c3094439P437539J4575607J8941958K858718L179892p520743K895998K068807
4264A1343337J1201721J486897N122548m581532l517245K056723m556939R454323k754259
4255B5255574m073894k326384k5912615O433677k5054690R350316j3002203j2362618
$$ y = [34946691, 21417735, -9092896, -9729696, -15855491, 7949524, 11625698, 25171641, 29828570, 39983525, 50307404, 53897981, 48261600, 51033838, 43444234, 62989010, 47178192, 49255550, 9846080, 2384234, -12671952, 4046050, 13555391, 17405409, 7081075, -8890808, -19893955, -12079693, -11055840, 12888895, -7448594, 2289055, -37793279, -32642816, -50756925, -36076196, -27156444, -25286123, -22281144, -35618923, -33094439, -25656900, -11081293, 7860665, 10719383, 13899275, 6378532, 9274530, 11343337, 22545058, 24031955, 29154503, 24572971, 21055726, 23112449, 18555510, 28009833, 25255574, 21181680, 18855296, -7057319, -623642, -25678332, -16328016, -29330219, -41692837]
4247d1692837n63286k3438049J7616450r100062J6404867J910692R22000J0228103J404589
4238b6307533J1783621l14643Q71394r328970O330386j3468097J5733974k4369340O711990
4229c2357218j7412256O607706J2380399N257269J0743749m035854l107437J7580120
4221d343522K846284K7509660j0814943l987259j2173648m463818J5281421L706640
4213A3560815l595876j3816602k4839590O067285J318525K3364941k411331m735221
4205e087054k3293958k250385j1932629K3910689n099587J7312797j0120231j3469034
4197c0029392k376616k3088332L2825495N245195M2724517N5730j3951422j7367717
4189e962542j8571433L0298366K5204498K5784048q919060l8609165k0261570j6501059
$$ y = [-41692837, -42256123, -65694172, -48077722, -57177784, -40772917, -38862225, -37940225, -27712122, -26307533, -14523912, -14838555, -13967161, -23296131, -16965745, -30433842, -14699868, -39069208, -32357218, -49769474, -43161768, -30781369, -25524100, -14780351, -18816205, -21923642, -4343522, -1497238, 26012422, 15197479, 11210220, -963428, -5427246, 9854175, 13560815, 9964939, -3851663, -28691253, -22623968, -21305443, 2059498, -351833, -5087054, -28381012, -30631397, -42564026, -18653337, -23752924, -6440127, -16560358, -30029392, -32406008, -55494340, -22668845, -17423650, 25300867, 25356597, 11405175, -5962542, -24533975, 5764391, 30968889, 56752937, 47833877, 9224712, -11036858, -27537917]
4181b7537917K9249978P874404J2347520k3337794j2740647j2988310L443614M243672
4173a9445480k50399K58557K015807K091144R531129j6087036P712554k3844987K8537058
4164i481653n184918L3861860n035342K560604r594960j7356417O272387o327198K0865582
4155A0579945O726406m362816p361803m3415075p13230j7605322L8605474J8469348
4147I22927J1619146j2388000m0469720j1823212j492245L1827872K9987988l101090
4139E083666j5135562m3836076j0388983M081229L1348260K3126165Q992944r888349
4131f616706n208903K582361J5066423J9964231L266550J0144376j0783585q66649
4123B7548098j1178670k2951401p863463k1281806R639365J021536l952362J038931
$$ y = [-27537917, 1712061, 9586465, 21933985, -1403809, -14144456, -27132766, -23689152, -19445480, -19695879, -19437322, -17421515, -15330371, -5799242, -21886278, -14173724, -38018711, -9481653, -14666571, 19195289, 14159947, 16720551, 7125591, -10230826, -3958439, -10285637, 10579945, 17306351, 12943535, 5581732, -37833343, -38546573, -56151895, -17546421, 922927, 12542073, 154073, -40315647, -52138859, -53631104, -21803232, 8184756, 5083666, -10051896, -53887972, -64276955, -60195726, -28847466, -5721301, 3271643, -6616706, -11825609, -9243248, 5823175, 25787406, 29053956, 39198332, 28414747, 27548098, 16369428, -6581973, -14445436, -35727242, -26087877, -25066341, -29018703, -27979772]
4115b7979772k1867605R772932J634343J1622646J6429458o312262J2856569j0761157
4107a4604848j4666643j6539861l3773987P863931M215256J6332612j83149l7319907
4099h8676596j0934689l90636N0400145N9480828K2064327O592424k9344352J0831538
4091B0022989K4998352M1073681J1919996j0197229l5048928j0678021j0567897J048024
4083C2570967l881984k1953223P332701j0700265N593995j0852911k8000544Q318257
4075b1573007o945543K8025073M22630k2584128l508867k3402084L1237126Q659014
4067i669786R361199Q523760p571570L5030949N699733J4924385k3673621j1208948
4059B1416101k661359K1311354J0109832l0204930l3205995p3080693K6043075j1520753
$$ y = [-27979772, -49847377, -40074445, -38440102, -26817456, -10387998, -16700260, -3843691, -14604848, -29271491, -45811352, -79585339, -71721408, -67506152, -51173540, -51356689, -88676596, -99611285, -100001921, -49601776, 9879052, 31943379, 38535803, 9191451, 20022989, 45021341, 86095022, 98015018, 87817789, 52768861, 42090840, 31522943, 32570967, 28688983, 6735760, 14068461, 3368196, 8962191, -1890720, -29891264, -21573007, -28518550, -493477, -70847, -22654975, -26163842, -49565926, -18328800, -9669786, -308587, 8215173, 643603, 35674552, 41374285, 56298670, 32625049, 21416101, 18754742, 40066096, 50175928, 19970998, -13234997, -86315690, -60272615, -71793368]
4051g1793368O9355720r159926q372271j1064337j7494560N4508123L2153697M0511794
4043G8644872K3138618l1275221M032327l3300301J363448J1654432j0872883K1064758
4035F4450050k5735863j2093053o056423j4045533L8672946J3448534K9727987N480822
4027I3849467r118778j8883397M168990l6787574K2859995n4709922j3426743k7330283
4019c9378245o2188304L7684521q3698359N3283462n9488555K6093707J0761115J3903227
4011a03027431K8547815N226628l5952403K5597811n1012024N8183598j8445961r60901
4003i1842868j7035696n5236109J990643J7359174O389338Q8228824m2818445Q5848994
3995g116145l7435256P0846523J2691745O0111385K22451O7929852p5049742Q0418534
$$ y = [-71793368, -2437648, -11597574, -19969845, -31034182, -48528742, 5979381, 38133078, 78644872, 101783490, 70508269, 74540596, 41240295, 42603743, 54258175, 43385292, 64450050, 38714187, 26621134, 20564711, 6519178, 45192124, 58640658, 88368645, 93849467, 84730689, 65847292, 70016282, 33228708, 56088703, 1378781, -12047962, -39378245, -101566549, -63882028, -147580387, -94296925, -153785480, -127691773, -116930658, -103027431, -74479616, -69252988, -105205391, -79607580, -130619604, -72436006, -90881967, -91842868, -108878564, -164114673, -162124030, -144764856, -138375518, -50146694, -92965139, -7116145, -44551401, 26295122, 38986867, 99098252, 99320703, 167250555, 92200813, 172619347]
3987A72619347j23072710O6893868p7260872J8475753j6224281m0064589j4893363
3980a3526847j6157345l4273579N9027960n7065489O5601603m0096246L0817148J5432261
3972I759466Q188710N511874L2848372m8596407J04287996q4122483J06946673q1427614
3964E3396587M3967284j9917523L918058M563415j1240219m0088817R393283n5830458
3956a1838390J5255491l2170020k9053844J4245109l7568643L4414676j610594q134009
3948e6460224N3437700k4402444P9766518r627941K1286476N964870j1690533K3218794
3940H1493216R569665l4980965P573016q1703233K2454731j9645277K881529K4637682
3932A2280364o2217174M2352803l5732473N9361013J3649148J4514032M423975r757441
$$ y = [172619347, 49546637, 116440505, 39179633, 57655386, 41431105, 1366516, -13526847, -29684192, -63957771, -4929811, -61995300, 3606303, -36489943, -5672795, 9759466, 17948176, 23460050, 56308422, 7712015, 112000011, 27877528, 134824201, 53396587, 97363871, 77446348, 81364406, 85927821, 74687602, 34598785, 43992068, -11838390, 3417101, -28752919, -57806763, -43561654, -81130297, -46715621, -48326215, -56460224, -3022524, -27424968, 52341550, 42713609, 64000085, 69964955, 58274422, 81493216, 91062881, 56081916, 63654932, -18048301, 4406430, -15238847, -12357318, 12280364, -49936810, -7584007, -43316480, 16044533, 29693681, 44207713, 48631688, 38874247]
3924C8874247J199921R324497p342667q194092j1176252l2291837J2771664l2365525
3916b9200044K1214605o170324J0676626K5885893p574236K5427745m860729J8748875
3908E4148411K0323316K726952J016807k2900481l0839101m548847k4609954J6030571
3900A1347674k1539213n641175j6140396j7445510J7086389k175846M3172293Q71116
3892I535332K8395224j5761331N490045p341702R796256J0604290j396012q304710
3884C1017392k1677564j5416159p847977k077985l000946k94388m249067J0293381M547925
3875h705388r07257j872678j7081787J7416875O999015K4707936J63210j8928907j3507346
3866a1716327j0653474J3140314K2323237k881372M928543k7822390m265393m950248
$$ y = [38874247, 40074168, 49398665, 42055998, 33861906, 22685654, -9606183, 3165481, -29200044, -7985439, -14155763, -3479137, 22406756, 14832520, 40260265, 35399536, 54148411, 74471727, 77198679, 78215486, 55315005, 24475904, 19927057, -4682897, 11347674, -10191539, -15832714, -31973110, -49418620, -32332231, -34508077, 8664216, 9535332, 37930556, 22169225, 27659270, 20317568, 30113824, 40718114, 39322102, 31017392, 9339828, -6076331, -13924308, -16002293, -19003239, -19297627, -23546694, -13253313, -8705388, -9612645, -11485323, -28567110, -11150235, -4151220, 20556716, 20719926, 1791019, -11716327, -22369801, -9229487, 13093750, 10212378, 15140921, -12681469, -16946862, -21897110]
3858b1897110l806845Q625838p749640K423560P82885j3547136O48985j0823496P822492
3849c7520467K7215618N751094K5294905j8011751k969312N981707k285176L5776304
3841C9232922j4531775N885704k1649445j7101035O516577r885078J2303573l746887
3833b975444q244088O954189j2362804J4611517j205938P968500M880167j218338J75924
3824H583685k940038m703680m966917m31382j1399276J2327244j3601052J0862967
3816f268449j0967085q284428J0916784j1020794L2224234j3122399O488458j6669536
3808a6703215j5859408J3810662p673658K3262676j9623671k299402j7530198L377722
3800c9238492Q787477R711080M801251n82479j162247Q050688k477671J0158957j8144591
$$ y = [-21897110, -25703955, -17078117, -24827757, -22404197, -21621312, -35168448, -34519463, -45342959, -37520467, -10304849, -4553755, 20741150, 2729399, -239913, 5741794, 3456618, 39232922, 24701147, 30586851, 8937406, -8163629, -1647052, -11532130, 771443, -2975444, -11219532, -4265343, -16628147, -2016630, -3222568, 4745932, 9626099, 8407761, 8583685, 5643647, 939967, -4026950, -4458332, -15857608, -3530364, -17131416, -6268449, -17235534, -25519962, -14603178, -25623972, 6600262, -6522137, -33679, -16703215, -32562623, -18751961, -26425619, -3162943, -22786614, -25086016, -42616214, -39238492, -30451015, -20739935, -15938684, -16521163, -17683410, -9632722, -12110393, -1951436, -20096027]
3791b0096027J2690137j4507601J9367077j2423146l105362j6122715r371889O143444
3783c7426082O911357N560927N88509j6771685O944452j3089862K2585709j7021406
3775d1718081J7571896k0962129K3629237p327924J6996748j2236520o515741J159020
3767b9403494J2486668K5698524J7039711j5112609r010773l7605263K1094091J348176
3759a3464969L3838398j0746013j5637351k8906253m647242Q451972L0581609R405244
3751H875395J3775193m711263P467845P347963O895702Q07838P848104j401186J9367278
3742F6272869j8091936j3520539m1240025k0934320L021256R488582J0033784k0886525
3734b5856854l1670417j4783084L499998L0347646J6449096p38044q229859k415616
$$ y = [-20096027, -7405890, -21913491, -2546414, -14969560, -18074922, -34197637, -43569526, -37426082, -30514725, -24953798, -24365289, -41136974, -34192522, -47282384, -24696675, -41718081, -24146185, -45108314, -21479077, -28807001, -11810253, -24046773, -30562514, -29403494, -16916826, 8781698, 25821409, 10708800, 1698027, -35907236, -14813145, -13464969, 20373429, 9627416, -6009935, -34916188, -39563430, -31111458, -529849, 8875395, 22650588, 17939325, 25407170, 32755133, 39650835, 40458673, 48306777, 46905591, 66272869, 48180933, 34660394, -6579631, -27513951, -24492695, -15004113, -4970329, -25856854, -57527271, -72310355, -68810357, -38462711, -22013615, -22751659, -30981518, -33397134]
3726c3397134J8537447K1323835N020026o398497l872152P084261L6238953O24724P109239
3717E2270702l7476879n282602R188660J6087530J7108872l0174894k3354180k3527719
3709b5160510j355261J6985620j1794611j973998k5747127J1087082O61076J7449372
3701a9848357j4398157K748075k793252K1231428J5495127j1238662j1733655k7808148
3693d8345601Q888982J5605800K154273J345118m1191912M237027l69725K9358520
3685b8317518K1455964j3026021N479046j7562953K5661705Q009315R237994q050913
3677B886619j4673222r248284o290602r145389o133742q422437M089087M79445P051556
3668c9406969j1954463J6228454k471910M5618523K693286K5185450j3325193L060967
$$ y = [-33397134, -14859687, 6464148, 11484174, 5085677, 1213525, 8297786, 44536739, 45161463, 52270702, 14793823, 9511221, 18699881, 34787411, 51896283, 21721389, -1632791, -25160510, -26515771, -9530151, -21324762, -23298760, -49045887, -37958805, -37297729, -19848357, -34246514, -31498439, -34291691, -13060263, 2434864, -8803798, -20537453, -48345601, -39456619, -23850819, -21696546, -20351428, -61543340, -57306313, -57676038, -28317518, -6861554, -19887575, -14408529, -31971482, -6309777, 1699538, 10937532, 2886619, -11786603, -21034887, -27325489, -36470878, -42604620, -51027057, -46937970, -46458525, -39406969, -51361432, -35132978, -37604888, 8013635, 10706921, 35892371, 22567178, 25628145]
3660B5628145Q051843O985088N378395r312351k3501769L641522k4427909J9929504
3652A2372468l5823737Q201597k5470999J8640229R58406J1457484p899997J84274J077271
3643a6303004J5363692J0341061N464153K342450N98890R232533L154972m586103K844
3634B5611488o816786K4840917N89269J1899478k5481168j3933287l428060J0846623
3626B4128474K3479485q956241j5929286l2818214q074038N073391K0376211l216653
3618D063129j349679l3540186N935132j3149989K8229220k029586J2439769j3979179
3610a3381369L59083j4441024J1814895m954624J7977722j359930l272571l94207k0193316
3601b7845341J4373752l168576J5767059J6999828j8522992K2548401m3869717K8412718
$$ y = [25628145, 33679988, 40665076, 46043471, 36731120, 13229351, 16870873, -7557036, 12372468, -23451269, -15249672, -40720671, -22080442, -21122036, -9664552, -17564549, -17380275, -16303004, -939312, 9401749, 14865902, 17208352, 17807242, 27039775, 30194747, 25608644, 25611488, 18794702, 43635619, 44224888, 56124366, 30643198, 16709911, 13281851, 24128474, 47607959, 38651718, 22722432, -10095782, -18169820, -13096429, 7279782, 4063129, 2713450, -30826736, -24891604, -38041593, -9812373, -11841959, 597810, -13381369, -13022286, -27463310, -15648415, -20603039, -2625317, -3985247, -7257818, -7652025, -27845341, -13471589, -16640165, -873106, 16126722, -2396270, 20152131, -23717586, 4695132]
3593D695132k4164345K7421233j168530o550357j1753027l0683889k738938m150762
3585d9093483J8234466n952845J667984k7209682J1628902j560322K4301168L472677
3577b4511135n623543O150849R028037K2657327J7984838k3356357j50219k4812052
3569b2632255L2471065K2097611P943042l104194m1700414q86404P602483J5686486
3561A7477420L4462336l0640648K3447946l8424393K6889112k1460218J0271845n107879
3553A6915521J7361882J2911668O63556j9923195l3692782K018784M054453M7019225
3545D7329112p412365j0344464m2194947k8862687J3361026j806027K2824943k3144998
3537c0250407j2978976j0033680r796687J3998368q124981J6532589R992830K5649469
$$ y = [4695132, -19469213, 7952020, 6783490, 233133, -11519894, -42203783, -44942721, -49093483, -30859017, -36811862, -35143878, -62353560, -50724658, -52284980, -27983812, -24511135, -30134678, -23983829, -14955792, 7701535, 25686373, 2330016, 2179797, -22632255, 9838810, 31936421, 39879463, 36775269, -4925145, -5811549, 1790934, 17477420, 51939756, 21299108, 44747054, 6322661, 33211773, 11751555, 22023400, 16915521, 34277403, 47189071, 47852627, 27929432, -5763350, -3744566, 309887, 47329112, 39916747, 29572283, -12622664, -41485351, -28124325, -29930352, -7105409, -30250407, -43229383, -53263063, -63059750, -49061382, -57186363, -40653774, -30660944, -5011475]
3529e011475J0310552Q802685j6991694J5672231p334285L4786006j1748458N432590
3521C3918152k6898219r470072j4560490k055196j0459027R009176l451862J7520925
3513f446613n585720m74641j07692P224520L0515092J4028614Q250180j1415233k0265121
3504A5723386P120150q873830J9702927k3331589q24359k1550193M656937J787587j191844
3495f780828Q818057j0003085K8547049j2943325L0230200k7752369K5220448r520235
3487B5815912K3265389Q74221j4743053j380226j5682377K5247506P717733J979704
3479E3094809n132957l1797506J7248655j1231176L2731844j7354649l483131k5685614
3471H390275o599049k705012O977193l334827N871691j0090862J4171120p133577K0017048
$$ y = [-5011475, 5299077, 14101762, -2889932, 12782299, 5448014, 40234020, 28485562, 33918152, 7019933, -2450139, -17010629, -19065825, -29524852, -20515676, -23967538, -6446613, -12032333, -12506974, -12614666, -5390146, 25124946, 39153560, 47403740, 35988507, 15723386, 22843536, 13969706, 33672633, 10341044, 9516685, -12033508, -7376571, -5588984, -6780828, 2037229, -7965856, 20581193, 7637868, 37868068, 10115699, 35336147, 25815912, 49081301, 49955522, 35212469, 33832243, 18149866, 43397372, 51115105, 53094809, 47961852, 16164346, 33413001, 22181825, 54913669, 37559020, 34075889, 8390275, 1791226, -913786, 6063407, 2728580, 8600271, -1490591, 12680529, 5546952, 25564000]
3462B5564000k071497K2817434N356125J0802729M288637j4623814J1961314k6991153
3454C7103775K2625675l0372700J2452621k0406820p727190J832885k2060384K1798635
3446A5246497j5201485K3792906l943830k847069N122658j6921653K4414414j7859327
3438A1803111K0527579l0966164J0270672k4757627J6836827j4136727Q737067o379046
3430h064308O646955Q689052J873545l651032m038497n302107J9637570j405777K231361
3421A6616762k8471667k4519595m813153J998177J9263804o554308j7048848j3736232
3413e7265060j1951634K2002548O009448J4482569o807215k801803k734229p58234l106142
3404d2929752k752899N628446J544822J9180189k0153341J5348302k5815412L5282907
$$ y = [25564000, 23492503, 46309937, 51666062, 62468791, 66757428, 52133614, 64094928, 37103775, 59729450, 29356750, 41809371, 21402551, 13675361, 15508246, -6552138, 15246497, 45012, 23837918, 19894088, 17047019, 22169677, 5248024, 29662438, 11803111, 32330690, 1364526, 11635198, -13122429, 3714398, -10422329, -1685262, -8064308, -1417353, 7271699, 9145244, 5494212, 1455715, -3846392, 15791178, 14385401, 16616762, -11854905, -36374500, -41187653, -39189476, -19925672, -26479980, -43528828, -57265060, -69216694, -47214146, -41204698, -26722129, -33529344, -36331147, -39065376, -39823610, -42929752, -45682651, -40054205, -38509383, -19329194, -39482535, -24134233, -49949645, -14666738]
3396a4666738L441069K6654286m41388p576772O867601Q60767J5703801n349374r979313
3387A5513939p956472j971519J5296577m051633L151928l0656092J1229148j5805794
3379a5249918L4960030r638102Q201078j6541956j7415852r07871j8015842Q245294
3371b6363139j569501L117858Q960966k2812487K377079j5937429K7585527K8602823
3363C961697K7515758J3757123j6094802l812969l109854J9793942J4359416q54068
3355E5516243p680654l0497568k474032k7657028J4868376j8428611J5425356l626971
3347d554889l095201P099889k1303447K3400944q354730K3559329P3202j0796178P663872
3338A3692791k6047742K2500445k9421408J4752689k6093708J3249364n441017N202452
$$ y = [-14666738, -11225669, 15428617, 14987229, 7410457, 14278058, 15138825, 30842626, 25493252, 15513939, 7557467, 5585948, 20882525, 16830892, 19982820, -10673272, 555876, -15249918, 19710112, 10072010, 18273088, 1731132, -15684720, -16592591, -34608433, -26363139, -27932640, -24814782, -15853816, -38666303, -36289224, -52226653, -24641126, 3961697, 31477455, 45234578, 29139776, 25326807, 22216953, 42010895, 56370311, 55516243, 47835589, 17338021, 14863989, -12793039, 2075337, -16353274, -927918, -4554889, -7650090, -550201, -21853648, 1547296, -6807434, 16751895, 16825097, 6028919, 13692791, -12354951, 10145494, -19275914, -4523225, -30616933, -17367569, -22808586, -17606134]
3330a7606134n386244j1006852P792964N841058K0398492O971820p651841J0348093
3322I701356j0756080L6439847q662418J9628027j4706075M964377R345090L212459
3314D9166583L331124j0843693j0693704P358109j0234671N921483l0221636k756586
3306A027009j0993535J8941162l913811n146390k4791296n214337J9991879J7756678
3298G657359K7133305k8355465m612760j8970746J8461383K4071696n756651J089100
3290B0717221l1211661L585698M505283Q9383O879172k2297652J5031631j697031K2198274
3281A7800318j2789476m46105k2261698K2351311n21944K3797166j2841860r095623
3273E992089k438661k201047J1797833K779895j0013567K1213519j3679951L3156638
$$ y = [-17606134, -22992378, -33999230, -26206266, -20365208, 33284, 7005104, -646737, 9701356, -1054724, 35385123, 26722705, 46350732, 31644657, 36609034, 45954124, 49166583, 52497707, 41654014, 30960310, 38318419, 28083748, 34005231, 3783595, 1027009, -9966526, 8974636, 5060825, -85565, -24876861, -30091198, -10099319, 7657359, 34790664, 6435199, 1822439, -17148307, 1313076, 25384772, 19628121, 20717221, -10494440, -6908742, -2403459, -2314076, 4565096, -17732556, -2700925, -4397956, 17800318, 5010842, 4564737, -17696961, 4654350, 4132406, 27929572, 15087712, 5992089, 3553428, 1352381, 13150214, 15930109, 5916542, 27130061, 13450110, 46606748]
3265D6606748k9490117Q3727k1930995P690179J8796448J0694430j1527352j9362019
3257A561049l3096602R229366M730346K7989308K881657r91837j6966374j419104j3007717
3248a9089908J8673814J227542J7459100K136199k5816907j1509785l6224572J4465224
3240c8679293J4654871J2466424J1797020l9240801J589771j0914455L2016997K7314003
3232A1004537M681026M819368j6047144J1013741M193589J3639000q662030P740052
3224C2382139j2392445J7586234j3418197o657200j2688231r677742J8453995L295044
3216A6883597j966087j0786781k9534843J4107851m095215K1884270l523589j0157477
3208g188274K972286J942938J1941284R177874j5313281J1613372m379467K3725479Q54751
$$ y = [46606748, 17116631, 17200358, -4730637, 2959542, 21755990, 32450420, 20923068, 1561049, -31535553, -22306187, -17575841, 10413467, 13295124, 12303287, -4663087, -6082191, -19089908, -416094, 811448, 18270548, 20406747, -5410160, -16919945, -53144517, -38679293, -24024422, -11557998, 239022, -39001779, -37412008, -48326463, -16309466, 11004537, 15685563, 20504931, 4457787, 15471528, 19665117, 33304117, 24642087, 32382139, 19989694, 37575928, 24157731, 17500531, 4812300, -4865442, 13588553, 16883597, 14917510, 4130729, -25404114, -11296263, -15391478, 6492792, 2969203, -7188274, -4215988, -2273050, 9668234, 18846108, 3532827, 15146199, 10766732, 34492211, 35346962]
3199C5346962j4622656k3419756j5328826K41907K7935108l465787J673939l1732707
3191b3371816j5770244J1442279J1099669L8381153L581822L510566n249888j1249762
3183A2373779J0157882L440052J0287269J0779670q510635m969444j8225798j7235861
3175a903086K989996q49057J7218848J3756537j0456839J1720251l2541262J4466437
3167A4401825q325085J8049525J7336030p407640m739004k9388715k1341784M600624
3159a6814224o228271K8197180j7325669N230907k6073149O950958q953943K1736089
3151a3280122n677770K2572979K93417J2662671j586226j4319942n312723N488798
3143H41082J4221454L5642402k0072759N109983n0394982J1726275J410472K5882893
$$ y = [35346962, 20724306, -2695450, -18024276, -17782369, 10152739, 6686952, 8360891, -23371816, -39142060, -27699781, -16600112, 21781041, 25362863, 28873429, 23623541, 12373779, 22531661, 25971713, 36258982, 47038652, 38528017, 33558573, 15332775, -1903086, 1086910, 237853, 17456701, 31213238, 20756399, 32476650, -64612, 14401825, 6076740, 24126265, 41462295, 34054655, 29315651, -73064, -21414848, -16814224, -23042495, 5154685, -12170984, -6940077, -33013226, -26062268, -35016211, -13280122, -18957892, 3615087, 3908504, 16571175, 14984949, 665007, -4647716, 841082, 15062536, 50704938, 30632179, 35742162, -14652820, -2926545, -1516073, 24366820]
3135B4366820N164802j9577300k0779422p390942K808616K6492129j0230855J2737008
3127A3590856k4168190K7306391o695724L0013882k0707299M520319j4464505K804504
3119A2200234Q054550j6371016m336314k6388258j0664489K282931j8864918J9851864
3111c4235416k4491467K9739264q094699K2435566o501657P313326J67723K1989434
3103H322074P618477J3704631j7441974j2411666j6958424O339448N047573K2281251
3095A6501390j6251795Q295337l0069958J6968484P382398K4555156J7360789j1610893
3087C3130908j7219382j6676891j8464300K7976727j9317505J6891753m8689750j2491606
3079e4860046k2044803J2323915J3923524J6457989j1086564O114131j7413434K1053254
$$ y = [24366820, 29531622, 9954322, -10825100, -18216042, -15407426, 11084703, 853848, 13590856, -10577334, 16729057, 10033333, 40047215, 19339916, 23860235, 9395730, 12200234, 20254784, 3883768, -452546, -26840804, -37505293, -35222362, -54087280, -34235416, -58726883, -28987619, -37082318, -14646752, -21148409, -13835083, -13667360, 8322074, 15940551, 29645182, 12203208, -208458, -17166882, -10827434, -5779861, 16501390, 249595, 8544932, -21525026, -4556542, 2825856, 27381012, 44741801, 33130908, 15911526, -765365, -19229665, 8747062, -10570443, 6321310, -42368440, -54860046, -76904849, -64580934, -50657410, -34199421, -45285985, -39171854, -56585288, -35532034]
3071c5532034Q02469J4215407L398612L386314p32790M441800j9767950J3531387j3203257
3062b9460042L7876530O254917J8153298q950583j2328661R78212Q202471J3593111
3054C4319253L140212j7785923j7425433j8781674m38313L95458J2402894J781455
3046b392071K4076779K561738K3606615j5022430M35106j6998033L220171R585999k693725
3037B6380149n553021m5371732l0956295m1522896o465880O201794N086328J2781567
3029g9419986j6833772J1193203J7034154M8788214O8048253M3567426M0152055K2630911
3021A55160458J6788662O8459872R884676O0263433n2819246j8137583o5899379l7063380
3013A36637513k1597762k6593434r611697m103615J448082J5677553r67462j3547089
$$ y = [-35532034, -34729565, -20514158, -17115546, -13729232, -14462022, -10020222, -29788172, -16256785, -29460042, 8416488, 14671405, 32824703, 23874120, 11545459, 12523671, 20726142, 34319253, 37459465, 19673542, 2248109, -16533565, -16971878, -16576420, -4173526, -2392071, 21684708, 24246446, 47853061, 32830631, 33265737, 16267704, 19487875, 29073874, 26380149, 20827128, -24544604, -55500899, -97023795, -103489675, -97287881, -92201553, -79419986, -96253758, -85060555, -68026401, -19238187, 48810066, 92377492, 132529547, 155160458, 171949120, 240408992, 250293668, 310557101, 257737855, 239600272, 173700893, 136637513, 115039751, 88446317, 78834620, 74731005, 76179087, 91856640, 90889178, 77342089]
3005G7342089l502495j4465487r71031l4512o5374468J5624936q2439564P6080575
2997B260043k8650094N4064257k567051K0010060P2418726R1052586P8374337P4582444
2989C61545308n2033171J0853349o0131940Q700m255389p3331204j8724461q6603821
2981G7327371j3801123l959404m0163475J5442128n2169436J8788831J5841553Q406356
2973B5712801K0094563o793916j5190000M8497219l1262833M9204990l4211138k1667878
2965C4383808M0853160o3030374R4210403q1072959M8499066m8674201L670883j5132662
2957A3707124K537012m2564298N2501152o6139492Q0083274o1860281K7194100k859212
2949B599379P985116O7323276M5041573K8398980R2263141m1512871J41817103l9813114
$$ y = [77342089, 73839594, 59374107, 58403076, 58368564, -7005904, 8619032, -73820532, 2260043, -26390051, 27674206, 25107155, 45117215, 117535941, 208588527, 286962864, 361545308, 309512137, 320365486, 260233546, 260242246, 255986857, 182655653, 163931192, 77327371, 63526248, 59566844, 19403369, 34845497, -17323939, 1464892, 17306445, 25712801, 45807364, 39013448, 23823448, 72320667, 41057834, 90262824, 56051686, 34383808, 75236968, 12206594, 106416997, 25344038, 73843104, 25168903, 28839786, 13707124, 16244136, -26320162, 26180990, -39958502, 40124772, -21735509, 5458591, 2599379, 10584495, 77907771, 122949344, 151348324, 243611465, 202098594, 343915697, 304102583]
2941C04102583J22247040k2359302L7916918n2069826q570502j17315235L0600923
2934B94552599j51405847O8309292j56168249R315304j20308528j7740064j9361471
2927i2806964L7202664r925754M2098784p8343719M3042182m7577085L7325235j5807340
2919h4791997l3072234m5836577k1857975p1404263N9440555j16782171Q9078229r8240847
2911c23467280R5397794J593647O1295765M1055188J9136080K4595242M0435778M117303
2903c5840483N8317140j2498733K1074827k0041020l2637042j6991104j3425266K0791490
2895c1250191N4841703K2350508L1924033j3569020j711271M0072921M4276853O9934179
2887B16869715L5657355l6093389r243698r2465143J7135928k6601863J8787421J0022622
$$ y = [304102583, 426349623, 403990321, 441907239, 389837413, 381266911, 263951676, 294552599, 143146752, 211456044, 55287795, 64603099, -55705429, -73445493, -92806964, -55604300, -65530054, -23431270, -101774989, -58732807, -106309892, -68984657, -84791997, -117864231, -163700808, -185558783, -256963046, -197522491, -314304662, -225226433, -323467280, -228069486, -226475839, -165180074, -124124886, -104988806, -80393564, -39957786, -35840483, 22476657, 9977924, 31052751, 11011731, -21625311, -38616415, -52041681, -31250191, 23591512, 45942020, 77866053, 64297033, 62585762, 102658683, 146935536, 216869715, 252527070, 216433681, 207189983, 114724840, 131860768, 105258905, 124046326, 134068948]
2879A34068948o8042374j0832791r4308668K3335667m442121N2899986J6095723j4804930
2871C3969440k7331675k6444705J3856589J9813431K8857463p768466n56611j623939
2863C2771527J5697539L1124304m633380J6111424n033426K8798646L3668724n913162
2855A42592196m846394o0050536j8160280j3043900m045970P657021m1204962p154943
2847A742232l1318050P307156L258571J0819708L1636905K7134388M3129637q409840
2839H5300707r250751m6777467J2818043J3542730L6200973j6256210o2853741o0187771
2831d7463487l7783850L1961544M3289842J7646943p096811m1223995Q057945K0196407
2823a2415462M5195838K2183933o568961j2513740j0816065o827926j06352k2977560
$$ y = [134068948, 66026574, 55193783, -39114885, -15779218, -20221339, 32678647, 48774370, 33969440, 6637765, -19806940, -5950351, 13863080, 42720543, 34952077, 34395466, 32771527, 48469066, 79593370, 74959990, 91071414, 86037988, 114836634, 148505358, 142592196, 137745802, 77695266, 59534986, 46491086, 42445116, 50102137, 8897175, 1742232, -29575818, -22268662, -19010091, -8190383, 23446522, 50580910, 93710547, 85300707, 76049956, 29272489, 42090532, 55633262, 91834235, 75578025, 12724284, -47463487, -85247337, -53285793, -9995951, 7650992, 554181, -40669814, -32611869, -12415462, 32780376, 54964309, 48395348, 35881608, 25065543, 18237617, 18131265, -4846295]
2815d846295n349278j0737658R010303L943140l735946m596310N096773J0804808K5036366
2806B4625903J418483Q054776r845638L170603n927359j2573021k0831107j4629172
2798b6536532K251437J4229820Q583750j4757230k2434980j5892014J8482747M1214426
2790E141424K8897663J2255017l7424262k0024465j9581484K3894390K9282572R366862
2782C1807717k938581m2821285j3761527j4213520K8870059K8916695K2198604P047488
2774D5105650k2193993o541106j0459844K3890165J8658079J1881109j886582l1989872
2766B6463606o738464k3180284J9071648k059928M565169q402644j8013117K674259
2758e619755m823938R363163J797082j2338803P192253j1333464K8697350m57754J7504152
$$ y = [-4846295, -10195573, -20933231, -11922928, -7979788, -11715734, -16312044, -11215271, -410463, 24625903, 26044386, 34099162, 24253524, 27424127, 21496768, 8923747, -11907360, -26536532, -24285095, -10055275, -1471525, -16228755, -38663735, -54555749, -36073002, 5141424, 34039087, 46294104, 8869842, -11154623, -30736107, -6841717, 22440855, 31807717, 28869136, -13952149, -27713676, -41927196, -13057137, 15859558, 38058162, 45105650, 22911657, 16370551, 5910707, 29800872, 48458951, 60340060, 58453478, 26463606, 19725142, -3455142, 15616506, 13556578, 18121747, 9719103, -8294014, -5619755, -10443693, -1080530, 716552, -11622251, -4429998, -15763462, 12933888, 12476134, 29980286]
2749B9980286j5050997k696652j785718J6788410K5406212Q295195L546569k9541793
2741C4941512n499682j3066721J7410126J4871482l676400M616593l5999556P154419
2733B0751773j7020690J9904752J1400596L179274Q918301k0896463k628213j2843065
2725A0766265P24606O512427n71212n169556n596444j6033226J0592523n622753J4823292
2716A0425922k305881N241431Q050940J4135221M369992P518574k6063716K173603
2708B3546086j4078638J3949574R195409j6800082m775984l7714370L846815N256203
2700a7574987J2250643K5546177j9867847J1139006k6416027J3188102l158698J3104966
2692H211335m868092j950948k2203482p742732j2041951J419597J6212861n663074
$$ y = [29980286, 14929289, 12232637, 10446919, 27235329, 52641541, 60936736, 64483305, 34941512, 29441830, 16375109, 33785235, 48656717, 44980317, 49596910, 13597354, 20751773, 3731083, 23635835, 35036431, 38215705, 47134006, 26237543, 23609330, 10766265, 11490871, 18003298, 17432086, 12262530, 6666086, -9367140, 1225383, -4397370, 10425922, 8120041, 13361472, 21412412, 35547633, 39917625, 47436199, 21372483, 23546086, 9467448, 23417022, 32612431, 15812349, 11036365, -26678005, -22831190, -17574987, -5324344, 20221833, 353986, 11492992, -14923035, -1734933, -4893631, 8211335, 3343243, 1392295, -20811187, -28553919, -40595870, -39176273, -22963412, -28626486]
2684b8626486J8166590j7551695J3052260J1551845J2673345K9465663j4992879M272291
2676B8010934j5471433k391963J9332107j3983858P740079l3293813j0596155J111891
2668a9542211O89670K8607059j1474682R104479j5787075O642953P796325J0963436
2660A6999954Q152159o003328l590866j6338193N350760r929711J7323080k842232M753812
2651A3875435K88901j4356048J9967044p666953L2178590r709279o9090j8540176j3836584
2642B131840O351525M679436M903518m432854k5621659N368851j0601150M0405906K780345
2633B5965758K6865949j2850675M195240o86044P019713J1458732n494091n164644
2625E1309938j7334337j4548329n881175j0955385N773934p967275Q571581l288799
$$ y = [-28626486, -10459896, -28011591, -14959331, -3407486, 9265859, 38731522, 23738643, 28010934, 12539501, 10147538, 29479645, 15495787, 23235866, -10057947, -20654102, -19542211, -18852541, 9754518, -1720164, 7384315, -8402760, -1759807, 6036518, 16999954, 25152113, 19148785, 15557919, -780274, 4570486, -5359225, 11963855, 9121623, 13875435, 14164336, -191712, 19775332, 12108379, 44286969, 34577690, 34508600, 15968424, 2131840, 8483365, 13162801, 18066319, 13633465, -11988194, -6619343, -17220493, 23185413, 25965758, 52831707, 39981032, 44176272, 43490228, 50509941, 61968673, 56474582, 51309938, 33975601, 19427272, 13546097, 2590712, 8364646, 397371, 8968952, 5680153]
2617E680153J4298438L062685K0114589l680834J1486531j2704556M048396j715360
2609D0590042l896963k426975k7277193j3915196k0608824K785175P010057J0778825
2601f961052m304079N250387j7477484K5762086o974922L3441147n897990R570642
2593C2408735j1157049q105946j3749816J909966r887985K1660439j1854065P949248
2585I173527j4930432m609250J4627952J0792467J5302309P625818l0152331K3611476
2577C1441536l8992948M6804701m3033473J2956759m0275508R03249P37921R001868
2569b0455895q550862j1907939k5482303R323451P998625J8542271p75104j7176227
2561d8483983j4270036J109327L811609K6249243p277297J3201620l822685P752257
$$ y = [5680153, 19978591, 23041276, 43155865, 39475031, 50961562, 38257006, 42305402, 40590042, 36693079, 34266104, 6988911, -6926285, -27535109, -24749934, -17739877, -6961052, -11265131, -6014744, -23492228, 2269858, -4705064, 28736083, 22838093, 32408735, 21251686, 13145740, -604076, 1305890, -8582095, 13078344, 1224279, 9173527, -5756905, -10366155, 4261797, 15054264, 30356573, 37982391, 7830060, 31441536, -7551412, 39253289, -3780184, 9176575, -31098933, -30195684, -29457763, -20455895, -29006757, -40914696, -66396999, -57073548, -49074923, -30532652, -31307756, -48483983, -62754019, -61644692, -57833083, -31583840, -38861137, -25659517, -29482202, -21729945]
2553b1729945K1324534J984481K4279156J1636231O036459K1882847l4369567J5189837
2545D6234033l3983827J7096984J365160k1473345j78436n8505465K0661869j8975136
2537d7758163M3050322l188613P727452j6141230N732418Q452556K8745150R887487
2529C6507379P249503j1901273j0220822j1555224J546910q804567J7226302j9113520
2521I34688J7218236k8856457J0328910r718738J4656224J0415203P461324p119154
2513A5320236P049080k5683287L0368339l9334594L4666422m4489768L0128735k1823278
2505a3798115J7932025j3556615n339431j0665905N950873L621340J7513839j2530175
2497a0872164K878158k5927578Q051791j5366868K0233959j4433332K5323061j7737902
$$ y = [-21729945, -405411, 1579070, 25858226, 37494457, 43530916, 65413763, 31044196, 46234033, 12250206, 29347190, 30712350, 9239005, 9060569, -49444896, -28783027, -47758163, -4707841, -7896454, -169002, -16310232, -10577814, -2125258, 26619892, 36507379, 43756882, 31855609, 21634787, 10079563, 11626473, 2821906, 20048208, 934688, 18152924, -10703533, -374623, -10093361, 4562863, 14978066, 22439390, 15320236, 22369316, -3313971, 27054368, -12280226, 22386196, -22103572, 8025163, -13798115, 4133910, -9422705, -14762136, -25428041, -19477168, -15855828, 1658011, -10872164, -7994006, -33921584, -25869793, -41236661, -21002702, -35436034, -10112973, -27850875]
2489b7850875K7063028k2326838K1882560j3508668K9824271L883332K4483785j5822600
2481B7627995J051888l5275982J2887340k1498590K7822918k2026606N402098k5704271
2473b9713210p419564o80015L948885J5352208O276227R71091O593440j1573761J5774756
2464d69943j4749327J4387171j4924783J3824353n588975J6713111j3747610P278382
2456B722379j8488784K1374321J0921633K3761915O389067j8500697p305956j3221554
2448G652324Q070573M349725k2403220j6117700l4853537m851825L48399j6196728j588520
2439g5590509l1206040J5692832J6687712J6180825J7681675l0446654J5715047K084953
2431e3200159M0792949J7167732j0704858j7099894j1967371J3718615K7087912q92191
$$ y = [-27850875, -787847, -23114685, -1232125, -14740793, 15083478, 18966810, 43450595, 27627995, 28679883, -6596099, 6291241, -15207349, 12615569, -9411037, -4008939, -29713210, -37132774, -37812789, -33863904, -18511696, -12235469, -11264378, -4670938, -16244699, -469943, -15219270, -832099, -15756882, -1932529, -7521504, 9191607, -4556003, 2722379, -15766405, 5607916, 16529549, 40291464, 46680531, 28179834, 20873878, 7652324, 15722897, 20072622, -2330598, -18448298, -53301835, -58153660, -57805261, -74001989, -75590509, -106796549, -91103717, -74416005, -58235180, -40553505, -71000159, -55285112, -53200159, -12407210, 4760522, -5944336, -23044230, -35011601, -21292986, 5794926, 4902735]
2423D902735j4876359j8555535q226402L5106379M236612P205715k4690709k1920043
2415c6817607K2762741J280914K5739208k2771981k1409304M134267j291973K9917351
2407A543616o547364j9820215Q985245j3821761N0143905j1578825Q77402j9826247
2399a0044244j4598672L2552240O569318J2277572k0401472k6016977N863409J0330942
2391c467884K0389534N221926k2003210l697413k527023J2637023J6007503j8257075
2383D303381m919505j8592308Q0302J5983110j2391866M351146k4042081p305394J2127060
2374c0406155l684651K6525363r598855J977443P424250j2014867L4122042j4337042
2366G528K7418701r183982O802519M615813l842121L363134m041541m818323R109616
$$ y = [4902735, -9973624, -28529159, -36755561, -1649182, 2587430, 9793145, -14897564, -36817607, -14054866, -12773952, 12965256, -9806725, -31216029, -27081762, -28373735, 1543616, -5003748, -24823963, -15838718, -29660479, 20483426, 8904601, 9782003, -10044244, -24642916, 7909324, 14478642, 26756214, 6354742, -19662235, -13798826, -3467884, 16921650, 22143576, 140366, -3557047, -6084070, 6552953, 22560456, 4303381, -616124, -19208432, -19128130, -3145020, -15536886, -11185740, -35227821, -42533215, -30406155, -34090806, -7565443, -17164298, -15186855, -7762605, -19777472, 14344570, 7528, 27426229, 18242247, 25044766, 29660579, 25818458, 29181592, 25140051, 20321728, 29431344]
2357B9431344o776435N136287j8376486j2503515j1013785q39422M673023j330045
2349a1599034j4130075j3598458q142230O576957J4194327J708916k323589p244984
2341c4558170K176727K2669347K402099J4510214k5539077N323815j389965J8235666
2333C830656J4094642j6179500k218555k1007646K1635847J3594988J5944372J458467
2325C1153271j6005610l51876N169798J3858137K0172393r080549M410354k1443104
2317B7882814j508698J42867Q11775K0124847p140420L771446k6547959j4280241o074329
2308b817898J3892763J9701718N845284k0638589l4684022k2363133m175234L4052020
2300a1187091J4313225J2316275k5562216l0942616k848699K83727M8411327J6030145
$$ y = [29431344, 22654909, 27791196, 9414710, -3088805, -14102590, -14942012, -10268989, -11599034, -25729109, -39327567, -47469797, -40892840, -26698513, -24989597, -27313186, -34558170, -32381443, -9712096, -7309997, 7200217, -18338860, -13015045, -14405010, 3830656, 17925298, 1745798, -472757, -21480403, 155444, 13750432, 29694804, 31153271, 15147661, 14795785, 19965583, 33823720, 53996113, 44915564, 49325918, 27882814, 26374116, 26516983, 27328758, 47453605, 40313185, 44084631, 17536672, 3256431, -2817898, 11074865, 30776583, 36621867, 15983278, -18700744, -41063877, -45239111, -11187091, 3126134, 15442409, -10119807, -41062423, -43911122, -43627395, 4783932, 20814077]
2292B0814077J4230210j7422095l2326442r390429K297378K2248802L3498602j5320281
2284A8629822J300136n0308977J564577J709274K5981398K7755204q482527p364475
2276A0784432k5566443m128681P109649J0180768L452602p514166j5128007r640790R01428
2267b9549208k422813J7536937p006337J5688236j858745N750203J3233566m635420
2259F736419J5692592q647011k610077m937852j7407534L327792r461520k504431K392416
2250a7419206k1249022J4287926j4134794L1293346Q354916K4233518O841746L852112
2242C6060542L286091M690373Q306345J450434M82334j3066235o634534j4576928j2849433
2233G148989p319664j7292434J2915604k567125J9746870l563318r157840p741006p252357
$$ y = [20814077, 35044287, 17622192, -14704250, -24094679, -21797301, 451501, 33950103, 18629822, 19929958, -30379019, -28814442, -27105168, -1123770, 26631434, 18148907, 10784432, -14782011, -18910692, -11801043, -1620275, 1832327, -5681839, -20809846, -30450636, -29549208, -31972021, -14435084, -21441421, -5753185, -7611930, -1861727, 11371839, 6736419, 22429011, 13782000, 11171923, 6234071, -11173463, -7845671, -17307191, -19811622, -17419206, -38668228, -24380302, -38515096, -7221750, 1133166, 25366684, 32208430, 36060542, 39346633, 44037006, 52343351, 53793785, 54276119, 41209884, 34575350, 19998422, 7148989, -170675, -17463109, -4547505, -7114630, 12632240, 9068922, -88918, -7829924, -15082281]
2224a5082281J8145194J6031530P248750m334240k8509513j2983091r491674Q598451
2216b0376874J7537975J329356R561252j8251069K552172j4454305J3845116M342973
2208c913404K0302038J423788o734227j9661074k2562330l869183K118758J4637760
2200a8257874N876748p792975n885499j5601306P220340K187834J8213998J0903428
2192c135306R330998j166136j0496246j4188174k988009O328303K2479912R083396K685601
2183A7934339j7373926j2593624J971779Q565115K7818777n036011R331478l4387442
2175c769515n466314k7011302L87109P98184M164432L934799j5346753j8277511q189382
2166f8776253N923194M3175336K6543757K9206681j6333298l743477r521021L0837467
$$ y = [-15082281, 3062913, 19094443, 26343193, 22008953, -6500560, -19483651, -28975325, -20376874, -2838899, -1509543, 8051709, -10199360, -7647188, -22101493, -8256377, -3913404, 16388634, 17812422, 11078195, -8582879, -31145209, -35014392, -32895634, -18257874, -12381126, -20174101, -26059600, -41660906, -34440566, -32252732, -14038734, -3135306, 6195692, 5029556, -5466690, -19654864, -22642873, -16314570, 6165342, 15248738, 17934339, 560413, -12033211, -10061432, -1496317, 26322460, 21286449, 30617927, -3769515, -9235829, -36247131, -35860022, -35061838, -30897406, -26962607, -42309360, -60586871, -68776253, -62853059, -19677723, 6866034, 36072715, 19739417, 15995940, 6474919, 37312386]
2158C7312386J7294816K0404400k1236143j9626770k5598165k034747j39207J0744410
2150A7120980j0889766J0900932j9044828J5797026j2427528J0104641J0982001J663162
2142B4206620K2861160k1131586M384595j8580665K523829J0931984q047538N971598
2134B3119997k0336138Q487874L242113J3528290j453093j2458392j0050995p434136
2126c354480J5728295p903402O264278l9859098r243139k5235132P675637J1521652
2118d4405389R767060J0154370J86289p792108J7020447j12409M9139255J2497358
2110D6454873L0790411j0188642j5173669q996685l564748J7627715P043408n869010
2102E8123653j4345120k5207353l212332j0712157J5523651j0224460J9757077j9079452
$$ y = [37312386, 54607202, 75011602, 53775459, 34148689, 8550524, 6515777, 6376570, 17120980, 6231214, 17132146, -1912682, 13884344, 1456816, 11561457, 22543458, 24206620, 47067780, 25936194, 30320789, 11740124, 14263953, 25195937, 17148399, 23119997, 2783859, 11271733, 14513846, 28042136, 26589043, 14130651, 4079656, -3354480, 12373815, 4470413, 10734691, -29124407, -38367546, -63602678, -55927041, -44405389, -34638329, -24483959, -24297670, -32089778, -15069331, -15181740, 33957515, 46454873, 77245284, 67056642, 51882973, 42886288, 39321540, 56949255, 63992663, 58123653, 43778533, 18571180, 15358848, 4646691, 20170342, 9945882, 29702959, 10623507]
2094A0623507J1085408k8685411m459932j0482776J526283J2130053j1420837r788644
2086b9472349j9854007p767595J5476679M415091J2835463j3873333L332154L35354
2078c4572543K1533219j357277L171335k5403593K717456k284667J6054276j067300
2070b1209094p043548j5270614N573702j59975K6332080p078394J7592160m381129
2062e644812J8140112K988579J963585j3985138L599836m770303K5957054j0537775M09718
2053A8120856l1190608m801867l315112K5470211j709995J6291886l3540376J1212615
2045c462390k1116342J7968862k012829l123260j788453j0699417j072714K613745
2037b2692798j2548518J2300462j4264324K7740265J599745K8078079n690049J0927343
$$ y = [10623507, 21708915, -6976496, -11436428, -21919204, -20392921, -8262868, -19683705, -29472349, -49326356, -57093951, -41617272, -37202181, -24366718, -38240051, -34907897, -34572543, -13039324, -14396601, -11225266, -36628859, -33911403, -36196070, -20141794, -21209094, -28252642, -43523256, -37949554, -38109529, -11777449, -18855843, -1263683, -5644812, 12495300, 15483879, 17447464, 3462326, 7062162, 2291859, 28248913, 17711138, 18120856, -13069752, -17871619, -21186731, 4283480, 2573485, 18865371, -14675005, -3462390, -24578732, -6609870, -8622699, -11745959, -13534412, -24233829, -25306543, -22692798, -35241316, -22940854, -37205178, -9464913, -7865168, 20212911, 14522862, 25450205]
2029B5450205j2195015J9869627P906352J9207074N710838j9394786n34126k1947530
2021B4072639J6197050Q69895r08996K319695j9492946J2399123k703729M536629L272459
2012D0561819j4862885J4861896n286515R515460j4712267j8547153r633229R66873
2004B863999J1460397J019522j7035477j7177712p781160K2540030J3069494K2098631
1996C1057724l2539982R321661k4973496M1892440K957333N466603j3707800l2031736
1988a2557253J3676104p074712K0060448r049614j4443553N89425n422850K1191681
1980F969676j346529O848221m558505Q794614L786326Q368096m690607l691815L7870
1971B0517347l616786K301599j0214478r219795K367680k239442J3105153k865823
$$ y = [25450205, 13255190, 33124817, 41031169, 60238243, 65949081, 46554295, 46020169, 24072639, 40269689, 41139584, 40230588, 42550283, 23057337, 35456460, 32752731, 37289360, 40561819, 25698934, 40560830, 35274315, 44789775, 30077508, 11530355, 1897126, 2863999, 14324396, 15343918, -1691559, -18869271, -26650431, -4110401, 8959093, 31057724, -1482258, 7839403, -17134093, 24758347, 27715680, 33182283, 19474483, -12557253, 1118851, -5955861, 14104587, 5054973, -9388580, -8799155, -14222005, 6969676, 5623147, 12471368, 7912863, 16707477, 20493803, 28861899, 24171292, 20479477, 20517347, 16900561, 19202160, 8987682, -232113, 2135567, -103875, 13001278, 10135455]
1963A0135455j2293881P324805j8655261L9597229r333862K6942416j7062060j4932896
1955A1721945m802998j2150502K7767014O782991R797698j6526589k8768883q682331
1947a4861655O509674L7481871J7976515O749206l3666903j0805693q562508K9331814
1939C0152321J5551397m225335j5863372k4357758m56160O021826p634242K370222
1931A558899j7803278J9948450J2270697K334179j241442l0708398K4629029J0625909
1923B1614045L6318510j0448129l0046791k1251567n440094L1421415M48579j3221916
1915I394052m1724384j1152036J9034979K1314795J3650319m2023703l055789p786575
1907d2348342N5900545J6533104n282428l3728074k0955875K5413424L5819811R607896
$$ y = [10135455, -2158426, 5166379, -13488882, 26108347, 16774485, 43716901, 26654841, 11721945, 6918947, -5231555, 22535459, 29318450, 39116148, 22589559, -6179324, -14861655, -8351981, 29129890, 47106405, 53855611, 20188708, 9383015, 820507, 30152321, 45703718, 41478383, 25615011, 1257253, 801093, 6822919, -811323, 1558899, -16244379, 3704071, 15974768, 18308947, 17067505, -13640893, 10988136, 21614045, 57932555, 47484426, 17437635, -3813932, -9254026, 22167389, 22615968, 9394052, -32330332, -43482368, -24447389, -3132594, 10517725, -31505978, -34561767, -42348342, 13552203, 30085307, 24802879, -8925195, -29881070, -4467646, 31352165, 40960061]
1899D0960061j9695626m7224164R11321J2317426L2657472j2677816k4938546l1846917
1891d9536789J2317840R694888J1626475l0797786k0348739k186184K9511483J3651116
1883b6067696j411626m7084167J3382732P444715P3410391N624751r334332l6846224
1875b0881456q584490L8348303M1150616O719532j4491270m5705351J1117613O203839
1867A3877336K6557661r436142j0561070p570426K9638761m144603J5832473n6609361
1859b415371P226667p199147L8351934N437057l4332582m6769207l2181167M386693
1851f7495123L6699144L679826l842384l1092184l577602J5028317K5389321M860139
1843b0350546J1389065j2485439L1921200k258864K046277k3708804l1807136J4508280
$$ y = [40960061, 21264435, -25959729, -25048408, -12730982, 19926490, 7248674, -17689872, -49536789, -37218949, -27524061, -15897586, -46695372, -67044111, -69230295, -39718812, -26067696, -27479322, -74563489, -61180757, -53736042, 19674349, 25299100, 15964768, -20881456, -29465946, 8882357, 50032973, 56752505, 42261235, -3444116, 7673497, 13877336, 40434997, 30998855, 20437785, 12867359, 42506120, 38361517, 54193990, -2415371, 4811296, -2387851, 35964083, 41401140, 7068558, -39700649, -71881816, -67495123, -30795979, -27116153, -30958537, -62050721, -65628323, -50600006, -25210685, -20350546, -8961481, -21446920, 10474280, 8215416, 10261693, -13447111, -45254247, -30745967]
1835c0745967P151869K4270195n487077l7057692k258003j4580285M3083151J8083290
1827B459481J1232872P752602j6980531K1344870j1960433J4029524j5294808J0434418
1819B3017995J102633R635188r575145k4714998q351968j1280547L3649059Q976565
1811B2458782R418799q033963l1454624J7460718j9012803L6094609j3330426K693453
1803A6294545q562401k2714587P936840j9434926J8205712k769412R231191j509010
1795c322048j2131043O818101o308917K7841556j1236353J0498952k1832527O99580
1787h972699J5736633n818324K4678865m1472180J3058836j9599765K2787763J1302849
1779A1701978j1166466n559207k4190321O24405P465651o822804P774950k0523969
$$ y = [-30745967, -23594098, 676097, -4810980, -41868672, -44126675, -58706960, -15623809, 2459481, 13692353, 21444955, 4464424, 25809294, 13848861, 27878385, 12583577, 23017995, 24120628, 33755816, 24180671, -534327, -8886295, -20166842, 13482217, 22458782, 31877581, 23843618, -7611006, 9849712, -9163091, 26931518, 13601092, 16294545, 7732144, -14982443, -7045603, -26480529, -8274817, -11044229, -1813038, -3322048, -15453091, -8634990, -14943907, 12897649, 1661296, 12160248, -9672279, -8972699, 6763934, 945610, 25624475, -15847705, -2788869, -22388634, 399129, 11701978, 535512, -5023695, -29214016, -28589611, -21123960, -27946764, -20171814, -40695783]
1771d0695783J4265669o801306J5222863r762202J6968605J0022185L4613382J2507086
1763D6340499p429103j1365327j5841811K3490457J8478239o353443j7431107o8964953
1755c9076549N230313k0088744M8127577j0512029q395520k6039405n536358K6889767
1747b9400948K7749178K3867120j589124K386750p565340J1118048r441376j352999
1739A5771309k430128l946661J3098384k1822222k945560j8284112J5749740K6234902
1731B1425652K2092929J0506415n519911j438119J2970135J6582761P342210j770932
1723H2191140j8080442l889757r601024p281409j4429308j6926028j1063720O793100
1715G712552j3923097J3002654k8907522J3040792p389214M475093M800459j7383418
$$ y = [-40695783, -26430114, -33231420, -18008557, -27770759, -10802154, -779969, 33833413, 46340499, 38911396, 27546069, 11704258, 35194715, 53672954, 47319511, 29888404, -39076549, -33846236, -53934980, -5807403, -16319432, -24714952, -50754357, -56290715, -29400948, -1651770, 22215350, 20626226, 23012976, 15447636, 26565684, 17124308, 15771309, 13341181, 9394520, 22492904, 670682, -2274878, -20558990, -4809250, 21425652, 43518581, 54024996, 48505085, 47066966, 60037101, 76619862, 83962072, 82191140, 64110698, 60220941, 50619917, 43338508, 28909200, 11983172, 919452, 7712552, -6210545, 6792109, -22115413, -9074621, -16463835, -11988742, -7188283, -24571701]
1707b4571701J4527297l052738J3163106n971428j5388972n485652O816955J8841101
1699a122032Q271886l520067k8962123J1871375j6520127L7045964k2285013l318826
1691a8538963j0938182q790881L0786060j1143028K294848j0889180o604804L7467151
1683C643021K240479J5091845k0731996j7029916O412613M620127M420615l667603
1675e000815k8805766L983854j0061850K923033K26024j7083611J6262271R983821R530515
1666a8042524J6697564l3069612K2275641j1140238K9764765Q077354j4438326K657557
1658B782181j4098959J5132419Q337323m841544M970337j070411J4206481J1023533
1650C6441360m481927j0230023N070648o001507K8953802k6928144m311287k2923945
$$ y = [-24571701, -10044404, -13097142, 65964, -5905464, -21294436, -26780088, -19963133, -1122032, 7149854, 3629787, -25332336, -13460961, -29981088, 7064876, -15220137, -18538963, -29477145, -38268026, -7481966, -18624994, -16330146, -27219326, -33824130, 3643021, 5883500, 20975345, 243349, -16786567, -10373954, -5753827, -1333212, -5000815, -33806581, -29822727, -39884577, -36961544, -36735520, -53819131, -37556860, -27573039, -18042524, -1344960, -34414572, -12138931, -23279169, 6485596, 14562950, 124624, 2782181, -11316778, 3815641, 12152964, 7311420, 12281757, 11211346, 25417827, 36441360, 31959433, 21729410, 26800058, 20798551, 49752353, 22824209, 18512922, -4411023]
1642d411023l112301K6630554j4888787K509102l1083361l268094K7403724J424940
1634A204754K1929083m4845762K43968j8476961K5598222m045794p805184k1163622
1626d7361296j1343265J9214202k896822J3333381k1565656P680822K8724650R408724
1618d805260L4577829m9695489J3891810k5219988M1280337R976304p079810k3686256
1610a0760523l0705268P905787J7687802K2060020L182012j5797265j910104j3363607
1602b1701146L1656107j7186792L1865739l9085664L73167l6040234k0481050J4309335
1594e6290538n357417L2100167j6965388j5704362L970612M150115O9948965K0445071
1586C6297225K9601690k2687212j0581504m085192J0523146m531412j2584854k3371641
$$ y = [-4411023, -7523324, 19107230, 4218443, 6727545, -24355816, -27623910, -220186, 1204754, 23133837, -21711925, -21467957, -39944918, -14346696, -18392490, -26197674, -47361296, -58704561, -39490359, -42387181, -29053800, -50619456, -42938634, -14213984, -4805260, 29772569, -19922920, -6031110, -31251098, 10029239, 20005543, 12925733, -10760523, -41465791, -33560004, -15872202, 6187818, 9369830, -6427435, -8337539, -21701146, 9954961, -7231831, 24633908, -14451756, -14078589, -50118823, -70599873, -56290538, -61647955, -29547788, -46513176, -62217538, -58246926, -54096811, 15852154, 36297225, 65898915, 43211703, 32630199, 28545007, 39068153, 34536741, 21951887, -1419754]
1578a419754k3340888n625585l9792167r094389k1223403K3725523M6682318l80449
1570c0468794J1521154n7412395J4803004J9988897M2815676J4606937m3539023k7426100
1562e5110644j7053184M3393353J1914539J4840634m8084786J8859729K7170250N7098110
1554E3028001M2971837o6943615J350110p8513768P0903305m393092J1498381n1168420
1546b1267261q8829480l3046316k3750837L7987933M2975644K3705513K1337627k5789833
1538f6677010J5710662q999052R6875618J0793119Q6804640q2791475k4796742o6757828
1530c9838068l0252525L5699388n7418544j2776717l2137136n4934856J11038910
1523h0619548j21197546J24877753j29621391J43724184L3357882P3119600J1057658
$$ y = [-1419754, -24760642, -30386227, -70178394, -79272783, -100496186, -76770663, -30088345, -30468794, -18947640, -76360035, -61557031, -41568134, 1247542, 15854479, -27684544, -55110644, -72163828, -28770475, -16855936, -2015302, -50100088, -31240359, -4070109, 53028001, 95999838, 29056223, 30406333, -48107435, 22795870, 18402778, 29901159, -21267261, -110096741, -143143057, -166893894, -128905961, -85930317, -62224804, -40887177, -66677010, -50966348, -59965400, 36910218, 47703337, 134507977, 51716502, 26919760, -39838068, -70090593, -34391205, -91809749, -104586466, -136723602, -191658458, -80619548, -201817094, -76939341, -206560732, -62836548, -29478666, 43640934, 54698592]
1516E4698592r6183363Q641440k024357Q1936706r418033m4151576o1500293R7306
1508f7903578Q3279058n4143666K8556722j97816354J78458177N6210212K14760476
1501B41401047m1689354k64509147n5392053k4668531M88517180K62278126n0509770
1494E55427498k55606844m48037923R5451473J67249969K68559730M0890346l19094457
1487A04839792j30060821k14171782J65848988k3883132P6433500j03402060K9447289
1480i4948226j15154246r2402417j59206332p489366L48040855L30052119L17081037
1473E25973424j46974397l26109106N5065392K08457957J105356457R7720377J39774073
1466A659264177q19105232l86226032m3140285K27395690K39792841j58787824m32741517
$$ y = [54698592, -41484771, -32843331, -34867688, 47069018, 37650985, -6500591, -68000884, -67903578, 15375480, -38768186, -10211464, -208027818, -29569641, 26640571, 241401047, 199711693, -64797454, -120189507, -144858038, 343659142, 605937268, 555427498, 299820654, -148217269, -52765796, 114484173, 383043903, 423934249, 104839792, -25221029, -239392811, -73543823, -97426955, -20993455, -124395515, -94948226, -210102472, -302504889, -461711221, -469200587, -121159732, 208892387, 525973424, 378999027, 52889921, 107955313, 316413270, 1421769727, 1519490104, 1659264177, 840158945, 453932913, 410792628, 638188318, 877981159, 719193335, 286451818]
1459B86451818k55067020k50013508K12473966n7037773J45869327j02084068R2623970
1452G3216712j02104379o412325j88295587J10523306J64477156K92804611R0631985
1445D34841479k06641150k57950345m4644059J77248471N81232267r5573464Q3808386
1438F72321585n93180072J3613182k2978328J86116397J00597736k09124347q4846378
1431F2519775j25218648N9988701P9552193p7272080j304590r9564444R3773513L870477
1423c655103M8468041r7322593J8582977l5416176Q8617485o515821m6264767k1239396
1415e4745353o9201058M4872695j8178746m5887754L2626981n9342787J44182045j3179282
1407c8853259M1917557l694967m1182423J34317646o331858J12190558p4062910k8665048
$$ y = [286451818, 31384798, -218628710, -6154744, -63192517, 82676810, -19407258, 73216712, -28887667, -35299992, -223595579, -113072273, 51404883, 344209494, 434841479, 228200329, -29750016, -74394075, 102854396, 684086663, 588513199, 672321585, 79141513, 92754695, 69776367, 255892764, 356490500, 147366153, 62519775, -62698873, -2710172, 76842021, -430059, -1734649, -101299093, -7525580, -3655103, 44812938, -52509655, -33926678, -69342854, 19274631, 12758810, -33505957, -54745353, -123946411, -79073716, -97252462, -143140216, -110513235, -169856022, -25673977, -38853259, 3064298, -630669, -41813092, 92504554, 86172696, 198363254, 124300344, 95635296]
1399I5635296n2340371k8270735J1991397l2038556K319994n0583640M737953o1952970
1391a10501632J4217813o550149O5706727P6713826M43654J2591659q1216411L0880164
1383B285651L2504798N7307098R986016p5730864n5308394k7501417L0502111L6198222
1375A0243221j1448261l5470766j1200717J5224417N5375571J1753645j1280871j8788284
1367D407955P723227K8614354L3295771l9320609n428230n5958528L9294845K32940
1359A2861725J3215639j5109367k1173556Q918103J4765239M42089k257393k2190391
1351a0527912L240988J3046255p346628j2238640k7571934k6949583L3729046k6338331
1343f0956739M6134294m3545252K5850033L561760J0450956K3588837j6392539J5696248
$$ y = [95635296, 43294925, 15024190, 27015587, -5022969, -2702975, -53286615, -48548662, -110501632, -96283819, -102833968, -37127241, 39586585, 40030239, 52621898, -28594513, 2285651, 34790449, 92097547, 102083563, 26352699, -28955695, -56457112, -25955001, 10243221, -1205040, -36675806, -47876523, -32652106, 22723465, 34477110, 23196239, 4407955, 12131182, 40745536, 74041307, 34720698, 29292468, -26666060, 12628785, 12861725, 26077364, 10967997, -10205559, -1287456, 13477783, 13919872, 11662479, -10527912, -7286924, 5759331, -1587297, -13825937, -41397871, -68347454, -34618408, -60956739, -14822445, -58367697, -32517664, -28955904, -18504948, 5083889, -11308650, 4387598]
1335D387598J7562728P285369K1646888l6569213p39112j4512239J8591629N971112
1327B3624760J408762j8995706P994023m506627J1058110q027665k1961560J7380074
1319G974171K007717K5195232j1741999n2358202j848047l1368824O8114252n148336
1311H25964Q868435m0451452k5262081J7974690K3541929K6641594m642428j7336085
1303i839434k574331O497178J4779682l957123J322795j1762045L0208944q167900
1295A6507766K1365782k8706847O665632J178436J4683468M588730q979763k0514918
1287F788286L025681j6133472J3970762k6870341M022318j3121263J6528527n458430
1279a7247932L599431j8258207J3748663R448097K2033844N85004j4866879j0937628
$$ y = [4387598, 21950326, 29235695, 50882583, 14313370, 13574258, -937981, 17653648, 23624760, 25033522, 6037816, 14031839, 9525212, 20583322, 12555657, -9405903, 7974171, 9981888, 35177120, 23435121, -28923081, -30771128, -62139952, 5974300, 825964, 9694399, -30757053, -56019134, -38044444, -14502515, 12139079, 7496651, -9839434, -12413765, -5916587, 8863095, 4905972, 6228767, -5533278, 24675666, 16507766, 37873548, 9166701, 15832333, 17010769, 31694237, 36282967, 27303204, 6788286, 9813967, -6319505, 7651257, -19219084, -15196766, -28318029, -11789502, -17247932, -13648501, -31906708, -18158045, -8709948, 13323896, 13908900, -957979, -11895607]
1271a1895607L055710L768269J8582010k9182468P318703k9837743K5039435q420302
1263b1571993J0894659q179255R823183J3397534J4711481K71279j1968431L032128
1255A0410585P356338K8440980K156677j4530640j5978734k1482897K6788522k701191
1247B0459640J6428859k3371402j0286498l412855N31687K991878j3414688j0669739
1239b0743118n284502Q610192K29854k344382k1635447n375071K331791J7015691J8212885
1230h982107R411226l119540L238518j6015551J5303071j275539K3829059J1751793
1222C4140930j1150030j2987914l6368277j627263J2958632J9857298J5262349j9236334
1214H49391j6729149q944534R906111J5272456J5634878j5989081J6710298k3959881
$$ y = [-11895607, -8839897, -5071628, 13510382, -15672086, -8353383, -38191126, -13151691, -21571993, -10677334, -18856589, -9033406, 4364128, 19075609, 19346888, 7378457, 10410585, 17766923, 46207903, 48364580, 33833940, 17855206, -3627691, 23160831, 20459640, 36888499, 13517097, 3230599, -182256, 349431, 3341309, -10073379, -20743118, -26027620, -17417428, -17187574, -19531956, -41167403, -46542474, -44210683, -27194992, -8982107, 429119, -2690421, 548097, -15467454, -164383, -1439922, 22389137, 34140930, 22990900, 10002986, -26365291, -27992554, -15033922, 4823376, 20085725, 849391, -15879758, -24824292, -14918181, 354275, 15989153, 72, 16710370, -7249511]
1206g249511J9100045k3384413j1946866M235327n112681L6112815j2263974p613743
1198h123001k1148172p168902K3310157K1345741J619430j356016k5248802P608445
1190i161120N943151j588451N302964j7329854J0174253J6328421q027245J1690063
1182A3332182l6447949J2735039J2747755J2251774K1008613l7963440j1526807j3896813
1174b7759646m196513L5868438k5585142J6821465m0042137K600947o783097J5838892
1166c3236793J6374235K2335224k619984l845491j8665679k936893K9204390K0102694
1158B6711703K0048972k4224935m3918870p549951m670033M5607204P916585j9021752
1150H98923j5384798l3748552L2162574Q775270J1645777K528427k2211775K7535438
$$ y = [-7249511, 11850534, -11533879, -23480745, -19245418, -24358099, 11754716, -509258, -8123001, -29271173, -36440075, -13129918, 8215823, 9835253, 8479237, -16769565, -9161120, -3217969, -4806420, 496544, -16833310, -6659057, 9669364, 1642119, 13332182, -23115767, -10380728, 2367027, 14618801, 35627414, -2336026, -13862833, -27759646, -31956159, 3912279, -21672863, -4851398, -44893535, -42292588, -49075685, -33236793, -16862558, 5472666, 2852682, -992809, -19658488, -22595381, 6609009, 26711703, 46760675, 22535740, -21383130, -28933081, -33603114, 12004090, 19920675, 898923, -14485875, -48234427, -16071853, -7296583, 4349194, 6877621, -15334154, 12201284]
1142A2201284q967430J2392541k6848652q045787M770038K0818121R438270k6708349
1134a0949964j8698603l6665542L7923163p821246K0930848l1255984k1729352K3183357
1126d5083323L549932K8933203k1114682l3064237K8054269R164048P0213714m880400
1118C5772524m3649048j4493952m7944402Q2382248P295197L4065865m2500882n5776438
1110d4848888j6914902K81634M1431628K5095329J2884780l0445891l492986m5724284
1102f1733580L1118702J3254571K1200343N0634987p9517642L1610347j00095031L8719265
1094e4808038J0234315R769549M7494356n2752074N13073k864964k9334526R6945171
1086B5196862l4152328R7033709k7732528o225946o727771m7493422N8744750R700559
$$ y = [12201284, 3233854, 15626395, -11222257, -19268044, -14498006, 6320115, 15758385, -10949964, -29648567, -66314109, -28390946, -36212192, -15281344, -46537328, -68266680, -45083323, -41533391, -12600188, -33714870, -66779107, -38724838, -29560790, 40652924, 35772524, -7876524, -22370476, -70314878, 12067370, 19362567, 53428432, 10927550, -44848888, -61763790, -61482156, -20050528, 5044801, 17929581, -12516310, -16009296, -61733580, -30614878, -17360307, 3840036, 54475023, -25042619, 6567728, -93527303, -54808038, -44573723, -34804174, 12690182, -40061892, -39548819, -42413783, -71748309, 25196862, -8955466, 88078243, 60345715, 54119769, 47391998, -101424, 58643326, 68343885]
1078F8343885L8345560k7753906n8226236m9956454K767669L0932826L1243687J4654905
1070E0351936q8290815L3351482q6153489J04411648l0183744R752701J8954219p7501005
1062f5307067R8926000p7173136M9406374k8123592j0473797Q6468092j6247047M7320624
1054H4796451m2123682m0537397N8465476L725R5216211m5348390k7391578n7726376
1046B5354440k18052L0274534L4235997j7280824m6465847k6934836l2910776O0920037
1038B6974673q695479K1334338l337111o5942207P4817244r3651066J11353633o7246148
1030d392123N2887146k272141l9962563L7934017o1471362N9286557R889588K8729479
1022H0628598K3864429n1680334j330005l7673732L4644047J8635026K5238206k7533362
$$ y = [68343885, 106689445, 78935539, 20709303, -29247151, -26479482, 4453344, 35697031, 50351936, -37938879, -4587397, -90740886, 13670762, -16512982, -6760281, 12193938, -65307067, 33618933, -43554203, 5852171, -22271421, -32745218, 53722874, 37475827, 84796451, 42672769, 2135372, 60600848, 60604573, 155820784, 110472394, 83080816, 25354440, 25136388, 55410922, 89646919, 72366095, 25900248, -1034588, -33945364, 26974673, 18279194, 39613532, 36276421, -29665786, 45151458, -48499608, 62854025, -4392123, 48495023, 46222882, 6260319, 44194336, -17277026, 42009531, 51899119, 80628598, 104493027, 52812693, 51482688, 13808956, 48453003, 67088029, 92326235, 64792873]
1014F4792873m7228460n3894066l1850833L7525393J6847727N0789548l7175734m2984429
1006d3177981k6811309k0410948Q7677604J7015651L8804758l7325773o2858730J6730572
998c0356156l2512131P7823233l5346935J7195819l6803355J124925J2523787m20055
990b6770868J0097064o454313K8486786J9819137K0244237j1740659l3374231K719199
982C026352j2244104N0396032k7205075P17399m6133215n112494J6944643P979365P552099
973d078998j6941923o864072K7830695J4202081J8992980k5822435k5943086O95779
965a7928979J2841315L1051325q458210l0749058k9424725j1246617K6518600K1683170
957e713179O519793j6365166j4835882l544014K0805730O938283N056514j3158466
$$ y = [64792873, 17564413, -36329653, -68180486, -30655093, -13807366, 36982182, -193552, -43177981, -69989290, -90400238, -2722634, 14293017, 53097775, 15772002, -47086728, -30356156, -62868287, 14954946, -20391989, -3196170, -39999525, -38874600, -26350813, -26770868, -16673804, -23128117, 5358669, 25177806, 45422043, 33681384, 307153, 3026352, -9217752, 41178280, 13973205, 14690604, -31442611, -36555105, -19610462, -11631097, -4078998, -21020921, -27884993, -54298, 14147783, 33140763, 7318328, -18624758, -17928979, -5087664, 25963661, 17505451, -13243607, -42668332, -53914949, -27396349, -5713179, 806614, -15558552, -30394434, -33938448, -13132718, -6194435, -1137921, -14296387]
949a4296387j2916817O852803l066393J4238408o797432J8918M775069N846298J6454638
940A1109105J0869684L073501Q658018o882549M575433k076128r391311M650352k7146520
931b560415O561420l1727585Q976952k0711530R626627p729884M639237N343143k621987
922c0204022J5937882n508859J8520487J844769K265298Q438852k3680789J8037041
914E650659j9880145K6961178q972659L379375j6496480o185057j084160K3322121L709975
905A0404807J3134859k5262209j0478762j2591764R775393J2017333J2851918j5180349
897e328774m923015k2496624P676424J7917550R702747K7586535j9387153J861483
889A2609173j0177002p565679K7643132j8400677J7517862k7302213j1259020J022820
$$ y = [-14296387, -27213204, -20360401, -23426794, -9188386, -15985818, -15966900, -11191831, -5345533, 11109105, 21978789, 25052290, 33710308, 26827759, 31403192, 29327064, 19935753, 24586105, -2560415, 4001005, -27726580, -18749628, -39461158, -29834531, -37564415, -32925178, -27582035, -30204022, -14266140, -19774999, -1254512, 590257, 2855555, 11294407, -12386382, 5650659, -14229486, 12731692, 3759033, 7138408, -9358072, -15543129, -16627289, 6694832, 10404807, 23539666, -1722543, -12201305, -24793069, -15017676, -3000343, 9851575, -5328774, -10251789, -32748413, -25071989, -7154439, 2548308, 30134843, 10747690, 12609173, 2432171, -5133508, 22509624, 4108947, 21626809, -5675404, -16934424, -15911604]
881a5911604j2698525J9304662m342383O058518J3918346J597761J6357863Q620637
873C2905275m027452K7682537r587759K3219037j5074715j6849345o365700j6656082
865A5245796Q920096n53428k5515026j014290l5773113J8747983J620656P053044N152059
856f116223j7041749K222911R344440n596956K1063789k4257039J2309524r25353J696942
847g299714R346708j9630309n874290J0177901o126729M0001773l1833385R028940
839b209105l4564654M95632Q579913M757921O3419r646119k8834539P559988j4780334
830f8577878K2723286j672673M212624r04789N47580q97459J6935170j1384193K0327771
821a8690561j8004286J2684467o075371N854138k042787L885571j5176258J9213723
$$ y = [-15911604, -28610129, -9305467, -13647850, -7589332, 6329014, 7926775, 24284638, 32905275, 28877823, 56560360, 46972601, 70191638, 55116923, 38267578, 31901878, 15245796, 24165892, 23612464, -1902562, -2916852, -38689965, -19941982, -18321326, -11268282, -6116223, -23157972, -20935061, -11590621, -17187577, 3876212, -20380827, -8071303, -8996656, -7299714, 2046994, -17583315, -23457605, -13279704, -19406433, 20595340, -11238045, -2209105, -36773759, -36278127, -27698214, -22940293, -22876874, -32522993, -61357532, -53797544, -68577878, -45854592, -47527265, -43314641, -44219430, -43671850, -44569309, -27634139, -39018332, -18690561, -36694847, -24010380, -30085751, -24231613, -26274400, -22388829, -37565087, -18351364]
813a8351364k1108178L4261256j9606913K1825951j1162793L988640n58195o075986
805a6787582l345042n89189J729R874219o828888j0450417j8308633m825659J1949797
796c9309665K8350259P707313O028890k9247046K836111N93458L1694791J3738880L586535
787B5979526j3906900j0750537k009282K170922O205523j1132283Q737396j6751634
779a1457269J3026969k6471910k562305k0284442P096546M002475N073157j3526424
771d5103203r537385j2659926J7591111N476117J7379529j0564920O309961Q50638
763c0258078K3891464P491789Q036391j4359543k89491m497019J8250460m795185J6190835
754A9661623k6144310J5921157l0403032K3266628j2757071K9365547J1001176O296065
$$ y = [-18351364, -39459542, -5198286, -24805199, -2979248, -14142041, -10153401, -10711596, -16787582, -20132624, -20721813, -20720084, -10845865, -17674753, -28125170, -46433803, -51259462, -39309665, -10959406, -3252093, 2776797, -26470249, -23634138, -23040680, 8654111, 22392991, 25979526, 12072626, 1322089, -687193, 1483729, 7689252, -3443031, 5294365, -11457269, 1569700, -24902210, -27464515, -47748957, -40652411, -36649936, -31576779, -45103203, -54640588, -67300514, -49709403, -44233286, -26853757, -37418677, -31108716, -30258078, -6366614, 1125175, 9161566, -5197977, -5487468, -9984487, 8265973, 3470788, 19661623, -6482687, 9438470, -20964562, 2302066, -10455005, 18910542, 29911718, 36207783]
746C6207783j411162l0494083J034529l812333K7268778J0312196j3367674k0200285
738E537749m0160969M530414p234926K8629104k2352O937154l668431j1794439N077241
729a2169455r027454K6775005J6423478K2847475j973037l1387178k0106718j6500978
721b5118862K3840396J8994840k666966j4869080m4274091Q624949q912538L8681834
713e699518j0505457P492457o187943N981302K2166925j1827515J1738655j7142000
705c983094K5666438J5834027M111294m827967m1997115N723835j1491010K9034323
697A8070731j1238582j6292530k4611125j9868260Q276067q181320O723325j0335040
689e7456734J2295763J4690584N217773M123241j8578722K3154054K4972641M4809265
$$ y = [36207783, 34796621, 4302538, 5337067, 1524734, 28793512, 39105708, 25738034, 5537749, -34623220, -30092806, -37327732, -8698628, -8720980, -1783826, -5452257, -17246696, -12169455, -21196909, 5578096, 22001574, 44849049, 42876012, 11488834, -8617884, -25118862, -1278466, 17716374, 15049408, 180328, -44093763, -35468814, -44381352, -5699518, -16204975, -8712518, -14900461, -8919159, 13247766, 1420251, 13158906, -3983094, 21683344, 37517371, 41628665, 36800698, -5196417, 527418, -10963592, 18070731, 6832149, -9460381, -34071506, -53939766, -45663699, -53845019, -47121694, -57456734, -45160971, -30470387, -25252614, -21129373, -39708095, -16554041, 8418600, 53227865]
681E3227865J5942929k7691713j6051880k8350864M0447803J8792206K1245306j9744081
673E7817571m2891811j2905268j5208748L1557061N505925J6242801j0169151j0637290
665A9311090j6443124j5007605N699327J0665502L0091964p77221j4256090l7068428
657a7784585k6522744J8204004J9760275M5040560j1099280j3009892k5394440l339207
649a4145309L0795017K1601805J9266700l329709k2606201K090977k1384054J9908299
641C2197525j4483381J2987557j5754132l761246k2083840q492931q532699P889791
633b0033356Q809336k262015l647321j4995717L357430J6660998J0953847K2761334
625B1604536k0230330P102148j3841137K0428375J3625475M711678q095278k0182146
$$ y = [53227865, 69170794, 41479081, 25427201, -2923663, 37524140, 56316346, 77561652, 57817571, 14925760, 2020492, -13188256, 18368805, 23874730, 40117531, 29948380, 19311090, 2867966, -12139639, -6440312, 4225190, 34317154, 33539933, 19283843, -17784585, -44307329, -26103325, -6343050, 38697510, 27598230, 14588338, -10806102, -14145309, 16649708, 38251513, 57518213, 54188504, 31582303, 33673280, 12289226, 32197525, 17714144, 30701701, 14947569, 11186323, -10897517, -19390448, -27923147, -20033356, -11224020, -13486035, -17133356, -32129073, -28771643, -12110645, -1156798, 21604536, 1374206, 8476354, -5364783, 15063592, 28689067, 33400745, 25305467, 5123321]
617E123321j7258608N749076m774229J4459943j8655395n052838j3117115J269140R947212
608b2309493O394432J2024716M194545J4765830K457757J0298165q253538M618534M849880
599B9040828M125833J1775044k4685406k398219k2890337J1974071R121258J584866o21486
590A7026452j6647562Q572730J5034037J7329347L855487j7107823j3186423L187400
582A8063645J3533720J2290843j4079493k6493444k1546935K352446J2209483J9007296
574A5337561j2124010k195292q857041R362289K2289163q450987J6826193j6054423
566A6133453J9087870N360995j1206132o08906k9860225J9906169K868850J3144129
558C4826203j0475623k2982995o764903R137361J3797214N272128k0477625k1591795
$$ y = [5123321, -12135287, -6386211, -11160440, 3299503, -15355892, -20408730, -33525845, -32256705, -22309493, -15915061, -3890345, 304200, 15070030, 17527787, 27825952, 19572414, 24190948, 29040828, 33166661, 44941705, 20256299, 17858080, -5032257, 6941814, 16063072, 17647938, 17026452, 378890, 8951620, 23985657, 41315004, 45170491, 28062668, 14876245, 18063645, 31597365, 43888208, 29808715, 3315271, -18231664, -15879218, -3669735, 15337561, 3213551, 1018259, -7838782, 1523507, 23812670, 15361683, 32187876, 16133453, 35221323, 40582318, 29376186, 28767280, -1092945, 18813224, 21682074, 34826203, 24350580, 1367585, -5397318, 3740043, 17537257, 22809385, 2331760, -19260035]
550a9260035p67811O607321J7484631p818650k7229008l308237j0721998M1410423P483754
541C880390O436440m529988k1728753K3002160k246995J6590499K446464j8706611R518530
532A4662136k8764818J372756j7139417k186196J7468739L638018P813587j2184572
524a5319767j1524046J1609597J8230470K1801756O763541k1110992j1424515q998857
516i972813J638021J0758107k3249056n197141j9542674J852122K1162805q253255
508c0803884K6695618j6803000K6549423R635309J5505605J8290260m905225J1440572
500E5604678p589878o733731j1120522j7077688k088562k951322o161635j3310565
492a1429225k1322165r370363J2452818J2879392K4049951j0682823J500070q142134
$$ y = [-19260035, -20027846, -13420525, 4064106, -3754544, -30983552, -34291789, -45013787, -3603364, 3880390, 10316830, 5786842, -15941911, 7060249, 4813254, 21403753, 23850217, 5143606, 14662136, -14102682, -12729926, -29869343, -32055539, -14586800, -10948782, -3135195, -15319767, -26843813, -15234216, 2996254, 24798010, 31561551, 10450559, -973956, -9972813, -8334792, 2423315, -20825741, -26022882, -45565556, -43713434, -22550629, -30803884, -4108266, -20911266, 5638157, 15273466, 30779071, 49069331, 44164106, 55604678, 48014800, 41281069, 30160547, 13082859, 10994297, 8042975, 1881340, -11429225, -32751390, -42121753, -29668935, -16789543, 7260408, -3422415, -1922345, -10064479]
484a0064479J6868215J7639931Q842403m171360j0678068p621946J0842551J230044
476B2887291N539824j3277158j0837751M755994l206630K3484294j2659032Q244723
468B4931555j5922370j9296M867590j213963J3040297n610332J629739j0558675r419952
459A724593p578274M532961j129060J2131517k0004099j2199758k1351345j6384854
451f0258319J8430391j4570351J9922993l3529820o579494j1621656K047967K4773004
443f1385285N318423P538179l331548q100511J4881183J3265665J7588910J9378166
435E153182j4057861R888667j4342074J4003519J6321010M370010J3216213j4733716
427A9818950m402479L672240J363707K0169663L020740r603769P302070k9196871K6187915
$$ y = [-10064479, 6803736, 24443667, 33286070, 29114710, 18436642, 10814696, 21657247, 22887291, 28427115, 15149957, 4312206, 9068200, 5861570, 29345864, 16686832, 24931555, 9009185, 8989889, 13857479, 12643516, 25683813, 20073481, 21703220, 11144545, 1724593, -5853681, -1320720, -2449780, 9681737, -10322362, -22522120, -43873465, -60258319, -41827928, -56398279, -36475286, -70005106, -76584600, -88206256, -86158289, -61385285, -56066862, -48528683, -51860231, -59960742, -45079559, -31813894, -14224984, 5153182, -8904679, 983988, -13358086, 645433, 16966443, 21336453, 34552666, 19818950, 15416471, 19088711, 20452418, 40622081, 43642821, 34039052, 41341122, 12144251, 38332166]
418C8332166j5692659J4549447m06331j8863599J4803477k2743271J9370404n183563
410B4166071L117176O775197q950681P590952j370555P252450N055778N542744j4789167
401C4389965M507221k7239426J7722705j2535963N998880j6653053l0443393j9324193
393d3577257j4921861l697580J5729193k3648666N112244l4972167M314007M731817
385i0930270R826400K7963040M28544J8403838K401607J01156J2689916m675506L0300711
376F509436O075069K5370206j2743772l066349j8373321J4324795J6429491K5114021
368E9639576J2650084j0447900J190905j3602787J3946384j515358K133331m117198
360E9877037j3479943j0009243k4738496k7538353j5123886j2193397K1808271l311900
$$ y = [38332166, 22639507, 37188954, 36782623, 17919024, 32722501, 9979230, 29349634, 24166071, 27283247, 34058444, 25107763, 32698715, 31328160, 38580610, 43636388, 49179132, 34389965, 38897186, 11657760, 29380465, 16844502, 22843382, 6190329, -24253064, -43577257, -58499118, -62196698, -46467505, -70116171, -65003927, -99976094, -95662087, -90930270, -81103870, -53140830, -52712286, -34308448, -31906841, -31805685, -19115769, -23791275, 6509436, 12584505, 37954711, 25210939, 22144590, 3771269, 18096064, 34525555, 59639576, 72289660, 61841760, 63032665, 49429878, 63376262, 61860904, 63994235, 59877037, 46397094, 36387851, 11649355, -15888998, -31012884, -43206281, -21398010, -24709910]
352b4709910O621197k6279612p15112Q894916L3476786K6928092M248282j1449311
344A7015328j3146453k055506J4827072q871794j417336l8756269J433817j5282399
336d6253540J7323512m121870J291068M018433J1762283K2703565J5718162Q664134
328C1105747R981206P074779J5715983l216993q520435k2821727p536962j370401L443191
319B3854388p547786k4946119j1716013j0157042K4203952R602497J3175190n300500
311A1168567q29930Q561119J4122802N026404P950145j6394278J6561269j1631174
303C4534924K0976070j7816316J630927j5251064M532415J387281P295612l660538l064064
294C0565247j4160314p918687j6274549L781530o051375K0840856j5641297N450729
$$ y = [-24709910, -18088713, -44368325, -45083437, -36188521, -2711735, 24216357, 28464639, 17015328, 3868875, 1813369, 16640441, 7768647, 6351311, -32404958, -30971141, -46253540, -28930028, -33051898, -31760830, -27742397, -15980114, 6723451, 22441613, 31105747, 41086953, 48161732, 63877715, 60660722, 52140287, 29318560, 21781598, 20411197, 23854388, 16306602, -8639517, -20355530, -30512572, -6308620, 3293877, 16469067, 11168567, 10338637, 18899756, 33022558, 38048962, 45999107, 29604829, 46166098, 34534924, 55510994, 37694678, 39325605, 24074541, 28606956, 29994237, 37289849, 33629311, 30565247, 16404933, 8486246, -7788303, -4006773, -10058148, 10782708, -4858589, 592140]
286E92140l3342604O204213K104544K7888037J5879604K92146j4911264p006517p382546
277i682247K0889763l412970Q862219j1208183m313294K881326p497670O985170p47419
268B756695J6343367J7868158J0505885j795316r035819n610362R273760J1540340o386603
259D5460105r534048l8274417j679847j3281310P946411o368586k2299450P95395o570161
250d3805908K4803498Q627306r19354j977858l891290J3865763J7765755l667777j355236
241I444899k1575381k792170R679263o253164J3489336k7636534R538075l998372J8066148
232b037900R429044q84915q329466N166609l558529K7198115j0809988L719200k2775186
223b883016j1892096L311566J45235J1359031m788279j2916398k799668j0063493J8219095
$$ y = [592140, -32750464, -26546251, -24441707, 3446330, 19325934, 19618080, 4706816, -2299701, -9682247, 11207516, 7794546, 16656765, 5448582, 1135288, 4016614, -3481056, 3504114, 2756695, 19100062, 36968220, 47474105, 45678789, 36642970, 31032608, 40306368, 51846708, 45460105, 35926057, -2348360, -4028207, -17309517, -9363106, -15731692, -38031142, -37235747, -43805908, -19002410, -10375104, -11294458, -13272316, -17163606, -3297843, 14467912, 10800135, 9444899, -12130482, -14922652, -5243389, -11496553, 1992783, -25643751, -16105676, -20104048, -2037900, 7391144, 6506229, -1823237, 3343372, -215157, 26982958, 16172970, 19892170, -2883016, -14775112, -11463546, -11318311, 40720, -4747559, -17663957, -20463625, -30527118, -12308023]
214a2308023O348555J7111798n49332N349936j3064713J4073360j3841503L0674352
206C3794430n800341K1937666q613898j6644503p315283j8359667K5466177J2480857
198C6945438J2529174j0348900m1044156j4257296q549670L0854208K8119039l712228
190C0535609j1911949m4578855q26653L197798L0247038J8330411n034724q756896
182A1201779k4567443k914207k964517J3021267J4285703Q727874M865327j8575010
174C080773o810815k0825941K2373252J604394L0616508j5459221n893330k2305228
166a3619608j3361647P518559m881168J5139362J361859O26007J1385799k1692235
158a7523072J4326103j4471307K6813990K1602823P532644J3084026l6754972m431528
$$ y = [-12308023, -5959468, 11152330, 10602998, 15952934, 2888221, 16961581, 3120078, 33794430, 27994089, 49931755, 41317857, 24673354, 17358071, -1001596, 24464581, 36945438, 49474612, 39125712, -1918444, -16175740, -24725410, 6128798, 34247837, 30535609, 18623660, -25955195, -26781848, -23584050, 6662988, 24993399, 19958675, 11201779, -13365664, -16279871, -19244388, -6223121, 8062582, 16790456, 21655783, 3080773, -3730042, -24555983, -2182731, -578337, 30038171, 14578950, 8685620, -13619608, -26981255, -19462696, -24343864, -9204502, -7842643, -7216636, 4169163, -17523072, -3196969, -17668276, 9145714, 30748537, 38281181, 51365207, 14610235, 10178707]
150A0178707k2579773L46058Q818264j4443926O111583k6521718o678137j5610398k790450
141f3169790J6382034K5771002K8890019J7288792m253485p036888P952897J4136777
133C5961358L6066961K745549j332395j7346985j9400520P624563j1595894L572562
125C6295199l564463r309970K5348735j6728462J1415204k4723443r318263J9110335
117B8524872k065386K8451034k6089458j7351252j5683854j7364386K0290668r196652
109a0484414N923231m948499q598183P541636r189474M02723Q750247N961847K6146195
100B1505309k830159l995078j2353113j237894J6198759K2648273k140977O290649
92D4085769k4958142J2042792J097243K037294n6619k7070813l455591j0353110j4479513
$$ y = [10178707, -12401066, -12055008, -3236744, -17680670, -11569087, -38090805, -44768942, -60379340, -63169790, -46787756, -21016754, 7873265, 25162057, 20908572, 13871684, 21824581, 35961358, 72028319, 74773868, 73441473, 56094488, 36693968, 44318531, 32722637, 36295199, 32730736, 23420766, 48769501, 32041039, 43456243, 18732800, 9414537, 28524872, 26459486, 54910520, 28821062, 11469810, -4214044, -21578430, -1287762, -10484414, -4561183, -9509682, -18107865, -10566229, -19755703, -19352980, -10602733, -4640886, 21505309, 18675150, 14680072, 2326959, 1089065, 17287824, 39936097, 37795120, 44085769, 19127627, 31170419, 32267662, 34304956, 34248337, 7177524, 3721933, -6631177, -21110690]
83b1110690m667000m1693985J677048j6244111J1208045K890560j0760442N320491R518804
74f3861280K0248279L3373301l316162K3529502n952003L2012384N448430J1527274
66E3009725j8902398K575869o763300K1605163m253138j3086778j0887899j4728314
58H568930K8000085P399746M498005j2885222k7767080J0925743L739811J0498657n839222
49B7139453l5758365o769417p426068Q052896J7551696k9852699J1314301k1760692
41c7508895K3858400J4986997j875181Q287653j8526271O542140J539067J989835o463222
32g169477M640565k4812963K5871907l6663001J9527594j4486934P966185L4357810
24I231686j2590528K2883671k6552888m553515K0873251P064539L0909469K360512
$$ y = [-21110690, -25777690, -67471675, -65794627, -82038738, -70830693, -67940133, -78700575, -73380084, -63861280, -43613001, -10239700, -13555862, 9973640, 4021637, 36034021, 41482451, 53009725, 34107327, 36683196, 29919896, 51525059, 47271921, 34185143, 23297244, 8568930, 36569015, 43968761, 48466766, 35581544, 7814464, 18740207, 22480018, 32978675, 27139453, -8618912, -15388329, -22814397, -14761501, 2790195, -27062504, -15748203, -37508895, -13650495, 1336502, -538679, 7748974, -10777297, -4235157, -2696090, -706255, -7169477, -2528912, -27341875, -1469968, -38132969, -18605375, -33092309, -25126124, 9231686, -3358842, 19524829, -7028059, -11581574, 9291677, 16356216, 47265685, 49626197]
16D9626197l6237864J3770761m6921821M7758153K836890R852992K5063165n5703922
8A0044551L0143751l5225188K7085906K0266413j2320941J6029118l5667893p561306
0A2794411l215423o327303Q72623P548739m3685345M2417472o0579048N1714776m1383322
-9c9842420N062073q21329j7153911K2238633L962260j8576491K7391545m8544087
-17f6283727L5954181o681189M763173M6778343l3328005M5353220k1986176j3717165
-25i147345L5148315n5022632P9235392n2702817L5123348m8746466k2920668j9102039
-33e8134912J1929194k646276L9875841m2379791J2966548k2158930K794687M9157750
-41h595889j3887246M4939075k0401876k454463J8364520k9472476K9780828k3378853
$$ y = [49626197, 13388333, 27159094, -19762727, 27995426, 30832316, 40685308, 65748473, 10044551, 40188302, 4963114, 32049020, 52315433, 39994492, 56023610, 20355717, 12794411, 9578988, 3251685, 4124308, 11673047, -32012298, 10405174, -50173874, 1540902, -39842420, -34780347, -35601676, -52755587, -30516954, -26554694, -45131185, -17739640, -66283727, -30329546, -37010735, -32247562, 14530781, -18797224, 26555996, 4569820, -9147345, 26000970, -29021662, 50213730, -2489087, 32634261, -16112205, -39032873, -58134912, -46205718, -48851994, -8976153, -51355944, -38389396, -60548326, -57753639, -8595889, -22483135, 22455940, 2054064, -400399, 17964121, -11508355, 18272473, -5106380]
-49e106380q29958J0904106k4168414J1570994j2488206k5089454L9609211m4829340
-57e0427441O4025147l8003504K3837814m244819j6538633K9919659k0602261K4786278
-65A2752240n203828K154164L02469m407070j1761672J2412595j3046035J7891278p831445
-74C262696k1503564r34274m4498356K4184263k3136174J7670593k0801910j7774078
-82h3530804j7193227L462596J0418919L7155441k41678J6239507j2899181O821421
-90c9767006K3805725J3664024L2932789q614538P73429j4670526q765616R425873n012858
-99C771296J8631177j1557923J1787697j6505369R876533o795733K0129304L847569
-107C3184551J9869913j1967904M651681k5176508P094747j2792624L029265p887620
$$ y = [-5106380, -5936338, 4967768, -19200646, -7629652, -20117858, -45207312, -5598101, -50427441, 13597706, -24405798, -567984, -4812803, -21351436, 8568223, -12034038, 12752240, 7548412, 9702576, 10005045, 5597975, -6163697, 6248898, -6797137, 11094141, 3262696, -18240868, -19175142, -63673498, -39489235, -62625409, -44954816, -65756726, -83530804, -100724031, -97261435, -86842516, -49687075, -49928753, -33689246, -46588427, -39767006, -15961281, -2297257, 30635532, 22020994, 22794423, 8123897, -641719, 8784154, 3771296, 22402473, 10844550, 22632247, 6126878, 16003411, 9207678, 29336982, 33184551, 53054464, 41086560, 45738241, 20561733, 27656480, 14863856, 17893121, 10005501]
-115A0005501j8246968J306455j2931493J1314190j740597o542420Q725027l300481
-123a1410786L0726618J1937952J2091520m586640j0685816m12259J9041136P025725
-131E3727450K2233260k3772094m859932j9347353Q30362J0574687M893000m177414j64414
-140C9937552k6899010J2693819j9819995J0905336o16472j0956216J5433521j8453265
-148B225270J2641704N07491q406134K3916833k4267199K7833419j4343009J4301567
-156C4409942J228496o464002q160898p612427j8016844K2061077j5416637K6261845
-164B8290552k3861041j507262j5305668M884299J2437770K5671901P01097J0573771
-172D1885419k6831276k276725m429521Q679426K0396777j118954j2038903j4666091
$$ y = [10005501, -8241467, -6935012, -19866505, -8552315, -10292912, -16835332, -8110305, -11410786, 19315832, 31253784, 43345304, 38758664, 28072848, 27660589, 46701725, 53727450, 75960710, 52188616, 47328684, 27981331, 28811693, 39386380, 44279380, 40101966, 39937552, 13038542, 25732361, 5912366, 16817702, 16201230, 5245014, 20678535, 2225270, 14866974, 15374465, 6968331, 30885164, 6617965, 34451384, 20108375, 34409942, 35638438, 29174436, 21013538, 13401111, -4615733, 17445344, 2028707, 28290552, 4429511, 2922249, -12383419, -7499120, 4938650, 30610551, 31311648, 41885419, 15054143, 12777418, 8347897, 17027323, 37424100, 36305146, 24266243, 9600152]
-180I600152l6792561K2969471j4717789M3149119j8756212l455314k7084937j1575308
-188c6663379J1140971J9019553N983590J135218l2231294J015736n031520K5734133
-196i896992J4483351o31541k760697r820612J0759727J3008749Q565073K948342j1324344
-205A5331056j262814n778028K569234j1406303k943126j2295553Q344070l745776L167828
-214h019412p177059m519417J3449615N197540J9572922j2260885n45172o920470J0873346
-223I651008J1917526l241485j4072827j7472198l874601K0124809R167951M535316
-231A6735499k6456669j6067559M58754J9749028K2908885l998402k2391225k1599127
-239c0660816r126245K1775186R792706Q550883j5745912n412005M900663J9772673
$$ y = [9600152, -27192409, -4222938, -18940727, 24208392, 5452180, 1996866, -25088071, -36663379, -25522408, -6502855, -519265, 615953, -31615341, -30599605, -35631125, -9896992, 4586359, 3954818, 1194121, -8626491, 2133236, 15141985, 23707058, 26655400, 15331056, 14068242, 8290214, 10859448, -546855, -3489981, -15785534, -7441464, -11187240, -8019412, -15196471, -19715888, -6266273, -1068733, 18504189, 6243304, 5698132, -1222338, 9651008, 21568534, 18327049, 4254222, -13217976, -17092577, 3032232, 12200183, 16735499, -9721170, -25788729, -25329975, -5580947, 17327938, 13329536, -9061689, -30660816, -39787061, -18011875, -8219169, 331714, -15414198, -20826203, -15925540, 3847133]
-247C847133J4033426Q293554m664270Q370757R131226J1519297j229352j9331187
-255B9970584j4097848j1415050M157185Q72781j2470678j6602842j7917590j479257
-263c8982715Q218652P354870K122035j848491P29214J2881584P725999K427713m151902
-272c523041j1852199J7322722N037459K6025895j0340221p260022r949140O786896
-280A2248349K6134702J7021409l90304j3764054k4582901L896036m227822Q357345
-288B4692760k5371003j9796600k5546689M258259K776859M138228j5178742j3974436
-296f4001364N258573K2598929L0917159J6134707j4786366k203469k0377201L0139817
-304C680785m690145J4858469k0652261j5371072m579067j2999110O997432j1005419
$$ y = [3847133, 17880559, 26174113, 21509843, 29880600, 39011826, 50531123, 49301771, 29970584, 15872736, 4457686, 8614871, 9487652, -2983026, -19585868, -37503458, -38982715, -30764063, -23409193, -21287158, -23135649, -22406435, -9524851, -1798852, 628861, -3523041, -15375240, 1947482, 6984941, 33010836, 22670615, 15410593, 5461453, 12248349, 38383051, 55404460, 55014156, 41250102, 16667201, 20563237, 16335415, 24692760, -678243, -20474843, -46021532, -41763273, -38986414, -34848186, -50026928, -64001364, -58742791, -36143862, -5226703, 10908004, -3878362, -6081831, -26459032, 3680785, -1009360, 13849109, -6803152, -22174224, -26753291, -39752401, -32754969, -43760388]
-312d3760388Q882555J5610941J3501912J4853364j7274613m943276m876266J9981173
-320A975402K3561865k678815r698606l9133486l699693q620909J9668314J0552k375796
-329b0991172r36810m249854J5714672m195311R216321j277215J1114660J6757750o409303
-338A4743738N569296l4749059J3260339j9022423K7561620j1330883N249966l915830
-346b633236k202321J2415765n540238K584582M746772M442734K3155561p718268j0194545
-355A9056806j6203501j9895503L0676870o997168K7130451k6410868l600667O66047
-363D422467J0137462K2139488J481899j979163P280409N381352J5913930o982087
-371E7795757j7851578j5215128P747143K215859L6373289n1915227J9154182p0697574
$$ y = [-43760388, -34877833, -19266892, -5764980, 9088384, -8186229, -13129505, -18005771, 1975402, 25537267, 22858452, 13159846, -25973640, -29673333, -38294242, -18625928, -18615376, -20991172, -21927982, -26177836, -10463164, -14658475, -5442154, -6719369, 4395291, 21153041, 14743738, 20313034, -14436025, -1175686, -20198109, 7363511, -3967372, 1282594, -2633236, -4835557, 7580208, 2039970, 4624552, 9371324, 13814058, 36969619, 29251351, 19056806, 2853305, -17042198, 13634672, 6637504, 33767955, 7357087, 3756420, 4422467, 14559929, 36699417, 38181316, 36202153, 43482562, 48863914, 64777844, 57795757, 39944179, 24729051, 32476194, 34692053, 71065342, 19150115, 38304297, -32393277]
-379c2393277M7385197j3567554L7940349j6558404j0593447k9039601J9047874k0978565
-387a8757428M4703340l7228711K3544456j6930438p95919J0933460k2770275P014641
-395a0286874R573730o612674M5197899n2978944K1796784n7226677K3385771K420989
-403b4729996K6070300j3290635m386287n3302824K9829371j0935922N6144212J4005404
-411A9403623j2881543J6999674l4034851N1492693O542224K5648688J124621j8076387
-419E6218742n659351J3854375j9352603K6215228n3451151P365287j4371399k007901
-427H811227K6440821l8368587m38096j9069755j4469178N0217679l9737607M7402055
-435B0788559n8124865K8771039k3375237K4214314k5089608K4762892l9246345O0963174
$$ y = [-32393277, 14991920, 1424366, 39364715, 22806311, 12212864, -16826737, 2221137, -18757428, 25945912, -11282799, 12261657, -4668781, -5464700, 5468760, -17301515, -10286874, -713144, -7325818, 37872081, -15106863, 6689921, -50536756, -27150985, -24729996, 1340304, -11950331, -16336618, -69639442, -39810071, -50745993, 5398219, 19403623, 6522080, 23521754, -10513097, 40979596, 47521820, 73170508, 74295129, 56218742, 50559391, 64413766, 45061163, 71276391, 17825240, 25190527, 10819128, 8811227, 35252048, -3116539, -3554635, -22624390, -37093568, 13124111, -26613496, 20788559, -37336306, -8565267, -31940504, -7726190, -32815798, -8052906, -47299251, 13663923]
-443A3663923l8911038L5833036n5440227r966921j077898J8114009K6697554k633865
-451a3721427n3536054j6856498m4237552M7515232J1681724K4118759j5129118k0257593
-459h0422527j2376682L3826558J860597O7388500k2377300N1952078j6008451K3465343
-467D7308116O694537l471675K2946259M582276J7164604J72652j9776248j9666484
-475E5954037j5398375j3377474J5430084j6943805M206175k6567964j7496356m768476
-483a8962154j3140948K0396596k656297J3664962j607103j669876O943632M117494
-491G086306J5698017L099223Q908495p785880J3044764j2782009J2642111k2410526
-499A7500501J692669n221610L963163J7801832j4712647J2055115j7560914K7362404
$$ y = [13663923, -25247115, 10585921, -44854306, -54821227, -55899125, -37785116, -11087562, -13721427, -67257481, -84113979, -128351531, -80836299, -69154575, -45035816, -60164934, -80422527, -92799209, -58972651, -57112054, 10276446, -12100854, 39851224, 23842773, 47308116, 54002653, 50530978, 73477237, 78059513, 95224117, 95396769, 75620521, 55954037, 40555662, 27178188, 42608272, 25664467, 29870642, 3302678, -14193678, -18962154, -32103102, -11706506, -14362803, -697841, -2304944, -3974820, 2968812, 7086306, 22784323, 25883546, 34792041, 27006161, 40050925, 27268916, 39911027, 17500501, 19193170, 13971560, 17934723, 35736555, 21023908, 33079023, 15518109, 42880513]
-507D2880513J2481856K1992657N02350p654020L67514J5207262J0903493Q822329
-515A05503954l5695602j7659767l3391125J2678757k031728j962037k8522269k9696300
-523c0776117j7702229J0361539O434321K5788806j7376325K0745720k2184801L2271226
-531G562140j5849590L1549739j0436125L0581691m239613P170995j3683910j4918381
-539A7736946Q554529J254825K3878812m817753j3863952r228739k4729705K5195911
-547B3980874j0890113K4957846j9475728m295524j5375440m952903L471368O167916
-555C588296J283609J60948q321412m126128N380438J138698J5822740o907470P508581
-564A5528300q028975J1493448k350452J0425052j6002448P956617r295043J6087835
$$ y = [42880513, 55362369, 77355026, 77857376, 70203356, 70570870, 85778132, 96681625, 105503954, 69808352, 52148585, 18757460, 31436217, 29404489, 27442452, -1079817, -30776117, -48478346, -38116807, -31682486, -5893680, -23270005, -2524285, -24709086, 7562140, -8287450, 23262289, 12826164, 43407855, 39168242, 46339237, 32655327, 17736946, 26291475, 27546300, 51425112, 46607359, 32743407, 23514668, -1215037, 23980874, 13090761, 38048607, 18572879, 14277355, -1098085, -6050988, -2579620, 3588296, 4871905, 5032853, -3288559, -7414687, -2034249, -895551, 14927189, 8019719, 15528300, 7499325, 18992773, 16642321, 27067373, 11064925, 19021542, 9726499, 25814334]
-572B5814334O92067j0426850n971536j9109345J6541310Q501052N852117m624284
-580A7268865l2479254L11047p540688K4629415M86236k366333k4660079j283719j2696492
-589c8331002K4657929q546817J4003609k289414K484098J3473781j3473944R725079
-597A703319l902583K1460763K1678298N864209q447312k0939767r692245J5124627
-605B2849309K1705131P661465n004429l5970372m980763m479380J7634595J6161556
-613C5577112j8551149J38387k5169528P346132Q162000o559915Q503662k3371784M23718
-622a3501365p49241r771662J3755512k4776263P377317j3704231j83198N036820n938727
-631d2455038Q267932k864451L865907o09075L452105j479903J6099377N229685J4948580
$$ y = [25814334, 26506401, 16079551, 10108015, -9001330, 7539980, 16041032, 21893149, 17268865, -15210389, -14899342, -22440030, 2189385, 2675621, 309288, -24350791, -25634510, -38331002, -13673073, -22219890, -8216281, -10505695, -8021597, 5452184, -8021760, 1703319, -2199264, 19261499, 40939797, 46804006, 38356694, 17416927, 7724682, 22849309, 44554440, 52215905, 47211476, 11241104, 6260341, 1780961, 19415556, 35577112, 17025963, 17164350, -8005178, -659046, 7502954, 943039, 9446701, -13925083, -13501365, -14250606, -24022268, -10266756, -35043019, -27665702, -41369933, -41553131, -36516311, -42455038, -34187106, -37051557, -33185650, -33794725, -30342620, -31822523, -15723146, -10493461, 4455119]
-640D455119P549655j4878485J4716597j9007132L3373437M318463P295237M308887
-648D2131778l5817726J4928507j3851584K5161423Q363344j9035637K37209l1387231
-656i269917J8531086M47067J1651513p535515j2176185r621245N048066K430141J857302
-665A362313m280098j2769296O152230m852852J89466J976629j7350120K8000087q718049
-674a0289690K5754765j1971161q478487J2648110N060133L4563309M627981j4647776
-682C7267184l064005k4879862K9974595o094828R204814k2114010j4776839n097173
-690D19876N725385k180944n267448r680958J825071K6436790N413656J1969037j9207836
-699A5452629o878589K4187043Q287602M0650580k4412639l405415j6704299l05811
$$ y = [4455119, 12004774, -2873711, 11842886, -7164246, 26209191, 30527654, 37822891, 42131778, 6314052, 21242559, 7390975, 32552398, 40915742, 21880105, 22117314, -9269917, 9261169, 9708236, 21359749, 13824234, 1648049, -7973196, -2925130, -494989, 1362313, -2917785, -15687081, -9534851, -14387703, -14198237, -12221608, -29571728, -1571641, -10289690, 15465075, 3493914, -4984573, 7663537, 12723670, 47286979, 51914960, 37267184, 34203179, 9323317, 39297912, 33203084, 42407898, 20293888, 5517049, 419876, 6145261, 3964317, -1303131, -10984089, -9159018, 17277772, 22691428, 34660465, 15452629, 8574040, 32761083, 41048685, 81699265, 57286626, 53881211, 37176912, 36871101]
-707C6871101K2305282r374528J138884j5871774k081266Q205366m229083j5187893
-715B1776089j1881422j4386370K2591330M606353r59412k1521696l2340089k538102
-723c4653319O456084J0096067R365124k5384087k38779j0887529M658040R777303
-731c0811096j2574157J5052794O721157J6289658J7351952k6358310L922246j7807852
-739b8213608L3446820K4837963J8007747q252000j9929637j7386884J5420098J5480729
-747C3411228K2387151P731018j7137237M266758j9113034J0026586K916094r62902
-755D3525662K2675055j4296569R128976k4481792j4538183m08925q83320J5806808O1034
-764C6588746j8165046p265801k1272975R195336O163669l14401R204858j4045284Q223982
$$ y = [36871101, 59176383, 49801855, 50940739, 35068965, 32987699, 41193065, 36963982, 21776089, 9894667, -4491703, 18099627, 22705980, 21746568, 224872, -32115217, -34653319, -28197235, -18101168, -8736044, -34120131, -34358910, -45246439, -40588399, -30811096, -43385253, -28332459, -21611302, -5321644, 12030308, -14328002, -10405756, -28213608, 5233212, 30071175, 48078922, 39826922, 19897285, 2510401, 17930499, 33411228, 55798379, 63529397, 46392160, 50658918, 31545884, 41572470, 44488564, 43525662, 66200717, 51904148, 61033124, 36551332, 22013149, 21604224, 20720904, 36527712, 36588746, 18423700, 11157899, -10115076, -919740, 5243929, 4929528, 14134386, 89102, 8313084]
-773H313084k204646r05916m99154n624042j350508J1327595r009519L771219k0481997
-782a6663884j5119202L818620j1628774K3586353r581838l28647l76543j7204584
-790d3498499K3121948l667857K4489520J0900649Q99888P647589q844128j096104
-798I953006J3519198k419630K4041167j2057827n129247j5566003j4704005R030740
-806F667399R748974Q927974P031554k1869290n590795m940750Q404623K8845358Q61407
-815C8086454L760361j1669728k1256597J8975027j3397762K3494022j3590549j2953407
-823A1447821J479647k1955505J3187746j6680607r501537L048180j1054543K4751640
-831e277158p737090l910943j2113406j2706779J6098157J3224492J1775383k299407
$$ y = [8313084, 6108438, 5202522, 4703368, -920674, -2271182, 9056413, 46894, 3818113, -16663884, -31783086, -27964466, -39593240, -16006887, -25588725, -25917372, -26293915, -43498499, -20376551, -24044408, 445112, 11345761, 12245649, 19893238, 11049110, 9953006, 23472204, 21052574, 45093741, 33035914, 27906667, 12340664, -2363341, 6667399, 16416373, 25344347, 32375901, 10506611, 4915816, -24934, 8379689, 37225047, 38086454, 41846815, 30177087, 8920490, 27895517, 14497755, 37991777, 24401228, 11447821, 12927468, -9028037, 4159709, -12520898, -22022435, -18974255, -30028798, -5277158, -13014248, -16925191, -29038597, -41745376, -25647219, -12422727, -647344, -2946751]
-839b946751j5375952j1674472O977293m756837J9089391r218714R444410R744442m580839
-848c298029J0205739k0081614P023034K3174946J9415176L5351006k7246014j7316275
-856B7227969k4702493L709885M1356664Q658428J776235l6838770l0208989R937675
-864I16604J1769931L7212047o373775p24049j5349646J3757089N392461J6608599
-872F3209261j0904064l310953k128077p117978O263626k9061236o493498j5868195M68776
-881d942338J2613607j4637704M945004j5625000J3266798J2033487Q572667j573031
-889A4653490m687991q889751J7928631o791174R803837k7795959r607818j2797739
-897b8184474R264746M959680O202151j4017393m218634n703144J0955509J4869468
$$ y = [-2946751, -18322703, -29997175, -23019882, -27776719, -8687328, -17906042, -8461632, 1282810, -3298029, 6907710, -13173904, -6150870, 17024076, 36439252, 71790258, 44544244, 27227969, 2525476, 6235361, 47592025, 56250453, 58026688, 21187918, -9021071, 916604, 12686535, 49898582, 43524807, 42800758, 27451112, 41208201, 46600662, 63209261, 52305197, 48994244, 46866167, 39748189, 46011815, 16950579, 10457081, -5411114, -4942338, 7671269, -6966435, -2021431, -17646431, -4379633, 7653854, 16226521, 14653490, 9965499, 1075748, 19004379, 12213205, 22017042, -5778917, -15386735, -28184474, -18919728, -13960048, -7757897, -21775290, -25993924, -31697068, -20741559, -5872091]
-905e872091O460195l600618p516993k3455900J5385516j8795299L2809187k8525969
-913c3111972O736716l2547604N898582L013119K9760200N10755J2585774l1244477
-921c8398907J4054998p618184L2791373L176415L507259j7634842l335587j0774936
-929b4232411K2116342j3878378K6287547j9612272K8579479j5647658J6157569k3964303
-937d194085J1686519j1048986K3826789j4426644m854120l5234596j2173183m687526
-945e1105832J4169145N099664M140069j3735232J6025661M572853L7546138r96338
-953A5716128J4163584j3452366J0793248K885718K887488j9728361k9534259l4801935
-961e1070755o233698o330998J8449067j1753784p125983r667530j872291M2265260
$$ y = [-5872091, 588104, -3012514, -10529507, -33985407, -18599891, -37395190, -4586003, -33111972, -26375256, -58922860, -53024278, -50011159, -20250959, -19740204, -7154430, -38398907, -24343909, -31962093, 829280, 4005695, 7512954, -10121888, -13457475, -24232411, -2116069, -15994447, 10293100, -9319172, 19260307, 3612649, 19770218, -4194085, 7492434, -3556552, 20270237, 5843593, 989473, -34245123, -46418306, -51105832, -36936687, -31837023, -27696954, -41432186, -25406525, -20833672, 16712466, 15716128, 29879712, 16427346, 27220594, 30106312, 32993800, 13265439, -16268820, -51070755, -57304453, -63635451, -45186384, -56940168, -64066151, -73733681, -75605972, -33340712]
-969c3340712J7568288M4569645k118071j897181O718174j4690375L5789641k5179469
-977B7419940J3909174l5474436o28497j0025107J1322205r637192Q931083j6157528
-985a0340358K3552214J1927836J3256737Q240259k6442359k884477n811750j5424050
-993c925948J7698368o1801412J8666689m9853809K7612347j4087127M10388j7578580
-1001h2859084K7421436n020375R3453183m8726203O1430012q0595139M2965592P181730
-1009A5251152L2152271J4056015l8130633m2582071K245195j7080178O5524606k4703711
-1017F732646J3944717k5540634O454172J3332785L6645578l6138390N0134344q5546820
-1025a9981602P7659352o5168399L5930081l6591105k5185512Q381532q797804J0592778
$$ y = [-33340712, -15772424, 28797221, 26679150, 24781969, 31500143, 16809768, 52599409, 27419940, 41329114, 5854678, 5226181, -4798926, 6523279, -3113913, 5817170, -10340358, 13211856, 25139692, 38396429, 46636688, 20194329, 17309852, 11498102, -3925948, 13772420, -48028992, -29362303, -79216112, -51603765, -65690892, -65280504, -82859084, -55437648, -60458023, 32995160, -15731043, 45698969, -34896170, 8069422, 15251152, 47403423, 61459438, 23328805, -19253266, -17008071, -34088249, 31436357, 6732646, 20677363, -4863271, 1590901, 14923686, 51569264, 15430874, 65565218, -19981602, 57677750, -7490649, 28439432, -8151673, -33337185, -24955653, -33753457, -23160679]
-1033b3160679J8826796k8312484K7796688q834992M036427L9216715m4150659N5578806
-1041D0996618m0157589K1333433K151124l4225041L1758838k2475866L0219832L8129423
-1049F7730772j0421337N5130665k7798251L4915055J9762215K1784429L5835050Q800333
-1057B05738931m8999998K1969999j10272143Q3448635q7854611O9768732q3845015
-1064D9954530p478323n8500771K6889927j0483869P6939038m9717290M6475558n2484345
-1072B1594455L3511522J0668891R59780o823343j5129690m9426441M9257482r0600400
-1080d5987744O2344211j14093641M8506858l7911392M8146738k174721J3683241m0321585
-1088f7808035M3143872l9504995Q4711854m7471728M1125386m2164988J184781j7792293
$$ y = [-23160679, -4333883, -32646367, -4849679, -13684671, -9648244, 29568471, -14582188, 40996618, 839029, 22172462, 24323586, -9901455, 21857383, -618483, 29601349, 67730772, 57309435, 112440100, 84641849, 119556904, 139319119, 161103548, 196938598, 205738931, 156738933, 178708932, 68436789, 151885424, 64030813, 133799545, 49954530, 42476207, -16024564, 10865363, 381494, 77320532, 27603242, 74078800, 21594455, 55105977, 65774868, 66734648, 59911305, 44781615, -4644826, 44612656, -45987744, 16356467, -97737174, -49230316, -87141708, -38994970, -41169691, -27486450, -67808035, -24664163, -64169158, 20542696, -26929032, 14196354, -27968634, -26783853, -44576146]
-1096d4576146k0355066k2587154k6766J970464L1248900j439399j5496062j6655433
-1104h7916662K220565L9384630P4311626P717794M5865060p4302068L3600046k7728475
-1112A3152516N0807332K6856651p491047J0336708n3544011m074473k6648939K762496
-1120A2157233J6055398L59851J621934k9893292k9863927j4004855j1371K4341155
-1128a9237874N048542Q562402j1279215J6274622J2179573K3330817J3206581n85565
-1136D7499883L5564836J1293777M9636942j8152331j5437701l7590614k1388655K2727144
-1144G4153281p286988Q470068n3019626l1997109l2530111n171634J6666068L933935
-1152b6782116K7579349k390914K1046557j8555615J510964l715555K8911621L8919871
$$ y = [-44576146, -64931212, -87518366, -87545132, -85574668, -54325768, -55765167, -71261229, -87916662, -85696097, -46311467, 28000159, 35717953, 81583013, 7280945, 40880991, 13152516, 63959848, 90816499, 83325452, 93662160, 40118149, 36043676, 9394737, 12157233, 28212631, 28572482, 30194416, 301124, -29562803, -43567658, -43579029, -19237874, -14189332, -5626930, -16906145, -631523, 11548050, 34878867, 48085448, 47499883, 83064719, 94358496, 143995438, 125843107, 110405406, 72814792, 51426137, 74153281, 66866293, 75336361, 22316735, -9680374, -42210485, -47382119, -30716051, -26782116, 797233, -1593681, 19452876, 897261, 2408225, -1307330, 27604291, 66524162]
-1160F6524162J5898245j7675370m7711208m2743706J1133962J6880830M3487880k5039293
-1168B0755502k3673932m0986866M401745K8631255K6856919P969746j3107882j5763444
-1176d916957N855518L567018J0183328j5370212p494403j4113044Q624438o544693
-1184b0209007P105313j8213259N658148n698365J5527609N490380J2611477L532012
-1192E804308P856245n324955J468114p732919Q063485P115974N672887n135932j6659347
-1201A127860j5401871L461058O230520K6470900l509386K671768k0239734k697945
-1209a886830M928768J4118333J5628616O16011j3049517j8389407j7612060N601219
-1217a0044867J0256862J9624553m294618j2178453k3588971o65506J6042020K5675148
$$ y = [66524162, 82422407, 64747037, 17035829, -25707877, -14573915, 2306915, 45794795, 20755502, -2918430, -43905296, -39503551, -10872296, 15984623, 23954369, 10846487, -4916957, 938561, 4505579, 14688907, -681305, -8175708, -22288752, -13664314, -20209007, -13103694, -31316953, -25658805, -31357170, -15829561, -10339181, 2272296, 5804308, 13660553, 8335598, 9803712, 2070793, 10134278, 17250252, 22923139, 17787207, 1127860, -14274011, -10812953, -4582433, 21888467, 18379081, 21050849, 811115, -1886830, 3041938, 17160271, 32788887, 33404898, 20355381, 1965974, -15646086, -10044867, 211995, 19836548, 15541930, 3363477, -20225494, -20891000, -4848980, 20826168]
-1225B0826168J6361255j2784547j2131208j4917332J2114186J7475720J376106J217260
-1233B9537608k9878348N942653p016315J6794688P08380j0633478K117747p940571
-1241c67636K1009627K202374O210628o174807n956591K150686N25937K716396o360445
-1250A5956169j709412j1397675K131246j6832346K870788j0340057J0312598O094698
-1258b913991K637942j28468o345674J116933J6761444N713191J9454960j2464549J445145
-1267B5276933l754253L445003J2877042p740638o019831q747799r501749K1648976
-1275B7483684q322652J4493783k7780694m840946r101850K1208775J2253600K4029114
-1283D9422814k8667087J178742l8710009K3475468J0971685K2948220J1002569l0629669
$$ y = [20826168, 37187423, 24402876, 12271668, -2645664, 9468522, 26944242, 28320348, 29537608, -340740, 5601913, -1414402, 15380286, 16088666, 5455188, 7572935, -367636, 20641991, 22844365, 29054993, 22880186, 16923595, 19074281, 19600218, 22316614, 15956169, 14246757, 2849082, 4980328, -11852018, -8981230, -19321287, -9008689, -2913991, -276049, -404517, -6750191, -5633258, 11128186, 16841377, 36296337, 23831788, 25276933, 21522680, 24967683, 37844725, 30104087, 24084256, 15336457, 5834708, 27483684, 19161032, 33654815, 5874121, 1033175, -8068675, 13140100, 25393700, 49422814, 20755727, 21934469, -16775540, 6699928, 17671613, 40619833, 51622402, 20992733]
-1291B0992733j3781381k1852843O100933L1199036J399605J9863124l4638946p158464
-1299B123797j9207349J2117618J1964351K2732248j1055343L931250l4435324P091393
-1307d737359l140999J8657004J7614859m937178n220816p676735q032156L1700415
-1315C4227035k999531K3708438j5423434j3550297J1932713j2515303L6047314j6841217
-1323D4585718l483304j4983097k4319275K3484746j0960817K3198922j9426955j0856906
-1331G239032j4870440l198459Q009921J2443061L36661l911878j2104372j2582236
-1339a8638710O068950p45353J3669546R97602r565584K485042j4868608J5973867J298807
-1348c324441M760178M826001j5312847J1342287m174601R531859M914398j9076745
$$ y = [20992733, 7211352, -14641491, -8540558, 22658478, 24058083, 43921207, 9282261, 2123797, -17083552, -4965934, 6998417, 29730665, 18675322, 22606572, -11828752, -4737359, -7878358, 10778646, 28393505, 23456327, 18235511, 10558776, 2526620, 34227035, 31227504, 54935942, 39512508, 25962211, 37894924, 25379621, 61426935, 44585718, 41102414, 26119317, 1800042, 25284788, 14323971, 37522893, 18095938, 7239032, -7631408, -10829867, -2819946, 9623115, 9959776, 6047898, -6056474, -18638710, -12569760, -13315113, 354433, 1352035, -8213549, -5728507, -20597115, -4623248, -3324441, 1435737, 6261738, -9051109, 2291178, -1883423, 7648436, 12562834, -6513911]
-1356f513911R205850k3519555K9538249r445428K3832406j7009078K108221j1018503
-1364b821749Q686620J1400293J3163489M972753o077725j5139015r773504n586516
-1372a175354R067210Q082688j331205j2770351k2169540j4622313J1283572O673075
-1380a6962218K9541286k1222759j637437k9771209Q934452J2326904J7070264l831079
-1388e551796j1350977l0249314Q984516m736121K4949864N442240r074444J3864325
-1396g721707k2663217K8342343j2248805J9763922K847450O010748o936441j2609225
-1404e214932l5197423j873227j2490767J3481570Q306729l6288715Q954758m2293184
-1412a02615191M0487027J8715527J7368958M1433314l3036414N3498747j9213064
$$ y = [-6513911, 2691939, -20827616, 8710633, -734795, 23097611, 6088533, 8196754, -2821749, 5864871, 17265164, 30428653, 35401406, 29323681, 14184666, 4411162, -1175354, 7891856, 15974544, 14643339, 1872988, -20296552, -34918865, -23635293, -16962218, 12579068, -8643691, -10281128, -40052337, -31117885, -18790981, -1720717, -5551796, -16902773, -47152087, -38167571, -42903692, -17953828, -12511588, -21586032, -7721707, -30384924, -2042581, -14291386, 5472536, 8319986, 14330734, 7394293, -5214932, -40412355, -42285582, -54776349, -41294779, -32988050, -69276765, -60322007, -102615191, -62128164, -43412637, -26043679, 15389635, -17646779, 35851968, 16638904]
-1419A6638904L4898541p912501r491819K023569L569501j1265232n71124o9118414
-1427d1228575q448754l3029701K6975189K3436342r881782q607789k9520867M344602
-1435g5961335M0395867L2746743L5413765J1521356j7286290K5353536j5156229L0832626
-1443F7860039J5223870j3216374M8336262o2018293L8162110o7443657R260691j194907
-1451C4969741j1117564K3152679n3148166j5965174l3055094n314177K0077592Q74406
-1459c9525757q475482o976976k1775965K9465950J2297119K4329047J4037185j1171367
-1467g796246J4731726L631323J4305161J9892628r384910K380083r012356j8426227
-1475A0321182K4871573k1823747L3108827j8150491j0647238N584640l1680518N0490992
$$ y = [16638904, 51537445, 43624944, 34133125, 36156694, 39726195, 28460963, 27889839, -41228575, -49677329, -82707030, -55731841, -32295499, -42177281, -50785070, -80305937, -75961335, -35565468, -2818725, 32595040, 44116396, 26830106, 52183642, 37027413, 67860039, 83083909, 69867535, 118203797, 56185504, 94347614, 26903957, 36164648, 34969741, 23852177, 47004856, -6143310, -22108484, -55163578, -60477755, -40400163, -39525757, -48001239, -54978215, -76754180, -47288230, -34991111, -10662064, 3375121, -7796246, 6935480, 10566803, 24871964, 44764592, 35379682, 37759765, 28747409, 10321182, 35192755, 13369008, 46477835, 28327344, 17680106, 23264746, -8415772, 42075220]
-1483D2075220k2390782L2596928l4852576j3184247j3217070M280728J3137019P051257
-1491A5496477j8514306j1324816j5755972Q992542J8338911J3929158J1535107M114791
-1499B6811892q280315J0237258j4642474K3125906n53330K2669166q478721j1302434
-1507C9586948l3177428R95133o026140M7053170r818302J6968128m6845235L062564
-1515A1798838j2289807L3941727N82300R224288l3766479r990813k5022259O09798
-1523b4912407r376952k347952p732596L600946j2753724J1452095j9252356K7039436
-1531c4283510l832086L4116109l900160J5313022j3027706J7017269j2981048J8030174
-1539A6452064k2744256R780417q927335R370267j066984n312503j1493816J2876141
$$ y = [42075220, 19684438, 52281366, 17428790, 4244543, -8972527, -4691799, 8445220, 15496477, -3017829, -14342645, -30098617, -21106075, -2767164, 11161994, 22697101, 26811892, 18531577, 28768835, 14126361, 37252267, 36698937, 59368103, 50889382, 39586948, 6409520, 7404653, 1378513, 48431683, 38613381, 55581509, 8736274, 11798838, -490969, 33450758, 34033058, 43257346, 9490867, -499946, -25522205, -24912407, -34289359, -36637311, -44369907, -40768961, -53522685, -42070590, -61322946, -34283510, -38115596, -3999487, -7899647, 7413375, -5614331, 11402938, -1578110, 16452064, -6292192, 3488225, -5439110, 3931157, 2864173, -2448330, -13942146, -1066005]
-1547a066005j985152L4776920j4516035R491790j0497749n91845J9053698j7829610
-1555A6836012J386386k1052351n080479J9635086j6109913Q964995l6856069N083810
-1563b7192523R388417K2564448J0491183q903697j8152377J2375827R536479K3562059
-1571C3669816q443358k3502485j865314L247760K7409009N843437k9961239q894263
-1579b496637k0022823L7489107K2620634m279683l902720m2324542J9836097Q580398
-1587A5499831R543670J2254179m2149507K6026225j7737132K5995911j4193189k3012490
-1595g772502Q88614L562973K7811836N995750l0688120k2381469k3603776J9183329
-1603b7003365K2480216R41371j3906974k6412033q107714K2159156R434705J6746249
$$ y = [-1066005, -3051157, 31725763, 17209728, 26701518, 16203769, 15611924, 34665622, 16836012, 18222398, -2829953, -7910432, 11724654, -4385259, 4579736, -32276333, -27192523, -17804106, 4760342, 15251525, 6347828, -11804549, 571278, 10107757, 33669816, 25226458, 1723973, -141341, 3106419, 30515428, 36358865, 6397626, -2496637, -22519460, 14969647, 37590281, 33310598, 29407878, -12916664, 6919433, 15499831, 25043501, 37297680, -4851827, 21174398, 3437266, 29433177, 15239988, -7772502, -6883888, -3320915, 24490921, 30486671, -201449, -22582918, -46186694, -27003365, -4523149, -3581778, -17488752, -43900785, -52008499, -29849343, -20414638, -3668389]
-1611c668389o987066k651947K1077537K201698J9134068j3490467j4706320J0161251
-1619A1070365j5589981K9994520k5483698l970107j8517761k1938713J7157389j6179171
-1627d3457157K6562116l782096R290463M532556r620242O983693N272267J6343586
-1635A2125186K6706119k522945M008400k9102023p351714o895036J1181395R991169
-1643A8140551k35920j5620324k2681113j8143496m974116J7743001J1091899J6367907
-1651A688389j5961608j3824798r781082J108490L6001940P155245K2939728k1912733
-1659G413571o039993m1664P329675L0984069r38985O703139j4271550r097214O875050
-1668B8916098k380519R358949l902764j6961029K627579k7967038J6004104k1200779
$$ y = [-3668389, -10655455, -13307402, 7770135, 9971833, 29105901, 15615434, 909114, 11070365, -4519616, 25474904, -8794, -3978901, -22496662, -44435375, -27277986, -43457157, -16895041, -20677137, -11386674, -6854118, -16474360, -9490667, -4218400, 12125186, 38831305, 36308360, 40316760, 11214737, 3863023, -3032013, 8149382, 18140551, 17904631, 2284307, -20396806, -38540302, -43514418, -25771417, -14679518, 1688389, -14273219, -28098017, -37879099, -36770609, -768669, 6386576, 29326304, 7413571, 1373578, 1331914, 8661589, 39645658, 38706673, 45409812, 31138262, 22041048, 28916098, 26535579, 35894528, 31991764, 15030735, 17658314, -10308724, 5695380, -15505399]
-1676a5505399P443568j4669422r223332n86082k424436Q569305K886400m289445L78520
-1685b7420323K616819J1951327K1169441M493346M415475p279026r236034J3705927
-1693A4416952o465765K0206197j1511705k665708j1349113j8733308j727217j035617
-1701a8865284R916422K2716036j0928531j853929k9067536p523452K5856111J0682736
-1709I32573L7751353l2963150j4536307l0270424L974321K6957831J2314227J112505
-1717E272929j7016662j7664024R039311P596344J1086736K904840q540133J1067440
-1725C746781J792115K834205o300120j9590426N356103M249471J5376400M283793
-1733A1748322j2886714m792218K464707Q811978K1879541p902457Q945092o515244
$$ y = [-15505399, -8061831, -22731253, -31954585, -32540667, -34965103, -26395798, -23509398, -27798843, -27420323, -24803504, -12852177, 8317264, 12810610, 17226085, 9947059, 711025, 14416952, 7951187, 28157384, 16645679, 13979971, 2630858, -16102450, -17829667, -18865284, -8948862, 13767174, 2838643, 984714, -28082822, -35606274, -9750163, 932573, 38683926, 5720776, -8815531, -39085955, -35111634, -8153803, 4160424, 5272929, -11743733, -29407757, -20368446, -12772102, -1685366, 1219474, -7320659, 3746781, 5538896, 8373101, 2072981, -17517445, -12161342, -7911871, 7464529, 11748322, -1138392, -5930610, -3465903, 5346075, 27225616, 19323159, 28268251, 21753007]
-1741B1753007K453577Q174225k4961793R85679k9238517J2138192o314854j49919
-1749a5160403j9295189j5410072j0563245J7013750P035815J8106586r313279L189816
-1757b4396221J627705J6137976J0726327Q991582q454105K870948n456323J2876265
-1765A4924154L730649O503333k950093K55591q548907J3915315l165997K9483851m797299
-1774D9350597Q935402k0408710j3442080k279576L615723J7325114k961998j2480274
-1782B7654198k1936787j4686643K822481J1773560J1881956N328655n361297m025024
-1790A3451099r402020p20397o719387Q501754j97532P361242j2039578j7003222j7270159
-1799c4038200q545398J2453027J4796118P978860L924434j7522592J0787249q067676
$$ y = [21753007, 24206584, 32380809, 7419016, 8404695, -20833822, -8695630, -15010484, -15160403, -34455592, -49865664, -60428909, -43415159, -36379344, -18272758, -27586037, -24396221, -22768516, -6630540, 4095787, 13087369, 4633264, 7504212, 2047889, 14924154, 18654803, 25158136, 22208043, 22463634, 13914727, 27830042, 24664045, 54147896, 49350597, 58285999, 37877289, 24435209, 22155633, 25771356, 43096470, 40134472, 27654198, 5717411, -8969232, -6146751, 5626809, 17508765, 22837420, 17476123, 13451099, 4049079, 3328682, -3390705, 5111049, 4913517, 12274759, 235181, -16768041, -34038200, -42583598, -30130571, -15334453, -7355593, -3431159, -20953751, -10166502, -18234178]
-1807a8234178K7609481k206535J8866094j945585P050090m09982j0122353j442164
-1815A9164868q918219J7092167N773607N299711j1823935k8435813o198862j2625981
-1823b0672457J7491538m018674j2228959j7541733k9465895L967745o535429J2306482
-1831e6697382j537134l549413N505632M429309J5756249J1754838N986181J1240288
-1839g111432J524647J5009750m309194J1759989k0226658J2041716k7902861J1938245
-1847g275798k0471528J401638L254595j4193665J6538921k5644768J1467775o25056
-1855c5547886R588513L1461026j1103401J7575413k2614387J0946443J2373637J8566079
-1863C1245437J6204797n084610j4468977o272668j868156J4515810J0746363o857535
$$ y = [-18234178, 9375303, 7168768, 26034862, 24089277, 31139367, 30729385, 20607032, 19164868, 10246649, 27338816, 33112423, 38412134, 26588199, -1847614, -8046476, -20672457, -3180919, -7199593, -19428552, -36970285, -66436180, -62468435, -69003864, -56697382, -58234516, -61783929, -56278297, -51848988, -36092739, -24337901, -18351720, -7111432, -5586785, 9422965, 5113771, 16873760, -3352898, 8688818, -19214043, -7275798, -27747326, -26345688, -23091093, -37284758, -20745837, -46390605, -34922830, -35547886, -25959373, 5501653, -5601748, 11973665, -10640722, 305721, 12679358, 31245437, 47450234, 42365624, 27896647, 21623979, 19755823, 34271633, 45017996, 38160461]
-1871C8160461q509954k4332243j1869154j153298k833812R851571m382839j6039539
-1879b1108807P65811l3227352K8696595j0387621L4773924N061270r621703P952148
-1887B904265k2683042L1501399P585512K2247644P604799j2611895N687021n471044
-1895C6764659J6517185J232019O579989j4126273N432900k0094685N410538k5447092
-1903A2269240j2725772j5341587j9360746R27114k0384715o231300j2508760r900725
-1911h3257251P800826n57367J3338741J3078807P706718K2119295k343097J1398544
-1919a0714784l956449N200902J2035508J85995N622477j9332547o630310j4007329
-1927c1596537Q749877J307630J2067211l301718M483210K304620N882952J1651853
$$ y = [38160461, 29650507, 5318264, -6550890, -7704188, -10538000, -686429, -5069268, -21108807, -20342996, -53570348, -24873753, -35261374, -487450, 4573820, -5047883, 2904265, -19778777, 11722622, 19308134, 41555778, 49160577, 36548682, 42235703, 36764659, 53281844, 54513863, 61093852, 46967579, 52400479, 32305794, 37716332, 12269240, -456532, -15798119, -35158865, -34231751, -54616466, -60847766, -73356526, -83257251, -75456425, -76013792, -62675051, -49596244, -41889526, -19770231, -22113328, -10714784, -14671233, -9470331, 2565177, 2751172, 8373649, -10958898, -17589208, -31596537, -22846660, -21539030, -9471819, -12773537, -8290327, -5985707, -102755, 11549098]
-1935A1549098j703619R282299n665500J0391925j246796n73037n453896j9892761K926727
-1944c85560j6088172K4789344j0735553J4416994k3821818q513969j2095239J536339
-1952c0897634J0496169M706280p475661q775815k0854893N478840k334704K1050523
-1960b8606895N449270J9320901J793090J7351843o057596J5844580K60037J9623617
-1968D4978847J0908865m147971j2948666k6118652j8041205R388105j2496511J6643652
-1976H166464l8056133k71914q484191J3561828K7794565j2642455O335011j7261001
-1984b0857826J5658559J9986261L80700n668031l4025173p500774m65752J7115279
-1992a5376757l033489n683593j5485696Q214806K3708903P603883K3940931k3484225
$$ y = [11549098, 9845479, 19127778, 13462278, 23854203, 22607407, 22034370, 16580474, -3312287, -385560, -16473732, 8315612, -2419941, 11997053, -11824765, -20338734, -32433973, -30897634, -20401465, -15695185, -23170846, -31946661, -52801554, -47322714, -49657418, -28606895, -23157625, -3836724, -2043634, 15308209, 9250613, 25095193, 25355230, 44978847, 55887712, 51739741, 38791075, 12672423, -5368782, 4019323, -8477188, 8166464, -29889669, -30161583, -38645774, -25083946, 2710619, -9931836, -3596825, -20857826, -5199267, 14786994, 15167694, 9499663, -24525510, -32026284, -32492036, -15376757, -18410246, -24093839, -39579535, -31364729, -7655826, -51943, 23888988, 404763]
-2000D04763L1325626k06299K5565235m333100k9480887l522450j3077066K1649346
-2008B8325168K130385k5113109j2573029k5811796K7303609J4019149J2027243q145022
-2016A2162598j4084043Q873151K0459372J5087626j205313j9905824r802070M709748
-2024A6295245J5353363k515671l034203l0303367J4023191n163891K0032298n090719
-2032A9596246k1985337P847454j7944364L1299855j6299417l531709j8811821j1709450
-2040c1538543J5716746O999085J3598745j500384m149214M069674Q353357J4179349
-2048B5728815J4194072J0398287J245135K222454j8262398k789406j4198105N490101
-2056B4028955M323357N77276o300716r838237k1200131J2762985j0579697L9322624
$$ y = [404763, 31730389, 31524090, 57089325, 52756225, 23275338, 19752888, 6675822, 28325168, 30455553, 5342444, -7230585, -33042381, -5738772, 8280377, 20307620, 12162598, -1921445, 6951706, 27411078, 42498704, 41293391, 21387567, 11585497, 16295245, 31648608, 29132937, 26098734, -4204633, 9818558, 4654667, 24686965, 19596246, -2389091, 5458363, -12486001, 18813854, 2514437, -1017272, -19829093, -31538543, -15821797, -8822712, 4776033, 3275649, -873565, 3196109, 11549466, 25728815, 39922887, 50321174, 51566309, 53788763, 35526365, 32736959, 18538854, 24028955, 28352312, 28929588, 22628872, 12790635, -8409496, 4353489, -6226208, 33096416]
-2064C3096416k602786J6298335j7256910k3858411o360973m956423K5570997J0006646
-2072B9936891r750443k3716318l4852138L613373J4078778L6655253L256277J773309
-2080B0994982k8676885J0326856q63167K6608468J08586m017732j0716850j3199075
-2088E65183j1679207p726736j6485835J4929717m038825J6344913j9797812j5830595
-2096d3719197n082437J6564602M1514277J8450499r101372l0408168k3761659J9124192
-2104a6419263K8995800L2739724j7956962k4036750l9350658J1107995J5959863L3616652
-2112B4656401R375476j2240908o101617k1190893J3382379J866034K4731106J6347397
-2120E0825375K976418q510327l0908654j0899055N757719L3239731K8624453k533241
$$ y = [33096416, 30493630, 46791965, 29535055, 5676644, -684329, -5640752, 19930245, 29936891, 20186448, -3529870, -38382008, -34768635, -20689857, 15965396, 19221673, 20994982, -7681903, 2644953, 1781786, 28390254, 28498840, 24481108, 13764258, 565183, -11114024, -18840760, -35326595, -20396878, -24435703, -8090790, -27888602, -43719197, -48801634, -32237032, 9277245, 27727744, 18626372, -11781796, -35543455, -16419263, 12576537, 45316261, 27359299, 3322549, -36028109, -24920114, -8960251, 24656401, 34031877, 21790969, 15689352, -5501541, 7880838, 9746872, 34477978, 50825375, 53801793, 45291466, 14382812, 3483757, 9241476, 42481207, 71105660, 68572419]
-2128F8572419k4825325m1709253J253410J1227312M7918775K758386p118418l9809901
-2136A8267405k6397624N849393J4132021L2876077K517117j4647679k0430415l4125020
-2144b1958725J3980461k929105L7781941j0588706p574867m1602204k6246790p331551
-2152f6469546R407787K5027468l029052m314874k8314291r617009O906495J2689104
-2160e7713918L9975734J819248K3107056k2868987m791159o039995M05879L3980821
-2168G874679k17554J8843935k9410655j3608820j1531622K319310K8389380L045369
-2176E704022J9277363j5194770N383582o429067j860105J1245205r739740L2774855
-2184D1161345j3671778K2924333l3635290j1697952j3260255p15965L6376710k280855
$$ y = [68572419, 43747094, 2037841, 3291251, 14518563, 62437338, 65195724, 58077306, 18267405, -8130219, -2280826, 11851195, 44727272, 47244389, 32596710, 12166295, -21958725, -7978264, -10907369, 26874572, 16285866, 8710999, -32891205, -59137995, -66469546, -57061759, -32034291, -35063343, -39378217, -67692508, -77309517, -70403022, -57713918, -17738184, -15918936, 7188120, -15680867, -20472026, -26512021, -26106142, 7874679, 7657125, 26501060, -2909595, -16518415, -28050037, -25730727, 2658653, 5704022, 24981385, 9786615, 15170197, 8741130, 6881025, 18126230, 8386490, 41161345, 27489567, 50413900, 16778610, 5080658, -8179597, -8895562, 27481148, 25200293]
-2192B5200293J4652345l5004874j5161374j0044865L166224K3503004k706561O961145
-2200A0565337k2104612p518451j3155341l993423J1577667L215407K8743466p183130
-2208A46920R385029k3832966n973975O933006R396268K9658272r213708j2871961
-2216C626885k7692228l1736497J5252353j6110239L4558210l1690324Q054017l2780152
-2224g8517975R835294k34955K0603051J3286758J1668732J1742110Q23533R367305K16338
-2233a209809R337431J7191153J853099J7966803k7763266M685073k5498172J8420229
-2241A4982541J267388J1028168j5403910j1615477j8408974J3764184O394874J9839364
-2249B1848158p262179j0715041j1299758k552672J1185318Q565197K734641r521253
$$ y = [25200293, 39852638, 4847764, -10313610, -20358475, -17192251, 6310753, 3604192, 10565337, -11539275, -19057726, -32213067, -36206490, -24628823, -21413416, 7330050, 146920, 9531949, -14301017, -20274992, -13341986, -3945718, 25712554, 16498846, 3626885, -24065343, -55801840, -40549487, -56659726, -22101516, -53791840, -45737823, -78517975, -68682681, -68917636, -48314585, -35027827, -23359095, -11616985, -10793452, -1426147, -1209809, 8127622, 25318775, 27171874, 45138677, 17375411, 22060484, -3437688, 14982541, 16249929, 27278097, 11874187, 258710, -18150264, -4386080, 2008794, 21848158, 14585979, 3870938, -7428820, -9981492, 1203826, 9769023, 12503664, 2982411]
-2257B982411j0266800j6302931M783338n703761J6027830r28992J054868j969404p859479
-2266a8182920J3201613J0218524K1189187J1932180M180769J123622N972344L925325
-2274E3560644J0047647K29609j2252766N065529l0091066J7442392l6689272Q361867
-2282A5674584k3675987n464477k754932j4987214K93206k583006K196163J4066961
-2290a7234702p024039j464663k469368K610057K3688182Q367684o512230n987459
-2298f026538k9507825K2187062J883518J7819422j852697k7329745K806363k480402
-2306b2500842J4697149K3747095k2430939J9889807j9219034K1084276J1630734j0759474
-2314A6138772J1765298j8064043J0740451O303240j4324083J91699k1518645l662447
$$ y = [2982411, -7284389, -23587320, -18803982, -24507743, -8479913, -9408905, -8354037, -10323441, -18182920, -4981307, 5237217, 26426404, 38358584, 42539353, 43662975, 49635319, 53560644, 63608291, 63837900, 51585134, 56650663, 26559597, 44001989, 7312717, 15674584, -8001403, -13465880, -16220812, -31208026, -30914820, -33497826, -31301663, -17234702, -24258741, -25723404, -28192772, -25582715, -1894533, 6473151, -39079, -6026538, -35534363, -13347301, -11463783, 6355639, 4502942, -22826803, -20020440, -22500842, -7803693, 15943402, -6487537, 13402270, -5816764, 15267512, 26898246, 16138772, 27904070, 9840027, 20580478, 26883718, 12559635, 12751334, -8767311, -12429758]
-2322a2429758J0040917j6718217O474835k0733943m566353K0545340r641042K9282648
-2330B254427j6014819Q013726J4756029R7243L0986822m723398Q998697O977810j0751789
-2339D0594748R162086j3318864l235479P773428j1860506M674968j9112611j7118914
-2347b441144M894768q007998J5921320J204868j6503899J7043519k6333167K6421276
-2355A2199543j6802840N28833R819262j0920075K7168005k3324098j763356j6301051
-2363a9395777J799412K5216139P735180R134693k4157528k376147p775592K9317150
-2371A9497530p96320P265602j8081570j0407154J0840851p481971J2871285j9271968
$$ y = [-12429758, -2388841, -19107058, -12632223, -33366166, -37932519, -17387179, -27028221, 2254427, -13760392, -5746666, 9009363, 9106606, 40093428, 35370030, 44368727, 51346537, 40594748, 49756834, 36437970, 33202491, 40975919, 29115413, 33790381, 14677770, -2441144, 2453624, -5554374, 10366946, 11571814, -4932085, 12111434, -14221733, 12199543, -4603297, -4074464, 5744798, -5175277, 21992728, -1331370, -3094726, -19395777, -17596365, 7619774, 15354954, 24489647, 332119, -2044028, -9819620, 19497530, 18701210, 25966812, 7885242, -2521912, 8318939, 836968, 13708253, -5563715]
$$ [...]
-2730B385043  $$ checkpoint
##END NTUPLES=
##END=
