##TITLE= S#390978
##JCAMP-DX= 5.00 $$ JEOL NMR v1.10
##DATA TYPE= NMR SPECTRUM
##DATA CLASS= NTUPLES
##NUM DIM= 1
##ORIGIN= DELTA_NMR
##OWNER= NMR
##SPECTROMETER/DATA SYSTEM= DELTA_NMR
##.OBSERVE FREQUENCY= 3.00529655924288E+02
##.OBSERVE NUCLEUS= ^1H
##.DELAY= (2.195E+02,2.195E+02)
##.ACQUISITION MODE= SIMULTANEOUS
##.FIELD= 7.0586013
##.FILTER WIDTH= 1.81675738660864
##.ACQUISITION TIME= 3.6339712
##.SPINNING RATE= 16
##.OBSERVE 90= 9.2
$$ ------------------------
$$ JEOL SPECIFIC PARAMETERS
##$FILENAME= C:\NMR/vanceolsenspenceroxidationP-3.jdf
##$TITLE= S#390978
##$AUTHOR= NMR
##$CREATION=  1-FEB-2018 10:45:41
##$REVISION=  1-FEB-2018 10:52:53
##$CONTENT= PROTON NMR EXPERIMENT
##$INSTRUMENT= DELTA_NMR
##$SITE= Center College ECP+ 300
##$NODENAME= nmr2
##$DIMENSIONS= 1
##$STORAGE= FLOAT
##$X_FORMAT= COMPLEX
##$X_CURR_POINTS= 16384
##$X_START= 12.50103 $$ppm
##$X_STOP= -2.50012 $$ppm
##$X_TITLE= 1H                             
##$X_ZERO_POINT= 0.33329
##$X_FREQ_FLIP= FALSE
##$X_POINTS= 16384
##$X_PRESCANS= 0
##$X_DOMAIN= 1H
##$X_OFFSET= 5 $$ppm
##$X_FREQ= 300.52966 $$MHz
##$X_SWEEP= 4.50857 $$kHz
##$X_RESOLUTION= 0.27518 $$Hz
##$SOLVENT= CHLOROFORM-D
##$TEMP_GET= 20.4 $$dC
##$ACQ_DELAY= 0.2195 $$ms
##$DIGITAL_FILTER= FALSE
##$FILTER_FACTOR= 1
##$FILTER_WIDTH= 2.254 $$kHz
##$FILTER_MODE= BUTTERWORTH
##$TRANSITION_RATIO= 0.9
##$ORDERS
##$FACTORS
##$LOCK_STRENGTH= 247
##$LOCK_LEVEL= 200
##$LOCK_GAIN= 26
##$LOCK_OSC_OFFSET= 25.6519 $$kHz
##$LOCK_PHASE= 187 $$deg
##$LOCK_OSC_STATE= 2H OSC ON
##$X_ANGLE= 45 $$deg
##$X90= 9.2 $$us
##$X90_HI= 10 $$us
##$X90_LO= 50 $$us
##$X_90_WIDTH= 9.2 $$us
##$X_PULSE= 4.6 $$us
##$RELAXATION_DELAY= 4 $$s
##$SCANS= 8
##$PROBE_ID= 1412
##$ITERATIONS= 1
##$FIELD_STRENGTH= 7.0586 $$T
##$TEMP_SET= 25 $$dC
##$SPIN_SET= 15 $$Hz
##$SPIN_GET= 16 $$Hz
##$HE_LEVEL= 75 $$%
##$N2_LEVEL= 83 $$%
##$CHANGER_SAMPLE= 0
##$ADC_CARD= 16/1MHz/20
##$EXPERIMENT= single_pulse.exp
##$OBS_NOISE= WAUGH
##$IRR_NOISE= WALTZ
##$TRI_NOISE= WALTZ
##$QUA_NOISE= WAUGH
##$OBS_PWIDTH= 1 $$us
##$IRR_PWIDTH= 50 $$us
##$TRI_PWIDTH= 1 $$us
##$QUA_PWIDTH= 1 $$us
##$RECVR_GAIN= 4
##$IRR90= 9.2 $$us
##$TRI90= 10 $$us
##$QUA90= 10 $$us
##$IRR90_HI= 10 $$us
##$QUA90_HI= 10 $$us
##$IRR90_LO= 50 $$us
##$TRI90_LO= 10 $$us
##$QUA90_LO= 10 $$us
##$MOD_RETURN= 1
##$TOTAL_SCANS= 8
##$X_ACQ_DURATION= 3.63397 $$s
##$DELAY_OF_START= 1 $$s
##$ACTUAL_START_TIME= 886329874.0
##$CLIPPED= FALSE
##$DC_BALANCED= FALSE
##$TRI90_HI= 10 $$us
##$SPIN_LOCK_90= 100 $$us
##$SPIN_LOCK_ATTN= 24.4 $$dB
##$DEUT_GRAD_SHIM_90= 213 $$us
##$DEUT_GRAD_SHIM_ATTN= 9 $$dB
##$IRR_CODE= 146
##$LOCK_STATE= LOCK ON
##$AUTOLOCK_LEVEL= 200
##$SAWTOOTH_RANGE= 4
##$LOCK_STATUS= IDLE
##$LOCK_SETTLE_POINT= 4096
##$LOCK_ACHIEVE_POINT= 0
##$SPIN_ACTION= SPIN ON
##$SPIN_STATE= SPIN ON
##$SPIN_STATUS= SPIN ON
##$SPIN_GAS_SOURCE= AIR
##$TEMP_ACTION= TEMP OFF
##$TEMP_STATE= TEMP OFF
##$TEMP_STATUS= TEMP OFF
##$TEMP_COMP= 0
##$TEMP_DELAY= 0 $$s
##$TEMP_LIMIT_HI= 150 $$dC
##$TEMP_LIMIT_LO= -100 $$dC
$$ [...]
##$VT_PID_STD_WB_H_TD= 5
##$VT_PID_STD_WB_H_CBL= 10
##$VT_PID_STD_WB_H_CBH= 0
##$VT_PID_STD_WB_H_HC= 2.4
##$VT_PID_STD_WB_H_HL= 70
##$VT_PID_STD_WB_M_PB= 1.5
##$VT_PID_STD_WB_M_TI= 30
##$VT_PID_STD_WB_M_TD= 5
##$VT_PID_STD_WB_M_CBL= 9.9
##$VT_PID_STD_WB_M_CBH= 2.3
##$VT_PID_STD_WB_M_HC= 2.5
##$VT_PID_STD_WB_M_HL= 70
##$VT_PID_STD_WB_L_PB= 1.3
##$VT_PID_STD_WB_L_TI= 29
##$VT_PID_STD_WB_L_TD= 5
##$VT_PID_STD_WB_L_CBL= 20
##$VT_PID_STD_WB_L_CBH= 20
##$VT_PID_STD_WB_L_HC= 0.6
##$VT_PID_STD_WB_L_HL= 100
##$VT_PID_LONG_0_H_PB= 1.5
##$VT_PID_LONG_0_H_TI= 30
##$VT_PID_LONG_0_H_TD= 5
##$VT_PID_LONG_0_H_CBL= 9.9
##$VT_PID_LONG_0_H_CBH= 2.3
##$VT_PID_LONG_0_H_HC= 2.5
##$VT_PID_LONG_0_H_HL= 70
##$VT_PID_LONG_0_M_PB= 1.5
##$VT_PID_LONG_0_M_TI= 30
##$VT_PID_LONG_0_M_TD= 5
##$VT_PID_LONG_0_M_CBL= 9.9
##$VT_PID_LONG_0_M_CBH= 2.3
##$VT_PID_LONG_0_M_HC= 2.5
##$VT_PID_LONG_0_M_HL= 70
##$VT_PID_LONG_40_H_PB= 1.5
##$VT_PID_LONG_40_H_TI= 30
##$VT_PID_LONG_40_H_TD= 5
##$VT_PID_LONG_40_H_CBL= 9.9
##$VT_PID_LONG_40_H_CBH= 2.3
##$VT_PID_LONG_40_H_HC= 2.5
##$VT_PID_LONG_40_H_HL= 70
##$VT_PID_LONG_40_M_PB= 1.5
##$VT_PID_LONG_40_M_TI= 30
##$VT_PID_LONG_40_M_TD= 5
##$VT_PID_LONG_40_M_CBL= 9.9
##$VT_PID_LONG_40_M_CBH= 2.3
##$VT_PID_LONG_40_M_HC= 2.5
##$VT_PID_LONG_40_M_HL= 70
##$SAMPLE_ACTION= LOADED
##$SAMPLE_STATE= LOAD
##$SAMPLE_STATUS= LOADED
##$AUTOSHIM_MODE= AUTOSHIM OFF
##$AUTOSHIM_DELAY= 3600 $$s
##$AUTOSHIM_TRACK= AUTOSHIM OFF
##$SHIM_MAX_RECALL= MAX FOUND
##$SHIM_NAMES= SHIM_Z0
##$SHIM_Z0= 9167
##$SHIM_Z1= 5096
##$SHIM_Z2= 22
##$SHIM_Z3= -2829
##$SHIM_Z4= -240
##$SHIM_Z5= 46
##$SHIM_Z6= -33
##$SHIM_X= -14
##$SHIM_XZ= 16
##$SHIM_XZ2= 0
##$SHIM_XZ3= 0
##$SHIM_X2= -7
##$SHIM_X2Z= -40
##$SHIM_X3= 0
##$SHIM_Y= 1608
##$SHIM_YZ= 13
##$SHIM_YZ2= 10
##$SHIM_YZ3= 0
##$SHIM_Y2= -11
##$SHIM_Y2Z= -20
##$SHIM_Y3= 0
##$NUM_SCANS= 1
##$END_TIME= 886329941
##$LOCAL_TIME= 886329939
##$PROBE_ATN= 0
##$PROBE_TUNE= 0
##$PROBE_MATCH= 2077
##$PROBE_COARSE= NONE
##$LF_TUNE_DIAL= 0
##$LF_MATCH_DIAL= 0
##$HF_TUNE_DIAL= 0
##$HF_MATCH_DIAL= 0
##$PASS_RIPPLE= 0.01 $$dB
##$STOP_RIPPLE= 60 $$dB
##$PROBE_RECOVERY= 0 $$us
##$AF_DELAY_RATIO= 0
##$VERSION= 4.3.3
##$X_ACQ_TIME= 3.63397 $$s
##$DEAD_TIME= 0 $$us
##$DELAY= 0 $$us
##$PHASE_PRESET= 3 $$us
##$UNBLANK_TIME= 2 $$us
##$INITIAL_WAIT= 1 $$s
##$NORMALIZED= TRUE
$$ END OF JEOL SPECIFIC PARAMETERS
$$ -------------------------------
##NTUPLES= NMR SPECTRUM
##VAR NAME= FREQUENCY,    SPECTRUM/REAL, SPECTRUM/IMAG, PAGE NUMBER
##SYMBOL=   X,            R,             I,             N
##VAR TYPE= INDEPENDENT,  DEPENDENT,     DEPENDENT,     PAGE
##VAR FORM= AFFN,         ASDF,          ASDF,          AFFN
##VAR DIM=  16384, 16384, 16384, 2
##UNITS= PPM,     ARBITRARY UNITS, ARBITRARY UNITS, 
##FIRST=  1.2501033903057E+01, 2.88627677430308, -2.43005873681654, 1
##LAST=  -2.50011824950436, 3.3855269534585, -1.8276684082036, 2
##FACTOR=  9.1565355261926E-04, 3.37202281863526E-04, 3.37202281863526E-04, 1
##PAGE= N=1
##DATA TABLE=(X++(R..R)), XYDATA
$$ [...]
7787 -63654047 -62126229 -62550146 -62967227 -62937835 -61575601 -61029376 -61013649 -61276017 -61640275 -60703556 -60756219
7776 -60756219 -61177545 -59483761 -60144892 -59630832 -59163325 -58648155 -57780584 -58268607 -58026652 -57345345
7766 -57345345 -56203174 -55852134 -56934656 -55885734 -54534234 -54962411 -53763670 -52011043 -52564840
7757 -52564840 -52231511 -51594104 -50383703 -49821508 -48521154 -48648534 -47434313 -46233027 -46283552 -46400221
7747 -46400221 -45439077 -45079423 -43241675 -42918765 -42698403 -41799117 -40377103 -39936330 -39887017 -39790301
7737 -39790301 -38039549 -38334684 -37171731 -37216930 -35755116 -35839419 -34529451 -34455174 -34781649 -32716803
7727 -32716803 -31631644 -30377282 -28052709 -29342207 -27956863 -26790799 -26047657 -26312980 -25046952
7718 -25046952 -23351167 -23412522 -22447128 -21701761 -20497733 -19578949 -19790791 -18305943 -17903507 -17240152
7708 -17240152 -17226752 -16531490 -14484829 -13720457 -14964634 -12495844 -11691798 -9905547 -9177928 -8796343
7698 -8796343 -7764713 -7844509 -6940693 -6565215 -6322441 -4411934 -4984393 -4127424 -4048323 -2732785
7688 -2732785 -1924128 -1303410 -581997 1073594 1580686 1491207 2600142 1978466 2774644 3491678
7678 3491678 3885882 4377785 4276410 6502797 6951506 6386099 7618141 6854431 8436315 7917047
7668 7917047 9390296 9652206 9311740 9513825 10646345 10255224 10769763 12385541 11828518 11137757
7658 11137757 10600226 11378173 11713630 10599021 11661663 11316670 11961639 12576923 11539435 11822902
7648 11822902 13248041 12186302 11839346 11265198 10917815 10977581 12851990 12268339 10697569 9702376
7638 9702376 10026519 9203839 8535625 8336216 8690431 7865844 7165258 6890757 5610467 5466234 5399479
7627 5399479 4472772 3414282 2964525 2394827 1931966 555453 -209521 -88120 -1370355 -1343249
7617 -1343249 -3176591 -3484837 -5128582 -6012366 -7095634 -7626791 -9164809 -8937502 -10035302 -11068667
7607 -11068667 -13081787 -14306302 -16188370 -17176495 -17920190 -19324506 -19759734 -20495871 -21252558 -22722764
7597 -22722764 -24144833 -25039059 -26597132 -28535331 -28631484 -29121665 -30082225 -31722872 -33667836 -34683653
7587 -34683653 -35526051 -36943165 -39194021 -38722379 -39824628 -41055686 -43456735 -44714220 -44424804
7578 -44424804 -45433148 -47915616 -48239420 -49157625 -50017766 -51250789 -51655645 -54803690 -54638635 -55789454
7568 -55789454 -56593800 -56937880 -57585513 -58964948 -59584394 -60374001 -61163205 -62393436 -61573617 -61617784
7558 -61617784 -63159546 -63703985 -64400354 -64487784 -64454322 -64277576 -67420343 -66607245 -67008015 -66722041
7548 -66722041 -65714299 -65313366 -66270435 -66968819 -66589426 -68366945 -67096769 -68309887 -67284647 -67525527
7538 -67525527 -70259091 -67044805 -67504574 -67814169 -68086351 -68335933 -65600631 -65178369 -66110659 -65055098
7528 -65055098 -64839489 -63445815 -64083888 -64199483 -63114043 -61773320 -59854084 -59439519 -59318785 -58490012
7518 -58490012 -58185798 -56537138 -54951414 -53738033 -53910479 -52195884 -53476087 -51684012 -50852125
7509 -50852125 -49331434 -47931518 -47038085 -45545648 -44886933 -43610113 -42387976 -41192792 -39165194
7500 -39165194 -38085357 -36520588 -35555478 -34991328 -33763816 -32518541 -30942101 -29423460 -27896800
7491 -27896800 -27460101 -26401931 -24076532 -23723450 -20993192 -19912178 -19570173 -18155009 -16391958
7482 -16391958 -14417887 -14050200 -12244282 -11355516 -10108837 -7936449 -6912934 -5831983 -5175464
7473 -5175464 -3326935 -1351372 -1586210 -827982 2252071 4138360 5198270 6312589 7263553
7464 7263553 8824784 9720237 10982539 12341963 13039381 14023424 14969012 16398014 17090383 18624185
7454 18624185 18785278 19933184 21914796 23248868 22993860 23983235 25623551 25852045 26313637 28285853
7444 28285853 29143777 29390313 30061324 31209774 32195450 33486892 32224255 33512137 35401187 35762503
7434 35762503 37360865 38351317 38382904 39622253 39568572 40313726 40728362 40349373 41895760 41905584 41947447
7423 41947447 41781465 43125711 43409527 43311787 45327869 45611959 46353031 46364042 47069072 47075375 47875216
7412 47875216 47772982 48400622 48217299 49318511 50029564 50266284 50383678 51549495 51441531 50832482
7402 50832482 51714453 51536428 52087819 52667117 52315121 54156974 54680589 54641777 54153325 55032162
7392 55032162 55229240 56736401 56104450 55684933 56425392 57183692 56315833 57069746 57530429 57220035
7382 57220035 57934042 58447605 57916779 58415904 59187597 59424881 61237514 61003909 60606956 59932551
7372 59932551 61017352 61605413 61290124 61593970 60652642 61556728 60276219 61614717 61964559 61591708
7362 61591708 61606528 61775726 62209134 62630574 61591471 62236221 62041482 62942151 62541920 62242418
7352 62242418 61364997 61340755 61116977 61766009 61147464 60905252 61037181 61501896 60929992 60510606
7342 60510606 59500040 60079443 58218704 57886163 58177188 59026050 57891503 56917358 57239280 57577647
7332 57577647 56879541 55512311 55127189 54293605 53371761 52903913 52350070 52080336 50609905 49851229
7322 49851229 48521948 49134257 48261257 46670832 46776560 44766312 44240630 43382964 42165820 40631790
7312 40631790 39831821 38516386 36553976 35954907 35138701 34503650 33077375 32013558 30568691 29746751
7302 29746751 27781842 26089534 24667683 22699205 22267615 21596261 19936692 18597405 17349845
7293 17349845 15680763 13281856 11235052 10904640 8976122 8278379 5907454 4989343 3878560
7284 3878560 2158265 781633 -597299 -1026541 -3514617 -4730631 -6729374 -8344215 -11129562
7275 -11129562 -11279658 -12522475 -14118288 -15291634 -16886272 -18438561 -19237235 -19836903 -21301014
7266 -21301014 -23097427 -24879510 -26037355 -27211103 -28654184 -30346714 -30497829 -33190197 -33265946
7257 -33265946 -33424863 -34901175 -35899220 -37296761 -38876680 -39629985 -40079382 -40509219 -40334713 -40760118
7247 -40760118 -41094852 -43238393 -43793821 -44605996 -44474488 -44997564 -46600153 -45704386 -46827094 -46693397
7237 -46693397 -48439381 -48778062 -48564520 -47530620 -48344902 -48548778 -48894142 -48953007 -48361013 -47831883
7227 -47831883 -48718285 -48712865 -49132936 -48985777 -48128798 -48024974 -47442004 -45952294 -45554273 -45901868
7217 -45901868 -44503848 -44683998 -44732220 -43766458 -43214599 -41571348 -40941128 -39797600 -39421517 -38740659
7207 -38740659 -38816561 -37197055 -36980035 -35599491 -35028602 -35183337 -33010726 -31526050 -31443793 -31004851
7197 -31004851 -29767041 -29285941 -28888964 -26348048 -25928146 -25640375 -23657743 -22599007 -21915416 -22803632
7187 -22803632 -20487100 -18318855 -16887358 -16270517 -15753050 -14454638 -13851415 -13260161 -12166013 -11980776
7177 -11980776 -11078612 -9502171 -8579885 -8597938 -7617908 -6371667 -4936474 -3898523 -3715886 -3124214
7167 -3124214 -3068513 -2595234 -1321912 -1267796 -663938 891982 1498291 1310227 1760562 4428639
7157 4428639 4807769 3513102 4970284 4414190 3899441 5070270 5072888 4633178 5608620 5879641
7147 5879641 5985191 7408873 7896020 7678101 7165595 6785769 7074082 7434620 7309522 6858246
7137 6858246 7294379 6577475 6718724 6072915 5586050 5690087 6461572 5945216 4982486 5802744 4984154
7126 4984154 5116319 5631601 6168091 5567420 4439499 3466107 2665870 3619936 3793818 3562837
7116 3562837 3239636 2958812 2773801 1160104 576599 561277 1516281 841561 1503396 1832659
7106 1832659 199296 -604643 -882611 -569324 -739000 -222826 -1081336 -999262 -1252527 -1344365 -972759
7095 -972759 -1508672 -1761629 -2600758 -1987355 -1292148 -2483693 -2208647 -399629 -1478312 -1641912
7085 -1641912 -948538 -1902074 -2436448 -2394267 -1067281 -1591092 -1010461 -43607 233492 152559 862509
7074 862509 1616678 1112844 1306780 2543603 2674081 3327424 5152764 4952274 5559711 6285683
7064 6285683 8046459 6611111 7670990 8724136 9093011 9571022 10436337 10138987 11862530 12761652
7054 12761652 12652203 14846818 15085019 14815022 15938571 17377417 18336348 18402563 19436044 20016407
7044 20016407 21191109 22720561 22244750 22123349 23620620 23492983 24491259 24923515 24861644 26426020
7034 26426020 27279253 26742424 28016474 28903165 29366869 30076200 30252630 30576183 31139061 30526442
7024 30526442 30900731 33244613 33222345 33100708 32856352 33089786 32857081 31692814 33561889 34194370
7014 34194370 34891695 33690217 34549766 33840453 34209389 33274081 32831550 32177549 32612947 31437323
7004 31437323 32330747 30700722 31085417 31007444 30535960 29062131 29329821 27922242 26779752 26474987
6994 26474987 25127687 23898220 24255461 23473773 21465486 20950889 19594618 18717600 17453643
6985 17453643 16234231 14873223 14807126 13682930 12441670 10514228 8373831 8759595 5912493
6976 5912493 5476721 4099879 2091971 2123328 1136758 -2113071 -3449239 -4077974 -5666174 -8693842
6966 -8693842 -8551374 -9884591 -13047573 -13386481 -15882018 -16594788 -17884947 -19237286 -21500925
6957 -21500925 -23065955 -23597555 -25031666 -25798243 -28564562 -29748085 -30064557 -31956737 -33721298
6948 -33721298 -34897912 -36648124 -36832942 -39883343 -41160501 -42477258 -43952968 -44376855 -45370198
6939 -45370198 -47567686 -48614815 -49205181 -49991456 -51049489 -52158702 -53251050 -55122308 -55559130
6930 -55559130 -55327821 -57741852 -57698496 -59310024 -58664214 -58407081 -60602971 -61663990 -60894973 -61800746
6920 -61800746 -62444856 -62831333 -62690404 -63679146 -63782680 -63251763 -64561662 -64791899 -65266627 -64499405 -64504117
6909 -64504117 -63508519 -64877971 -63361210 -64002230 -64510834 -64484563 -62173777 -62802383 -62729380 -63154489
6899 -63154489 -61990768 -62602795 -61371803 -61180990 -59406874 -58902207 -58897489 -60342703 -59501732 -57483181
6889 -57483181 -56652113 -56706890 -56122250 -55312912 -54203984 -53592609 -52794408 -52386906 -51840709 -51256467
6879 -51256467 -50351247 -49483049 -48548878 -48114385 -47749060 -47130045 -45861727 -44734288 -44122755 -43434747
6869 -43434747 -41895449 -43245523 -40734103 -40571559 -39472668 -39267299 -38313161 -38311647 -36484063 -35857661
6859 -35857661 -35397890 -35936672 -35298871 -34637556 -34409499 -33166409 -33475480 -32081882 -31393529 -30831251
6849 -30831251 -29976242 -30433296 -28920518 -30328564 -30290990 -29657543 -29447408 -28133155 -28352872 -28633670
6839 -28633670 -28191031 -26760870 -27507480 -27838731 -27924481 -27269515 -26109261 -26343582 -26847251 -25027423
6829 -25027423 -24884462 -25669488 -25770374 -25865257 -25781264 -25828546 -26440163 -26711607 -25662550 -25565633 -25603314
6818 -25603314 -24182248 -24030930 -25686134 -25004899 -25118272 -24398868 -25233829 -25347080 -25148333 -24270849
6808 -24270849 -24969525 -23685317 -25601911 -25164559 -23550971 -23641487 -23926103 -24603227 -24886589 -24665588
6798 -24665588 -23590757 -23249943 -22523665 -21853023 -22406171 -20897844 -21565956 -19804573 -20331136 -19272453
6788 -19272453 -19407443 -18445459 -17696816 -16860616 -17294429 -16412281 -16323822 -15636645 -13990858 -13435848
6778 -13435848 -12888390 -11244675 -10011657 -10219170 -8577097 -7624855 -6006815 -5865260 -4219008
6769 -4219008 -2797937 -1355603 -559867 958781 2437231 3496732 4092102 6362875 7526354
6760 7526354 9806569 10216536 10620688 12791913 14695626 15494450 17046119 19219611 20309954
6751 20309954 22257400 24115728 25044693 26826289 29092404 31546979 32730937 34409069 36156829
6742 36156829 37612700 39742235 41588489 42673713 45740317 46532913 47508082 48709374 51535755
6733 51535755 52126662 53813780 55506875 57142579 59787977 61625790 62360602 64088280 66314833
6724 66314833 66088211 66586341 68232163 70067203 70289342 72446323 73170985 75593263 75610083 76850633
6714 76850633 77072310 79086680 78746046 80622133 81178763 81046162 83069877 83398627 83461891 83990615
6704 83990615 83226985 85098746 85103392 84774412 83995583 83825222 84366778 84521651 83443595 84239192
6694 84239192 83038896 83403357 83029787 81828682 80810958 81316982 80220163 79894138 79304551 78171835
6684 78171835 76514357 75072623 74222817 73581724 72406987 71495942 70366204 68964761 66583934
6675 66583934 65526667 63055839 62754389 59834747 57142099 56747488 54915779 52935148 50392556
6666 50392556 48121868 46745296 43798864 41698449 39038744 37643772 35193411 32285415 31162538
6657 31162538 29797427 26956977 24467717 21656790 19733446 17680015 14909383 13065787 10941332
6648 10941332 8034538 6044892 3181616 597167 -2561565 -4547550 -7698180 -9059672 -11214897
6639 -11214897 -14197282 -16873911 -18733296 -21133365 -23571613 -26905119 -28804185 -32288400 -32870961
6630 -32870961 -34831807 -36546875 -39395924 -41198491 -42718888 -44748412 -47168809 -48938051 -51445454
6621 -51445454 -52624728 -54520446 -56075178 -57846880 -59861016 -61976362 -62425073 -64043573 -65552832
6612 -65552832 -66777563 -68732890 -68512687 -71296604 -71902561 -72544045 -73366143 -74719852 -76359285 -75371008
6602 -75371008 -77844803 -78791046 -79259689 -79489852 -80561866 -81290149 -82460003 -82260104 -82078793 -82139519
6592 -82139519 -84291019 -82614347 -84370909 -83895770 -84037769 -84411399 -84376840 -83589906 -83983221 -85031055
6582 -85031055 -84001051 -83842066 -83420582 -84155401 -83563119 -82814395 -83022472 -82033469 -81673264 -80565240
6572 -80565240 -80612096 -80557418 -79622281 -78345823 -79306107 -79341296 -77627566 -77281934 -76258156 -75700203
6562 -75700203 -75829744 -74486499 -74065407 -73697307 -72187771 -71501569 -70623419 -71699453 -70553593 -69751492
6552 -69751492 -68812658 -68550699 -68030645 -66856248 -66605601 -66197997 -66410542 -65378498 -64471585 -65142452
6542 -65142452 -63046962 -63542379 -63017600 -62227683 -62584527 -62339080 -61572026 -61689942 -60361033 -60073275
6532 -60073275 -59979549 -59821867 -58704705 -58933081 -58561511 -58871215 -58141897 -57690351 -57306534 -56990295 -57050668
6521 -57050668 -57827370 -57924895 -57868792 -58127271 -57778474 -57628493 -57889837 -57335668 -57361910 -57742869 -57004998
6510 -57004998 -56934800 -56371511 -57577972 -57647534 -56409110 -56431637 -56524566 -56782341 -56956442 -57060270 -56028234
6499 -56028234 -57723706 -57061678 -57329038 -56287445 -56832476 -57010268 -57041647 -55598686 -55097437 -55812204
6489 -55812204 -55262228 -55038937 -56429651 -55962997 -54677323 -54799574 -55056168 -55567226 -55513694 -54772781
6479 -54772781 -53757717 -52706467 -52607370 -51921988 -51269453 -50076001 -49672285 -49472606 -48445173 -47742514
6469 -47742514 -46540139 -45708481 -44947478 -45209007 -43652019 -42489769 -42580728 -41360969 -40977712 -40057307
6459 -40057307 -39022995 -37638019 -35807160 -34852493 -32197050 -32098477 -30645195 -29793311 -28385505
6450 -28385505 -27212858 -25838143 -23726614 -21864099 -20901808 -19382793 -17470611 -16328604 -14019846
6441 -14019846 -12991715 -11330547 -9835501 -7981881 -6312960 -4188128 -3468322 -1801355 737003
6432 737003 2231271 4243559 5223131 7433181 9713492 10690582 12562326 14248241 17017400 17053044
6422 17053044 19484894 20854944 22314465 23037416 24960376 25990055 29101626 31095473 31798657
6413 31798657 32538274 34042649 35015725 35720945 38027782 40333141 40467905 41166494 42764865 43921431
6403 43921431 44215954 45455014 46255897 47079770 47247371 49185551 50433087 51065229 50414042 50859913
6393 50859913 51404274 52360754 52279890 53952827 54022785 52751671 53001315 53019248 53139584 53466365 52993022
6382 52993022 52448162 52633549 52701388 51097194 51612930 50959256 48562277 49150838 48538422 47903509
6372 47903509 47569180 46370931 44531689 43301876 42655003 41932943 40608524 39450912 37516116
6363 37516116 36969063 35993262 35135225 32992578 31401964 29444148 27952395 27089312 24736322
6354 24736322 22996616 21213250 18791069 18213539 15769092 14468774 12826780 9916727 8631820
6345 8631820 6859441 5322575 3754713 2277140 1266340 -2148833 -3930627 -6604919 -8968454
6336 -8968454 -10000936 -11432088 -13940516 -14900249 -17085663 -18733003 -22139904 -23979897 -24690896
6327 -24690896 -26303954 -28081024 -29774257 -30720607 -33115959 -34139502 -34273758 -37442421 -38314179
6318 -38314179 -39943941 -41686868 -42048485 -42872370 -45449569 -47947421 -47511101 -47920616 -49978440 -50740700
6308 -50740700 -51407117 -52648852 -53556931 -54356755 -53852030 -55986084 -54943182 -55532553 -55637758 -57404394
6298 -57404394 -56999651 -57309817 -57556753 -57412697 -58127559 -57343612 -57145977 -57267640 -57912518 -58184809
6288 -58184809 -57709536 -57074745 -56110929 -55992052 -55450779 -55195831 -54555387 -53784868 -53546308 -52059858
6278 -52059858 -52128189 -51344351 -51074031 -49837387 -49264131 -48241031 -48268846 -47161454 -45525405 -43993653
6268 -43993653 -44134104 -42750465 -41626518 -39999097 -39024116 -38556296 -36932013 -35604291 -35188174
6259 -35188174 -33948475 -32995760 -31309748 -30949135 -29647003 -27430566 -26912516 -25841843 -25648243 -25435030
6249 -25435030 -24326392 -23051807 -22132376 -20490183 -19835566 -18398556 -17138994 -16869496 -16298300 -16093555
6239 -16093555 -15396893 -14136127 -11532749 -11464314 -12472939 -11328532 -10200809 -10064420 -10079393 -9500589
6229 -9500589 -9507228 -9379716 -9132493 -8814772 -8912268 -8298487 -9734213 -8545110 -8132929 -8418561 -9195229
6218 -9195229 -9390910 -7464175 -8772288 -9490355 -10107053 -9799673 -10304450 -11829428 -10931079 -12426806
6208 -12426806 -13098933 -13766262 -14011171 -14141090 -16715254 -17426546 -17230293 -18757250 -19086095 -19152823
6198 -19152823 -21868622 -22622495 -23530709 -24980202 -25172268 -26034686 -27765155 -28771292 -29345334 -30510173
6188 -30510173 -32066754 -33388993 -34575759 -35532846 -37460952 -39104367 -40171906 -41776639 -42040562
6179 -42040562 -43041976 -44553470 -44877846 -47705131 -48240277 -48704907 -50509237 -52098313 -53566532
6170 -53566532 -53825602 -54674904 -56695074 -57839695 -59546135 -58719904 -59303789 -61806414 -61341794 -62985263
6160 -62985263 -63984553 -65055142 -65593475 -66264544 -66561079 -68341263 -68092301 -68947184 -70593233 -70923734
6150 -70923734 -70841519 -71084761 -70876768 -72201273 -72822089 -72438438 -71898727 -73349067 -73970217 -74739826
6140 -74739826 -75800634 -75245666 -75616415 -75237274 -74493240 -76117108 -75061766 -73863683 -73943331 -74257185
6130 -74257185 -73373028 -73617073 -73829629 -73335995 -73907650 -73084184 -73036350 -72862463 -72471038 -71642691
6120 -71642691 -70157404 -70030812 -68360164 -70067756 -71109871 -67775828 -66198548 -66638032 -67595461
6111 -67595461 -67352561 -65077321 -63427147 -62354895 -62900017 -62477123 -61865430 -61501960 -60569903 -60343502
6101 -60343502 -60406996 -59611622 -58841892 -57281927 -57445531 -57370271 -56084756 -55505442 -54643296 -55330126 -55249804
6090 -55249804 -55089453 -55068050 -53997738 -54204624 -53708999 -54443660 -53201059 -52004774 -51867261 -52624160
6080 -52624160 -53154160 -52395293 -52598246 -51250993 -52400178 -52705537 -52217566 -52851422 -53413200 -52849159
6070 -52849159 -53767235 -54538058 -54994670 -55390219 -55788153 -56979084 -57599946 -57646124 -58587437 -58893085
6060 -58893085 -59414598 -58931353 -60762087 -61473724 -62655943 -63610697 -64139514 -65241603 -67180325 -66942235
6050 -66942235 -67431072 -68504667 -68929255 -70570275 -72030939 -72829351 -74361672 -74162394 -75172464
6041 -75172464 -77001864 -77698615 -78468640 -80008696 -80903905 -82194602 -82578393 -84233076 -84908113 -86853559
6031 -86853559 -88354021 -89076570 -88969355 -90057504 -90919227 -91642387 -93506211 -94500228 -95856645 -97224578
6021 -97224578 -96821091 -98881374 -98905745 -98816448 -98935617 -100221031 -101233153 -101373431 -102244995 -103295342
6011 -103295342 -103755534 -104981194 -104537842 -104724561 -104412559 -104059072 -104786904 -104928122 -104360411 -104525618
6001 -104525618 -105076500 -103398999 -103587958 -103216318 -103702693 -104617118 -104187329 -103975676 -103364629 -102027150
5991 -102027150 -100269827 -101264596 -100421064 -99171487 -98787150 -97724801 -95191517 -95023117 -93721846 -93813943
5981 -93813943 -92450259 -91572096 -89874489 -87568818 -86611455 -85180240 -83670530 -82237936 -81127790
5972 -81127790 -78452738 -78234575 -75129609 -74491828 -72562096 -71224971 -70358052 -68308396 -66258339
5963 -66258339 -63417269 -60603774 -59945748 -58435677 -56172074 -54314190 -52639066 -50733089 -48919329
5954 -48919329 -46726909 -44628770 -43524374 -41163075 -38753504 -37408453 -35765812 -33881904 -32249969
5945 -32249969 -30222116 -28844931 -26484883 -25365772 -24063923 -21284421 -19290809 -17799482 -16851005
5936 -16851005 -15374812 -13009295 -11065635 -10292322 -8824740 -7353327 -6730356 -4292586 -2968708
5927 -2968708 -1666478 -1431278 203641 33819 683849 2512570 4042675 4967017 6343581 6368799
5917 6368799 7417870 7468322 8517890 8759045 8752597 8971767 9753535 9592947 9679932 9423275 10647425
5906 10647425 9659051 8961542 9403002 8808179 8958233 9282663 9201831 8817676 8473566 6033922
5896 6033922 6556669 5276052 4610672 4479963 3408419 2026241 1791772 2132775 751759 -539165
5886 -539165 -923594 -2387190 -3758602 -4664112 -5051742 -7731323 -7209631 -8424692 -10173496 -10692233
5876 -10692233 -12713537 -13551840 -14811795 -17219483 -18591332 -19314192 -19339554 -22251807 -23820289
5867 -23820289 -25325691 -25753011 -27494043 -29315677 -30169981 -31767540 -32418305 -33476811 -34239797
5858 -34239797 -35661308 -37090950 -38115990 -38479666 -39722456 -41602916 -41679720 -43014417 -44598514
5849 -44598514 -45254906 -45704214 -47183869 -48019837 -48946557 -49250159 -50423694 -50905448 -51672653 -53899969
5839 -53899969 -53890017 -54151635 -55010038 -54438732 -55560409 -54532127 -54968331 -55820043 -55563196 -57015841
5829 -57015841 -57132542 -57306671 -56763380 -56774997 -56694965 -56968774 -56620093 -55635065 -55856684 -56631329 -55373709
5818 -55373709 -56554548 -55377521 -54885878 -54094441 -54047848 -52219564 -52305680 -51680836 -51421887 -51422512 -49643821
5807 -49643821 -49950741 -49127722 -48532698 -46904784 -47064859 -46706260 -46288507 -44884996 -43181590 -42598905
5797 -42598905 -42206894 -41044993 -40219824 -39480787 -38852035 -37558040 -35555638 -34587029 -34888522 -33368370
5787 -33368370 -32868197 -31433004 -30831452 -31112122 -29655289 -27544296 -26483202 -26754758 -25791003 -24424970
5777 -24424970 -24294957 -23001387 -21984522 -21257508 -19869555 -19854083 -18646725 -17833029 -17094452 -15631120
5767 -15631120 -15980830 -16535381 -16239043 -14983079 -14905638 -13110583 -14219894 -13614927 -13845172 -12680732
5757 -12680732 -12332561 -12302319 -12512246 -12889177 -12891344 -12119358 -12149448 -12165741 -12661439 -12076448 -13377002
5746 -13377002 -13902011 -14656776 -14170878 -14610271 -15157039 -16760922 -16663594 -17707252 -18129203 -18814031
5736 -18814031 -20389493 -20887697 -20730146 -21795996 -21410546 -21985627 -22927767 -25100769 -27153631 -26702391
5726 -26702391 -27853861 -28780813 -29482742 -30963184 -30321088 -31967505 -32010702 -33139738 -34162495 -36061253
5716 -36061253 -36772591 -36176459 -37281643 -37026555 -37799378 -39649566 -39486192 -40448074 -41843822 -41689818
5706 -41689818 -42636144 -43975063 -43919250 -43361298 -43990759 -44137058 -43516300 -44054815 -44430078 -44645881 -44566055
5695 -44566055 -45579538 -46829136 -45852671 -45430930 -45573529 -45782833 -45256159 -45971237 -45441543 -45344897
5685 -45344897 -44524067 -43950725 -43681162 -43369632 -42597910 -43424447 -41163319 -40600240 -38923052 -37826218
5675 -37826218 -38533207 -37048388 -36841960 -34438749 -35015615 -34042418 -32532856 -30695511 -30915908 -30590768
5665 -30590768 -29248569 -26746988 -25540577 -24780997 -23442519 -21674773 -21926834 -19585377 -18401207
5656 -18401207 -16193175 -16121061 -13565233 -12177372 -10488177 -8458622 -8565630 -7053218 -5189837
5647 -5189837 -2697138 -1306169 552956 2970899 4872060 4967918 7069724 7577893 10259052
5638 10259052 11575065 12241851 14188328 15864508 16815539 18278820 19910880 21052755 23021872
5629 23021872 23480566 25145141 26778869 28835309 29806097 31054971 32653629 33549679 34538653 35426629
5619 35426629 37753073 38497958 38169431 38630742 39256681 40468836 41031283 42069335 43212605 43776970
5609 43776970 44038842 44316540 45664390 46899648 46258170 46301218 47290421 49083051 48049511 48115793
5599 48115793 48707859 48293270 47902073 47545497 46307954 47871655 47073803 46915203 46695215 45755565
5589 45755565 46022635 46901038 45764108 46020574 44946650 44656689 44004624 43611766 42296805 42353550
5579 42353550 41470759 41999642 40330051 38772603 37232420 36466421 36461837 36170514 33961198 32948176
5569 32948176 31172730 30089482 30119192 28449405 27431675 26496507 25949888 25527948 24186292 22682338
5559 22682338 21249002 20761121 19309960 19340032 18502143 17908335 15509342 14491799 13909737 12840810
5549 12840810 10895264 10074071 8977203 8443261 8109051 7646939 5977600 5334332 4710729 2126674
5539 2126674 2073951 1433054 498856 -259838 602154 318948 230711 -1503002 -792205 -1408429 -2012581
5528 -2012581 -2056464 -2891402 -3161832 -4373802 -4535854 -4143657 -3274497 -4315496 -3911983 -4526267
5518 -4526267 -4690914 -2704957 -5324313 -4056408 -3396655 -4079191 -2380473 -2372035 -2850968 -3112152
5508 -3112152 -2662920 -2249928 -1596940 -1227437 -1133079 -578736 1301258 1113670 1917969 2140194 2829208
5497 2829208 4813270 5534028 4439016 5205211 6553273 7656297 8723876 9356938 9800232 9734824
5487 9734824 10952392 11874722 12071106 13232235 14462221 15264161 16197071 17372173 17749471 19186473
5477 19186473 19397172 18955960 20710536 21335652 22614963 23248339 23187922 26127006 26863180 27269779
5467 27269779 28276197 26936028 28698943 31044430 37489640 26672179 23001821 23759406 28580551
5458 28580551 28868774 28675649 30553538 31996343 32422616 30898801 30700868 30811854 31994313 32185919
5448 32185919 33652263 32689503 32978536 31799397 32656176 32797591 31872811 32658724 31310931 31235829
5438 31235829 29425687 30279453 29210070 29221777 28314365 29212834 29122587 27077977 27960460 26350380
5428 26350380 27172302 26202852 25290146 24694770 24284561 23750828 22671032 21494895 20452230 21212642
5418 21212642 18982726 18033744 18026592 17069851 17463615 16777878 15703333 15043559 13892292 13299699
5408 13299699 11856139 9138946 9311111 9651123 8000252 8031074 7549781 6499345 5572879 4382572
5398 4382572 4297557 3443717 1473471 2136347 818539 -24129 -39530 -370005 -1140591 -1597608
5388 -1597608 -2629730 -2518023 -3864143 -3742347 -5244176 -3976348 -4038529 -4667019 -4109990 -5694579
5378 -5694579 -5460011 -5958009 -5852732 -6115459 -6512216 -6544331 -6688756 -6679783 -6892378 -7239890 -8314062
5367 -8314062 -6471326 -6348583 -6604752 -6445525 -6837841 -7167516 -7265253 -6262363 -5759543 -4763995
5357 -4763995 -3841005 -3916989 -4003286 -4011416 -2459952 -1862605 -2660599 -1970204 -1114554 -147991 -91521
5346 -91521 -507457 435984 676846 1181179 3613078 2609257 4762276 4827422 5723926 5925914 6910922
5335 6910922 7016802 7720878 8748965 10002690 9987868 10858277 11123385 11877053 12258752 14099228
5325 14099228 13481484 13184535 14150107 14811264 16663529 16886228 17432228 17943471 17055559 17674121
5315 17674121 18940649 19354934 19989819 17934173 18500014 19495552 19395280 19636317 19954904 18861599
5305 18861599 19427790 19320141 19201796 19786482 19620523 19197995 18610940 18640306 18867100 17405360 17393722
5294 17393722 16650398 16888825 16888648 16158768 15121803 14426406 13944289 13231578 12708301 12128611 10983803
5283 10983803 9763965 8939895 7862825 6948802 5158007 5703980 4402927 2581083 1720313
5274 1720313 656161 -1950177 -2600191 -3922276 -3479548 -6060594 -7770022 -8703613 -9903345 -10306476
5264 -10306476 -12979502 -14618571 -16090142 -17897750 -18800085 -21143324 -21413939 -22401105 -23245338
5255 -23245338 -25562025 -28149806 -29199755 -30830349 -33324046 -33585242 -35132888 -35913096 -37961973
5246 -37961973 -40666308 -41473598 -43291426 -45414134 -45847822 -47794164 -48777248 -50549010 -51382939
5237 -51382939 -54442169 -54037542 -55522852 -56796205 -58180234 -59183118 -61048543 -62035512 -61372785
5228 -61372785 -64017877 -64922980 -65458121 -67418821 -68238356 -68933694 -70375786 -71602482 -73239495 -72456650
5218 -72456650 -73029847 -73620171 -74101752 -76428494 -75990616 -76829111 -76496335 -77170257 -78348115 -79313534
5208 -79313534 -78716408 -78981349 -79718029 -78001023 -79163014 -79754252 -79129114 -79396212 -78526379 -79948558
5198 -79948558 -79707236 -80620803 -80454062 -79484895 -79529665 -79355616 -79243798 -77379707 -78985162 -78585087
5188 -78585087 -78156776 -77319989 -77588330 -74797192 -74323258 -74632665 -75433957 -74888670 -73127203 -73702714
5178 -73702714 -71504866 -71452283 -72042128 -71065615 -69323056 -67615791 -67809690 -67746222 -65834265 -65406884
5168 -65406884 -64673059 -64153502 -62457610 -61845228 -60839729 -61359113 -60341846 -59432391 -58405769 -58427701
5158 -58427701 -55216418 -55273833 -54330764 -53394954 -52093095 -52266327 -50664622 -51427743 -51245131 -47794071
5148 -47794071 -47015558 -47011973 -45532059 -44183464 -43105168 -42440357 -41458905 -41379594 -40263836 -38252093
5138 -38252093 -38659849 -39276595 -36633494 -36827898 -35638593 -35062655 -33780050 -32330176 -32285567 -31708802
5128 -31708802 -30705601 -30342956 -29307230 -28887095 -28462930 -28269797 -26901074 -27408859 -25992796 -25038006
5118 -25038006 -24491119 -24058127 -22422809 -22871485 -21437330 -20416059 -21195051 -20568856 -19982055 -18689052
5108 -18689052 -18950860 -18640200 -17402752 -16416943 -16764520 -16205743 -15608550 -15855460 -15703618 -14752753
5098 -14752753 -14013183 -13456186 -13340090 -11103327 -9630855 -9652998 -10635223 -9544332 -8291791 -7628162
5088 -7628162 -7567224 -7006357 -6865474 -6571218 -5337990 -4531251 -3493930 -3522988 -1796799 -1716643 -1272365
5077 -1272365 432276 -253114 516719 1483396 1563680 2662505 3772520 4316804 5791636 6967154
5067 6967154 6806976 9018313 8698034 9864048 11124578 11598396 11447915 12818462 12871867 14803839
5057 14803839 15071662 16375374 17626905 18966375 18968977 19552242 19894350 22202319 22313859 22994666
5047 22994666 24488501 26348528 26650047 28968961 29167743 29899474 30356528 30836390 33604151 33976914
5037 33976914 34601447 35140157 36265780 36459035 37107188 39113688 38578580 39220438 39648819 41043853
5027 41043853 41554547 43024089 46167422 45344924 46418227 46093296 47314483 47317165 46998791 48099906
5017 48099906 49378460 50014185 50610898 50933108 52211774 51336931 51481300 52565201 52934212 51872032
5007 51872032 53377969 52541969 53341270 53695382 54140510 53319170 53708009 54521512 54202076 52989981
4997 52989981 52980233 52377433 52398706 52034417 52544469 52268115 52998183 51313885 52773665 51070921
4987 51070921 49382760 49185173 48676264 47553469 47322714 46387598 45966802 45822075 44941300 42749365
4977 42749365 43154386 42053667 41075414 40152164 39052688 38008430 36951913 35802130 35251329 34275509
4967 34275509 32499915 31526236 28716375 27924862 26860794 24732560 23709541 22668499 20459575
4958 20459575 19668268 17585563 16589795 14609541 13306597 11294083 10289545 9107741 7202912
4949 7202912 4919785 3565479 1763862 1713814 -1166237 -3736368 -4442788 -6756006 -7592770 -8853390
4939 -8853390 -11280251 -11178031 -14062226 -16335713 -17771321 -18791129 -20268672 -22095462 -24739564
4930 -24739564 -25705954 -26716840 -29009390 -29975389 -31516229 -33767163 -34891247 -36279955 -37450389
4921 -37450389 -37778029 -39447707 -41365989 -43204571 -44543431 -44517150 -46563650 -47191858 -48683627
4912 -48683627 -50583871 -50068477 -50846487 -52553137 -53690530 -54964428 -55889348 -56250922 -57258392
4903 -57258392 -58608446 -59232297 -59269803 -60007367 -60715784 -61489749 -62400666 -63278256 -63909221 -64780171
4893 -64780171 -64412161 -64463256 -65314159 -66065103 -66607226 -67448927 -67504066 -68251755 -69079980 -68101015 -68638287
4882 -68638287 -67903300 -67548719 -69075028 -68344214 -68556051 -68168985 -68724072 -67760261 -68104789 -67376026
4872 -67376026 -66583666 -66861690 -68292924 -67368999 -66707923 -65826323 -65456964 -65882953 -65622956 -64509165
4862 -64509165 -65373329 -64001231 -63629318 -64341019 -63523731 -62723163 -61821574 -62262431 -60920970 -59971272
4852 -59971272 -58706343 -58825401 -58442483 -57830077 -57483256 -57286918 -55582733 -55337045 -53711937 -52931854
4842 -52931854 -52758633 -52195627 -50991835 -50102790 -49404650 -48689608 -47788440 -46737591 -45421568 -45315784
4832 -45315784 -45011631 -42477149 -42864418 -42532073 -40907334 -39190133 -39474373 -38308429 -38524452 -37547754
4822 -37547754 -37032556 -35264227 -34776097 -33190620 -31807720 -30249445 -30339990 -29059768 -28436736 -27602044
4812 -27602044 -26682235 -26570125 -25567889 -23589588 -24236889 -24827698 -22513636 -20095959 -19273993 -18804417
4802 -18804417 -18335809 -17031265 -16409367 -15424932 -14292406 -13766140 -13535527 -12267656 -11054219 -9869063
4792 -9869063 -8932303 -8751423 -8099711 -6950084 -5604125 -2794115 -3113498 -3073525 -1795493 -324527
4782 -324527 -528937 2060936 3104272 4802412 4594813 4947984 5550497 7027876 8296528 8092402
4772 8092402 8554139 11296224 12737323 13299462 13947781 14688662 14171895 15717063 16536931 17646250
4762 17646250 18181637 19666105 20086709 21677583 21958772 22404738 22763247 24310719 25186397 25840246
4752 25840246 26920695 27289709 28550113 29728972 30426955 31584393 32411857 31714259 33040858
4743 33040858 34075146 34336538 34691780 34776020 35862352 37069808 38477370 39003313 38782027 38628535
4733 38628535 39874572 41114676 41815085 42192026 42623505 42906964 44410702 45189941 45602296 46332018
4723 46332018 44910060 45797941 46275326 47727040 47025165 46825874 47765640 48717412 49173927 49193150
4713 49193150 50069120 50746067 51442379 50398156 50020453 51412596 51248889 51594478 51603938 51139066
4703 51139066 51497201 51153099 50779974 52077093 52181678 51254995 51259493 51230475 51180008 50867042 51576541
4692 51576541 51351635 51754572 51232899 51349018 50251758 50421534 48873957 49924897 49544852 48422342
4682 48422342 48065865 48161241 48816510 49037981 47979856 47440168 46069400 46054641 46054150 45737141 44496176
4671 44496176 44364190 43480820 43536394 42509779 42627886 42387387 42298542 41476199 40387465 39938524
4661 39938524 38997592 39466632 38776011 38202881 37450538 36819246 36031987 34844154 34767252 35410713
4651 35410713 34887941 32744893 31707654 30846758 30698374 30475833 30994128 29975305 29795997 28275163
4641 28275163 27915476 27677488 27294044 26154503 26114054 24902551 23160233 22718786 22673615 21810864
4631 21810864 21357890 20305643 20505702 20422767 19264113 17161296 17559390 18095073 16624927 14925841
4621 14925841 14580026 14700760 14812727 14173518 12348720 10853112 11173617 10332745 10642274 9809419
4611 9809419 10599412 9915942 8729548 8318411 6962535 6086151 7256824 6247839 4560225 5170422
4601 5170422 4811313 4372794 3633605 1719981 1230767 1398687 -180605 -149876 -491063 -627369
4591 -627369 -482498 -1414619 -2184599 -3087759 -4510089 -4603400 -5043904 -5340603 -5676155 -6829891 -6330023
4580 -6330023 -8105508 -8446304 -9113630 -9419965 -11063007 -12377597 -11805842 -12302692 -13285980 -14461765
4570 -14461765 -15243515 -16129570 -15602044 -16128793 -17354101 -18917348 -18775970 -19206971 -21200662 -21963541
4560 -21963541 -23122262 -23718337 -24117173 -23759200 -24980104 -25340059 -26999407 -28727775 -29189956 -30665243
4550 -30665243 -30701832 -31357270 -31145879 -33663168 -33500846 -35162233 -35877265 -37007080 -38879988 -38528601
4540 -38528601 -39711240 -40334910 -41342099 -42562448 -43234934 -44131676 -44667456 -45155656 -46502439 -46754282
4530 -46754282 -48510529 -49175062 -51181001 -49870551 -52791141 -53423490 -53408901 -54607415 -55685181
4521 -55685181 -58680200 -58374509 -59157636 -60265192 -61135291 -61699387 -64103078 -63394523 -63810912 -63978657
4511 -63978657 -65566411 -66951333 -68836149 -69107407 -70388537 -71078590 -71673356 -72619707 -74080474 -74830355
4501 -74830355 -75412682 -75820790 -76408831 -78240968 -78797193 -79960671 -79892274 -80572151 -81684344 -83139039
4491 -83139039 -84555615 -85049800 -85930075 -85224838 -85825779 -87417010 -87864534 -89187014 -89284115 -89796552
4481 -89796552 -92144597 -92069231 -92667647 -92260671 -93705292 -94358943 -94081725 -95687376 -96167215 -96597728
4471 -96597728 -97186237 -98953472 -98003556 -98439175 -99485934 -100643222 -102426782 -101434719 -101085252 -102873416
4461 -102873416 -103090067 -103982828 -104439583 -104489255 -104332289 -105311301 -107120661 -106768704 -107536153 -108339912
4451 -108339912 -108830417 -108671164 -108585795 -109257677 -109505963 -111290771 -110384778 -110913172 -111742917 -111129923
4441 -111129923 -112646276 -114385132 -114850376 -114501061 -114064803 -115631586 -115524202 -116292644 -117003641 -117857277
4431 -117857277 -118225252 -118566059 -118846443 -119662095 -119602675 -120404077 -120696589 -121388149 -121154075 -120606797
4421 -120606797 -120905776 -122200061 -122452511 -121699659 -123520126 -123719351 -124420656 -125088638 -123797596 -124819993
4411 -124819993 -124267356 -124974780 -126371091 -127053077 -126887598 -126265960 -127043903 -127613916 -127754502 -127787270
4401 -127787270 -127959292 -128774056 -128360992 -129174851 -129666540 -129553559 -129112713 -129483272 -129487897 -129416894 -129796806
4390 -129796806 -129380333 -128593920 -129771458 -129934631 -130037983 -128739997 -128501958 -130121400 -128616143 -127816563
4380 -127816563 -127735803 -127824149 -128177988 -128357726 -127435000 -127538172 -126949161 -127602395 -126567575 -123661381
4370 -123661381 -124238862 -124306261 -122172221 -121614880 -121489632 -120689320 -120701376 -119539690 -119232546 -118549164
4360 -118549164 -117495927 -115757488 -115094707 -115733857 -114466811 -112641998 -111234393 -109671880 -108893102
4351 -108893102 -108472198 -107428314 -105993688 -104738359 -103159896 -101432921 -100369819 -98963018 -97180207
4342 -97180207 -96209430 -94964319 -92950377 -91420192 -89931923 -88809334 -86755470 -86092353 -84530514
4333 -84530514 -81254082 -80410883 -77498189 -76475710 -74253476 -73608672 -72684150 -70052467 -68594515
4324 -68594515 -66312964 -64832313 -63352963 -62260643 -60649200 -58502246 -57523732 -55230507 -53430141
4315 -53430141 -50857981 -49018654 -46766190 -45939584 -44555881 -41365738 -40781682 -39956332 -37576521
4306 -37576521 -36917647 -35251487 -33970754 -31031700 -30220616 -29099730 -27360209 -25563084 -24840130
4297 -24840130 -23306564 -22571722 -20628151 -19605024 -19594371 -18400432 -15803902 -14996386 -14331110 -11892203
4287 -11892203 -11402240 -10984601 -11055765 -9352171 -9136509 -7343174 -7197703 -6271622 -5714245 -6075765
4277 -6075765 -5598803 -4491499 -4974363 -3492502 -3087920 -1512808 -2479923 -2459629 -1766749 -1595560
4267 -1595560 -1422365 -766326 -950960 -1548863 -2207630 -2873358 -2816744 -2865549 -3378536 -4116567 -3480615
4256 -3480615 -3821452 -4558911 -5259931 -4885972 -4297664 -5387086 -6185960 -5524848 -6814435 -8553330
4246 -8553330 -9221314 -10129244 -10426402 -11252747 -12089348 -13171750 -13343739 -14192786 -15061032 -16029467
4236 -16029467 -15874894 -17657700 -19752435 -19944802 -20958000 -20363733 -22213040 -22694518 -23616018 -25586041
4226 -25586041 -27398351 -27191973 -28241498 -28029540 -29425851 -31337058 -32241037 -32913979 -33160422 -33851014
4216 -33851014 -35425210 -36697521 -37403303 -39489369 -40359129 -40775924 -41474508 -42063550 -41949268 -43211949
4206 -43211949 -44006721 -44316860 -45108753 -45557724 -46307997 -46884959 -47182888 -47500896 -47446412 -49515790 -49428827
4195 -49428827 -50584465 -50185689 -50971519 -51163064 -52033591 -52054772 -52409581 -51038274 -51456968 -51127761
4185 -51127761 -51448783 -52743687 -52817343 -52180992 -53189795 -52315500 -52674370 -51982685 -51403547 -51516575
4175 -51516575 -50560290 -51019892 -50370020 -49317926 -48569936 -48821015 -48866711 -48052300 -47580651 -47263211
4165 -47263211 -46838529 -45763979 -46484140 -46661631 -45229328 -43944518 -43564379 -42310451 -41389044 -40951576
4155 -40951576 -41888959 -41064492 -40198299 -38288447 -37499288 -36117504 -35947110 -35396262 -34954713 -34424351
4145 -34424351 -32517479 -30354795 -30474845 -29853299 -30391780 -30152145 -28927922 -26958187 -26620236 -25188155
4135 -25188155 -25464260 -24662928 -23976864 -23293999 -22255816 -22218970 -21183045 -20454838 -19307215 -18109191
4125 -18109191 -17528916 -17194174 -17001493 -16731665 -17076673 -16797638 -15706825 -14620856 -13884418 -13395456
4115 -13395456 -13107435 -12545285 -13231004 -12196251 -12431240 -11596147 -11712958 -11268621 -10901551 -11538386
4105 -11538386 -11159935 -10702815 -10597611 -9620711 -8429891 -9633754 -9565862 -9658606 -9932711 -9831054
4095 -9831054 -9225608 -8622341 -8300324 -9311170 -9089266 -9744046 -10641558 -10963743 -9232099 -9946553
4085 -9946553 -10124318 -9579008 -9013179 -9672982 -10485639 -10347486 -9561915 -11347006 -10351161 -9987140
4075 -9987140 -12467687 -10831795 -10705359 -11018441 -11856808 -12575401 -12406746 -11358102 -11269072 -9565203
4065 -9565203 -10692229 -10927263 -11621922 -9993192 -10551755 -10486726 -10620956 -10837292 -9920723 -10257740
4055 -10257740 -9964844 -9686967 -8116779 -8688090 -8956813 -8157572 -7231890 -7188038 -7056930 -6696805
4045 -6696805 -6122242 -5793494 -4007636 -3660150 -3122693 -2357170 -1188879 -511363 313179 25042
4035 25042 295625 1671312 2075756 4069328 4082134 5542790 6896247 6417082 9199414 9247229
4025 9247229 11080664 11957172 12245481 13157149 15380294 15573323 16563718 17944836 19477249 19942046
4015 19942046 21618987 22266016 24553442 25058342 25702526 28018766 28032964 29622398 30440395 31857482
4005 31857482 33607426 34570091 35607741 36761609 37662169 38770897 39553411 40997593 41134306 41870915
3995 41870915 42744950 44232711 45017212 45624952 46165410 47642029 48332426 48737706 50040408 50018754
3985 50018754 50667037 50418486 51684908 51630107 51355972 53510533 55201167 53164197 52459417 52713023
3975 52713023 52573689 52711578 53752519 53577122 54107263 53680853 52668762 52346137 51338505 50998766
3965 50998766 50864685 50297044 49799789 50212607 49021885 49062647 47456630 47949381 45193687 44898242
3955 44898242 43917589 43447801 42821551 40253831 38892357 37954233 36685348 35259847 35489168 34677479
3945 34677479 32594097 30641971 28672969 27521132 26553302 24313076 24129999 23061963 21299378
3936 21299378 17403149 17232193 15558942 12532635 10838786 9689078 7758691 6711043 5159429
3927 5159429 3083451 1766363 -99520 -1275035 -3529618 -4836096 -6397633 -7774729 -8111090
3918 -8111090 -11149063 -11107841 -13444417 -14042501 -16401983 -17575301 -19825926 -19239921 -20784523 -22527660
3908 -22527660 -22783451 -23317609 -24755101 -26324744 -26966681 -25869181 -27140693 -27719348 -29382174 -29425822
3898 -29425822 -29696457 -31061023 -30909858 -30769816 -32446418 -31369482 -31954804 -30968056 -30757680 -30550126
3888 -30550126 -30790815 -29752665 -29238113 -28405568 -28146153 -27864262 -26661785 -26216267 -26114129 -23864215
3878 -23864215 -22600727 -22247832 -21012229 -18751677 -18099796 -17074329 -16272031 -14728990 -13051823
3869 -13051823 -10789637 -9474443 -8036722 -6246121 -3738024 -1317570 794390 2515059 4996767
3860 4996767 6657210 8784635 10989725 13818876 16479601 19309817 20925433 23038295 25059956
3851 25059956 28120139 30498785 33737107 36296327 38004153 40236262 43342199 46124129 49202300
3842 49202300 50923985 53465664 56714994 59203869 61333171 63990675 66449511 68732228 71691301
3833 71691301 74091326 76896248 78040625 80788569 84360476 85605525 88063637 90349657 92075187
3824 92075187 93499515 94801406 97105332 100921748 101987230 102954273 104745524 107002558 107804133
3815 107804133 108992146 110236771 111963011 113197051 113951736 116420791 117501030 117925825 120341048
3806 120341048 121607727 122516523 122685244 122760477 123182687 123605371 122845498 124167898 124610712 123919916
3796 123919916 125054658 125405577 125325415 125024447 125984322 126646301 125703030 124396180 123718068 122784818
3786 122784818 121665334 121638201 120814091 119407063 118319798 117850728 117357732 117196224 114734771 113623168
3776 113623168 111927801 111489774 110318256 109449260 107933798 106268724 103464823 102704436 101829709
3767 101829709 99610131 98539751 97033334 96424352 94756683 92053328 89852473 88485353 87980959
3758 87980959 85799202 85516451 83629620 81254950 78865099 77842463 75873846 75770361 73618042
3749 73618042 71169371 70461568 69814380 67796382 66306808 65327305 64591075 62809542 60662171
3740 60662171 58082626 58296624 56450092 55165038 54579501 53099312 51834614 51252815 50561499
3731 50561499 49164792 48612047 46633356 46567383 45603615 45081350 44065828 45120555 43666673 43460841
3721 43460841 42958980 42492205 43090573 43097871 41728335 42942679 41838587 41339805 41326677 42137334
3711 42137334 41871304 41839175 42134126 42136891 43198474 42857761 43022751 43836889 43728219 43277164 44580880
3700 44580880 44915060 44586540 46576665 47386467 46503604 48092771 47802739 48964611 49578336 49887367
3690 49887367 50558039 51180882 52805893 52170276 52240312 52768203 53063447 54633939 55561517 55584429
3680 55584429 56225267 56543895 56752899 57762507 57837150 58223753 58203139 58872474 58439559 58566499 58669930
3669 58669930 59999044 59599372 61091049 61946306 61063390 61877915 61144166 60259000 59811285 59691166
3659 59691166 60164345 59928410 59642728 59699683 59909188 58429579 58297358 58450839 57715392 57475349
3649 57475349 57115122 55604383 54783972 55152871 54146461 52770049 51493454 50364280 47934380
3640 47934380 47682401 47419569 46279871 45340695 44464281 42120984 40531162 40424894 37933239 37786349
3630 37786349 35703701 34032938 32777349 31921120 30543505 29594274 28435966 26928905 25671908
3621 25671908 23982500 23108822 22264217 20412701 18615022 17034436 15667142 14132408 13232397
3612 13232397 11834686 10912078 9643237 8727407 6564346 5747697 4667767 4199151 4294718 3238179
3602 3238179 1191044 574510 807910 -1175952 -1033985 -803084 -666688 -1867236 -2566338 -2097233
3592 -2097233 -2839878 -2366365 -2754484 -1126003 -1469366 -1166460 -2630057 -2588532 -1126271 -973517
3582 -973517 -1526420 76358 1298899 2327047 3008570 4655634 5137068 6154213 7215744 8010317
3572 8010317 8900332 11825825 13058204 14612078 16766790 19539155 20016467 22654729 24500670
3563 24500670 25853694 28709892 31292985 33443261 36691131 38770517 41306864 42026992 45690474
3554 45690474 49175955 51206178 53340275 55663494 59089317 60758438 64439542 67652732 70108563
3545 70108563 73348715 75929819 78439583 81625122 84460744 86895281 89956586 94064066 96220453
3536 96220453 97957226 101303050 103599944 106463347 110250849 112013467 115620118 118039771 120633758
3527 120633758 122906295 125280582 126739617 129202419 131441706 133732483 136645431 137938158 140475759
3518 140475759 142219061 143413906 145529933 146565272 147913718 149518971 150557563 151004247 152248052
3509 152248052 153898941 155287567 155934892 156522224 156309537 157074835 157826607 158282972 158266238 159592303
3499 159592303 157023342 157986099 157693912 157394342 155826158 155434253 153806549 153517716 151963248
3490 151963248 150845194 149929622 149307930 146901495 146025742 144056995 142188279 139933096 137528663
3481 137528663 134905722 133497566 130274579 127065253 125839629 123425364 120917246 117904960 114757685
3472 114757685 111486172 108562656 105310404 101833392 99243171 96848412 93593608 90924216 85815853
3463 85815853 81727468 80551549 76826073 72535983 69175666 66093986 62082208 58627872 54852871
3454 54852871 52404320 48065627 45337176 41484777 37642161 32559188 29707202 26502406 22694381
3445 22694381 19201421 15967002 12484652 9567391 7244167 3674919 215780 -2869692 -5047634
3436 -5047634 -8661983 -12360812 -14891534 -18351595 -21165753 -23196831 -25229243 -27584472 -29845827
3427 -29845827 -32219795 -33703093 -36048887 -37986135 -39522390 -40871085 -42325336 -44510242 -44405355
3418 -44405355 -45971764 -48048242 -48826548 -49013263 -50778405 -51472646 -51989515 -51551987 -53379309 -52934365
3408 -52934365 -54031175 -53192527 -53467693 -53857998 -52670104 -53258685 -53316660 -53513450 -52574274 -51172071
3398 -51172071 -50126842 -48852475 -48433639 -48242118 -47780612 -46812091 -44492134 -43512189 -42169165 -40731227
3388 -40731227 -39519957 -37826985 -35295560 -32815526 -32522241 -31815305 -29299055 -25578356 -25044800
3379 -25044800 -24269448 -21943284 -19931648 -16497090 -15073618 -13984754 -12282495 -9948441 -8880839
3370 -8880839 -7480839 -4339379 -1945311 -695546 1211271 2007007 4196098 5946409 7905985
3361 7905985 9679525 12046367 12905429 13229536 16138024 17635275 18476265 18847838 20982638 21717839
3351 21717839 22699149 23131296 24699933 26291583 26607845 27829728 27547297 28120305 28691449 30152147
3341 30152147 28796450 29081728 30423412 29892664 30058548 30682586 30491366 29461203 29417965 28375981
3331 28375981 28042861 27425304 26842235 25638983 25072222 24686446 24042532 23761532 22978325 20616132
3321 20616132 19878794 17988471 17500012 14832610 14034668 13583998 12118628 9882279 8442049 7453969
3311 7453969 4957631 2896513 1509173 -810647 -2961504 -4967608 -6879737 -8713149 -10092680
3302 -10092680 -11946347 -13853631 -17245851 -19157229 -19860310 -21101228 -23552702 -24707752 -27138675
3293 -27138675 -28964758 -30496623 -31934204 -35049221 -35390346 -37777011 -39311915 -40084323 -41815026
3284 -41815026 -45066770 -45003877 -46784234 -47189303 -48292268 -49442207 -50743325 -51777130 -51517769 -52224036
3274 -52224036 -54371108 -55171082 -54434066 -56103486 -56698284 -56706548 -56254938 -58127617 -57363512 -57805220
3264 -57805220 -57576118 -57186207 -56218701 -56179730 -55265342 -53554948 -52611003 -52547267 -51932057 -51084484
3254 -51084484 -48453146 -47409312 -47408312 -46584679 -44248187 -43539191 -40926473 -38621583 -37644879 -37313467
3244 -37313467 -35102316 -33273154 -29915568 -28277808 -26723971 -24034712 -20773467 -17125616 -16528641
3235 -16528641 -15661266 -13126192 -8711678 -6247889 -4212222 -1559157 588426 3533588 5356664
3226 5356664 8508965 11757382 14081076 17090754 20577217 22778111 24957595 26880357 29415455
3217 29415455 32591374 35073357 37787481 39857674 42499209 45386745 47482083 49955540 51714903
3208 51714903 54216036 56350484 60001973 61115794 62493877 64841134 66073011 67559060 69541171
3199 69541171 71101099 73080742 74473986 75889427 76463965 78197567 79031263 80108576 80926268
3190 80926268 81480701 82384638 83389744 84497412 82928003 84113256 84689653 86077222 85782651 85257031
3180 85257031 85065320 85059079 84972702 85712698 84541348 83544897 82982128 82539314 81538540 81365261 80643836
3169 80643836 79515568 78875277 77167094 75778213 74582071 73673371 72595859 71929951 69920932
3160 69920932 67925930 66738706 65769461 64743507 62522148 60217058 59202980 57767513 57151281
3151 57151281 54541819 52681066 51334857 50051839 48216078 47546270 45462048 44036176 42914048
3142 42914048 41315417 39863779 37424602 37564754 35569472 33507419 33462617 31567261 30827716 30228408
3132 30228408 29839645 28571821 27486858 28462513 27718356 27085776 25900295 26750775 27027291 26129955
3122 26129955 25585283 26368567 27150067 27319931 26757962 27869735 28783402 29350268 30632998 32171022
3112 32171022 33370433 34341554 36760855 36441234 37962956 40450596 42832601 44676568 46540004
3103 46540004 48589689 51068341 52847397 56218559 58807452 60469805 63133636 65214278 69566492
3094 69566492 71996667 75016914 79201002 82509350 85894174 89683664 93183738 95437769 99043748
3085 99043748 102853097 106709233 110769249 116004894 118210010 121972116 127128381 129619186 134761697
3076 134761697 138844908 142326807 145501338 150511049 154841615 158588974 162364982 164969604 169128439
3067 169128439 173007767 177794938 181366245 185078638 188346858 192174138 195702667 198485463 201342951
3058 201342951 205635940 208838005 210931495 214959619 216231648 220138379 222615675 224264881 227335927
3049 227335927 228424149 232345561 232910467 233532212 236100131 237927913 238793514 239943974 240881662
3040 240881662 241793468 243438725 243701950 242790692 243436374 243430343 243991940 243278375 241737152 242476354
3030 242476354 242378139 240563342 240347171 238650865 236485584 234167440 232117620 231326106 228060505
3021 228060505 225706572 223764645 220102269 218697243 215734601 211955622 208700914 205616824 201934425
3012 201934425 197978158 194051137 189699332 186223998 181397814 177024741 171852138 168111052 163285300
3003 163285300 158688042 154322720 148781883 143680394 138631941 132593282 128468287 122407287 116985116
2994 116985116 111260291 106039192 100056808 95530073 90116025 83692907 79269055 73035208 67325344
2985 67325344 62725333 56169627 50652336 45007375 39457740 34615350 29105571 22619935 18231744
2976 18231744 13203031 7713235 2515125 -2111813 -7194371 -11958297 -18202024 -21986393 -26305224
2967 -26305224 -30579321 -34971123 -40104571 -44366069 -47627144 -50924614 -54789119 -57653133 -60496443
2958 -60496443 -64603789 -68327181 -71279676 -74058240 -77258884 -78705696 -81864740 -84237301 -85984967
2949 -85984967 -87611556 -90113091 -91135784 -92665363 -94940771 -95162794 -96157283 -96589384 -97907763
2940 -97907763 -97699680 -98244577 -98372110 -98617232 -97162872 -96769678 -97910747 -96322678 -96093709 -95811344
2930 -95811344 -94979018 -93021399 -91234935 -89994662 -88233186 -86076269 -83541630 -82054905 -80707626
2921 -80707626 -77552826 -75291167 -72613690 -70429237 -68020920 -65323283 -61741952 -59397458 -55987981
2912 -55987981 -52654678 -49450767 -46478929 -43426062 -40655888 -37653793 -35032842 -31582188 -26448174
2903 -26448174 -24276974 -21169204 -18159527 -15077194 -10373031 -7402382 -3061642 -52214 1761012
2894 1761012 6764114 10626640 11742614 15799113 18619276 22962126 24922668 28126354 30912056
2885 30912056 35218045 36756356 39747991 42901655 45694256 47903529 50945009 53275741 55824093
2876 55824093 57795049 59967724 62226852 64578673 66574825 68745066 69082977 71172653 72419881
2867 72419881 74683404 76014022 76767432 77579710 79096486 80147241 81628249 82797517 82390164
2858 82390164 82718072 83581555 82956595 84381502 84133325 84306142 85798025 85062574 85730792 85606670
2848 85606670 85594189 85219790 83406945 83232077 82739890 81796420 82367032 82392450 81316405 80910833
2838 80910833 78899383 77907229 77198549 76594443 76153861 75424517 73619994 72742520 71853312 70960407
2828 70960407 70126320 69685723 68776353 68058511 66445877 65489443 65660296 63714448 62816842 62409082
2818 62409082 61144004 61704594 60259345 59927434 58852995 59071926 58346463 56770852 56138707 55711265
2808 55711265 55754013 55410504 54697713 52913675 52990244 53500590 53733845 54143718 54252040 54514417 53898150
2797 53898150 54827315 53241059 54165391 53579656 55244486 56190707 55750136 55269764 56556386 58052391
2787 58052391 57822697 57501974 58022201 59699909 60023772 60496234 61162550 62010632 62377867 63135167
2777 63135167 63351159 64140112 65025649 65819087 66414108 67222971 67650297 67985961 68743905 68903175
2767 68903175 70409848 69990612 71724319 71454007 72542399 72257733 71248650 70421523 71669181 71233223
2757 71233223 70255120 70432776 70214200 69784898 68137901 68377044 68318212 66198803 65348737 63426021
2747 63426021 62062092 60752847 58814528 56938160 54097568 52645408 51543098 49093258 45035169
2738 45035169 43620542 39881151 35397021 31360939 28349632 25846392 21805789 17995515 12225593
2729 12225593 9041418 4730061 -1464525 -6008451 -11451358 -16841228 -21594796 -28008974 -34612130
2720 -34612130 -41111608 -47021181 -53248581 -59034093 -66426889 -74116355 -81098445 -88379323 -95898643
2711 -95898643 -103435427 -110614147 -121344682 -127882897 -136213719 -144451082 -151906452 -159593517 -169556430
2702 -169556430 -178470946 -188097581 -196868360 -206319663 -216220810 -225720823 -233540639 -243216122 -252709203
2693 -252709203 -261998599 -272926993 -283560700 -292564900 -300707225 -311656761 -320168740 -330520375
2685 -330520375 -339586928 -348035186 -357691713 -368603387 -378347081 -387505061 -397027757 -407110670
2677 -407110670 -416365694 -425352208 -434005226 -442666983 -452037064 -461099497 -470266194 -477861897 -485532594
2668 -485532594 -494300405 -502219668 -510647580 -517992974 -526127213 -532849421 -540847810 -547735845 -553939087
2659 -553939087 -560473027 -566721473 -573399927 -578558249 -584295295 -588221074 -594545628 -598994269 -604109868
2650 -604109868 -608169427 -612617649 -616179861 -620779276 -622730357 -626735983 -628524916 -631920170 -634243484
2641 -634243484 -634669208 -636720940 -638929701 -639088143 -639231918 -640312062 -640680700 -638824922 -639475975 -639409651
2631 -639409651 -637661417 -636498629 -634161288 -634071498 -631153048 -628883127 -625602962 -622024374 -619523794
2622 -619523794 -616904214 -612824731 -608857224 -605095735 -600219091 -594525786 -589898530 -584678918 -579540925
2613 -579540925 -574332117 -568078869 -561577527 -554886464 -549347574 -542442155 -535754501 -529318418 -521782757
2604 -521782757 -514752297 -507807009 -498888094 -491752463 -483913651 -475865885 -466875577 -459005570 -451274892
2595 -451274892 -442016939 -434037167 -425956246 -416989278 -407548894 -399205849 -390165017 -382253827 -371638513
2586 -371638513 -364202314 -355030255 -344738738 -336406178 -327757383 -319256248 -310821819 -302409934 -293637728
2577 -293637728 -285673605 -277568066 -267886421 -260025338 -251953514 -243778198 -234338388 -226541047 -219342500
2568 -219342500 -211175431 -204475439 -197803964 -189636071 -182439958 -175221337 -168675401 -162858056 -156295768
2559 -156295768 -149974176 -144121456 -139070409 -132920166 -127264971 -122645157 -116998688 -111845013 -106985971
2550 -106985971 -102613667 -97155065 -93850785 -88922013 -85787307 -82121267 -77148272 -74644282 -71024561
2541 -71024561 -67403778 -64163520 -61384644 -58462469 -55323173 -53342958 -50907218 -49382733 -47228038
2532 -47228038 -43898016 -41881759 -40034039 -38260388 -37204413 -34721155 -32905807 -31399209 -31015003
2523 -31015003 -29025915 -27487513 -25540923 -25716316 -24065389 -22526141 -20231733 -18854448 -18075396
2514 -18075396 -17330282 -15626817 -15498907 -15094847 -13356954 -13540428 -12545343 -11383500 -10140957 -9587358
2504 -9587358 -8157217 -6905940 -6476270 -5395353 -5731895 -3318586 -2566337 -2148126 -2256788 -479534
2494 -479534 14271 1544735 717810 1560004 2073462 2672833 3927498 4932164 6494201 7256296
2484 7256296 8518106 8603362 8158442 9521943 11132152 11293360 12234577 13622875 15351773 15435958
2474 15435958 17103829 17801789 18902128 19925869 21177219 21950758 22823036 23849633 25667175
2465 25667175 26817444 27247723 28370430 30011287 32866234 34140929 34996558 36376816 38935160
2456 38935160 41521527 41859121 42903530 43648137 46335955 47263787 48486570 50657750 52033644
2447 52033644 52151916 53159400 55070553 56945061 57885980 59127149 61273032 62706199 63147188
2438 63147188 65076516 65525747 67107853 67232175 67545573 68006223 68081487 68790858 69990680 70061663
2428 70061663 69618085 70016956 70915661 70203314 68768837 68826388 68732545 68214561 67897420 66246463
2418 66246463 65577724 65147998 63951856 63341804 61092415 59650765 58179005 56278364 53154260
2409 53154260 51819899 49448321 47939550 45116774 43568227 40479508 38306759 34670424 32146702
2400 32146702 27104360 24968354 21729923 18863979 14907604 11629309 8964283 4850439 1952724
2391 1952724 -3053780 -6417748 -10014361 -15035913 -18115099 -24464463 -27714922 -32173218 -36254898
2382 -36254898 -40079384 -43575152 -48085459 -52559902 -56900892 -61682767 -66542583 -69125797 -73211520
2373 -73211520 -77014807 -81898554 -87727456 -91929687 -95057867 -98446112 -101765580 -105517193 -109756559
2364 -109756559 -112395124 -116504361 -120176311 -123067216 -125833696 -128865134 -131415637 -134380645 -137300190
2355 -137300190 -137956223 -141280371 -143674344 -145602879 -147223531 -149402789 -150581582 -150274727 -152160077
2346 -152160077 -153498267 -153274908 -153300092 -153279807 -153505406 -154005073 -152803016 -152530039 -152345565 -150930719
2336 -150930719 -149640276 -146415318 -146266137 -143266854 -141037176 -138506446 -136523301 -134795680 -131066217
2327 -131066217 -126761968 -123948311 -120615958 -117266347 -111680623 -107887843 -104174205 -98996027 -94608017
2318 -94608017 -89403235 -83654085 -78168242 -73441922 -67112567 -62457612 -56704787 -49695038 -43112740
2309 -43112740 -36604960 -30174712 -22531544 -15719465 -9226281 -1725576 5349883 12611423 20391141
2300 20391141 27907544 35745834 42405863 50702373 59938474 67124603 74694863 82183483 90524108
2291 90524108 98657129 107620586 115268942 122595488 130701797 138589541 146690964 154459578 162115316
2282 162115316 171087727 176373080 184414464 192948426 201027838 208471737 215986124 223988620 230235650
2273 230235650 238113506 244050989 251110456 256979542 263697956 269752381 275209810 281079554 287207950
2264 287207950 292662020 298272337 302691327 306977088 312131176 315975175 319794835 323805958 326663775
2255 326663775 329216201 332460366 335067675 336888465 339072226 340711258 341558139 343080698 342928166
2246 342928166 344136512 343670909 344076611 341945488 341067409 339361146 337521747 335383217 332917854
2237 332917854 330272258 327595667 323367162 319326151 316747783 312444963 307895506 301854627 297468556
2228 297468556 291859309 285535290 278386898 272868485 265370483 259594729 252592087 244098417 237732932
2219 237732932 229869389 220694150 212651422 204767509 197499229 189067634 179416247 172320444 162934466
2210 162934466 154268954 145639399 135572618 127525726 117786092 109375087 100683903 91487893 83216653
2201 83216653 73391516 64031305 54772812 45571162 36665227 30047256 20587055 12573858 3808380
2192 3808380 -4269876 -12010487 -20242694 -28929053 -37056379 -44858071 -52033073 -59301080 -66486934
2183 -66486934 -73961776 -80962562 -86427102 -93691549 -99308459 -105132247 -110808361 -116372937 -122394799
2174 -122394799 -128620272 -132099177 -136617485 -141791034 -146655617 -150036531 -153608530 -157155057 -161852172
2165 -161852172 -165589749 -168788544 -170325081 -173358061 -174920699 -176746974 -178562950 -179417904 -181886594
2156 -181886594 -183610864 -183823378 -184058730 -184228273 -184497353 -184363910 -185397891 -183529658 -183570984 -183597020
2146 -183597020 -182004940 -180877998 -179365080 -177903477 -175826456 -174871541 -172541673 -170648998 -168291476
2137 -168291476 -166248825 -163348805 -160340008 -157894918 -154424614 -151901522 -149352265 -145298755 -142301362
2128 -142301362 -137624323 -135209124 -131385636 -127967763 -124016040 -120937032 -116659164 -113885565 -108894934
2119 -108894934 -105438063 -101695415 -97861649 -94402689 -90612859 -85615326 -82452158 -78207743 -74222232
2110 -74222232 -70316032 -67003319 -63866790 -59428967 -55850196 -53317864 -48921366 -45192032 -42253740
2101 -42253740 -39282818 -35688404 -33207627 -30727406 -27226722 -24071087 -20835361 -18395708 -16489311
2092 -16489311 -13636120 -10491027 -8492104 -6968610 -4125870 -2396292 -1945795 1145771 3315253
2083 3315253 2866933 4437300 6959804 7374804 9212415 11117910 11825499 13013774 13102488 14102239
2073 14102239 14407127 16324724 16576319 17345824 17766211 18307931 18640361 19803160 21176654 20900235
2063 20900235 20768636 21327342 21918654 21832706 21957386 22644633 24086922 25068893 26261234 25742554
2053 25742554 25779502 27613701 27929187 28570911 29001523 29309881 30633278 32265926 32846484 33635065
2043 33635065 35226813 36086660 37959406 39161893 41975177 43463896 44957548 47531551 49570760
2034 49570760 51254791 53225732 55912464 58806991 60628310 64358003 67638281 70156152 73923235
2025 73923235 77659100 81176031 83604265 87828055 91535570 96218888 100050739 104483815 108335816
2016 108335816 112859888 117424995 121709667 126671678 132325640 137976718 140696720 145344485 149617671
2007 149617671 153156069 159084690 164729701 168882728 172146052 178057728 183373324 188866777 194450467
1998 194450467 198614112 204984899 207669463 212874743 219237620 223359050 227792951 232824556 238141103
1989 238141103 241860939 246150000 250311615 255184093 260122948 265202333 269123624 272354161 277085578
1980 277085578 281092329 285886845 288511164 293957637 297815065 301735373 304686659 307643825 311370818
1971 311370818 314505361 317137210 321589858 325489665 327381824 330685008 331911365 335498465 337036443
1962 337036443 339293137 341509011 343253146 344746501 346029288 347173973 349354464 350132627 350725826
1953 350725826 350599173 351531496 350774915 351629210 350902188 349521393 348812289 348001417 346122452 345561109
1943 345561109 341741031 340115194 337028615 334721024 330904318 328373370 324662873 319503527 315720698
1934 315720698 311549103 306852366 301261431 295512165 290090855 284838062 277630474 270953785 265471970
1925 265471970 259770318 251713954 244946551 237755132 229986190 222417256 213741902 206227453 197842228
1916 197842228 189092955 181642896 174308778 164966273 156037216 147420061 139399545 129787828 120912124
1907 120912124 112071406 103748255 95150954 86544935 78148281 68858975 60158746 51529329 42174139
1898 42174139 34883773 25955815 17593702 9117355 965092 -7324780 -14836213 -22498868 -30486844
1889 -30486844 -37474204 -45282371 -51894543 -59074988 -66106954 -72107453 -79457242 -84587670 -89603767
1880 -89603767 -95713669 -101837843 -106446017 -111162993 -116350622 -120783382 -125346362 -128466141 -131946270
1871 -131946270 -136493874 -138878977 -140863480 -143065286 -145512010 -146935496 -148747533 -150005776 -151535448
1862 -151535448 -151588037 -152288478 -150839995 -151411377 -151140192 -149547341 -149483494 -148544211 -146051417 -145147726
1852 -145147726 -143242034 -140867053 -138597689 -133833162 -130826387 -127535154 -123745897 -119492569 -114049150
1843 -114049150 -109626306 -106159749 -101716627 -96339975 -90529599 -84642715 -78351170 -73888066 -67383562
1834 -67383562 -60891883 -54792223 -46203079 -40934772 -33445140 -26495860 -20550949 -12977057 -6113951
1825 -6113951 2008856 10058382 18284767 26205604 34100078 41440574 49528245 57859159 65803884
1816 65803884 74520330 81650306 90141805 98401739 105417112 115214283 122001245 130014330 137127136
1807 137127136 146418253 154165672 162726072 168621690 176585756 183695388 191274797 198113929 204325400
1798 204325400 211795352 218468020 223871189 230164016 236628402 243117831 248684052 253813278 258386617
1789 258386617 262929778 267151157 272303162 276102561 280181707 284286738 286935944 289785672 292473402
1780 292473402 295462931 298721703 300448785 301884404 303477324 304982590 306722109 306335559 307966075
1771 307966075 308604960 308954886 308525754 308772252 306895509 305754067 304859341 303623427 301433247 301338785
1761 301338785 298673403 296640621 294143177 291800252 289346714 287042812 284256426 281291456 276790437
1752 276790437 272180889 267831574 264589199 260636987 256061965 251406258 247694129 242154879 237353008
1743 237353008 232737710 226493355 222080354 216392188 211337818 206471092 200963220 195052414 189358561
1734 189358561 183777536 177588732 172334897 166469622 161386598 154887839 149634740 143029876 137497821
1725 137497821 131518895 124775391 118606650 113760995 107054088 101144426 96987641 91764654 85943860
1716 85943860 79063484 73371588 68778897 63577061 57756470 51461014 46276664 41355359 38257626
1707 38257626 32868855 26455609 22974926 18085591 13424401 10281140 5178041 1904313 -2895520
1698 -2895520 -6732400 -9763638 -13474726 -17678613 -21685714 -24257937 -28573640 -31444812 -33875922
1689 -33875922 -37334746 -40846947 -43083235 -45610014 -48155888 -51015642 -52685697 -55232827 -57657431
1680 -57657431 -59706018 -61514049 -62680752 -64171666 -67187591 -68795424 -70617107 -72081553 -73070229
1671 -73070229 -75680258 -77037100 -78122776 -79550669 -81839796 -82713602 -84524500 -85236885 -87038217
1662 -87038217 -87161125 -89480065 -91137407 -91700131 -93099745 -95239075 -96929130 -98840528 -100259383
1653 -100259383 -101554760 -102701130 -105464412 -106998114 -108496442 -110009322 -111214844 -113065931 -115499206
1644 -115499206 -117127016 -119492265 -120692194 -123297904 -125666518 -128985174 -131610671 -134536045 -137285925
1635 -137285925 -139916412 -142302340 -144823457 -148102293 -149874065 -153291668 -156994029 -160486797 -164234748
1626 -164234748 -167186081 -171458846 -173769284 -178242626 -184016874 -186519283 -190544951 -194518003 -198111504
1617 -198111504 -202116154 -205028954 -209544906 -212609043 -216473893 -221588991 -225907679 -229634661 -233472696
1608 -233472696 -238627396 -242034003 -246633174 -250747575 -254813929 -259370298 -263340140 -268889001 -271942291
1599 -271942291 -275975867 -278695549 -282231023 -286935294 -290265040 -294006983 -298781535 -301884189 -304497286
1590 -304497286 -307275412 -310687979 -313813327 -315906360 -318327329 -320591862 -322716285 -326336446 -328283304
1581 -328283304 -329985232 -331227969 -332414073 -333474704 -334297427 -335190865 -335802174 -335711051 -336247734 -335941673
1571 -335941673 -336510338 -335898953 -334772530 -333501669 -331242748 -329658420 -328455196 -326350375 -323760137
1562 -323760137 -320663789 -317006860 -315107563 -310991071 -307697085 -303439947 -299977616 -295668406 -290778438
1553 -290778438 -284998928 -278390722 -273512833 -268503637 -262155341 -256494057 -249213316 -241785488 -234760767
1544 -234760767 -227494695 -219517258 -212458343 -203969906 -195951672 -186579590 -177771608 -168823729 -160111893
1535 -160111893 -150620572 -141233190 -131598378 -121937324 -112854016 -102544711 -92112600 -82252781
1527 -82252781 -71904776 -60749950 -51141821 -41096190 -29553211 -19014652 -7224990 3757601
1519 3757601 13389245 24651710 36241043 47082301 57588169 68792126 79332824 89950023
1511 89950023 101481958 111275916 122396302 132613825 142252924 153792473 164834741 174044629
1503 174044629 184132479 193836288 204380621 213377124 223980526 233066839 242257047 250821065
1495 250821065 258920251 266461761 275714251 282778297 290120400 298211174 305584859 313085771 319628743
1486 319628743 324749302 330613501 335871204 342553462 348596283 353321500 357522511 362166184 366552254
1477 366552254 371829999 375244707 378228967 380873468 383302169 384837432 386562202 390887583 391530136
1468 391530136 392296853 393646255 394784259 393650119 392083552 392310006 391515909 390365903 388569669
1459 388569669 386923313 385169173 381630318 378570367 375473273 370990135 367069139 363426324 358318289
1450 358318289 353610262 347031011 341700361 335805289 329171109 323536150 316030304 308505255 300494798
1441 300494798 293776385 285377643 277241688 268824888 260171125 251743259 242791550 233878996 225404914
1432 225404914 216692898 207462280 197631239 188851831 178762044 169636962 159696567 149803046
1424 149803046 139099122 130152542 121160428 111735521 100832071 91135935 81772739 72586139
1416 72586139 63848406 53932146 45063891 35183357 26277832 16688306 8298675 -342526 -9857537
1407 -9857537 -18230385 -26578288 -34300952 -42783552 -52017754 -59514632 -66541598 -74115490 -81723654
1398 -81723654 -89394532 -95983362 -101837069 -108548113 -114630236 -121209649 -128650921 -132550499 -138018143
1389 -138018143 -143272823 -148244216 -152564916 -156682809 -159702211 -165482875 -168397940 -172815322 -174678859
1380 -174678859 -177586360 -180538496 -182870455 -185570091 -187001019 -189364740 -191659322 -192056373 -193417701
1371 -193417701 -193853459 -195077673 -196175662 -195417160 -194607680 -194551190 -193102554 -193534076 -193746546 -191262495
1361 -191262495 -189384013 -189193038 -188068742 -186610258 -184087295 -182387725 -180806227 -177808175 -175298107
1352 -175298107 -173831194 -171262986 -168428483 -166762328 -163905451 -159697710 -156377289 -152747953 -149379354
1343 -149379354 -145914947 -142245352 -138765183 -136110890 -132517891 -128811484 -125482385 -122160824 -118534887
1334 -118534887 -115186644 -110998149 -106628895 -104173909 -99492687 -96710720 -94168891 -90395273 -85541677
1325 -85541677 -82163061 -78813273 -75876195 -73551846 -69846582 -66888353 -64723852 -61627111 -57241156
1316 -57241156 -54394796 -53410546 -50418817 -47808306 -45602714 -42591541 -40260621 -38905036 -39420127
1307 -39420127 -36483596 -33902610 -33904273 -29986391 -27012207 -27401880 -24775663 -25132153 -22364049 -22842538
1297 -22842538 -21436594 -20361319 -19360234 -18429949 -18067704 -17970537 -17693344 -17327379 -15967962 -16322004
1287 -16322004 -16122815 -16226996 -15162606 -16897872 -17406321 -17977690 -17993614 -17463457 -17238083 -17735509
1277 -17735509 -18595597 -18541934 -19624169 -19285955 -20132076 -20881250 -20576741 -21345255 -23121918 -23173841
1267 -23173841 -23634249 -24113546 -24687914 -26544943 -26406887 -26631251 -26945871 -27972553 -27681090 -26775278
1257 -26775278 -27275489 -27764502 -27883220 -28713071 -28294766 -28655305 -26815348 -27109278 -27861822 -27816837 -27722920
1246 -27722920 -25906904 -25127095 -24774331 -26939287 -26457549 -26409569 -24025699 -23575132 -23976606 -22954543
1236 -22954543 -21767515 -19828576 -20252956 -19148604 -17332722 -17720796 -16579091 -15028222 -13910153
1227 -13910153 -13723830 -13111522 -12852463 -11216953 -9662064 -8564780 -7929635 -5415977 -6126747 -4500126
1217 -4500126 -4639983 -3016307 -1668450 -1271854 -313780 -734980 -266148 488992 1161293 2079155
1207 2079155 1494394 1858151 131008 530936 1166399 184773 -377720 -987901 -2853636 -3325599
1197 -3325599 -4491570 -5874765 -6766392 -7514830 -10127134 -11272225 -13916631 -16622463 -19295547
1188 -19295547 -22493504 -24145583 -27581847 -31700522 -35041613 -40231966 -43526501 -47870731 -52814845
1179 -52814845 -57880084 -62832093 -67911205 -73014892 -79865750 -86492302 -91555140 -97940770 -105532202
1170 -105532202 -112648087 -119974650 -126557856 -134451055 -143166393 -151897909 -159704766 -168536828 -177851004
1161 -177851004 -187500970 -196224021 -205363402 -215880802 -224693554 -234851825 -244750005 -256211256
1153 -256211256 -268197921 -278458056 -287741487 -298882195 -310981203 -322978397 -333307167 -346117902
1145 -346117902 -356250929 -368922645 -380562294 -393217672 -405563461 -416823790 -429713928 -441991433
1137 -441991433 -455432282 -467684813 -480151997 -492396055 -504943399 -517347355 -530231294 -542645852
1129 -542645852 -554468279 -566267987 -578863559 -591123878 -602935394 -615359344 -626829073 -637637055
1121 -637637055 -649347067 -660908812 -672332271 -682636303 -692730552 -703562599 -714361201 -723343266
1113 -723343266 -732242606 -742250466 -752436000 -760812403 -768116366 -776990679 -784075429 -792085133
1105 -792085133 -799223726 -806738442 -812873512 -818902091 -824757742 -828890819 -833794034 -837798969 -840897435
1096 -840897435 -844382030 -847113990 -850139662 -852480102 -853964295 -855633237 -855207164 -855329623 -854388527
1087 -854388527 -853237827 -851834258 -849564511 -846242359 -843966668 -839833977 -835644755 -830845385 -826249130
1078 -826249130 -820633181 -813732167 -807170339 -800600459 -793021459 -783624303 -775060600 -765554555 -755759552
1069 -755759552 -743880673 -732557942 -720737411 -709412253 -696373459 -682841550 -668212652 -652613464
1061 -652613464 -638084697 -622182180 -605951698 -589114090 -572691667 -555237205 -536681289 -517720369
1053 -517720369 -497418331 -479771673 -459724181 -437368645 -415831221 -394072792 -372817453 -349819127
1045 -349819127 -326296652 -302342573 -278149749 -254233679 -229232031 -202928683 -177390134 -152411041
1037 -152411041 -124879125 -97850668 -70679854 -42146724 -13145783 14725294 43676517 72593619
1029 72593619 103949234 133052719 162476592 191846479 223271886 253843705 285154132 316256404
1021 316256404 347625447 378390292 409475055 439361027 470939666 501791885 533150291 563578721
1013 563578721 593935361 623414803 652864877 682403458 712181142 741475869 769368755 796967905
1005 796967905 825491134 852221587 879121838 904365383 930014205 955208101 980581622 1005324250
997 1005324250 1028843457 1052853428 1075697201 1097857944 1121348974 1143074816 1164443479 1186140796
989 1186140796 1207735904 1229131662 1248867034 1268752626 1289811965 1310152635 1329832579 1349288845
981 1349288845 1368711394 1388868524 1408037293 1427437434 1446921019 1466410944 1485115777 1504119308
973 1504119308 1522632993 1540863981 1559515942 1577691521 1595732629 1612588729 1630788826 1647390007
965 1647390007 1665270022 1681379449 1697365680 1714031592 1729651606 1744484227 1759265999 1773660160
957 1773660160 1787726738 1802096246 1814259292 1825585321 1838063842 1849132246 1859067410 1869468656
949 1869468656 1879233019 1888138338 1898414561 1905883047 1914107199 1920051595 1927596890 1933540838 1939002078
940 1939002078 1946249422 1951859327 1957409095 1961418973 1966276659 1971003776 1975442435 1979577772 1984058890
931 1984058890 1986686352 1990486744 1993540824 1997609061 2001665646 2005179012 2009323085 2011987112 2014799681
922 2014799681 2018326511 2020368156 2024430351 2030268388 2032782418 2035905988 2039648277 2042941032 2046105053
913 2046105053 2051070912 2053795848 2056733923 2061692184 2066469583 2069245690 2073937073 2077902840 2081891686
904 2081891686 2085838230 2089402457 2094181307 2098419654 2102945032 2106476322 2110264446 2114047142 2117234926
895 2117234926 2119989759 2124323465 2127334124 2130035545 2133605860 2135539865 2138021915 2140215844 2143291483
886 2143291483 2145936609 2146369787 2145413666 2146765624 2147483647 2146555390 2145283958 2143630021 2142335401
877 2142335401 2139598512 2136374261 2131657728 2126697069 2121840735 2115617436 2108291549 2100613293 2091213845
868 2091213845 2082213350 2072881914 2061772031 2051228185 2039318902 2025015364 2011866997 1997576756
860 1997576756 1982601585 1966218215 1949574144 1932240398 1914844994 1897357639 1878503069 1860415464
852 1860415464 1840472840 1827263241 1803358061 1777810964 1757231840 1735255382 1713777742 1691805898
844 1691805898 1669526990 1645722152 1623098524 1599757612 1577299514 1553095678 1529025757 1505490480
836 1505490480 1481157945 1456614075 1433347885 1408115815 1382138774 1357343123 1333149410 1309069737
828 1309069737 1283790912 1258628364 1234050837 1207713290 1183373940 1158060050 1132678282 1107048435
820 1107048435 1082438170 1057001927 1033583910 1007509756 983325394 960017428 933363674 909740899
812 909740899 885180433 860518710 836828559 814443506 789779383 765775195 743418698 719788236
804 719788236 696811060 674221394 651935610 629985143 608305740 586005370 564009337 542480391
796 542480391 522465314 502084907 482022909 462664887 442918125 423108096 404351991 385483516
788 385483516 367374728 350064587 333076179 315643696 300046434 283865307 266186991 251198304
780 251198304 236321343 221664584 207932596 193944147 180597132 167948409 154934018 143748318
772 143748318 131470995 120351377 110061529 99149218 89979530 80145454 70970076 62205429
764 62205429 54312284 46199956 39231737 32964632 25531903 19787081 14462856 8622309 4116545
755 4116545 -28133 -3756740 -6911095 -9614601 -12723749 -15292941 -17206350 -17958139 -20868860
746 -20868860 -20481448 -22000693 -20747425 -20423587 -20240746 -19155527 -17817808 -16464650 -13430903 -12490549
736 -12490549 -10347329 -6904866 -3900398 -2287521 585467 4236635 8874053 14535055 18480443
727 18480443 22500048 27405886 31885712 36149583 42411530 47215326 52076124 57582475 63956673
718 63956673 69349890 75475633 81107894 86054178 91804032 99009946 103921632 111488215 116655096
709 116655096 121785462 127621401 134414661 139596801 146397195 152866345 159894399 165535491 170579216
700 170579216 175643537 181332287 187401384 193150426 199236325 205039540 209496913 215253292 220345835
691 220345835 224767984 229425182 234165635 239464772 244540218 249261420 252749757 256929751 262258064
682 262258064 266204912 269576152 272878552 276289270 278607453 282133247 285985076 289816623 292839189
673 292839189 294578248 298145633 300364706 301602484 304550954 306996932 309087061 310404071 311772193
664 311772193 313755964 315070907 315798452 317141326 318576251 319565309 320286346 321816923 321301606
655 321301606 323443370 324672286 324640257 323918982 325278373 325995215 326585900 325818068 325839808 325155818
645 325155818 326574357 325753805 325621677 325592108 325519385 325589737 324953625 325187306 325731423 325041875 325938466
634 325938466 324696318 325803059 325515792 324644469 324532832 325347497 325144437 324154092 324635980 323665603
624 323665603 324417073 324410343 325702281 325176898 325187934 326168970 325241063 326553099 327701701 327415997
614 327415997 328678390 329908034 328690218 331071649 331659971 331246092 333112845 333250276 334317930
605 334317930 335331468 335689702 338412508 338391719 339577100 340690807 342115260 343837991 344672579
596 344672579 346650627 346948245 349235378 351201814 351841565 352931992 354048377 355587877 357494540
587 357494540 359078958 360629718 361540020 362413907 363907142 363736516 365286489 367421492 368800364
578 368800364 369560271 371090659 371502911 373170963 373417770 374873863 374910368 375316462 377381540 377083233
568 377083233 375046371 376505756 376212595 376878734 375653168 373942096 374090277 373779353 372884153 372886365
558 372886365 371568776 369543794 368007633 366046407 364464544 361945781 359965057 357014481 355096561
549 355096561 352891236 350861607 346463640 344290266 341002875 338226286 332337440 329344097 325753017
540 325753017 321550550 315469327 310716796 306538349 300233575 295689137 290339231 285081414 278816333
531 278816333 273372822 266861044 260883483 254268259 248021111 241033278 235238239 228258233 221889620
522 221889620 213862570 206261673 199048694 190886285 182947086 174207335 168190611 160000916 151467378
513 151467378 143452513 135568732 127151252 118319469 109076949 100919591 91932245 85147556 76590592
504 76590592 68549983 60927116 51521245 42457472 33119263 26004220 16764288 9220000 372361
495 372361 -7626931 -16435859 -25003479 -33082941 -39884161 -47933563 -55474410 -63164715 -69920548
486 -69920548 -77082912 -82871047 -90072853 -98400982 -104509007 -111136020 -117424639 -123161653 -129542013
477 -129542013 -135076388 -140331180 -146589252 -151259494 -156420860 -162590866 -167029086 -170840454 -174464119
468 -174464119 -178266362 -181864251 -185221396 -188705066 -191584068 -193505054 -196548001 -197782298 -199960545
459 -199960545 -202616142 -203279044 -203401819 -204741703 -206313862 -206316269 -206177538 -206738933 -205937844 -206034539
449 -206034539 -205551073 -203404887 -203284161 -201231129 -199861212 -197457425 -195003677 -192116513 -190990881
440 -190990881 -187896164 -184333286 -181613228 -178403888 -175075775 -170950355 -167181890 -163826664 -159701932
431 -159701932 -153893973 -149843736 -146118301 -139769438 -136712569 -131519939 -126208102 -120431824 -115099457
422 -115099457 -109469165 -103797715 -97208401 -91881189 -86692349 -79317588 -74102566 -68766771 -64009348
413 -64009348 -57666302 -51643155 -45437467 -39830999 -33473137 -27260721 -21268838 -15151180 -9299824
404 -9299824 -3907481 2191824 7772612 13344819 18072108 23685289 30133519 35265456 39403198
395 39403198 44132881 49539848 55061545 59319241 64675029 68246095 72173100 75950536 81303480
386 81303480 85350476 88062031 91129209 94262639 97921913 102373364 105045761 107817393 110609165
377 110609165 112372152 114732321 116991860 119082462 120271749 122942279 125360547 127036234 127878784
368 127878784 128938268 129186137 129252577 130803851 130359536 131172432 131135659 130626573 131628450 130895206
358 130895206 130044974 130450439 128722308 127840629 126744416 125947316 125795591 123979597 123521758 121080746
348 121080746 119487374 118202399 117601772 115252103 113862754 111485661 110815938 108516505 105826402
339 105826402 102776501 101477310 99854310 97682056 95087573 94405325 91680400 89622214 87087546
330 87087546 84519131 82398043 80779907 80382248 78306169 76291043 74926624 74006775 72397045
321 72397045 70509192 68907340 67782164 66749111 64500930 62957361 63163488 62049765 62139767 62136349
311 62136349 60602951 59994245 59281539 58799540 57968519 58058980 58042467 58781532 60137632 60608011 60030432
300 60030432 60383375 60984842 62010223 63848928 64866385 68046059 68936108 68632269 70366574 73106189
290 73106189 75096453 77774775 80261457 82798946 84187452 86706627 88959919 91690161 94751516
281 94751516 97443764 100250275 103655450 105898655 109402277 113785610 116699139 119450242 122336918
272 122336918 125068788 129080227 133337664 135907068 140107343 143209780 146358247 149156373 153161425
263 153161425 157381876 160320680 164524313 167576808 171374517 174460047 178292296 181496198 183764621
254 183764621 187441770 190321320 192876902 196824607 199147534 202220563 204841291 208531369 210676975
245 210676975 212529916 214060899 217111406 217381560 220724368 222655599 225040715 225497622 226279954
236 226279954 227356616 228883127 230078065 230409544 231207029 232089938 232508306 232642551 232402911 232257980
226 232257980 231246077 231762443 230100456 229298980 229721652 228234296 225305859 223772184 222212494
217 222212494 221879550 219521673 216074856 215068691 212629224 210447264 207792288 204672972 201796881
208 201796881 199023475 195559826 192181613 189007023 184918694 181395191 175824042 173072288 170731190
199 170731190 165121617 161821269 156885311 152976841 149731505 144504400 140733551 135748477 130513700
190 130513700 126229350 121447265 117304932 111506221 107030549 102415187 96978492 93320913 87777515
181 87777515 83307214 79437411 74248950 70416056 65409667 60193574 55696769 51982908 47471228
172 47471228 42442806 39008240 35498906 30887336 27415483 24256375 20375808 16787390 13550137
163 13550137 10513767 6803464 2602290 269593 -2688062 -4468251 -6745944 -10611161 -12736938
154 -12736938 -15895859 -16174390 -17684281 -19935355 -21467774 -23672331 -23699417 -24796301 -25642013 -26009818
144 -26009818 -26342815 -26305876 -26956855 -27600365 -26207177 -26165138 -26626728 -24938447 -24710230 -24174779 -24117885
133 -24117885 -22360874 -21311178 -19438812 -18486216 -15661937 -12502058 -10209109 -8232118 -7811190
124 -7811190 -4554490 -2492293 241722 3308790 6035458 8670125 11700821 13746656 18502669
115 18502669 20696304 22836969 27543266 30026735 33546558 37468097 40109716 44477386 47840704
106 47840704 51302498 54253702 58094148 61478751 64464886 67948849 71729684 75331233 79181468
97 79181468 81696053 84795836 87788366 92597804 95270693 98519082 101168487 104996075 107528337
88 107528337 109301231 114303114 115406693 117467381 119671870 122020032 124636293 125945587 128000845
79 128000845 129304041 131096517 132558180 133662469 133800993 134665466 135784352 137407522 138952914
70 138952914 139081277 139176178 139311951 139368690 139076078 138539910 138193130 137496176 136712694 135893693 135384429
59 135384429 134692186 131753466 130394870 128459161 127393707 124571761 122492780 120898639 117144974
50 117144974 116054276 114580659 111343341 109214041 105817071 101783814 100142772 96080157 93972088
41 93972088 90610369 86317956 82793996 79276134 76145859 72186923 68515271 64252730 61274824
32 61274824 56252483 52418518 48478085 43331599 39985038 37011151 32284623 29532098 25521610
23 25521610 20824097 18367560 12555156 8944575 3730193 -326254 -4578617 -7242337 -11031432
14 -11031432 -14827195 -18259966 -21850256 -25368007 -28135890 -31944488 -35774567 -38321550 -41399440
5 -41399440 -44810315 -48311572 -51096321 -54026565 -56187284 -58750726 -61515354 -63907750 -65528098
-4 -65528098 -67320697 -68846708 -70226762 -72150949 -74523803 -74545682 -76308114 -77804055 -78140082 -78690576
-14 -78690576 -79416462 -79880178 -80589780 -79991457 -80045127 -79872707 -80971260 -80409385 -81130285 -80284231
-24 -80284231 -78987897 -77480426 -77714387 -76012459 -75466647 -73596040 -72032667 -71305780 -69253335 -69028624
-34 -69028624 -66973816 -65548616 -62516030 -61228113 -58724651 -57356979 -54568608 -51741281 -49793579
-43 -49793579 -48474527 -46732774 -44031269 -41800633 -38689715 -35698934 -34573628 -31312606 -28703910
-52 -28703910 -27344822 -24173627 -21583949 -19434302 -16535719 -16017187 -12757135 -8908565 -6495567
-61 -6495567 -5746790 -3038222 -1810565 -1327460 3117664 4853828 6981130 9176423 9757659 12181715
-71 12181715 13284673 15170853 16561840 17694853 18275265 19310042 20039933 20747122 21119968 23539497
-81 23539497 24724673 23678560 23915092 24215902 23797730 23981368 24377804 22529724 22644879 21987307
-91 21987307 21363025 20318708 19037094 18986752 18434182 17241813 15709228 13429899 12478739 10880714
-101 10880714 9377369 7247420 4247337 1969575 279682 -3146869 -5777605 -7520014 -9681105
-110 -9681105 -12374755 -14577806 -17911050 -20077565 -23415773 -25439618 -29696728 -33568381 -36116602
-119 -36116602 -39436026 -43317099 -45377250 -48160285 -51875783 -56139007 -59213971 -61796959 -65348130
-128 -65348130 -68650358 -71785396 -74485855 -78813835 -80470037 -84324042 -87811848 -90816980 -92939325
-137 -92939325 -95762854 -98323591 -102108760 -105085794 -106612175 -110125173 -112836893 -115131882 -116732205
-146 -116732205 -118218201 -120347387 -123122574 -125431891 -127563204 -127901817 -129142450 -130549936 -132257978
-155 -132257978 -133676362 -134174463 -135319927 -135434236 -136145571 -137363823 -137344695 -137044917 -137196934 -137580898
-165 -137580898 -137717619 -136274171 -135415355 -135229552 -134411206 -134933021 -133467010 -132825207 -131215003 -128825538
-175 -128825538 -126601055 -124357985 -122425948 -120921481 -119262187 -117018493 -113927958 -111304656 -108228013
-184 -108228013 -105971358 -103719162 -100065187 -97890984 -95207134 -90851937 -88134029 -84182671 -81202545
-193 -81202545 -77939634 -73510644 -69375508 -65879255 -62122698 -57837256 -54906027 -51283247 -46797955
-202 -46797955 -42803195 -38308496 -34583642 -30007386 -25719918 -22504371 -17948879 -13834029 -9239530
-211 -9239530 -6313386 -2428005 2318783 6372160 8752486 14274753 17654118 20136575 25588821
-220 25588821 28826549 30871501 34718056 38281262 41196347 44110194 48375968 51715675 54268741
-229 54268741 55100734 58087109 61659107 64362667 64822138 67641535 69219472 71049301 73732321
-238 73732321 74524064 76182519 77397971 78586774 80378092 80349957 80890121 81653180 81268976 82536557
-248 82536557 82257391 83360853 83252511 83712067 81453827 82418759 80225693 80393283 78491539 78151739
-258 78151739 76451061 75589260 72786069 72501873 70716710 69084633 67063475 64435424 61592211
-267 61592211 58957791 56576363 53678679 52126028 49370795 46602144 43811047 41121775 38890374
-276 38890374 35057005 30964595 27356380 24878528 21076484 17413081 13491848 11721535 9126771
-285 9126771 4563664 579952 -3308277 -6564386 -9184221 -13166368 -15921769 -19868614 -23427455
-294 -23427455 -26913204 -31330924 -34940678 -38044547 -40610514 -44604102 -47775995 -50435924 -54061036
-303 -54061036 -57189979 -59184584 -62457032 -64724289 -68623522 -70651330 -73954748 -76455832 -77752675
-312 -77752675 -81532738 -83508274 -85759003 -87977908 -88809630 -90338171 -92320094 -94143043 -96238327
-321 -96238327 -97346356 -98132288 -99941947 -102124618 -102377177 -103431038 -104156013 -104518264 -104946603 -105529569
-331 -105529569 -105221858 -104086220 -103923539 -105160220 -105850523 -104545765 -104355117 -103712450 -103280826 -101732821
-341 -101732821 -102060964 -101449967 -98900921 -99386757 -98000625 -96187713 -94605765 -92421751 -91627572 -91637156
-351 -91637156 -89425322 -87778298 -86952322 -84760653 -82114799 -80339697 -78658383 -75603008 -74402275
-360 -74402275 -72423815 -69876080 -68314237 -65644018 -64340525 -62205913 -59899377 -58203095 -56491917
-369 -56491917 -53900508 -50990131 -49066084 -46822678 -44306651 -43020125 -40917108 -39283246 -36368229
-378 -36368229 -36443869 -34536616 -31578830 -30859652 -28561190 -27590785 -26270502 -24094547 -23510744 -21713255
-388 -21713255 -20495465 -19298111 -18456224 -18444930 -17141323 -15624687 -15393019 -15421434 -14193280 -14245484
-398 -14245484 -13330509 -13313251 -12772714 -13254852 -12569380 -12528294 -14272548 -14655602 -15188077 -15397193
-408 -15397193 -16512106 -15867021 -15901280 -18588972 -18472405 -20779751 -21230258 -22961720 -24122263 -25308438
-418 -25308438 -27610696 -29469798 -30823465 -32718872 -34911668 -36591197 -37138073 -38895640 -40699757
-427 -40699757 -43581405 -46096168 -47722865 -49031563 -51915526 -54208299 -56499779 -58624268 -61458659
-436 -61458659 -63491912 -66209295 -69017259 -70432021 -72379031 -75632190 -76830168 -78717934 -82074504
-445 -82074504 -83701871 -86705342 -89686812 -91332952 -93028564 -95665701 -96698105 -98641438 -101542115
-454 -101542115 -103337922 -104037414 -105503618 -107626643 -109211900 -111425150 -113463090 -114516423 -115969616
-463 -115969616 -116359976 -119054765 -120253852 -119525534 -119738812 -121078895 -122881737 -123348583 -124730544
-472 -124730544 -124982068 -124062153 -124296602 -125910157 -126156607 -124408711 -124813930 -124579682 -124131628 -124548179
-482 -124548179 -122575700 -122861859 -121708888 -121463487 -120042086 -119628025 -118008355 -116847494 -116029832
-491 -116029832 -114317796 -112753366 -110283349 -109417236 -107184936 -104723879 -101653209 -100468442 -99413593
-500 -99413593 -96748879 -95789129 -93405523 -90853688 -87621311 -85136398 -83720842 -81913527 -79109942
-509 -79109942 -76578561 -74862247 -71549654 -69075952 -67027566 -63247495 -61770495 -58352714 -55935323
-518 -55935323 -53813333 -50066520 -47443448 -46164604 -45337854 -41669765 -38848584 -37325597 -34596852
-527 -34596852 -32667236 -30034437 -26828584 -24394323 -23558537 -21237320 -19623691 -17204471 -14721337
-536 -14721337 -14043372 -12571011 -11266390 -10841655 -8624313 -6818964 -6291832 -4776922 -3672249
-545 -3672249 -3241709 -1757858 -1228045 -707674 -653527 -552574 356641 288474 795088 1024001 490310
-556 490310 -715658 -1073681 -560673 -281670 -1386859 -2514824 -4267133 -5576692 -5787545 -8115468
-566 -8115468 -9740671 -10133015 -13040709 -14155846 -15842905 -18274924 -19329463 -21379569 -22979265
-575 -22979265 -25344249 -27782230 -29923464 -32073628 -34393979 -38885013 -41093678 -42869818 -45071324
-584 -45071324 -48977365 -51613151 -55042828 -58280239 -60919411 -62402818 -65936077 -69741316 -71479378
-593 -71479378 -74505242 -78093828 -82034056 -84787980 -87886765 -90489996 -93400997 -95630580 -98689327
-602 -98689327 -102359178 -104718853 -107900302 -111298113 -113540142 -118830691 -119971752 -121353700 -124695525
-611 -124695525 -127524897 -129579896 -131625005 -133144921 -134889381 -136771059 -140570309 -142808287 -144707034
-620 -144707034 -145724973 -147045503 -148646530 -150657447 -152259326 -153182213 -154742874 -155557710 -157433167
-629 -157433167 -156737864 -155952116 -157439169 -158758943 -159735836 -160003086 -159055309 -159074633 -158817811 -157891124
-639 -157891124 -158422558 -157573562 -157163178 -156049418 -155214200 -154272609 -152559662 -151406357 -150456106 -149231362
-649 -149231362 -148113952 -146173707 -143927834 -141979302 -140186446 -137397814 -135840441 -134005158 -130766252
-658 -130766252 -127673276 -124222266 -122369520 -119737002 -117499589 -112990208 -111002284 -108360398 -103732534
-667 -103732534 -101353254 -98316844 -95018872 -91157811 -88747734 -84757823 -81048488 -77085726 -73417331
-676 -73417331 -69985150 -66561683 -62840772 -60519415 -56690264 -51964030 -48892037 -44004777 -41633088
-685 -41633088 -37358930 -33078498 -30431520 -25970581 -22413145 -19512475 -15686370 -12640720 -8205047
-694 -8205047 -5463702 -1963403 1536181 4084446 7010559 10363912 13666499 15713893 18108312
-703 18108312 21344357 24082632 28839097 31545511 34595487 36467985 39687310 41751068 42997893
-712 42997893 45269326 47035770 49224196 52480005 54157653 55273823 57454322 59418582 59527075
-721 59527075 61763985 63528403 63194226 66223955 66952108 68440044 68409067 68692372 72205597 71692500
-731 71692500 72283895 72483226 72418419 72786660 74535161 75290034 74711298 75554509 74741946 74817080
-741 74817080 75859160 75360824 74012605 75655422 74409516 73760779 72696322 73319610 74042386 73647811
-751 73647811 72523317 71987860 72241044 71792266 70846708 71277081 69630573 69702852 69357848 67913290
-761 67913290 68115013 66364458 65945412 66023206 64777787 64430221 63778508 63132170 63896817 62371096
-771 62371096 62347840 63209206 63029272 62153014 61408133 62738018 62669266 61934110 61538563 60831873 60809925
-782 60809925 61547763 62493160 61522066 61431554 62661385 64000405 63433058 63161963 64441017 65465596
-792 65465596 65046396 66973018 67586560 67760496 68680505 70363395 71298812 72125041 72482253 73598507
-802 73598507 75924166 75577307 78681963 79395974 80499407 82496098 84159968 85642717 86157671
-811 86157671 88857001 89555355 91123826 93514027 95850473 96907482 98780926 100341267 102272024
-820 102272024 103523131 105387326 107328911 109388975 110481525 113233358 114572742 117478427 119774720
-829 119774720 121018405 122165633 123484692 125453642 127338270 128469469 130564519 132458479 134517989
-838 134517989 135932546 137323892 139420616 141478528 142199868 143576109 144477148 146297856 146606918
-847 146606918 148661178 150320785 152957169 153522258 154161880 154980183 155644904 155575221 155730111 156447196
-857 156447196 157859310 159764084 159469761 159523708 159165933 160394852 160518923 160819736 160156456 160429035
-867 160429035 160471292 160554954 159992708 159212827 159291406 158584073 157880151 157969430 156339100 155062913 154723252
-878 154723252 154402141 152399908 151581377 149732761 148415197 148623307 146473619 144954363 143035859
-887 143035859 141676043 139909116 138473542 136579482 135774976 133830256 131440405 128637305 127415408
-896 127415408 125583365 124568218 122669852 120049406 117633261 116808606 114200834 111347550 109646482
-905 109646482 108109750 104432541 103358480 100733118 99428123 97681972 94972792 93094813 90950108
-914 90950108 89160880 86842532 85335757 82537313 80803346 79541008 77408089 74413972 73878450
-923 73878450 72767605 70616449 68193959 66342257 65003820 65097160 63292275 61835634 60497524
-932 60497524 60035925 58950774 57645147 56179754 55097175 53879521 52361021 52237541 52493772
-941 52493772 50948040 50054192 49797688 49286612 50130215 49563364 48324765 47538427 49048029 49792487
-951 49792487 49655092 50219856 50330005 50855313 50498038 51554508 52453802 52982214 54295773 54724119
-961 54724119 55216175 56143272 57473045 58824595 59541444 59978163 61027471 62913608 64179618
-970 64179618 66239072 68122892 69164936 70294191 72149856 73405203 74124317 75738437 77388270
-979 77388270 78938872 80114889 81996466 84643959 86661837 88423602 90031434 92320983 93939412
-988 93939412 95710132 96818618 97709943 100243630 101958988 103413633 104237989 106784102 107613548
-997 107613548 108992603 110162867 112078672 113764622 114530614 115287382 116364875 118355886 120015441
-1006 120015441 120917488 120703860 122205811 123867111 124676392 125177589 125758246 126626406 126183748 128118409
-1016 128118409 128846938 128240127 129001585 127908374 128030491 129088210 128910139 128593041 128257195 127174261
-1026 127174261 125750776 126092182 124921179 124792717 124715092 123083557 121113322 120961094 119601294
-1035 119601294 118725264 117310899 116931640 116655395 114368949 112817551 110979171 109116883 107161461
-1044 107161461 105819386 102946645 100775482 98852936 96146296 94151557 91681566 90660253 88374162
-1053 88374162 86629916 83517151 80543597 78002537 75296319 73423401 70681100 67949284 65257619
-1062 65257619 62215603 59710824 56964666 54106745 51976169 48463107 45347047 43304302 40014776
-1071 40014776 38099150 35106399 32587765 30016214 26138188 24373919 22397548 19794467 15971730
-1080 15971730 13306003 10173055 8056125 4452774 2558908 144635 -1633014 -4390720 -5964887
-1089 -5964887 -7228265 -10463045 -11833949 -15997836 -17739661 -18916948 -21459856 -23937342 -26163086
-1098 -26163086 -27716667 -30119499 -31872188 -33185964 -33801620 -35989586 -37457176 -39323418 -41182416
-1107 -41182416 -41776266 -42329271 -43626917 -45328692 -45901168 -47492765 -47398255 -48173111 -48962098 -50006102
-1117 -50006102 -51047108 -50801129 -51961774 -51393716 -51004639 -54705345 -54052003 -53005343 -52974812 -50515850
-1127 -50515850 -55300203 -54614442 -50035349 -50988918 -51886089 -55260971 -53195052 -55374587 -56599186
-1136 -56599186 -55615158 -52232177 -51163686 -51797830 -51153209 -51139747 -50274290 -49705058 -49656355 -48768998
-1146 -48768998 -47739378 -46724084 -46499303 -46417294 -46313787 -45656250 -44594573 -42341758 -44266862
-1155 -44266862 -42214073 -41141250 -40863881 -39249166 -39129992 -39923581 -38852237 -38745259 -39367478
-1164 -39367478 -37365423 -36445526 -36300985 -34171772 -35261156 -34025502 -33455729 -33329163 -34381575
-1173 -34381575 -32962344 -32185970 -31972308 -31393712 -31451472 -31263448 -30450213 -30259083 -30701268 -30737788
-1183 -30737788 -31517389 -31543848 -31153025 -30421611 -29554036 -29802054 -30346424 -31126130 -29596718 -30482466
-1193 -30482466 -31107547 -31734693 -31438272 -31595050 -32715207 -32993002 -33064225 -33827829 -33978720 -33957677
-1203 -33957677 -33811775 -34275954 -36264795 -36464829 -37034036 -37391740 -38418792 -38496563 -39208224 -40642618
-1213 -40642618 -41754638 -42597414 -42121694 -43156135 -44010039 -44869183 -45382790 -46658831 -47253064 -48233459
-1223 -48233459 -49281102 -48660782 -48471292 -49671601 -50610329 -50409516 -52595892 -52397303 -52522129 -53319574
-1233 -53319574 -53593864 -54989925 -54937786 -55921357 -56651461 -55488721 -56771128 -57484905 -57189102 -57746721
-1243 -57746721 -57785137 -57624431 -58491367 -59229846 -59685508 -60858779 -58688088 -59318927 -59932621 -59788600
-1253 -59788600 -59821149 -58469456 -57922926 -58199733 -58881917 -57922829 -56936297 -55669430 -56218057 -56205658
-1263 -56205658 -55574646 -56066017 -55465384 -54787543 -53839559 -53471991 -52933128 -51507441 -51166211 -50673219
-1273 -50673219 -49604500 -48687038 -48726323 -46444719 -45901164 -45345687 -44505448 -43285187 -43185833 -42118045
-1283 -42118045 -40292909 -39851464 -38638393 -37471716 -36179575 -35461821 -34874076 -32837791 -32201261
-1292 -32201261 -30638477 -29254484 -28159618 -27432980 -26944475 -25707305 -25269207 -23155403 -22001201
-1301 -22001201 -21873815 -21301639 -18385043 -18495897 -16062759 -15798223 -14883190 -14935809 -14114115 -13404759
-1311 -13404759 -11538766 -10278750 -9866021 -10398643 -9358350 -8770221 -7502703 -7191731 -6542186 -6062182
-1321 -6062182 -5207405 -6256827 -4659496 -4397520 -3994136 -4423163 -3313324 -3890779 -3496551 -2599502
-1331 -2599502 -3103982 -3419306 -2907028 -3704540 -2593554 -3311163 -3334870 -5197971 -3615372 -4904467
-1341 -4904467 -5099082 -4444387 -6433343 -6469945 -6239826 -6523526 -7661437 -7424582 -8707094 -10073816
-1351 -10073816 -10812715 -11997359 -12850051 -12853240 -13318135 -14300046 -15179899 -14565285 -15937995 -17608193
-1361 -17608193 -19992329 -21033308 -22441556 -23867120 -24008689 -24754292 -25343798 -27525085 -27604415
-1370 -27604415 -29175375 -30527070 -31282167 -32223968 -33210632 -33677771 -35802399 -36882899 -37924731
-1379 -37924731 -38486256 -39088310 -41082311 -42018975 -43349822 -44653985 -45261744 -46830775 -46956887 -46911268
-1389 -46911268 -48761829 -49193114 -50086609 -51053702 -52278643 -52889596 -53206664 -53389096 -55123817 -55980230
-1399 -55980230 -55480907 -55844127 -55986944 -56006428 -57305847 -57523750 -58168264 -56891181 -58128727 -57720244
-1409 -57720244 -57770007 -58773158 -58449716 -58307197 -57336473 -57533990 -57833891 -57280568 -57885756 -57268616
-1419 -57268616 -56176183 -57134920 -56132184 -55647444 -55131123 -53267187 -53424847 -51459164 -52543281
-1428 -52543281 -51147415 -51291729 -49912382 -48178838 -48110234 -46534587 -46192027 -45955001 -43795694
-1437 -43795694 -42469608 -41068194 -40209062 -39378087 -40117034 -35413888 -35493079 -33984193 -32372836 -31542515
-1447 -31542515 -30648122 -28200900 -26526055 -26759409 -24786288 -23482584 -22639072 -20098776 -19037088
-1456 -19037088 -17445873 -15673367 -13722070 -12796492 -10905044 -9872797 -8494028 -8236073 -5913078
-1465 -5913078 -3807297 -3712485 -2009966 -133126 579320 1782769 2347470 4405093 6612508
-1474 6612508 7808934 8119153 9233943 10672238 11595732 13137752 14058742 14269735 14491167 16861072
-1484 16861072 17605046 16824337 18801151 19944669 20600351 19972338 21189987 22845199 23565447
-1493 23565447 24587699 24605009 24513460 25133582 25477389 26729646 25758509 27160486 27560040 27061554
-1503 27061554 26408543 28016582 26948043 26996508 27368019 27196127 27976744 27928212 26479578 25442416
-1513 25442416 25940506 25207706 26390040 24897998 25252010 24379889 23526149 23060341 22243603 22568320
-1523 22568320 20847857 20681786 19899744 19331099 18771591 17921626 18132169 16542428 15680951 13809272
-1533 13809272 14422019 14023893 11810855 11279419 10671563 8873723 9223236 8467450 8088059 6741027
-1543 6741027 4770146 3956846 3324156 2083776 768698 -322232 -1229791 -1823136 -2933075
-1552 -2933075 -4034204 -4033215 -5242840 -5912342 -6942727 -8583574 -9882008 -10895260 -11451065 -12995885
-1562 -12995885 -12782156 -14526222 -15594302 -15483898 -17356378 -17468416 -18672681 -20103338 -20240957
-1571 -20240957 -20926346 -21005202 -22360859 -23406289 -23530517 -24979100 -25515819 -25679809 -25592879 -27638872
-1581 -27638872 -28877291 -28614689 -28826673 -29471173 -29809947 -30111260 -30915965 -31562877 -31479125 -32521729
-1591 -32521729 -33091835 -34537829 -33489559 -33521950 -34282541 -34539268 -34060506 -34626706 -35661055 -36390567
-1601 -36390567 -37632046 -36033307 -35474262 -35905361 -35601476 -37027340 -36862670 -38522954 -37752561 -38208024
-1611 -38208024 -37659067 -37524984 -38349902 -38020872 -37776184 -37484461 -38060776 -37455075 -38081137 -37151942
-1621 -37151942 -37429115 -39036050 -39660222 -39111811 -38388907 -38456114 -38488068 -38773096 -39157769 -38043534
-1631 -38043534 -38085432 -38805185 -38591538 -38270518 -38973975 -38365105 -38705868 -38308049 -39013217 -38012125
-1641 -38012125 -38106448 -39118082 -39110625 -38644451 -37617518 -37338188 -37577695 -38244047 -37577247 -38133722
-1651 -38133722 -37901548 -38096007 -38818877 -37601501 -37903891 -36894498 -37859770 -37684355 -37044820 -37039953
-1661 -37039953 -36464562 -36537440 -36720972 -35862286 -35895055 -36574207 -36204211 -36213701 -36186132 -36331161 -35885775
-1672 -35885775 -34364548 -35201107 -35253183 -34712262 -34735317 -34186135 -33451092 -33365641 -32676008 -33929685
-1682 -33929685 -33330148 -32685178 -32638556 -32012585 -31169623 -31336437 -31122813 -30559230 -30475889 -29726867 -29486413
-1693 -29486413 -29038831 -28377592 -28114086 -28794277 -27697440 -27776195 -27424528 -25684309 -25853495 -25886952
-1703 -25886952 -23692516 -23897440 -22968877 -22835178 -21489330 -20618327 -20606728 -18940200 -18840471 -17885604
-1713 -17885604 -17531338 -17017584 -16775279 -16239556 -15458036 -15330457 -13837261 -12633121 -12913829 -12060298
-1723 -12060298 -10980677 -11148001 -10254011 -10335673 -9085253 -5881426 -4851599 -5160165 -5777996 -5073150
-1733 -5073150 -3230841 -3145893 -1311114 -232143 83190 601576 1706713 2673756 3989682 3891204
-1743 3891204 4353543 5246374 6665902 7715063 8035498 8906767 9855496 11517455 11566278 12163778
-1753 12163778 11838235 13158185 13869058 15357512 14708528 15735319 16010593 16141342 17973913 17053321
-1763 17053321 18979476 18901880 18853012 20494362 21094027 21096596 20716346 21880783 22750878 23268891 23298050
-1774 23298050 24389293 23842127 22896379 22429643 23131922 23557266 23953734 23477966 23718140 23389890
-1784 23389890 23435962 23048749 22794725 23410721 23578522 23900222 23371328 21823550 22356068 22849088
-1794 22849088 22214323 22030236 21080457 20334377 20345035 20011371 20489294 18362773 17543630 18338207
-1804 18338207 16330781 15739944 15365460 15821238 14633340 13623727 13450088 11996918 10711794
-1813 10711794 9821277 9314986 8844569 7830306 7115479 5189095 4431186 3386147 2566856 1713361
-1823 1713361 415136 -1233517 -1045379 -3065059 -4551078 -4235703 -7886560 -9282923 -10342623
-1832 -10342623 -11092824 -12005875 -12865731 -13044799 -13922174 -15839672 -18248808 -19499852 -20312037 -20723328
-1842 -20723328 -22944987 -24844439 -25683478 -27445965 -29548567 -28964195 -30836641 -31711946 -32050537
-1851 -32050537 -34032167 -35344139 -36696288 -37980845 -39463876 -39927656 -41632035 -42728485 -43342298
-1860 -43342298 -45727287 -47177733 -48551671 -48841265 -50034330 -51039321 -52455468 -54940059 -55554625
-1869 -55554625 -56497282 -57955798 -58340497 -59269673 -59579589 -61611106 -61026054 -62156695 -63852104 -64640418
-1879 -64640418 -65717657 -66514946 -67198569 -68054738 -70615336 -72237948 -72571041 -72049370 -73151575 -73207518
-1889 -73207518 -74698548 -74878191 -75769714 -77363597 -77930565 -78943780 -79352849 -79402150 -80167781 -80430541
-1899 -80430541 -81431016 -81356843 -83127203 -84447223 -84764710 -84783873 -84770252 -86015012 -85663016 -86465081
-1909 -86465081 -87191951 -87413650 -87574786 -88363754 -87971039 -89682671 -87983536 -88891924 -90135537 -90939973
-1919 -90939973 -91502402 -92637266 -91639184 -91752886 -91794876 -92410975 -91615783 -93419401 -92508514 -92875206
-1929 -92875206 -92853439 -93210903 -93493908 -92711179 -93821101 -93449727 -92985407 -93056785 -92679855 -93451831
-1939 -93451831 -93556469 -92869123 -93132320 -92286200 -93024679 -91943266 -92834065 -92312169 -92823040 -92272526
-1949 -92272526 -92514813 -92023581 -90912767 -89861096 -89685545 -90019033 -90778307 -89934969 -91686150 -91056276
-1959 -91056276 -89976376 -88767657 -89472244 -88952524 -89079581 -88919623 -88000347 -87683202 -86625730 -87307020
-1969 -87307020 -86648121 -86480791 -87046517 -84598795 -85086276 -85788068 -84737798 -85287033 -84169703 -83131126
-1979 -83131126 -81922224 -80760747 -82297112 -82107054 -81706967 -80225831 -79363815 -80181955 -78748302
-1988 -78748302 -78489931 -79272245 -78251087 -77396327 -76679825 -75762068 -76316468 -74709585 -74942478 -73506770
-1998 -73506770 -73307049 -72154185 -71601364 -71652530 -71334360 -70487069 -71879932 -71086771 -71209219 -68076961
-2008 -68076961 -69233210 -68576800 -67890137 -67758910 -66492142 -65807099 -65348829 -65469528 -65795268 -66811871
-2018 -66811871 -65834133 -65062440 -63652621 -62608121 -63422290 -62467664 -62545426 -62023628 -61472158 -62109768
-2028 -62109768 -61393073 -61466175 -60757619 -59981831 -60524734 -61042997 -61050591 -60859881 -60341317 -60083586 -59527196
-2039 -59527196 -61233815 -60091545 -59585381 -59858236 -59232740 -60338733 -60350584 -60032504 -58816855 -59593646
-2049 -59593646 -60592027 -60672629 -61654969 -60913659 -61500578 -61270038 -63396878 -63116623 -63465933 -64586288
-2059 -64586288 -63459691 -63176442 -64096676 -65064581 -65998659 -64918965 -65877961 -66008321 -67099776 -67741593
-2069 -67741593 -68067074 -69007739 -68866141 -69801266 -70057512 -72349106 -72198577 -73041730 -73873011 -74488356
-2079 -74488356 -74426883 -75362032 -76321083 -76703137 -76869910 -76469670 -77257747 -78686735 -79531502 -80311332
-2089 -80311332 -79720411 -81398881 -82094567 -82959737 -82536841 -84204015 -84370524 -85162675 -85642724 -85520860
-2099 -85520860 -86001128 -87149109 -87354179 -89588061 -90448745 -90984037 -89871716 -90622675 -90957769 -92026683
-2109 -92026683 -91418986 -92476036 -93087541 -93780026 -92724377 -93966184 -95144655 -94576932 -95498820 -95599643
-2119 -95599643 -95289765 -96598610 -96481977 -96333434 -96384321 -96717420 -97173426 -97912038 -96604036 -98182987
-2129 -98182987 -98020099 -97509182 -96921672 -95845384 -97862467 -97176009 -97003562 -96715291 -96915630 -97632075
-2139 -97632075 -96703361 -96704564 -96367738 -95327534 -94805803 -93573168 -93727790 -93956081 -93987151 -92906514
-2149 -92906514 -93085379 -92702673 -92146694 -90412665 -90267393 -89138064 -89072461 -87810016 -86491071 -87204602
-2159 -87204602 -86406985 -84307471 -84148200 -83636620 -82944613 -80980530 -80600942 -79982618 -80044438 -77862088
-2169 -77862088 -76119091 -74613196 -74265447 -73775568 -73711802 -71790716 -70376291 -69695809 -69016102 -68675300
-2179 -68675300 -67403290 -65739993 -65135669 -64137313 -62201108 -61370107 -59740405 -58671968 -57944366
-2188 -57944366 -57491010 -57368374 -56544025 -54024879 -54000604 -53711517 -51856646 -50454877 -50040912 -49164684
-2198 -49164684 -48175949 -47369889 -46269687 -45172941 -44508775 -43392352 -42574118 -39892864 -41000497
-2207 -41000497 -40302534 -38801510 -39282098 -37746331 -36881901 -36185457 -35925975 -34787031 -33590041 -33795821
-2217 -33795821 -33093115 -31693492 -30805276 -30414966 -31047569 -30251594 -29381746 -28367074 -27388260 -27621647
-2227 -27621647 -27687908 -26872804 -26167381 -25063936 -26198196 -25394166 -25819783 -25177112 -25723542 -25776896
-2237 -25776896 -24136484 -24939944 -23652506 -23873941 -23893747 -24525507 -23447695 -23504687 -23516342 -23217100
-2247 -23217100 -23039391 -23488601 -24045723 -23662506 -23520936 -22820638 -23046163 -23642416 -23531260 -24033119
-2257 -24033119 -23170546 -23251123 -23376488 -24802426 -23654478 -24322644 -23987204 -24750092 -24349348 -23765584
-2267 -23765584 -24297156 -26258740 -26147426 -26334468 -25370762 -25479614 -26928648 -27078183 -27106442 -27016464
-2277 -27016464 -27310544 -27480573 -27446109 -28164319 -27243432 -27863120 -28353906 -28206436 -28402111 -27794444
-2287 -27794444 -28501781 -28514510 -29030852 -29390255 -28982575 -29711208 -29682460 -28949686 -29364856 -29235427 -29734605
-2298 -29734605 -30753443 -30074364 -31151248 -30632812 -31648930 -31820465 -31823630 -32916426 -32990180 -32277307
-2308 -32277307 -33470464 -33480106 -33689747 -33792269 -33785661 -33077134 -33368592 -33857852 -34797100 -34908330 -35449180
-2319 -35449180 -36212530 -36051389 -37030255 -38032715 -37017831 -36468286 -37790226 -39199464 -38426853 -38454420
-2329 -38454420 -38963877 -39069670 -40281596 -40836209 -40630005 -40514422 -41296798 -40692606 -41777384 -42624233
-2339 -42624233 -42823803 -42853054 -44018268 -44901199 -46324304 -46605996 -46159423 -47267730 -49168590 -49021730
-2349 -49021730 -50270453 -51545622 -51715186 -52454118 -52609570 -54225841 -55115509 -55187176 -55866407 -56550974
-2359 -56550974 -56781517 -57702896 -57775671 -60330731 -61612981 -62551810 -61528209 -62058534 -62785793 -64343237
-2369 -64343237 -65094170 -66213498 -67815413 -69575516 -69153126 -71409328 -71835365 -72667800 -72315353
-2378 -72315353 -73446581 -75881391 -74373776 -76778491 -77445198 -78255786 -80851471 -81543481 -81569662
-2387 -81569662 -82928236 -83196711 -83710419 -84537074 -85006433 -86399966 -87295749 -88728372 -89695462 -90558403
-2397 -90558403 -91172451 -90671394 -92600790 -92862082 -93669000 -92543193 -94581473 -94670078 -94391183 -95432308
-2407 -95432308 -96072517 -96606018 -96534172 -96658038 -97617045 -97677879 -98410698 -98744817 -99096127 -98488594 -98637360
-2418 -98637360 -99569552 -99414045 -99144917 -98821621 -98399222 -97580526 -98621986 -99197830 -97531543 -96423571
-2428 -96423571 -96192393 -96055714 -95266575 -95740657 -94642247 -93789078 -91821943 -92454999 -91394187 -91767433
-2438 -91767433 -89928175 -90160267 -87967511 -85727566 -85049719 -84556714 -83630763 -82377830 -80413835
-2447 -80413835 -78640640 -77736787 -76765283 -75209660 -74594144 -72100418 -71254156 -69269369 -68111092
-2456 -68111092 -66717072 -64264762 -62581472 -60467985 -59415497 -57202724 -54738429 -52814481 -52209954
-2465 -52209954 -50903861 -47732603 -47660064 -45334227 -42732865 -41392179 -37858242 -36205932 -35719413
-2474 -35719413 -32570913 -31200298 -28111926 -26803535 -24750643 -23845235 -20673757 -18700112 -17336235
-2483 -17336235 -14632366 -14108309 -11487555 -9429833 -6661060 -4916665 -3511658 -1471271 -483238
-2492 -483238 1664117 2617844 6058357 7413428 8168356 9485489 12087209 13378604 14850130
-2501 14850130 16215685 17456553 19700808 20850116 22623917 24471209 25858178 27381639 28016263
-2510 28016263 28510547 29994743 30740745 31766902 32438911 33316186 34413181 33776750 35442105 35666451
-2520 35666451 36285955 36897778 38256767 39626567 39619968 38879389 39507583 39156669 39031916 39044141
-2530 39044141 38850901 40215542 41226221 41179345 41682909 40995049 41485637 41253938 40470728 41085365
-2540 41085365 40590015 39855186 39871206 39219818 38709322 37406608 37843750 37302751 36716977 37291731
-2550 37291731 37485254 35722327 34964598 34190602 33578533 32166515 32286219 31442321 30110607 30645169
-2560 30645169 29623337 28797694 27392145 26938226 28031202 25742192 25192778 23714955 22724917 22701165
-2570 22701165 21978842 20919338 19833929 19732672 17591525 17629613 17573487 17981746 14860159 13477716
-2580 13477716 13186561 12860618 13363177 12482900 11719804 10310009 10154393 9099141 9579076 9275320
-2590 9275320 8709140 8496666 7704271 8326945 7670421 6874822 6761047 6800896 6724303 6112169 5290593
-2601 5290593 6372128 5693736 5971893 6262451 6423254 6309310 7240489 7162562 6574660 7045488
-2611 7045488 7310900 7403252 7179933 8766618 8502170 8772935 8167097 9766253 11127269 11508359
-2621 11508359 10829343 11645314 11593389 12898106 13248780 13720356 14659531 15081179 16517100 16576883
-2631 16576883 16971769 19379146 19422019 20508351 21503998 21050723 21658689 20728306 23848149 22726660
-2641 22726660 24262798 24455857 25598936 27322495 30525723 31651710 29765862 30072767 30906020
-2650 30906020 32736860 33419665 34161884 33808198 33871920 35627002 37564240 38448446 38580399 39409865
-2660 39409865 38436476 39313524 39461574 39832249 41521398 43400093 41909292 43038517 42548910 43203658
-2670 43203658 44156246 45357175 44935470 44580501 45360002 44167523 44781845 46470450 45767139 45173458
-2680 45173458 44836265 46807305 46157536 45832420 44825192 45650388 46151523 46317490 46075954 45766080
-2690 45766080 44786132 45690791 44021537 42596112 43634712 43438588 44793579 43661807 43221175
-2699 43221175 42966634 41205550 42312005 40137865 40572769 40245728 39674959 40105350 39489518 40156676
-2709 40156676 38547781 38989168 38579419 38298989 38504722 36201373 37131162 36049748 35217291 34845517
-2719 34845517 34433532 33454882 33163781 32201931 32062045 31859251 32202879 31248520 30136299 29278308
-2729 29278308 29774554
-2730B9774554  $$ checkpoint
##PAGE= N=2
##DATA TABLE=(X++(I..I)), XYDATA
13653 -21371537 -22075667 -21805683 -21952505 -20925267 -20265799 -21859858 -21406334 -21801350 -21523306 -21415009
13643 -21415009 -21553911 -21833036 -21773083 -21911346 -21474389 -22376576 -22078443 -21966973 -22374647 -21793860
13633 -21793860 -22493734 -22513522 -22071330 -22554856 -22779983 -22366544 -22079990 -23426278 -23040113 -22115785
13623 -22115785 -23592469 -23944116 -24547864 -24336065 -24564683 -25453301 -25778290 -25907544 -25276643 -26566962
13613 -26566962 -26332976 -27683618 -27692864 -28358418 -28683716 -28156194 -28837413 -29821312 -30044973 -30076879
13603 -30076879 -31258281 -31526936 -33070215 -33783404 -34609409 -35052291 -35915128 -35481031 -37303672 -38590473
13593 -38590473 -39310534 -38630541 -39757441 -42055358 -43213249 -42495949 -43999148 -45156517 -45918038
13584 -45918038 -47500749 -48482183 -50140755 -50317919 -51811283 -51214755 -52512918 -54504475 -54654675 -54620183
13574 -54620183 -55924136 -56847046 -58020908 -60503763 -61378729 -61409336 -62410640 -64357735 -64719017 -64864208
13564 -64864208 -66041356 -65730211 -68707044 -69212544 -67480948 -67360507 -70506270 -72029190 -71333806
13555 -71333806 -71465378 -70810364 -71559804 -73011807 -71941817 -72616666 -72021464 -71679671 -73076448 -72638948
13545 -72638948 -72708441 -73236446 -75103950 -73079584 -72714721 -72330502 -71288115 -71377731 -70342591 -70130791
13535 -70130791 -70161347 -68407932 -67899153 -67571685 -66504256 -66601217 -63392574 -64606944 -63421523 -61131392
13525 -61131392 -60435114 -58094066 -56231850 -55141291 -52918222 -51157612 -50495286 -49908426 -46153926
13516 -46153926 -44921969 -43336437 -42582363 -39389772 -36993531 -35949237 -32802636 -30388749 -29130948
13507 -29130948 -27358298 -25475908 -22960841 -19786075 -16642483 -14796890 -12524349 -9235146 -7251907
13498 -7251907 -4385035 -864456 1675637 3021770 5922209 9345019 11760000 14835820 17003726
13489 17003726 20518832 22751888 26979550 28773007 32852937 35281974 36963254 40164112 42910934
13480 42910934 45941469 47071653 50597567 53857412 56977177 60327574 61619746 65770509 67202011
13471 67202011 69692708 71922887 75449993 77394174 79511067 82300709 85125950 86837535 87939275
13462 87939275 90744566 91315626 94216713 95826750 100039343 100105399 101570717 103852884 105149765
13453 105149765 105981438 107280832 108887911 110838177 110785229 113345646 115069831 116263474 117156428
13444 117156428 117118908 117931240 118405432 117834756 119909133 120809388 121328989 121467743 120700756 121134325
13434 121134325 120930054 121282833 120699378 120715755 120339079 118468715 118328632 119351770 117737997 117714638
13424 117714638 116884899 115662909 115853839 114151622 112585570 112065485 111181912 110940698 108602189
13415 108602189 106888148 105749654 104734001 103753335 101192221 99132969 98065951 95691799 94888950
13406 94888950 92802439 91667905 90285164 86826548 85277680 83025076 81170654 78933651 76416731
13397 76416731 75275316 72129728 70496105 68297646 65885368 63565613 62202419 59440419 56461155
13388 56461155 54823753 51420925 49428462 47781092 45744556 44327059 41809437 39456379 36618416
13379 36618416 34407963 31935150 29291081 26646194 25338046 23602727 20926905 19601044 17459779
13370 17459779 14609867 12417712 10551986 8948576 7035668 5039930 3568224 1306632 -1502629
13361 -1502629 -3991150 -4566798 -8153875 -7749440 -10299232 -11780011 -12502132 -14205629 -17153763
13352 -17153763 -18265929 -18773369 -21610957 -21999887 -22892234 -23973717 -26671897 -28077368 -29123143
13343 -29123143 -30288163 -31167836 -32064630 -35044772 -36217196 -36384225 -36565462 -38240630 -38345075
13334 -38345075 -40805328 -40243369 -41619934 -42590423 -43784718 -43851474 -45731143 -47200270 -47299271 -48479579
13324 -48479579 -48395323 -50223540 -49999231 -50411521 -51025423 -51618432 -52745775 -53424298 -55475700 -54767099
13314 -54767099 -55823371 -55906305 -57742465 -57538208 -58517437 -58935216 -60277200 -60828079 -60855240 -60614561
13304 -60614561 -62097082 -63434126 -63126481 -63135154 -62659349 -64067348 -65173734 -65451714 -66100694 -67637172
13294 -67637172 -69317929 -69565119 -70052637 -70878748 -71033148 -71632191 -72362696 -71625069 -72600729 -74104227
13284 -74104227 -74057657 -74074434 -75856849 -76653448 -76409933 -77829616 -78981317 -79416680 -80097996 -80386846
13274 -80386846 -81006594 -80962566 -81880729 -82458238 -83495465 -84647684 -85348242 -86470977 -86143043 -86168813
13264 -86168813 -86475996 -87216231 -88038966 -88215452 -88887270 -90010737 -89585690 -89931369 -91230461 -91802122
13254 -91802122 -92048270 -91705933 -91607920 -92172533 -92198114 -90798803 -92448582 -92835197 -91618958 -91067873
13244 -91067873 -93454516 -93820915 -93317361 -91970135 -91138028 -90852650 -91501721 -89889410 -88949620 -88401439
13234 -88401439 -88101620 -88833781 -86931363 -86652533 -85539511 -84569970 -83563753 -82873141 -81574722 -81239450
13224 -81239450 -79200354 -79492370 -77667134 -76159320 -75052136 -72814914 -71569583 -70052925 -69016499
13215 -69016499 -67191406 -65135902 -63576842 -61933057 -59115938 -57723414 -56468903 -54630008 -51503283
13206 -51503283 -49762519 -47904465 -44834810 -42413275 -39584636 -37750143 -35016165 -31730220 -28859234
13197 -28859234 -28036607 -24956263 -23056718 -20408589 -17823242 -14643070 -12633391 -9414481 -5790732
13188 -5790732 -2843550 536071 2421773 4217517 8452353 11522276 13720170 15662899 18710504
13179 18710504 22071700 24971777 29450950 30791559 33723343 37850546 40391523 42697750 45693085
13170 45693085 49394483 51962910 55127427 56523914 61672576 61903383 64507937 66719509 69007423
13161 69007423 71827465 75533525 77176585 79615317 82870113 83987286 86032585 88818032 91334591
13152 91334591 92133517 93709962 96265372 98128153 99452748 101399700 103698572 104435250 105051403
13143 105051403 106829691 108839529 110646549 111459304 112263543 112493306 113639789 112995965 113585571
13134 113585571 115596524 116130178 116323802 116419101 117314789 117990119 118594265 118237913 118365074 118974347
13124 118974347 118463366 117648503 117497330 116713995 116401529 116051894 114835460 114300761 114277926 112848124
13114 112848124 112097592 111800707 110099740 108195200 106490355 105267939 104303524 102652000 101319039
13105 101319039 99503125 97961530 96744312 94147355 93285565 91660018 91421013 89089052 86316813
13096 86316813 83564402 83503205 80230009 77650064 76596913 73926217 72092236 69537629 67766204
13087 67766204 66710134 64186868 61946785 60473335 57839372 55166087 54150967 52496494 49834635
13078 49834635 47698000 44595483 43074349 41121925 37866181 37517743 35431701 33583258 31703443
13069 31703443 29702420 27629502 25069182 23297067 21594898 20002183 18737024 15441218 14849146
13060 14849146 13274971 11162515 9757400 9004185 6966204 6512361 4046530 3123722 1689273
13051 1689273 1099464 -712679 -1872886 -2802184 -3245753 -4795372 -6147248 -6835803 -7867776 -8303740
13041 -8303740 -8465480 -9048110 -9622628 -10383113 -11890976 -11631672 -12586619 -13532739 -13210391 -13069804
13031 -13069804 -13692030 -13158370 -14966155 -15637247 -15746582 -16632666 -15620930 -16298274 -15351452 -16129839
13021 -16129839 -15406817 -16099114 -14701447 -13570901 -14368900 -15002803 -14414159 -13296490 -13194411 -13700892
13011 -13700892 -12569912 -12555855 -12271621 -12022671 -12001545 -11191490 -10609525 -10502045 -9782972 -10285689
13001 -10285689 -9797999 -9852934 -8881590 -8486823 -8085511 -8184734 -6862153 -6756783 -8037184 -7878450
12991 -7878450 -7393889 -7443194 -7302278 -7231671 -6929885 -7231187 -5954048 -5513643 -6362905 -6091150 -5883625
12980 -5883625 -6031247 -6450712 -7023269 -6620239 -6697277 -7162597 -7499113 -6378956 -7728402 -7441401
12970 -7441401 -7695567 -8272450 -9259917 -9945474 -10505398 -10535303 -11880851 -11257223 -11623883 -12771856
12960 -12771856 -12039224 -13178340 -14069089 -15230279 -15984385 -17067907 -17735112 -18701568 -18755625 -20529819
12950 -20529819 -21323042 -21108715 -22698111 -22406909 -23449012 -24129403 -25466308 -25828792 -27500383 -27083948
12940 -27083948 -28079468 -29476875 -29752536 -31560234 -32732667 -33444200 -34608012 -34720216 -35866508
12931 -35866508 -36772990 -35549378 -37642912 -38345709 -37839503 -41110319 -39860905 -40502142 -41430726 -41685041
12921 -41685041 -41492938 -42739175 -43738225 -43202786 -44718461 -45230071 -45044194 -45582180 -46245463 -46610990
12911 -46610990 -45861454 -46341343 -47021804 -46765284 -46582116 -46336368 -47005190 -47094909 -46602365 -46162822
12901 -46162822 -46421592 -45600577 -45354927 -44936631 -44444938 -44754455 -43856151 -43527660 -43517336 -43231337
12891 -43231337 -42182796 -41720045 -39995432 -38865534 -39004765 -37824280 -37136586 -35633923 -36009995
12882 -36009995 -35190004 -33184507 -31407990 -31861798 -30509595 -29803171 -27460324 -25928062 -25906583 -25412308
12872 -25412308 -25004813 -21427455 -20018055 -19808765 -17072910 -17281184 -15296063 -14202197 -12244686
12863 -12244686 -10985396 -10110462 -7945819 -8379644 -6222888 -4518759 -4528220 -2666630 -789466 -189176
12853 -189176 1248551 2165756 3755356 4892015 5654266 6854445 9506498 9325661 10964449
12844 10964449 12660649 12982344 13799089 13850905 14314138 14929100 16324998 16507408 16262376 17851200
12834 17851200 18441878 19766658 20331519 20950377 21537492 22254700 22484827 22080885 21124332 23175455
12824 23175455 22900238 22798917 20814336 22109007 23306637 23805003 22879972 22635431 22399661 22126258
12814 22126258 21749036 21076307 20012136 20195816 18951981 18916430 18384305 18003038 16618096 15910736
12804 15910736 15378518 14617865 13372035 11820832 10526534 10390634 8708058 6496503 5763109
12795 5763109 5043139 4248681 2700458 525339 144879 -1726917 -3136807 -4080894 -4363599 -5339553
12785 -5339553 -6423423 -7899621 -10113415 -10934372 -12916946 -15179932 -14948085 -16237415 -18044858
12776 -18044858 -19800464 -19948758 -21478513 -23404775 -24849616 -26112517 -27124995 -28718052 -30087676
12767 -30087676 -30826284 -30549031 -32137900 -35061037 -35493849 -36254318 -36842209 -38337704 -38132393 -39942075
12757 -39942075 -40434293 -40729722 -42132954 -43023016 -43444206 -44723830 -45175385 -45009279 -45661016 -46589858
12747 -46589858 -46077705 -46545659 -46932604 -46803699 -46697548 -47637690 -48067541 -48694307 -47945024 -47970200
12737 -47970200 -48906953 -47563827 -47609334 -46889558 -46493323 -46336830 -45945755 -45416670 -45351117 -45569533
12727 -45569533 -44672098 -44754281 -44037928 -42782597 -41660521 -40740141 -41033413 -39853210 -38312429 -37653104
12717 -37653104 -37817139 -35384182 -34614972 -33629608 -33803204 -30940747 -29902555 -28315596 -28123224
12708 -28123224 -26111133 -25158021 -24357916 -23551967 -21970578 -20760509 -18936771 -18442064 -18156041
12699 -18156041 -16241978 -15607072 -14675460 -13895669 -11181300 -10160614 -8525426 -8281536 -8091145 -7093002
12689 -7093002 -5701252 -5346595 -4017610 -2464748 -1433786 -1570222 138539 487950 1609565
12680 1609565 2165859 2217002 2536157 4253116 4994502 4285048 4632795 5238460 6630484 6704444
12670 6704444 6524023 7005462 7135890 7676517 8127549 8256365 7856605 8391477 9508231 9175978
12660 9175978 8866013 8470634 7839916 6714554 7623077 7068423 6362687 5249210 5882055 5008926
12650 5008926 4115534 4060688 2974935 3271006 2316894 666538 1270372 -1295278 -1282135 -2000300
12640 -2000300 -2427614 -4026725 -4969491 -4986653 -5401072 -7909662 -10682823 -10540083 -10735064 -12146603
12630 -12146603 -14098757 -15117196 -15907242 -16205534 -17098176 -18415951 -19990500 -20883805 -22410831
12621 -22410831 -23605789 -24489460 -25528484 -26552922 -28458390 -29093529 -30054513 -31670922 -33264005
12612 -33264005 -33758569 -34508862 -34639836 -36708864 -37869091 -38756245 -38993663 -39324795 -40838903 -39987133
12602 -39987133 -41029820 -42171860 -42555322 -43880887 -43359381 -44957307 -45291651 -45985908 -46259110 -46713296
12592 -46713296 -46787339 -46522860 -46686923 -46717678 -48385456 -47499762 -47798524 -48482331 -47725510 -47597942
12582 -47597942 -46728999 -46918467 -46983670 -46148171 -45251304 -45112626 -45462575 -43981453 -42731493 -42998799
12572 -42998799 -42419382 -41709557 -41722934 -41073091 -39584337 -38307291 -38799719 -36929837 -35239036 -35009304
12562 -35009304 -32329350 -31937197 -31085673 -29798284 -28413449 -26724316 -24897555 -24554634 -22737826
12553 -22737826 -21170954 -20544917 -18689529 -17769878 -17486645 -16309401 -15276027 -12626264 -11321753
12544 -11321753 -10562574 -9391816 -6654448 -6228017 -3588075 -2103410 -522564 1576565 1783453
12535 1783453 3556592 4609722 6021642 6432702 7834145 8620795 10623991 12037797 12558584
12526 12558584 14138439 15582802 17047063 18900672 20399001 20708134 21830358 23289483 23898941
12517 23898941 24993371 25295404 25480216 26690800 27998866 29440686 30120782 30158132 30836764 32002784
12507 32002784 32634331 32609117 33579621 33969424 33336873 33383167 33418848 35528296 35440478 35304405 35298658
12496 35298658 35340437 35486212 35413504 34832030 35970104 35207713 34368773 35253312 35453677 34981902 35055994
12485 35055994 35176843 34501678 34555335 33420827 32705586 33357506 32658305 32959223 32636825 30656363
12475 30656363 31244246 29718352 28325061 28390716 28641742 28424191 26865267 25604659 25650144 24083973
12465 24083973 23799907 23933315 23956986 23132690 21721743 20981033 19773104 19288512 19328480 18228896
12455 18228896 19218706 17771009 17339460 17293136 16699213 14487688 14228742 14211419 14760807 14305963
12445 14305963 14122182 13905382 12435293 11554550 12096986 12025560 12134136 11555218 12035561 10989187
12435 10989187 10920315 10215987 10935399 11069176 10575916 10841796 10550257 11006710 11620221 11754628
12425 11754628 12062683 11273349 12288926 11502009 12998140 13767323 12574597 13264224 13933453 14916833
12415 14916833 14612898 14329315 16198802 17070493 15790984 17859410 19378807 19569719 19761516 20138624
12405 20138624 21598190 22746334 21738316 22461443 24494486 23902034 24872330 25162703 26685339
12396 26685339 28005649 27941850 28986875 29894473 30158117 31187923 30797822 33150578 34151989
12387 34151989 35184650 34618778 34500246 35688241 36358650 38121472 38698293 39483924 40072973 40309122
12377 40309122 40891519 40784176 42757224 42427656 42692877 43093949 43232280 44279157 45043983 44893065
12367 44893065 46428525 45754209 45928417 46473873 46192011 47147084 46692186 46294194 47068198 46720212
12357 46720212 46497955 47054161 47254686 46637818 46268196 46679104 45629428 46064647 45876453 45529198
12347 45529198 45309348 43460278 43542310 42915546 42498171 43236296 43239637 41992602 40231239 40354384
12337 40354384 38172801 38025917 38083911 36208016 35535032 35703439 33763662 34167755 32690863 30781213
12327 30781213 29779680 28974298 28702823 27061145 24163998 25320310 24421447 23668987 21791249
12318 21791249 19976035 20580816 19579838 18807344 16755923 16738595 16212439 14692884 13584130
12309 13584130 10674681 11094538 9887130 9251999 8712003 7160629 6939559 5737439 4025296
12300 4025296 3220540 3897881 2294867 2417103 2293963 860797 213872 -795356 -1404912 -1458944
12290 -1458944 -1255310 -2322598 -3021038 -3414990 -3797567 -2416380 -3404964 -4235462 -3267678 -3653255
12280 -3653255 -3443181 -3812259 -2676811 -3372178 -3869802 -4209364 -3435180 -2929481 -3214252 -2349552
12270 -2349552 -983199 -948603 -900674 -368982 -315196 730909 660399 1895562 3096383 3819567
12260 3819567 4647465 5821948 5302626 6857776 7727938 9159385 10611091 12597932 13004248 13477803
12250 13477803 14772232 16017402 17581259 17606669 19034099 20222504 22196466 23920522 25819970
12241 25819970 26713286 28536243 28119779 29580934 30312123 31919484 34441473 34807050 36648914
12232 36648914 38306765 39579204 42559179 42878068 43907324 45497060 47118293 48252130 49613089
12223 49613089 50190707 51731205 52490340 54263265 56091913 56810098 57899914 58758660 60497566
12214 60497566 61307553 60902146 62461646 62876332 64156341 65844689 66415583 67596928 67762148 68014644
12204 68014644 68897093 69995014 71362701 70833726 71446563 72372411 72294935 73098384 72046036 73435896
12194 73435896 73071432 73234296 72637400 73138077 72716648 73792435 73268000 72865340 73144912 73044896
12184 73044896 72584810 71910974 71935888 72744849 70882003 71229485 69785319 69292901 67800754 68437777
12174 68437777 66901114 66833724 65552812 65121080 64554437 62424205 61790718 62419211 60801868 60245367
12164 60245367 59302707 58594875 57427500 55551358 54994202 54543093 52376775 51367730 50417178
12155 50417178 48668076 48441839 46440658 45682386 43853397 41314283 41169525 40233906 38806215
12146 38806215 36717867 36459669 35638937 34204615 31741298 31027287 29733243 29333729 27782211
12137 27782211 26601909 25845409 23674014 22669016 21301593 19794473 19337487 18179893 18006120
12128 18006120 16494097 15829584 13550761 11933672 12795960 12038727 10575164 10459562 9372266
12119 9372266 7595813 6735868 6985795 5312462 5771109 4733196 3815633 3569712 2453285 2468370
12109 2468370 1764070 1404352 310070 174622 -64376 -78899 -715416 275467 -1827160 -1669870
12099 -1669870 -1451135 -2026719 -2014406 -1710198 -2580932 -2851092 -4226850 -1666847 -2506009 -3137394
12089 -3137394 -2167924 -1845879 -2865690 -2732746 -2355585 -2644560 -1682031 -2263432 -2192612 -1586930
12079 -1586930 -342764 -1446700 -926720 -1929598 -666452 847121 3819 175051 2084124
12070 2084124 104681 619427 1451113 1494005 1614106 1237260 1338321 1738707 1594330 736658
12060 736658 217691 4317654 4951814 4147952 4237972 5599661 1813348 2776638 3772731 2273619
12050 2273619 6633720 10456505 3124735 3341559 4216341 3262858 3187103 1940864 2573281 3581067
12040 3581067 2333464 3061958 2966233 2365368 2108059 1022215 619311 2296068 2465931 2400635
12030 2400635 1870094 1661266 480269 -829702 -176477 -2126003 -1380434 -1179164 -1946189 -2185329
12020 -2185329 -1965464 -3432385 -3589333 -4280831 -5202406 -6147883 -5960012 -7033375 -6761149 -6379207
12010 -6379207 -7064600 -7033937 -8785875 -9621908 -10411512 -10101240 -10234364 -11244390 -12478864 -12816667
12000 -12816667 -13796990 -13709489 -15354825 -14768332 -16601908 -16145515 -16164220 -17169694 -16273019 -17051095
11990 -17051095 -18014796 -19414478 -19090021 -19806714 -19896710 -20762661 -19850947 -22106461 -21402967 -21849171
11980 -21849171 -23136319 -22793026 -20905307 -20908327 -21683391 -22648512 -23481731 -22304988 -22469331 -21533466
11970 -21533466 -21793174 -21725580 -21552369 -22235148 -22122880 -21422002 -21287141 -21772859 -21798879 -21586923 -21555116
11959 -21555116 -20852880 -19649545 -19288980 -18641472 -19228359 -18863627 -17436179 -16922788 -17716379 -17074265
11949 -17074265 -16550264 -15748810 -15352112 -13955901 -14074386 -12699247 -11125455 -10835599 -9873207 -10279996
11939 -10279996 -8869267 -8129902 -7818325 -6777115 -6065225 -6129941 -5880412 -4703071 -4247730 -2699539
11929 -2699539 -1529456 -1250826 -638433 1022772 1437296 3161325 4291468 4002985 3856576 5450332
11919 5450332 5295406 6621098 6947534 8735844 8267619 9292422 8955980 9886732 10979908 12582294
11909 12582294 13535771 13520650 13717518 13790860 13964893 14654460 15165546 15953004 17403874 17332511 17131122
11898 17131122 18367205 18308041 17993837 18284052 18320420 18868903 19387319 18578938 18498829 20100618
11888 20100618 19732081 19067152 18701401 19255562 20243314 18797506 18316391 17514732 17140936 17990194
11878 17990194 16734495 16516952 16223821 17043492 17114297 15157187 15319634 15303249 14019110 14013957
11868 14013957 13220797 13302728 11652526 10621329 10116606 7903570 9070466 8765327 7948837 7903867
11858 7903867 6042949 5971722 5899202 4512753 2992468 1882274 1457383 916782 -560655 -685915
11848 -685915 -1710392 -1961184 -2419960 -4436039 -5227879 -6570729 -6521460 -7609841 -9160445 -9187103
11838 -9187103 -9373611 -9596851 -10657555 -12411214 -13199427 -12940431 -15130574 -14811817 -15178363 -16238216
11828 -16238216 -17086218 -16762092 -17228060 -17962881 -17967739 -18226088 -18813345 -20548442 -20739878 -19382630
11818 -19382630 -20487583 -21155954 -20436049 -21022967 -22451508 -20801974 -22079622 -22260950 -22015150 -22299341
11808 -22299341 -22910400 -22498706 -22448665 -23043488 -21369960 -22502668 -22557234 -21770999 -21471244 -21021698
11798 -21021698 -20821705 -20953680 -20776131 -19290748 -18997909 -18520381 -17479134 -17147723 -15873522 -15108474
11788 -15108474 -14575328 -13486968 -13587819 -12709539 -11085930 -8974145 -9003856 -8392221 -8663425 -7427352
11778 -7427352 -5192451 -5491210 -3867662 -3829798 -3436890 -1910588 -1920513 -422063 1973920 2782078
11768 2782078 3278828 4721075 6147678 6600804 7680232 9310339 9952879 11177404 11975170
11759 11975170 13295336 14278888 14726961 16100059 17357782 18536489 20147327 20679450 23915787
11750 23915787 24154528 25412727 25905192 28261097 28807726 29136993 30944121 31922203 34537726 34476115
11740 34476115 34257248 35535811 37114886 38425236 38449179 38612656 40835009 41094416 41226931 43206597
11730 43206597 43659563 43820448 45058759 45368173 46337053 47033955 47631983 49237072 50020060 51032736
11720 51032736 50289964 51172742 51952456 52188838 53875892 53669403 54467846 54164790 54305611 54481050
11710 54481050 54583045 54602953 53847793 54037294 54963020 55032263 55504565 56183337 54778352 55753526
11700 55753526 56508655 55858624 55450779 55922951 56101520 55830453 55974798 56375054 55574133 55484238
11690 55484238 54946905 55466018 55470563 53984208 54130829 54227186 53856121 53544806 54194399 52988844
11680 52988844 53186142 53099599 51995839 52843974 52872873 52009518 51775288 51972918 51535377 50143147
11670 50143147 49581926 49675775 48601108 48457178 48387057 47468001 46812822 46621045 46849957 46107605 46078105
11659 46078105 44638420 45406007 44326404 44323315 44073678 43491287 42812358 41105773 40927334 41607971
11649 41607971 40767212 40575861 39662670 39822355 40085090 37705679 36794099 36535635 36690121 36497533
11639 36497533 35800158 35400099 34757985 34949806 34944364 34203769 33246228 32400487 31955009 32645365
11629 32645365 31339311 30594854 30766763 30783892 29423753 28099279 28733574 28554475 28254128 26955393
11619 26955393 27048700 25875935 25385445 24299569 24179403 23782829 23230942 22300513 22187413 21299187
11609 21299187 20029505 19297863 19099932 18730306 19966779 18625720 17341602 17235519 16338166 16028651
11599 16028651 15151611 14683883 13179767 12121785 12579079 11737575 11235544 9813333 9609015 10084462
11589 10084462 8720509 7376959 7586236 6341139 6012971 4677095 2978718 1658187 1405669
11580 1405669 1794717 1454497 -593884 -1423966 -2684669 -3396234 -2849584 -4051417 -5070104 -5826490
11570 -5826490 -7872921 -8109013 -9723345 -9927279 -11409978 -12660181 -12405059 -13867210 -14232908 -14604650
11560 -14604650 -16196506 -16640917 -17599175 -19524153 -18854099 -20297449 -22084328 -22108694 -24016822 -25003070
11550 -25003070 -24597845 -26842329 -26974420 -27509432 -28859211 -29974168 -30540491 -31648922 -32999059
11541 -32999059 -33966969 -34489935 -34974191 -35676721 -36163736 -35934382 -36657371 -37264118 -38442951 -38944458
11531 -38944458 -39080557 -40631745 -40931722 -40930816 -42207616 -43655608 -43263230 -44032874 -44527029 -44903310
11521 -44903310 -45811478 -44673443 -45809223 -46614199 -46901915 -46376071 -46198185 -47734107 -48750031 -48109373
11511 -48109373 -48741955 -49077029 -48433317 -48487796 -48169231 -48452162 -48234147 -49527079 -47926341 -47931813
11501 -47931813 -48865161 -47710240 -48222009 -47983743 -46581256 -46260912 -46301390 -45807522 -45004068 -45489567
11491 -45489567 -44917333 -43779047 -43878559 -43449503 -43172712 -43285093 -41299693 -40844527 -39960306 -38614398
11481 -38614398 -39283135 -37611304 -37889112 -36254597 -35690862 -35850239 -34147505 -33456416 -33361805 -32193116
11471 -32193116 -29981512 -28327650 -28673662 -28776204 -27639325 -26891690 -26109777 -24145921 -22890177
11462 -22890177 -22389229 -20978504 -20329609 -19091981 -17674565 -16546813 -15332567 -15001249 -13870547
11453 -13870547 -12634843 -11451097 -11354300 -9272081 -8567075 -7590147 -5930016 -5542496 -4158856
11444 -4158856 -2067917 -2178442 -590722 -236508 1167538 2150444 3408218 4557722 5619431
11435 5619431 5984319 6884315 7485652 9643639 9874878 10920965 11139585 13209014 14947872 14319037
11425 14319037 15570176 16577507 16748952 17752616 19550174 20442297 20214618 21615277 22666777
11416 22666777 21864828 22735598 22942717 23398883 26494358 26722551 26294025 26538632 27504581 28317540
11406 28317540 27637241 28492678 28924657 30908705 30008340 31473059 30878918 31187155 31445626 32765383
11396 32765383 32140937 32168098 32976661 32929357 34014200 33700397 33772127 32959604 33660695 32777670 32888431
11385 32888431 33525787 33902554 33447807 34032979 34967639 34392822 34156611 34526477 34092710 34531512
11375 34531512 34672666 33787498 33306667 33777574 33410590 32429748 32575281 32276330 32011873 31865266
11365 31865266 32151265 32133470 33014676 31356531 31655265 30740527 30468919 31402629 30728486 29824954
11355 29824954 29428981 29173317 29092867 28240735 26570829 27299620 27694505 27887718 26986705 26350391
11345 26350391 26230878 24253542 23857967 23462349 22626467 23376580 23580722 21842573 19880163 21156158
11335 21156158 21153371 20059427 19581858 19367193 18453452 18258498 17663217 17958356 18316452 16988610
11325 16988610 16359612 16581154 14004023 14357601 14088263 14424145 13394210 11488712 10519166 9256730
11315 9256730 10126610 10050177 8580559 8644937 7735691 6838614 7305177 6581246 5200913 5526168
11305 5526168 4930420 3693412 2953822 3003542 2755184 2192844 1503838 161676 -395583 45262
11295 45262 -628559 -1688361 -2256851 -2419757 -3582242 -3368827 -3950777 -4140260 -4393951 -5683913
11285 -5683913 -5633356 -7220991 -7462757 -8088594 -8802795 -9044658 -9726324 -10077268 -10759796 -10085225
11275 -10085225 -11597588 -11231207 -12091647 -12863546 -12380660 -13468538 -14341765 -14614765 -14502641 -14330636
11265 -14330636 -15226629 -14652250 -17039148 -16533994 -17452663 -18386224 -18375251 -18174205 -19072039 -20072800
11255 -20072800 -19825641 -20515845 -21029544 -20617022 -21291818 -21229913 -21016353 -21118606 -21897933 -22209941 -22229445
11244 -22229445 -21667523 -23102462 -23527243 -23723373 -22621424 -22705244 -22896850 -23649574 -24086128 -23163109
11234 -23163109 -22727456 -22276848 -21739210 -22290362 -22988876 -22819274 -22520970 -22652454 -22560294 -23231420
11224 -23231420 -23903574 -22309816 -23104644 -21975831 -21759187 -22058204 -21369786 -20982761 -21103858 -20253733
11214 -20253733 -20520799 -20375175 -19658252 -19478911 -19133776 -19480101 -18839789 -17869417 -18369034 -17400331
11204 -17400331 -17004741 -16054746 -15109287 -15738562 -15371657 -14852456 -13269163 -13334852 -11857798 -12489367
11194 -12489367 -11273534 -10173545 -9516648 -9757277 -9758073 -9098706 -8922038 -6935041 -7558404 -6538090
11184 -6538090 -5265214 -4039203 -3067152 -4042008 -3110359 -2609825 -926417 765764 1380897 1707457
11174 1707457 3368661 2697233 3759883 5068429 6228230 5438474 7341143 8154284 8274589 8519652
11164 8519652 10698153 10351730 11603129 12171687 14063631 14018137 14512917 16281154 17774437 17947925
11154 17947925 17682289 19062133 19549615 20099616 20730163 21333501 22051756 21883304 24592065 24769162
11144 24769162 25876667 27244096 27447252 27628874 29503567 29457441 30383773 31925768 32789053 32493926
11134 32493926 32824163 34565254 33647241 35112751 35580288 35940579 37064697 37308882 39033070 39436772
11124 39436772 39958337 40658324 40816839 41572423 41548116 41556667 42483228 44042493 43910824 44290010
11114 44290010 45551000 44671408 46332929 46333134 47355680 47929341 47311470 47730698 48611264 49113799
11104 49113799 50061125 49619651 50948855 51324503 51816432 51840618 51643584 51352606 51689394 52713079
11094 52713079 52506608 53010486 54167573 53313503 53338609 53954098 54970629 54687324 55579772 55056772
11084 55056772 54900331 55116911 55407942 57117483 55621833 55895508 55808407 54854783 55183325 56787494
11074 56787494 55987713 56455815 55403993 54413433 55329540 55463358 55440812 56169961 54978851 55524823
11064 55524823 54864193 55390289 54891605 54787166 55219219 54444301 54802262 54759678 54481539 53234007
11054 53234007 54160160 54109238 53481547 54357254 52950637 52240546 51831576 51809982 51890713 51190715 50601028
11043 50601028 50104082 50094325 49140690 49259422 48346614 46986026 47430356 47977022 47125844 46152474
11033 46152474 45415569 44586885 44614687 44426146 43687392 42031370 41386558 41189386 40804505 40269678
11023 40269678 38382361 38217063 36782822 35592525 35950474 34889138 33518351 32898436 31830904
11014 31830904 32285115 30807367 29445174 28382323 27721343 28273938 25212245 25364656 23987110
11005 23987110 21898079 21147918 20730549 19456616 17924222 17347346 15853836 17470280 14865366
10996 14865366 14269254 12322711 10797750 9749471 8997103 7774500 7157290 5937552 4404865
10987 4404865 3640169 2623317 1644232 -923556 -906640 -1940170 -2983526 -4528713 -5539692
10978 -5539692 -7200138 -8518981 -10763276 -11772685 -12093393 -13471769 -14771124 -15579215 -17743941
10969 -17743941 -17876622 -18694789 -21465192 -21966069 -22846712 -24552914 -25730418 -25578549 -27210606
10960 -27210606 -28673087 -29378928 -29361282 -31131469 -32247640 -32697811 -33475333 -34225051 -35162550 -37089611
10950 -37089611 -38431489 -38873966 -38389565 -39651688 -40382799 -41526982 -41771565 -43214537 -43724166
10941 -43724166 -45242148 -45448774 -45251321 -47101471 -48149450 -48608860 -48949237 -48535036 -49283492 -50087002
10931 -50087002 -50033515 -49680595 -50911855 -52050884 -51975109 -51799422 -51534879 -51880503 -51491759 -52089925
10921 -52089925 -51498636 -52530953 -52974543 -52645126 -53145995 -53765146 -54064706 -54038221 -53487925 -54392347
10911 -54392347 -53142227 -53584953 -51762418 -52605723 -52756899 -53361300 -52298947 -52472953 -52565895 -52809170
10901 -52809170 -51520786 -51126327 -49855530 -50575547 -50989832 -50585915 -49546902 -50262387 -50191348 -49806872
10891 -49806872 -47796959 -46525870 -46324773 -46369315 -46707543 -46592343 -45803421 -45802130 -45651869 -44555635
10881 -44555635 -43659693 -43033395 -40815007 -41088638 -41402913 -41242450 -39597871 -40242204 -38922588 -38805505
10871 -38805505 -38068287 -38286040 -36624654 -34944713 -34914174 -33977923 -34585019 -33748703 -33803370 -33440266
10861 -33440266 -32709409 -31384893 -30427847 -29575198 -28686684 -29009057 -27528715 -27997314 -27681301 -27500984
10851 -27500984 -25594965 -25392663 -25367329 -23774772 -23930991 -23082368 -22612598 -22137822 -21615319 -21069486
10841 -21069486 -19664985 -19333447 -19164047 -18492266 -17632220 -16954172 -16855910 -16074273 -15569994 -15992305
10831 -15992305 -14224144 -13809117 -12958639 -11493798 -11843166 -11424378 -10821144 -10837417 -10021036 -8889034
10821 -8889034 -8645717 -6984767 -7349349 -6177958 -6375831 -5859357 -4706132 -3712124 -3793659 -2069988
10811 -2069988 -2406169 -2246058 -1650385 85515 614182 1041049 2759764 1740139 2749535 4038907
10801 4038907 4049174 4394386 5835400 7365588 6885762 7225226 8125622 8870231 10080265 10834932
10791 10834932 11162819 12015634 11993401 13225411 14716954 15659660 16088781 15739197 18718959 17978065
10781 17978065 18952165 19774320 20675786 21730028 22422992 22272081 23776619 24401116 24612069 26450534
10771 26450534 28033849 28938223 30309048 30359536 30771436 31205131 32641109 33270980 33982968 35311520
10761 35311520 36093660 37306870 37594073 39082094 39627290 39978784 40374528 40921947 41512018 42100341
10751 42100341 44242646 44396487 45590498 45904924 47708814 47288232 48654335 49749306 51200268
10742 51200268 52285198 52105175 52373383 52389151 54128287 53921624 54743538 54905940 55651332 56666012
10732 56666012 56645880 56475404 56349560 57360502 59025004 58424434 58852359 58930848 58911722 58480108
10722 58480108 59913512 59691495 59074155 60310224 59613330 61137060 60777321 60730212 59764884 60468670
10712 60468670 58837061 60026923 60795929 60185664 60460202 60940553 60217760 59932402 59469905 58754776
10702 58754776 58022542 58427847 58082134 57735536 57433114 56520998 55880699 54720603 54426615 54361698
10692 54361698 53496217 53145201 52230841 51083234 50419583 51347263 49752995 48170992 47847647 47612916
10682 47612916 45519820 44502398 44238754 43517997 43036103 42238029 40136560 40241072 39172634
10673 39172634 38052761 37095305 35621773 34855430 34175558 33138014 32414919 31426862 30293341 29383874
10663 29383874 28480505 26916554 26801196 24820959 23539287 23569004 22760207 21239622 19949570 19733174
10653 19733174 18979284 17857753 17403344 15867831 15682066 13275482 13004937 12351843 12268749 11974209
10643 11974209 10160867 10871370 9732206 8007763 8199624 7112318 6500971 5965933 5239538 4444778
10633 4444778 4075576 3292908 3181573 2100640 2491286 3099238 2658953 2064870 2373021 1344223
10623 1344223 1374815 1564115 1222756 649134 781740 433564 489335 214007 -208588 1005402
10613 1005402 2059717 1226116 1754660 3175934 1778891 2204675 2507351 3405330 2607316 3721186
10603 3721186 3730372 4110658 4819832 4662888 4953621 6346271 7656631 7466440 8311704 8388453 9373298
10592 9373298 10684461 10767359 10210883 11743924 12784779 12804599 13332999 13773367 14063142 15672368
10582 15672368 16138944 15665185 16392206 17994438 18153996 18728823 19838938 21366163 20846031 21040688
10572 21040688 23535789 23027042 23505680 24463230 25196707 25342844 25563120 27133456 26640258 27518716
10562 27518716 28599566 28630229 29276280 30596585 31313968 32775564 32201506 32071436 33224888 33973277
10552 33973277 34197897 34238870 34263272 34353764 35530638 36351355 36185710 36195554 37652122 36519940 36672708
10541 36672708 37797768 38232933 37384876 38714248 38177253 38341975 38594193 38437498 37707535 38332429
10531 38332429 40170114 39777985 39683133 38623079 38381514 38323019 39595935 38831559 38476941 38587218
10521 38587218 39437018 39179463 37145735 37929897 37636219 37400689 37851950 38648104 38387350 38175307
10511 38175307 37993497 38127641 37850973 37856839 36823011 37425452 36844339 36580455 37285487 35986095
10501 35986095 35191753 35785855 36235205 35630820 36208820 35965373 35388218 35879831 35390513 35822433
10491 35822433 34849645 36548126 36185659 35817106 36419039 35836696 36607061 36134817 35604777 36451285
10481 36451285 36096619 35273978 36326661 36405446 37042237 36699635 36622818 38406955 38510653 37904699
10471 37904699 38180270 38922215 39680476 40261399 40291454 39978069 40471674 40439265 40942982 42666424
10461 42666424 43245472 43263728 44034326 44545582 44066195 45357724 44973967 45701372 46837404 47019585
10451 47019585 47273125 48372058 48510776 48940379 49308164 50659457 50230665 51114528 52592921 52383981
10441 52383981 53442785 54371852 53927523 55278709 55900875 57564627 57756873 58141792 59210366 59531123
10431 59531123 60154783 61349916 62326008 62017245 62659004 63619825 63544979 64422632 63769889 64697135
10421 64697135 63632618 65828947 65882698 66126466 66390536 66575523 67051181 68031918 68280338 66948256
10411 66948256 68456671 68799939 69920236 69383543 69123507 69732963 68463766 67860468 69110134 68672807
10401 68672807 68698293 69556540 69724331 68666398 69266782 69251934 69896556 68167180 68429810 67367535
10391 67367535 67401503 66757854 66367033 65202006 64825476 65412236 64045918 63254844 62361655 62677167
10381 62677167 61765457 61856963 61485387 60721518 60493840 60139985 59626270 58066872 57802544 55504435
10371 55504435 54380349 53911103 52930961 52762221 51812760 50042476 49884545 48261123 48426859 46619306
10361 46619306 45494237 45207988 44022614 43542910 42492905 41714952 41272674 40198178 38570554
10352 38570554 37850598 36315188 35296346 35364062 34594881 33967979 33247142 31461351 29637031 29714634
10342 29714634 28005857 28037658 27346507 26689715 25718157 25422209 24943402 23320679 22519009 22866673
$$ [...]
-2730a6073720  $$ checkpoint
##END NTUPLES=
##END=
