##TITLE= S#394977
##JCAMP-DX= 5.00 $$ JEOL NMR v1.10
##DATA TYPE= NMR SPECTRUM
##DATA CLASS= NTUPLES
##NUM DIM= 1
##ORIGIN= DELTA_NMR
##OWNER= NMR
##SPECTROMETER/DATA SYSTEM= DELTA_NMR
##.OBSERVE FREQUENCY= 3.00529655924288E+02
##.OBSERVE NUCLEUS= ^1H
##.DELAY= (2.195E+02,2.195E+02)
##.ACQUISITION MODE= SIMULTANEOUS
##.FIELD= 7.0586013
##.FILTER WIDTH= 1.81675738660864
##.ACQUISITION TIME= 3.6339712
##.SPINNING RATE= 16
##.OBSERVE 90= 9.2
$$ ------------------------
$$ JEOL SPECIFIC PARAMETERS
##$FILENAME= C:\NMR/vanceoxidation-3.jdf
##$TITLE= S#394977
##$AUTHOR= NMR
##$CREATION=  1-FEB-2018 10:51:29
##$REVISION=  1-FEB-2018 10:58:41
##$CONTENT= PROTON NMR EXPERIMENT
##$INSTRUMENT= DELTA_NMR
##$SITE= Center College ECP+ 300
##$NODENAME= nmr2
##$DIMENSIONS= 1
##$STORAGE= FLOAT
##$X_FORMAT= COMPLEX
##$X_CURR_POINTS= 16384
##$X_START= 12.50103 $$ppm
##$X_STOP= -2.50012 $$ppm
##$X_TITLE= 1H                             
##$X_ZERO_POINT= 0.33329
##$X_FREQ_FLIP= FALSE
##$X_POINTS= 16384
##$X_PRESCANS= 0
##$X_DOMAIN= 1H
##$X_OFFSET= 5 $$ppm
##$X_FREQ= 300.52966 $$MHz
##$X_SWEEP= 4.50857 $$kHz
##$X_RESOLUTION= 0.27518 $$Hz
##$SOLVENT= CHLOROFORM-D
##$TEMP_GET= 20.5 $$dC
##$ACQ_DELAY= 0.2195 $$ms
##$DIGITAL_FILTER= FALSE
##$FILTER_FACTOR= 1
##$FILTER_WIDTH= 2.254 $$kHz
##$FILTER_MODE= BUTTERWORTH
##$TRANSITION_RATIO= 0.9
##$ORDERS
##$FACTORS
##$LOCK_STRENGTH= 249
##$LOCK_LEVEL= 200
##$LOCK_GAIN= 26
##$LOCK_OSC_OFFSET= 25.6519 $$kHz
##$LOCK_PHASE= 187 $$deg
##$LOCK_OSC_STATE= 2H OSC ON
##$X_ANGLE= 45 $$deg
##$X90= 9.2 $$us
##$X90_HI= 10 $$us
##$X90_LO= 50 $$us
##$X_90_WIDTH= 9.2 $$us
##$X_PULSE= 4.6 $$us
##$RELAXATION_DELAY= 4 $$s
##$SCANS= 1
##$PROBE_ID= 1412
##$ITERATIONS= 1
##$FIELD_STRENGTH= 7.0586 $$T
##$TEMP_SET= 25 $$dC
##$SPIN_SET= 15 $$Hz
##$SPIN_GET= 16 $$Hz
##$HE_LEVEL= 75 $$%
##$N2_LEVEL= 83 $$%
##$CHANGER_SAMPLE= 0
##$ADC_CARD= 16/1MHz/20
##$EXPERIMENT= single_pulse.exp
##$OBS_NOISE= WAUGH
##$IRR_NOISE= WALTZ
##$TRI_NOISE= WALTZ
##$QUA_NOISE= WAUGH
##$OBS_PWIDTH= 1 $$us
##$IRR_PWIDTH= 50 $$us
##$TRI_PWIDTH= 1 $$us
##$QUA_PWIDTH= 1 $$us
##$RECVR_GAIN= 4
##$IRR90= 9.2 $$us
##$TRI90= 10 $$us
##$QUA90= 10 $$us
##$IRR90_HI= 10 $$us
##$QUA90_HI= 10 $$us
##$IRR90_LO= 50 $$us
##$TRI90_LO= 10 $$us
##$QUA90_LO= 10 $$us
##$MOD_RETURN= 1
##$TOTAL_SCANS= 1
##$X_ACQ_DURATION= 3.63397 $$s
##$DELAY_OF_START= 1 $$s
##$ACTUAL_START_TIME= 886330274
##$CLIPPED= FALSE
##$DC_BALANCED= FALSE
##$TRI90_HI= 10 $$us
##$SPIN_LOCK_90= 100 $$us
##$SPIN_LOCK_ATTN= 24.4 $$dB
##$DEUT_GRAD_SHIM_90= 213 $$us
##$DEUT_GRAD_SHIM_ATTN= 9 $$dB
##$IRR_CODE= 146
##$LOCK_STATE= LOCK ON
##$AUTOLOCK_LEVEL= 200
##$SAWTOOTH_RANGE= 4
##$LOCK_STATUS= IDLE
##$LOCK_SETTLE_POINT= 4096
##$LOCK_ACHIEVE_POINT= 0
##$SPIN_ACTION= SPIN ON
##$SPIN_STATE= SPIN ON
##$SPIN_STATUS= SPIN ON
##$SPIN_GAS_SOURCE= AIR
##$TEMP_ACTION= TEMP OFF
##$TEMP_STATE= TEMP OFF
##$TEMP_STATUS= TEMP OFF
##$TEMP_COMP= 0
##$TEMP_DELAY= 0 $$s
##$TEMP_LIMIT_HI= 150 $$dC
##$TEMP_LIMIT_LO= -100 $$dC
##$TEMP_MELTING= -63 $$dC
$$ [...]
##$VT_PID_STD_WB_H_CBL= 10
##$VT_PID_STD_WB_H_CBH= 0
##$VT_PID_STD_WB_H_HC= 2.4
##$VT_PID_STD_WB_H_HL= 70
##$VT_PID_STD_WB_M_PB= 1.5
##$VT_PID_STD_WB_M_TI= 30
##$VT_PID_STD_WB_M_TD= 5
##$VT_PID_STD_WB_M_CBL= 9.9
##$VT_PID_STD_WB_M_CBH= 2.3
##$VT_PID_STD_WB_M_HC= 2.5
##$VT_PID_STD_WB_M_HL= 70
##$VT_PID_STD_WB_L_PB= 1.3
##$VT_PID_STD_WB_L_TI= 29
##$VT_PID_STD_WB_L_TD= 5
##$VT_PID_STD_WB_L_CBL= 20
##$VT_PID_STD_WB_L_CBH= 20
##$VT_PID_STD_WB_L_HC= 0.6
##$VT_PID_STD_WB_L_HL= 100
##$VT_PID_LONG_0_H_PB= 1.5
##$VT_PID_LONG_0_H_TI= 30
##$VT_PID_LONG_0_H_TD= 5
##$VT_PID_LONG_0_H_CBL= 9.9
##$VT_PID_LONG_0_H_CBH= 2.3
##$VT_PID_LONG_0_H_HC= 2.5
##$VT_PID_LONG_0_H_HL= 70
##$VT_PID_LONG_0_M_PB= 1.5
##$VT_PID_LONG_0_M_TI= 30
##$VT_PID_LONG_0_M_TD= 5
##$VT_PID_LONG_0_M_CBL= 9.9
##$VT_PID_LONG_0_M_CBH= 2.3
##$VT_PID_LONG_0_M_HC= 2.5
##$VT_PID_LONG_0_M_HL= 70
##$VT_PID_LONG_40_H_PB= 1.5
##$VT_PID_LONG_40_H_TI= 30
##$VT_PID_LONG_40_H_TD= 5
##$VT_PID_LONG_40_H_CBL= 9.9
##$VT_PID_LONG_40_H_CBH= 2.3
##$VT_PID_LONG_40_H_HC= 2.5
##$VT_PID_LONG_40_H_HL= 70
##$VT_PID_LONG_40_M_PB= 1.5
##$VT_PID_LONG_40_M_TI= 30
##$VT_PID_LONG_40_M_TD= 5
##$VT_PID_LONG_40_M_CBL= 9.9
##$VT_PID_LONG_40_M_CBH= 2.3
##$VT_PID_LONG_40_M_HC= 2.5
##$VT_PID_LONG_40_M_HL= 70
##$SAMPLE_ACTION= LOADED
##$SAMPLE_STATE= LOAD
##$SAMPLE_STATUS= LOADED
##$AUTOSHIM_MODE= AUTOSHIM OFF
##$AUTOSHIM_DELAY= 3600 $$s
##$AUTOSHIM_TRACK= AUTOSHIM OFF
##$SHIM_MAX_RECALL= MAX FOUND
##$SHIM_NAMES= SHIM_Z0
##$SHIM_Z0= 9167
##$SHIM_Z1= 5211
##$SHIM_Z2= 22
##$SHIM_Z3= -2829
##$SHIM_Z4= -240
##$SHIM_Z5= 46
##$SHIM_Z6= -33
##$SHIM_X= -14
##$SHIM_XZ= 16
##$SHIM_XZ2= 0
##$SHIM_XZ3= 0
##$SHIM_X2= -7
##$SHIM_X2Z= -40
##$SHIM_X3= 0
##$SHIM_Y= 1608
##$SHIM_YZ= 13
##$SHIM_YZ2= 10
##$SHIM_YZ3= 0
##$SHIM_Y2= -11
##$SHIM_Y2Z= -20
##$SHIM_Y3= 0
##$NUM_SCANS= 8
##$END_TIME= 886330341
##$LOCAL_TIME= 886330287
##$PROBE_ATN= 0
##$PROBE_TUNE= 0
##$PROBE_MATCH= 2077
##$PROBE_COARSE= NONE
##$LF_TUNE_DIAL= 0
##$LF_MATCH_DIAL= 0
##$HF_TUNE_DIAL= 0
##$HF_MATCH_DIAL= 0
##$PASS_RIPPLE= 0.01 $$dB
##$STOP_RIPPLE= 60 $$dB
##$PROBE_RECOVERY= 0 $$us
##$AF_DELAY_RATIO= 0
##$VERSION= 4.3.3
##$X_ACQ_TIME= 3.63397 $$s
##$DEAD_TIME= 0 $$us
##$DELAY= 0 $$us
##$PHASE_PRESET= 3 $$us
##$UNBLANK_TIME= 2 $$us
##$INITIAL_WAIT= 1 $$s
##$NORMALIZED= TRUE
$$ END OF JEOL SPECIFIC PARAMETERS
$$ -------------------------------
##NTUPLES= NMR SPECTRUM
##VAR NAME= FREQUENCY,    SPECTRUM/REAL, SPECTRUM/IMAG, PAGE NUMBER
##SYMBOL=   X,            R,             I,             N
##VAR TYPE= INDEPENDENT,  DEPENDENT,     DEPENDENT,     PAGE
##VAR FORM= AFFN,         ASDF,          ASDF,          AFFN
##VAR DIM=  16384, 16384, 16384, 2
##UNITS= PPM,     ARBITRARY UNITS, ARBITRARY UNITS, 
##FIRST=  1.2501033903057E+01, -4.49326678800444E-01, -3.24353187217415E-01, 1
##LAST=  -2.50011824950436, -3.82682565552871E-01, -3.82680811490113E-01, 2
##FACTOR=  9.1565355261926E-04, 8.90496042629455E-05, 8.90496042629455E-05, 1
##PAGE= N=1
##DATA TABLE=(X++(R..R)), XYDATA
$$ [...]
4768d6980777o666924J2162213k467638Q746088n157446r867840L108185O52906O719644
4759c9751589j6525410j4842409J0323356J8064770R370734J92367n615932Q02237n174023
4750d3155899k38079r006172Q182087p409625Q040345J887527j301179L31596n605507
4741d8274906N776444j2454390P414506j14523K68617m599489N193771P430041k921853
4732d2281782j1013319K19145j520931P220804o619571O324263l339607r86757j049915
4723e3047670j1502815J7911035P057988R106323p489412k467974n080744J966802r5691
4714d3642158p707139P768206O232268j1893253L409129J0678115k132162j649040
4706c8936034j2580790J3180476r879590q84464K532182O006736q89742O281212j1404012
$$ plain form
4768 -46980777 -53647701 -41485488 -43953126 -35207038 -40364484 -50232324 -47124139 -46471233 -39751589
4759 -39751589 -56276999 -71119408 -60796052 -42731282 -33360548 -33168181 -38784113 -37981876 -43155899
4750 -43155899 -43393978 -52400150 -44218063 -51627688 -43587343 -41699816 -43000995 -42669399 -48274906
4741 -48274906 -42498462 -54952852 -47538346 -47652869 -47384252 -51983741 -46789970 -39359929 -42281782
4732 -42281782 -53295101 -53075956 -54596887 -47376083 -53995654 -47671391 -51010998 -51997755 -53047670
4723 -53047670 -64550485 -46639450 -39581462 -30475139 -37964551 -40432525 -45513269 -43546467 -43642158
4714 -43642158 -51349297 -43581091 -37348823 -49242076 -45832947 -35154832 -37286994 -38936034
4706 -38936034 -51516824 -38336348 -48215938 -49100402 -46568220 -40561484 -41451226 -35170014 -46574026
4697d6574026M135280O505134j1787880P769858j5974636J1076589Q242013o015678
4689d2623346K684992p75178o23646m145359p825467R848734o507378N079823r633512
4680e4520337K607289M791181p507839n84034J0523155o792674L846913j1460234J3943312
4671d5153268p018216Q732863L21472l840215R580869j0965781r199404J4090286n062960
4662d8514354m350237P448792j659708J3877031j823634j0578870p676258J01955J3121022
4653d0054261k406684J73794L722487j537401M422076n28031j0914060J0605825p710222
4644d4226477L581428o472085k743222K009549N235174Q994080r302439o598236J8533395
4635c0988833q412503r446682N405270l652117K363182J242369m177243L864834L644676
$$ plain form
4697 -46574026 -42438746 -35933612 -47721492 -39951634 -55926270 -44849681 -36607668 -42623346
4689 -42623346 -39938354 -40713532 -41337178 -45482537 -53308004 -43459270 -49966648 -44886825 -54520337
4680 -54520337 -51913048 -47121867 -54629706 -55213740 -44690585 -51483259 -47636346 -59096580 -45153268
4671 -45153268 -52171484 -43438621 -43117149 -46957364 -37376495 -48342276 -57541680 -43451394 -48514354
4662 -48514354 -52864591 -45415799 -47075507 -33198476 -35022110 -45600980 -53277238 -53175283 -40054261
4653 -40054261 -42460945 -42287151 -38564664 -40102065 -35679989 -36208020 -47122080 -36516255 -44226477
4644 -44226477 -40645049 -47117134 -49860356 -47850807 -42615633 -33621553 -42923992 -49522228 -30988833
4635 -30988833 -39401336 -48848018 -43442748 -47094865 -44731683 -43489314 -47666557 -43801723 -40157047
4626d0157047K499436j0028660o04722N748076M341862m863019K855252m625797O843187
4617c7991432q321003M475503j787223K611496R124893j1998832O447157J300680K29908
4608c5908853L940857r432460j3293663Q423289P420706K1493519j5818921j8636309
4600e1811835L910119P073876o16116j012728j2927938P915849L97071m549732P643550
4591d3977884l103592j409797P68242Q17771p509708Q594869N031255j79809j0352550
4582e1321203O426945r898345N577123j1173063J779057J612227J1274442J7537318
4574b8185499p770298J276267m466207j0196245J9822355j8676003K403154J2338328
4566c3454148k3591266J0653938R945272j812019N180898j2622206m842392R551648
$$ plain form
4626 -40157047 -37657611 -47686271 -48290993 -42542917 -38201055 -43064074 -40208822 -44834619 -37991432
4617 -37991432 -46312435 -41836932 -43624155 -41012659 -31887766 -43886598 -37439441 -36138761 -35908853
4608 -35908853 -31967996 -41400456 -54694119 -46270830 -38850124 -17356605 -33175526 -51811835
4600 -51811835 -47901716 -40827840 -41443956 -42456684 -55384622 -47468773 -47071702 -51621434 -43977884
4591 -43977884 -47081476 -48491273 -47723031 -46905260 -54414968 -45820099 -40788844 -40968653 -51321203
4582 -51321203 -44894258 -54792603 -49215480 -60388543 -58609486 -56997259 -45722817 -28185499
4574 -28185499 -35955797 -34679530 -39145737 -49341982 -29519627 -48195630 -45792476 -33454148
4566 -33454148 -57045414 -46391476 -36446204 -38258223 -33077325 -45699531 -50541923 -40990275
4558d0990275j677684j5765750K0020224m868368j020423J929177k7663n648114j1635402
4549e9684278m964431J2669481P799896o107827R078693j594427J560328n922387M564489
4540d2600463k373389M301121m749687L359835o801813Q657761q229139N232444J470978
4531d1732352r05940r06980M160068l680894j450134K8864o85487n648450O967515K675774
4521d1178016o877438j3522345R925917O457758k835891Q363319j078152j333931o772907
4512d8851686N461027o039307l70700J0358376j1165288K081039j067005J0921754p377515
4503d6049305K811648M31720l865306O536476m64873m517162K599186o209423n134508
4494e3861547P040437o964334Q305245L049236q613021Q296132Q26117j2540665O299114
$$ plain form
4558 -40990275 -42667959 -58433709 -38413485 -43281853 -44302276 -42373099 -42400762 -48048876 -59684278
4549 -59684278 -64648709 -51979228 -44179332 -50287159 -41208466 -42802893 -41242565 -47164952 -42600463
4540 -42600463 -44973852 -40672731 -45422418 -42062583 -48864396 -40206635 -48435774 -43203330 -41732352
4531 -41732352 -42638292 -43545272 -39385204 -43066098 -44516232 -44487368 -45172855 -50821305 -43853790 -41178016
4521 -41178016 -48055454 -61577799 -51651882 -45194124 -48030015 -39666696 -40744848 -42078779 -48851686
4512 -48851686 -43390659 -49429966 -49800666 -39442290 -50607578 -48526539 -49593544 -38671790 -46049305
4503 -46049305 -43237657 -42805937 -46671243 -40134767 -40599640 -45116802 -42517616 -48727039 -53861547
4494 -53861547 -46821110 -53785444 -45480199 -42430963 -51043984 -42747852 -41921735 -54462400 -48163286
4485d8163286m601212J1218976l685905l52137Q302108m189545q916745M70911J3862652
4476c6054183K143637k0382400J7452158j2189394M911587j3225017N958247O566519
4468d4818846J0022079j5425765R184776K956033p346562r015656P972050O167244M551589
4459c5753058o095405L82530N993332j084612j566898j1077708R196375J510587j3327942
4450e1822799M960595l783534r02142J8235188m856027l440154Q053903J151263l640858
4441c6044565N42533p846369J463655K935294K0146871j3909359m233671o523124K296398
4432d1172337k985862j769304Q302806j793974L940995n829529R279747R245629j0237242
4423c3019071k556546P029879R947756m289391o989036j3344359l24763l530379J0224434
$$ plain form
4485 -48163286 -52764498 -41545522 -45231427 -45583564 -37281456 -41471001 -50387746 -49916835 -36054183
4476 -36054183 -33910546 -54292946 -36840788 -49030182 -44118595 -57343612 -51385365 -44818846
4468 -44818846 -34796767 -50222532 -41037756 -38081723 -45428285 -54443941 -46471891 -40304647 -35753058
4459 -35753058 -41848463 -41465933 -35472601 -36557213 -38124111 -49201819 -40005444 -38494857 -51822799
4450 -51822799 -46862204 -50645738 -51547880 -33312692 -38168719 -41608873 -33554970 -32403707 -36044565
4441 -36044565 -35502032 -43348401 -41884746 -38949452 -18802581 -32711940 -36945611 -43468735 -41172337
4432 -41172337 -44158199 -45927503 -37624697 -39418671 -35477676 -41307205 -32027458 -22781829 -33019071
4423 -33019071 -35575617 -28545738 -18597982 -22887373 -29876409 -43220768 -43545531 -47075910 -36851476
4414c6851476K91088n755985Q440526R419886j983020K099579j3248743Q689710j373941
4405c0272376r273203J1918241p41872j09155l709129L16827p91149l235054K70887
4396c5625983Q928652q19291k445395O48335J041141p18847n428227O005943M53004
4387b7960668K333583j1949463j0532472K0924981K140696J2121835q830739r548863
4379c1301110J13144l31781k877306N11840J2671108M346009O485919K4408373k6376394
4370a2350198n012997m359248J2281713j2261007k152594L237781Q855114J169558K013770
4361h578108M61370j4351489J252994M438706j0691257k112071J2655779J900505n04654
4352a5528225j477335K136243K492262k411532M953382M366130j4481863n5707P815596
$$ plain form
4414 -36851476 -36560388 -42316373 -33875847 -24455961 -26438981 -24339402 -37588145 -28898435 -30272376
4405 -30272376 -39545579 -27627338 -28369210 -28478365 -32187494 -31870667 -32661816 -35896870 -35625983
4396 -35625983 -26697331 -27516622 -29962017 -29313682 -28272541 -28991388 -34419615 -28413672 -27960668
4387 -27960668 -25627085 -37576548 -48109020 -27184039 -25043343 -12921508 -21752247 -31301110
4379 -31301110 -31187966 -31519747 -34397053 -33885213 -21214105 -16868096 -10382177 14026196 -12350198
4370 -12350198 -17363195 -21722443 -9440730 -21701737 -23854331 -20616550 -11761436 -10591878 -8578108
4361 -8578108 -8116738 -22468227 -21215233 -16776527 -27467784 -29579855 -16924076 -15023571 -15528225
4352 -15528225 -17005560 -14869317 -12377055 -14788587 -9835205 -5469075 -19950938 -20006645 -12191049
4343a2191049L859461k219644K876015k062345l151957L268968r98759k91862P785705
4334c125467j858377l610513N284074R08803j730523O024011j729359J3908485j1672695
4325B398439r36843k931794j7509375J7225947J695748P865497l622665J448088j1002987
4316e369945L994251r93308l616914l431922j0154101J2523598N169111L021182O032056
4307G174008L812483q636463m526430J2693957j8769647j0412635P596136Q064179L163301
4298A58889n167247K343224j6240881J6946711r054253n334538M883428K320695L216644
4289e927328L038262n610381N378497J999110j5671045K55637P884708j364326J1539002
4280A522136k2022461R538243m352183m717894R960172n467825q721010K345673R642522
$$ plain form
4343 -12191049 -8331588 -10551232 -7675217 -9737562 -12889519 -9620551 -10619310 -10911172 -3125467
4334 -3125467 -4983844 -8594357 -3310283 -2401480 -4132003 1892008 162649 14071134 2398439
4325 2398439 1461596 -1470198 -18979573 -1753626 -57878 7807619 4184954 5633042 -5369945
4316 -5369945 -1375694 -2369002 -5985916 -9417838 -19571939 -7048341 -1879230 1141952 7174008
4307 7174008 10986491 2350028 -2176402 10517555 -8252092 -18664727 -11068591 -3004412 158889
4298 158889 -5008358 -2665134 -18906015 -1959304 -11013557 -16348095 -11464667 -9143972 -5927328
4289 -5927328 -2889066 -8499447 -3120950 -1121840 -16792885 -16537248 -8652540 -10016866 1522136
4280 1522136 -20500325 -10962082 -15314265 -20032159 -10071987 -15539812 -24260822 -21915149 -12272627
4271a2272627j2064576N316275l809648P812972r898058K890864j4365306J3572547
4263b2817557P252702R95915N246529j2382756L109510j683209k083088L287394q310602
4254b7385162p422557K2261311j8646076m870277N228034O027839o164530J0430151
4246b0541267j2571297P972504p761656l372006M305107K019382j1198643l381361R831613
4237c4697624l999516M797152o05807M539070l746714o480273J9239887N888810j1220720
4228b6285735j931756o105602P862418L273707o057597L973387K535337m059923j3382388
4219d0178152K458298P094120o147467L524300P104771j591730n62256J767366m330810
4210c0861560m268719k27521Q905453n838149N906412K83511p802686n159684L065820
$$ plain form
4271 -12272627 -24337203 -19020928 -22830576 -15017604 -24915662 -22024798 -36390104 -22817557
4263 -22817557 -15564855 -14568940 -9322411 -21705167 -18595657 -20278866 -22361954 -19074560 -27385162
4254 -27385162 -34807719 -12546408 -31192484 -36062761 -30834727 -24806888 -30971418 -20541267
4246 -20541267 -33112564 -25140060 -32901716 -36273722 -31968615 -29949233 -41147876 -44529237 -34697624
4237 -34697624 -38697140 -33899988 -34505795 -29966725 -33713439 -40193712 -20953825 -15065015 -26285735
4228 -26285735 -28217491 -34323093 -26460675 -23186968 -29244565 -25271178 -22735841 -26795764 -40178152
4219 -40178152 -37719854 -30625734 -36773201 -33248901 -26144130 -27735860 -28298116 -26530750 -30861560
4210 -30861560 -35130279 -35357800 -26452347 -32290496 -26384084 -26100573 -33903259 -39062943 -35997123
4201c5997123L354562O80933q190937K572592K329833J913006N27375m037870j3285842
4192e0133471O527080J4596551n209796J502611j888517O744743j0925575j6387333
4184e5173707O355724j12500K322024l479156K698534J319966J029277j1682803p338453
4175f4061094J5387228R146266K748237K699652M06827j2539227Q018949l411774N37796
4166d1067140Q916484N637510j76124k0888255J861000J0028182r078350J2341118n523582
4157c7949157q567379l223947J1743487n023275q762966L117421J4293910j1968997
4149d6340903Q091875J948752j2502948J0217445q14433l993938m551459N553496k154020
4140d4546133M554760o862915O761367q018882N65604J195026J71484J634102o10887
$$ plain form
4201 -35997123 -32642561 -31961628 -40152565 -37579973 -35250140 -33337134 -32809759 -36847629 -50133471
4192 -50133471 -43606391 -29009840 -34219636 -32717025 -34605542 -27860799 -38786374 -55173707
4184 -55173707 -48817983 -48930483 -46608459 -50087615 -47389081 -46069115 -45039838 -56722641 -64061094
4175 -64061094 -48673866 -39527600 -36779363 -34079711 -33672884 -46212111 -38193162 -41604936 -41067140
4166 -41067140 -32150656 -26513146 -26689270 -47577525 -45716525 -35688343 -44766693 -32425575 -37949157
4157 -37949157 -46516536 -49740483 -37996996 -43020271 -51783237 -48665816 -34371906 -46340903
4149 -46340903 -38249028 -36300276 -48803224 -38585779 -39400212 -43394150 -47945609 -42392113 -44546133
4140 -44546133 -39991373 -46854288 -40092921 -48111803 -47546199 -46351173 -46179689 -44545587 -45156474
4131d5156474j1134479J2460908L154466N408269n146756K053557p987797l269082N686313
4122d3931075J784945n124678L814102J3971419K997886n292974j002495o004435J613799
4113c7173506J1935947r55260n148651p638228R08593o717751K156522j5112732J8935340
4104c8809726q259128L660116N346643o212844k819155O309305k528626J690918P173115
4095c4449382n249703l587888J081322L599375M133313j449592l168946q888241N384138
4086d2595604J037018j844281Q955203r824941P364438q605277R751009K002627P532642
4077b6227166r67859m367230r362043K585836j7641475N741227m925308J3627632M830899
4068c6705487K091632N066171j1857189j128012O360369j2393144L314015J132781J427867
$$ plain form
4131 -45156474 -56290953 -43830045 -40675579 -35267310 -40414066 -38360509 -46348306 -49617388 -43931075
4122 -43931075 -42146130 -47270808 -43456706 -29485287 -26487401 -31780375 -32782870 -38787305 -37173506
4113 -37173506 -25237559 -26192819 -31341470 -38979698 -38071105 -44788856 -42632334 -57745066 -38809726
4104 -38809726 -47068854 -43408738 -38062095 -44274939 -47094094 -40784789 -43313415 -41622497 -34449382
4095 -34449382 -39699085 -43286973 -42205651 -38606276 -34472963 -35922555 -39091501 -47979742 -42595604
4086 -42595604 -41558586 -43402867 -34447664 -44272605 -36908167 -45513444 -35762435 -33759808 -26227166
4077 -26227166 -27195025 -31562255 -40924298 -38338462 -55979937 -50238710 -55164018 -41536386 -36705487
4068 -36705487 -34613855 -29547684 -41404873 -42532885 -36172516 -48565660 -45251645 -44118864 -42690997
4059d2690997P659084k298170P275137o862574j0752311Q140923n371691R089732J139278
4050c4671589R468518j2586711R77776k937002L537351M30712o110415M466953R65264
4041c6459143l5356395J5041693J7281031m067528Q398221L363716L634353r405852
4033c7569904j3076740l228213J0887792k989783J3040948j2658762P846069l398582
4025d1147175Q016993j5390339J085599Q555395N501629q835784R470388N805215r53815
4016b7891894m23934j274390j818336j807998o76236j0597445P814513q036195K829680
4007d1882235O173432j690188Q132006J398652j2658475J678779Q814281n654628p593467
3998d3281843P482627M625597j957610j3084262R28470J0344719L099310P36402p971296
$$ plain form
4059 -42690997 -35031913 -37330083 -30054946 -36917520 -47669831 -39528908 -44900599 -35810867 -34671589
4050 -34671589 -25203071 -37789782 -36812006 -39749008 -36211657 -35780945 -41891360 -37424407 -36459143
4041 -36459143 -71815538 -56773845 -39492814 -43560342 -35162121 -31798405 -28164052 -37569904
4033 -37569904 -50646644 -53874857 -42987065 -45976848 -32935900 -45594662 -37748593 -41147175
4025 -41147175 -33130182 -48520521 -47434922 -38879527 -33377898 -42213682 -32743294 -26938079 -27891894
4016 -27891894 -28315828 -29590218 -31408554 -33216552 -33892788 -44490233 -36675720 -44711915 -41882235
4007 -41882235 -35708803 -37398991 -29266985 -27868333 -40526808 -38848029 -30033748 -35688376 -43281843
3998 -43281843 -35799216 -31173619 -33131229 -46215491 -45287021 -34942302 -31842992 -31106590 -39077886
3989c9077886q598076N956513j460871Q917322J655639k27449L093701j1952023M275331
3980c7417799n865582k995931O322096k237172L658893J674952P50640r927058O258551
3971c9778410M776360L518156j6301668M836524N244073n940278N307054Q877812J1798403
3962a7661974j0308730R71949r668503O345520M525828m207389N530056j3271327q304149
3953d6048719J0940423N789481j4435293m056797J1115494L318883j6727343J256620
3945d8847251K934569M412814M571834Q016288j388851n32853o546601j945518n392611
3936d4718180m782209J1890775p90057j094890O492913l44967m02046k224896j32862
3927c6106419l169916O812519n896851q95075r699050J1335501Q439863k150210j221087
$$ plain form
3989 -39077886 -47675962 -41719449 -43180320 -34262998 -32607359 -32834808 -29741107 -41693130 -37417799
3980 -37417799 -43283381 -46279312 -39957216 -42194388 -38535495 -36860543 -36109903 -46036961 -39778410
3971 -39778410 -35002050 -31483894 -47785562 -42949038 -37704965 -43645243 -38338189 -29460377 -17661974
3962 -17661974 -27970704 -26998755 -36667258 -30321738 -25795910 -30003299 -24473243 -37744570 -46048719
3953 -46048719 -35108296 -29318815 -43754108 -47810905 -36695411 -33376528 -50103871 -48847251
3945 -48847251 -45912682 -41499868 -36928034 -28911746 -30300597 -30833450 -37380051 -39325569 -44718180
3936 -44718180 -49500389 -37609614 -38399671 -39494561 -33001648 -33346615 -33748661 -35973557 -36106419
3927 -36106419 -39276335 -32463816 -38360667 -39255742 -48954792 -37619291 -29179428 -31329638 -32550725
3918c2550725P31694r591939K391906L698539o139561M675471j5798112Q960155L783575
3909c9838997r131083R710419l677054J1102085J674300j4102069J0014236l596186
3901c7844349Q108865m131484j2944639L604110l24466n836433J4361271j0448453L1980
3892d5423598J447817J0563142j2251837Q423892j321822J862030q208193q176663Q538485
3883d4546747J6292771r681498o336481l361198J847004R833076j4924311N552199o342935
3874e1668120J0511671R48836r686721J0638960l340943L852270r52681J1157135q174566
3865c6714159P813447j9155603K381091P752516l848446q889004J268141j304416L165733
3856d7530700M4697J0110820m569165K707996o380992J6918263j2135302q556480J6189538
$$ plain form
3918 -32550725 -31819031 -41410970 -39019064 -35320525 -41460086 -36784615 -52582727 -43622572 -39838997
3909 -39838997 -48970080 -39259661 -42936715 -31834630 -30160330 -44262399 -34248163 -37844349
3901 -37844349 -29735484 -33866968 -46811607 -43207497 -43531963 -49368396 -35007125 -45455578 -45423598
3892 -45423598 -43975781 -33412639 -45664476 -37240584 -38562406 -36700376 -44908569 -53085232 -44546747
3883 -44546747 -28253976 -37935474 -44271955 -47633153 -45786149 -35953073 -50877384 -45325185 -51668120
3874 -51668120 -41156449 -40207613 -49894334 -39255374 -42596317 -38744047 -39696728 -28539593 -36714159
3865 -36714159 -28900712 -48056315 -45675224 -37922708 -41771154 -50660158 -49392017 -50696433 -47530700
3856 -47530700 -47486003 -37375183 -41944348 -39236352 -45617344 -28699081 -40834383 -49390863 -33201325
3847c3201325m574176n479993P825167o879231J2064577p443166k217989l17380K072755
3838c8150761j3689663J0921156Q249075n722709N080746p800794J795224j4771670
3830e4089396L372374n573355J0784831k059619Q631362m934035m01673K721026k148380
3821d3696865K062623J062859k153274k621125k819244J356142Q362299l660216N51480
3812d1555321M342206l237337k065577p77313K488617K674243l796268N079525r12220
3803c7759445l824058n63624J926763J950932m624144j125312L180739n506725k735017
3794d9079891M110867J801811J94621n862346k741711M047918M563750K871191j5394146
3785e5487936P92856O491447r733054O407478K886867k398770K807344R441474n994711
$$ plain form
3847 -33201325 -37775501 -43255494 -35430327 -42309558 -30244981 -37688147 -39906136 -40223516 -38150761
3838 -38150761 -51840424 -40919268 -32670193 -38392902 -33312156 -41112950 -39317726 -54089396
3830 -54089396 -50717022 -56290377 -45505546 -47565165 -38933803 -43867838 -44269511 -41548485 -43696865
3821 -43696865 -41634242 -40571383 -42724657 -45345782 -48165026 -46808884 -38446585 -42106801 -41555321
3812 -41555321 -37213115 -40450452 -42516029 -43293342 -40804725 -38130482 -41926750 -36847225 -37759445
3803 -37759445 -41583503 -42147127 -40220364 -38269432 -42893576 -44018888 -40838149 -46344874 -49079891
3794 -49079891 -44969024 -43167213 -42972592 -48834938 -51576649 -47528731 -42964981 -40093790 -55487936
3785 -55487936 -54695080 -48203633 -57936687 -51529209 -48642342 -51041112 -48233768 -38792294 -44787005
3776d4787005j1488561L017505J2994624L965364k027070k825660j0244208R963999m85198
3767d1916210M653720k928367K553595j3698399J1245088N682847j1043410K740440
3759d2710696j832701j132435L658631m013393q048821Q027609o149488N763299J0314825
3750c6123170K105376m829952j699645N585967n322041K180609J356250j1028139O977888
3741d0796857K996772K544463J302996L469992j026308k2635853O681811R057734p094422
3732d5499672j7392567K7622032K1402810j4964259k3867469Q762504k745518L426462
3724d3255677L667686n737785K764841l064376J098358j433006j5847830K1451242k200541
3715d2557088l864996q723185Q00706m699324J8152016n800605J4229386j3613106Q122194
$$ plain form
3776 -44787005 -56275566 -53258061 -40263437 -36298073 -38325143 -41150803 -51395011 -41431012 -41916210
3767 -41916210 -37262490 -40190857 -37637262 -51335661 -40090573 -34407726 -45451136 -42710696
3759 -42710696 -44543397 -45675832 -42017201 -46030594 -54079415 -46051806 -52201294 -46437995 -36123170
3750 -36123170 -34017794 -38847746 -40547391 -34961424 -40283465 -38102856 -36746606 -47774745 -40796857
3741 -40796857 -37800085 -35255622 -33952626 -30482634 -31508942 -54144795 -47462984 -38405250 -45499672
3732 -45499672 -62892239 -35270207 -13867397 -28831656 -52699125 -43936621 -46682139 -43255677
3724 -43255677 -39587991 -45325776 -42560935 -45625311 -44526953 -45959959 -61807789 -40356547 -42557088
3715 -42557088 -46422084 -55145269 -54344563 -59043887 -40891871 -46692476 -32463090 -46076196 -37954002
3706c7954002p778337r17753P23900o894960n465498J7991805P09408o549552N682340
3697d0452649j2043855O517251P484136o093832P61659k052723M126578j731404o262150
3688d9746989J2917605k649535k28277l775478o158949Q99537k361431R521736L075191
3679c8506590n953297K4759K618742N036084j0649368Q89737K979737N762012l713465
3670d1511649O16677j916835N025955n455266n462731L581129L93383l672579L663388
3661d4738528l268580m136264O669689L995339J779627K651137m098666L546665j1124079
3652d8723660Q515414r118254K682867o97039K054753k566824p014428N945261j801692
3643e0723602K556330J3514232J924710o084575p474437R104441j534693J061607m872137
$$ plain form
3706 -37954002 -45732339 -46650092 -45926192 -52821152 -58286650 -40294845 -39585437 -46134989 -40452649
3697 -40452649 -52496504 -45979253 -38495117 -44588949 -43827290 -45880013 -41753435 -43484839 -49746989
3688 -49746989 -36829384 -39478919 -39707196 -43482674 -49641623 -48742086 -51103517 -41581781 -38506590
3679 -38506590 -44459887 -44435128 -41816386 -36780302 -47429670 -46539933 -43560196 -37798184 -41511649
3670 -41511649 -40894972 -42811807 -37785852 -43241118 -48703849 -45122720 -44729337 -48401916 -44738528
3661 -44738528 -48007108 -52143372 -45473683 -41478344 -39698717 -37047580 -41146246 -37599581 -48723660
3652 -48723660 -40208246 -49326500 -46643633 -47340672 -45285919 -47852743 -54867171 -48921910 -50723602
3643 -50723602 -48167272 -34653040 -32728330 -38812905 -46287342 -37182901 -38717594 -37655987 -42528124
3634d2528124J206081R745449o842462P81453K88053l856422Q889229q133936j63902
3625d0614581L578078m562925k185765R73957L597425M077502j0403844M15192M676519
3616d0448442r04778k742446K792964m519209P673677o602903p312364q97407J3383022
3607c9577886j3146629J5206903o007703J616608N275153k931666o875420J0067726
3599c6372914j229458Q70258K003744k2845687L942649P713533P311494r566623k891027
3590e1064031M264065K852046j2818078R626061R697354l563184P08576p300115N66135
3581d7031171J941859N408011m141587j688803l591328P672307l467557p087605J1399100
3572d0586774L556703l559768L453017R261594j0686665n183709P551655J806802r75396
$$ plain form
3634 -42528124 -41322043 -31576594 -38419056 -37637603 -37349550 -41205972 -32316743 -40450679 -40614581
3625 -40614581 -37036503 -41599428 -43785193 -42811236 -39213811 -35136309 -45540153 -45124961 -40448442
3616 -40448442 -41353220 -44095666 -41302702 -45821911 -38148234 -44751137 -52063501 -52960908 -39577886
3607 -39577886 -52724515 -37517612 -43525315 -41908707 -36633554 -39565220 -46440640 -36372914
3599 -36372914 -37602372 -36732114 -34728370 -57574057 -53631408 -45917875 -38606381 -48173004 -51064031
3590 -51064031 -46799966 -43947920 -56765998 -47139937 -37442583 -41005767 -40297191 -47597306 -47031171
3581 -47031171 -45089312 -39681301 -43822888 -45511691 -49103019 -41430712 -44898269 -51985874 -40586774
3572 -40586774 -37030071 -40589839 -37136822 -27875228 -38561893 -43745602 -36193947 -34387145 -35362541
3563c5362541o127597j0163756K654026l364106J438695L663645Q441088j968349j97486
3554d0986381L59660J460647N875461M655970p854141p448156o178067Q516801J401623
3545d0196583q786876M039242o247593n39161O227011o815805P35935L958340R727533
3536c7897957l01093m89939k594111l661614m717410L892827R38003j129605K1372648
3527b4588251j8383332o86635k992661J2069061L779661p90775j461598L752997o189621
3518c5491154m304950k786318o724147j361517L007650M138158n287795M585832l947752
3509d8171993p153140J2149169P62368o4525o907575n070807R476817j0122974Q566717
3500d6535943R682387K02917j5148535J0936092q416969n783132J5055266N27094K470682
$$ plain form
3563 -35362541 -41490138 -51653894 -48999868 -52363974 -50925279 -47261634 -38820546 -40788895 -40986381
3554 -40986381 -40626721 -39166074 -33290613 -28634643 -36488784 -43936940 -50115007 -41598206 -40196583
3545 -40196583 -48983459 -44944217 -51191810 -51730971 -45503960 -52319765 -51583830 -47625490 -37897957
3536 -37897957 -38199050 -38688989 -41283100 -44944714 -49662124 -45769297 -44831294 -45960899 -24588251
3527 -24588251 -42971583 -43658218 -46650879 -34581818 -30802157 -31592932 -33054530 -29301533 -35491154
3518 -35491154 -39796104 -42582422 -49306569 -50668086 -47660436 -43522278 -48810073 -44224241 -48171993
3509 -48171993 -55325133 -43175964 -42413596 -42478121 -49385696 -54456503 -44979686 -55102660 -46535943
3500 -46535943 -36853556 -36650639 -51799174 -40863082 -49280051 -55063183 -40007917 -39480823 -37010141
3491c7010141l909778j0183237Q859352r715955m375385N793447P132254l021039O164896
3482d0265586M426820q218792p207836J1358592P732522o631147m701863l011536O581295
3473c9937531m709833m00302K776844k665086k727231O335524q111602N103214q861134
3464e3197137Q256503r28349J576583M946958m210293O834698n780476m647573J279569
3455d5869517R145974p657166K421113k378230J622036m171347K087645J359220k468497
3446d5908769o98217O653998r270385k98283K122778n217272O121777q110402k655300
3437e7260075J1535133j776103n730731O956200J1727588p672847k548297L669945o261299
3428d7360486j865031L242737R941334M812659m872868p857569n015455N025600o95608
$$ plain form
3491 -37010141 -40919919 -51103156 -42243804 -51959759 -56335144 -50541697 -43409443 -46430482 -40265586
3482 -40265586 -35838766 -44057558 -51265394 -39906802 -32174280 -38805427 -43507290 -46518826 -39937531
3473 -39937531 -44647364 -45047666 -42270822 -44935908 -47663139 -41327615 -49439217 -44336003 -53197137
3464 -53197137 -44940634 -45868983 -44292400 -39345442 -43555735 -36721037 -42501513 -47149086 -45869517
3455 -45869517 -36723543 -44380709 -41959596 -44337826 -42715790 -46887137 -44799492 -43440272 -45908769
3446 -45908769 -46606986 -39952988 -49223373 -49521656 -47398878 -52616150 -46494373 -54604775 -57260075
3437 -57260075 -45724942 -47501045 -53231776 -46275576 -34547988 -42220835 -44769132 -41099187 -47360486
3428 -47360486 -49225517 -45982780 -36041446 -31228787 -36101655 -43959224 -48974679 -43949079 -44644687
3419d4644687O931291J125424j0196881l804974J1832632m201281K37334l557826O191287
3410d0087681K888179L212579m963505o887160m60795J1132724k389175P881090j3493015
3401d3166759N305322o558216p119702J2533300n470864J4036943l935235o984002l013540
3392d4372753J0143657k9673088J7413380J5755442p414774M059242m381116r270647
3384d7740657j429467J993547l384537P181734l523692O132492O069490j6724837L087102
3375d8338825l712514J4195745j8770286Q299153L89001o528151J2391934n355086j368046
3366d8797075O101394j5250799J2565411O559384j1812826O354633j5101672O209192
3358e3172358Q72594L372096o11021q278366N191170J2119218m254450J965445m779707
$$ plain form
3419 -44644687 -37713396 -36587972 -46784853 -50589827 -38757195 -42958476 -42721142 -46278968 -40087681
3410 -40087681 -37199502 -33986923 -38950428 -45837588 -46298383 -35165659 -37554834 -29673744 -43166759
3401 -43166759 -37861437 -44419653 -51539355 -39006055 -44476919 -30439976 -34375211 -41359213 -44372753
3392 -44372753 -34229096 -63902184 -46488804 -30733362 -38148136 -34088894 -38470010 -47740657
3384 -47740657 -49170124 -47176577 -50561114 -43379380 -46903072 -40770580 -34701090 -51425927 -48338825
3375 -48338825 -52051339 -37855594 -56625880 -48326727 -47937726 -54465877 -42073943 -47429029 -48797075
3366 -48797075 -42695681 -57946480 -45381069 -38821685 -50634511 -44279878 -59381550 -53172358
3358 -53172358 -52299764 -48927668 -49538689 -57817055 -52625885 -40506667 -44761117 -42795672 -47575379
3349d7575379m461648P03479J0299244M97837q372732n0966n880506m787149J5412375
3340d4215445l946664R016269n583275j049020K777700j45358o114398L09144M212936
3331d4738111Q010124o589159o675534o859110K525930O555973N141798l070978j151111
3322d6850178J310070L02131j0439660M358210n08441m921329M659419j265701K871913
3313e0483566M705029N179704j4522465M161626J1306717m248219p975949k015638N513834
3304d8378927k312898O405655q926348m923357M481311J0069672l679409L404495p395080
3295e1254886L368052J1896993q117591L62687N074443r648648Q359963n047548l690366
3286d8696901Q842978o365358k370774J088375J081754R197737n888387P528989n088836
$$ plain form
3349 -47575379 -52037027 -51333548 -41034304 -40536467 -48909199 -48960165 -54840671 -59627820 -44215445
3340 -44215445 -48162109 -39145840 -44729115 -45778135 -43000435 -43145793 -49260191 -48951047 -44738111
3331 -44738111 -36727987 -43317146 -49992680 -56851790 -54325860 -47769887 -42628089 -45699067 -46850178
3322 -46850178 -45540108 -45237977 -55677637 -51319427 -51827868 -56749197 -52089778 -53355479 -50483566
3313 -50483566 -45778537 -40598833 -55121298 -50959672 -39652955 -43901174 -51877123 -53892761 -48378927
3304 -48378927 -50691825 -44286170 -53212518 -58135875 -53654564 -43584892 -47264301 -43859806 -51254886
3295 -51254886 -47886834 -35989841 -44107432 -43744745 -38670302 -48318950 -39958987 -45006535 -48696901
3286 -48696901 -39853923 -46219281 -48590055 -47501680 -46419926 -37222189 -43110576 -35581587 -40670423
3277d0670423n608940P759115J931667j4938234P058898K466798J3676633l379065j344314
3268c3047865k260336l885945j012446q435133O679558j2644881N514008J0013114N366829
3259c3713097j0103650k301800l084605J023506j981595J6253887p267055k887699k309809
3250d6371917J193233K508863q41492K997982J561010J20066j1971612J876753Q143185
3241d0783929M74709J607458j1367388N718281K631532l51633J832395K265377j770847
3232c9744045P456824m458068L65600n394761m35131o329407L930784j95122Q355196
3223c6448130k864829J047742n098267o001313o216057Q723524l154801L822059M055609
3214d2134463K152110j0649183Q460206N990780l659622l644291l49877j30406O866327
$$ plain form
3277 -40670423 -46279363 -38520248 -36588581 -51526815 -44467917 -42001119 -28324486 -31703551 -33047865
3268 -33047865 -35308201 -39194146 -40206592 -48641725 -41962167 -54607048 -49093040 -39079926 -33713097
3259 -33713097 -43816747 -46118547 -49203152 -48179646 -50161241 -33907354 -41174409 -44062108 -46371917
3250 -46371917 -45178684 -42669821 -43511313 -40513331 -38952321 -38832255 -50803867 -48927114 -40783929
3241 -40783929 -40309220 -38701762 -50069150 -44350869 -41719337 -42070970 -40238575 -37973198 -39744045
3232 -39744045 -32287221 -36745289 -36379689 -41774450 -42209581 -48538988 -44608204 -44803326 -36448130
3223 -36448130 -39312959 -38265217 -43363484 -49364797 -55580854 -46857330 -50012131 -46190072 -42134463
3214 -42134463 -39982353 -50631536 -42171330 -36180550 -39840172 -43484463 -43834340 -43964746 -37098419
3205c7098419r43142j7918266J5591806N732212j7810893M213939J595824L892573l398240
3196d6142606o217781P195267L536267O423124j8733119K0906317j7452408o701533
3188e7186472L629973O670469n821981Q358158R986054q584318k471545N046015r92920
3179d1366567r386195k341395N247213K769689P557212r006265o130343K207648L256955
3170d7192048K020349J391803Q93055o127915J6514194j2430516l594327r129254M914882
3161e2739777J2120188r837657O368042r461962P314134j937537J4784428o48015l407801
3152c7445957j2231907L720836M315195p038847K007143J1592306p285897L97106m563114
3143d6533136M734180P817817j2019778l957857k985721L12737k913053R754132o669622
$$ plain form
3205 -37098419 -38041561 -55959827 -40368021 -34635809 -52446702 -48232763 -46636939 -42744366 -46142606
3196 -46142606 -52360387 -45165120 -41628853 -35205729 -53938848 -33032531 -50484939 -57186472
3188 -57186472 -53556499 -46886030 -52708011 -44349853 -34363799 -42948117 -45419662 -40373647 -41366567
3179 -41366567 -50752762 -53094157 -47846944 -45077255 -37520043 -46526308 -52656651 -50449003 -47192048
3170 -47192048 -45171699 -43779896 -42886841 -49014756 -32500562 -44931078 -48525405 -57654659 -52739777
3161 -52739777 -40619589 -50457246 -44089204 -53551166 -46237032 -48174569 -33390141 -34038156 -37445957
3152 -37445957 -49677864 -45957028 -41641833 -48680680 -46673537 -35081231 -42367128 -41970022 -46533136
3143 -46533136 -41798956 -33981139 -46000917 -49958774 -52944495 -52631758 -55544811 -45790679 -52460301
3134e2460301R208048R132980j2124898P975543R18269p724335j288520N530550m693987
3125d5526651M598390M051133j4461585l541831Q171649j433146J520233R691116n182695
3116d2113387k770285O38255M375843j1793579J173786R823100j2077J229175k946940
3107d2396109R892464j658626j0201614m651746K565781k383484J0790739K541263J966444
3098c3534888L277252q442438k080386m678811P199764j5531656K1153223j0353375
3090d2991315P152182K463409m570230N585414j0579273R374533K3141m897148o502252
3081d4941539M653315N441644R309489j6440745K6385j969158p72678J99961N987361
3072c8505965m022433J4620085n485125N84376l45691j1068474Q559083k337557K466834
$$ plain form
3134 -52460301 -43252253 -34119273 -46244171 -38268628 -37350359 -45074694 -46363214 -40832664 -45526651
3125 -45526651 -40928261 -36877128 -51338713 -54880544 -46708895 -48142041 -46621808 -36930692 -42113387
3116 -42113387 -44883672 -44245417 -39869574 -51663153 -50489367 -40666267 -40678344 -39449169 -42396109
3107 -42396109 -32503645 -34162271 -44363885 -49015631 -46449850 -48833334 -38042595 -35501332 -33534888
3098 -33534888 -30257636 -38700074 -40780460 -45459271 -38259507 -53791163 -32637940 -42991315
3090 -42991315 -35839133 -33375724 -37945954 -32360540 -42939813 -33565280 -33542139 -38439287 -44941539
3081 -44941539 -40288224 -34846580 -25537091 -41977836 -41951451 -43920609 -44693287 -44493326 -38505965
3072 -38505965 -42528398 -27908313 -33393438 -32809062 -33154753 -44223227 -35664144 -38001701 -35534867
3063c5534867o700011M527393R98916l785301n011479p580655R807607P547927j0526278
3054d6256748Q895461M5194l715553n557825L092904j241583Q659390L948035K101112
3045c0029613r339051l237933j022431J3995128l445997L409300o757208r407148k221372
3036d8056325k176523K2497929j3747008J919833n217040M921435N382133n837260O834281
3027c3478545j231898L590862j1769070j154552P748336p30325p880778K080215O29818
3018d2195937J2319839K079524j2017177P781139M658870m01160n932071r80871j0675430
3009d5363274k231843P414756L295684r977602R356977o94780N393169m052458k983544
3000c9842915P461570r136408n144581O985596O223229k184450P66316J450678j1246768
$$ plain form
3063 -35534867 -42234878 -37707485 -36708569 -40493870 -45505349 -53086004 -43278397 -35730470 -46256748
3054 -46256748 -37361287 -37316093 -41031646 -46589471 -43496567 -44738150 -36078760 -32130725 -30029613
3045 -30029613 -39368664 -42606597 -43629028 -29633900 -33079897 -29670597 -36427805 -45834953 -48056325
3036 -48056325 -50232848 -27734919 -41481927 -39562094 -44779134 -39857699 -34475566 -40312826 -33478545
3027 -33478545 -34710443 -31119581 -42888651 -44043203 -36294867 -37025192 -44905970 -42825755 -42195937
3018 -42195937 -29876098 -27796574 -39813751 -32032612 -27373742 -27774902 -33706973 -34687844 -45363274
3009 -45363274 -47595117 -40180361 -36884677 -46862279 -37505302 -38200082 -32806913 -36859371 -39842915
3000 -39842915 -32381345 -41517753 -46662334 -39676738 -33453509 -35637959 -34871643 -33420965 -44667733
2991d4667733J0229224p975596M868818k690149k107093l168888Q305637J6095857
2983b1109923k4140543j316920l297314J2881516M494176Q272359r842547q53991J261285
2974c3651902l105545m442607L748631Q386883j3562263R800927L796432K151085r12332
2965b7790691q997895R207812J264316J8117L451457k970410o732904Q972215q848390
2956c2426373N312811l266039M431523k300132j0019968M899235l952859k2220821
2948e9542623K4654300L283748l747142P925148j0018441n614269J4687914j511587
2940b9882952m022984o37766j445161r311366L199169J3705356N505693r903017P390128
2931b5402900l856841p774681L964893N02786p851245j4609781J7230994M110831r695152
$$ plain form
2991 -44667733 -34438509 -42414105 -37545287 -40235436 -42342529 -45511417 -37205780 -21109923
2983 -21109923 -45250466 -46567386 -49864700 -36983184 -32489008 -24216649 -34059196 -34913187 -33651902
2974 -33651902 -36757447 -41200054 -37451423 -29064540 -42626803 -32825876 -29029444 -26878359 -27790691
2965 -27790691 -36788586 -27580774 -26316458 -26298341 -22846884 -25817294 -32550198 -23577983 -32426373
2956 -32426373 -27113562 -30379601 -25948078 -28248210 -38268178 -33368943 -37321802 -59542623
2948 -59542623 -34888323 -31604575 -35351717 -27426569 -37445010 -43059279 -28371365 -29882952
2940 -29882952 -33905936 -34543702 -35988863 -45300229 -42101060 -28395704 -22890011 -32793028 -25402900
2931 -25402900 -29259741 -37034422 -33069529 -32566743 -40417988 -55027769 -37796775 -33685944 -43381096
2922d3381096K940984o872999J3747134Q26795L676709o111203r979936J0361886l103455
2913c7895181k694008Q294337j2458546J837251j359771J1561641O7307n288248J0954232
2904b6980986j2781200q106610j639151p13324L627867J5550758L336154p095349R448187
2895b5353654m234839P595699k2605436O503862P029204r113649J2830254P84275n933045
2886c2497329P049198k549659q0612k073723q054082N221073K93147J0410339J66757
2877b2114891j067973j351168m918485n832451k162587P462991Q509514j0739683k65457
2868c2480190L365969Q851736l885662r074334J1847433l559982q079299L899218N597627
2859b3517484o372251J366634l347979Q128736p561222Q084200j3646184m62191J6168569
$$ plain form
2922 -43381096 -40440112 -47313111 -33565977 -32739182 -29062473 -35173676 -45153612 -34791726 -37895181
2913 -37895181 -40589189 -32294852 -44753398 -42916147 -44275918 -32714277 -32646970 -37935218 -26980986
2904 -26980986 -39762186 -47868796 -49507947 -50221271 -46593404 -31042646 -27706492 -34801841 -25353654
2895 -25353654 -29588493 -21992794 -44598230 -38094368 -31065164 -40178813 -27348559 -26564284 -32497329
2886 -32497329 -25448131 -27997790 -28078402 -30152125 -38206207 -32985134 -32691987 -22281648 -22114891
2877 -22114891 -23182864 -24534032 -29452517 -35284968 -37447555 -29984564 -21475050 -32214733 -32480190
2868 -32480190 -29114221 -20262485 -24148147 -33222481 -21375048 -24935030 -33014329 -29115111 -23517484
2859 -23517484 -29889735 -28523101 -31871080 -23742344 -31303566 -23219366 -36865550 -37327741 -21159172
2850b1159172j4436497P761492K189279m860400L19066K081504j7985769K2965864
2842b3124633J1495861j901937j0550874K143780j3899160k869903J2830652P416135
2834a8460079j5028434O319189L707693k837773k290142O356434r461942J0529403k663437
2825b3829088J375762J1292434j6876432o021558K908012J8838975p705920K146678
2817a7871137j4337333Q93482J0587189R653453k0080232J014709R559940l838941J984637
2808b2434233o85555q83169p294716R798576L332777N486870l214285k700102j568101
2799b0161938m767525L005616R272249O6854l621202j748n828831m517281O914216r848416
2789b9488006M34794P661492L983524N736154r478199p049132P760747j2998612K150282
$$ plain form
2850 -21159172 -35595669 -27834177 -25644898 -30505298 -30186232 -28104728 -46090497 -23124633
2842 -23124633 -11628772 -13530709 -24081583 -21937803 -35836963 -38706866 -25876214 -18460079
2834 -18460079 -33488513 -27169324 -23461631 -26299404 -28589546 -22233112 -31695054 -21165651 -23829088
2825 -23829088 -22453326 -11160892 -28037324 -34058882 -31150870 -12311895 -20017815 -17871137
2817 -17871137 -32208470 -31314988 -20727799 -11074346 -31154578 -30139869 -20579929 -24418870 -22434233
2808 -22434233 -23119788 -24002957 -31297673 -21499097 -18166320 -12679450 -15893735 -18593837 -20161938
2799 -20161938 -24929463 -21923847 -12651598 -12584744 -16205946 -16207694 -22036525 -26553806 -19639590 -29488006
2789 -29488006 -29053212 -21391720 -17408196 -11672042 -21150241 -28199373 -20438626 -33437238 -31286956
2780c1286956O573730L129431J0022722K155095L34634K14493j0405724N614797K717285
2771a0930493j6986771J1695555P035975o112148j3245410n058627N843118L939889
2763b3818912N313310o827805Q699329J944929j248003j2708244J3695539J184067p297046
2754b1062836K764681j246590O171557k443959P013789k117165K53830o495642K862632
2745a4299703N614228j0683854O491219K733106o557800L702718k856878P721943j831084
2736i966105p62617J4701866m246648o781275L511481k066646L956952r934382j1685044
2727b3272418J9236185K05495K05256o435530J2684655k283931Q818914q380663J698810
2718B476773R474212j1666159L805308j9566736l37418K3114869j776668r680728j830987
$$ plain form
2780 -31286956 -24713226 -21583795 -11561073 -9405978 -9071344 -8856851 -19262575 -13647778 -10930493
2771 -10930493 -27917264 -16221709 -9185734 -15297882 -28543292 -33601919 -27758801 -23818912
2763 -23818912 -18505602 -25333407 -16634078 -14689149 -15937152 -28645396 -14949857 -13765790 -21062836
2754 -21062836 -18298155 -19544745 -13373188 -15817147 -8803358 -10920523 -10666693 -17162335 -14299703
2745 -14299703 -8685475 -19369329 -12878110 -10145004 -16702804 -13000086 -15856964 -8135021 -9966105
2736 -9966105 -10728722 3973144 -273504 -7054779 -3543298 -5609944 -1652992 -11587374 -23272418
2727 -23272418 -4036233 -3830738 -3625482 -10061012 2623643 339712 9158626 777963 2476773
2718 2476773 11950985 284826 4090134 -15476602 -15814020 7300849 5524181 -4156547 -5987534
2709e987534J4000351m970540o050082m226542Q906846J1293842l2498468L1467817
2701A1935690l0878134J2304075P286734J4942139p040760j4081856j3779246J5470590
2693c840768j605270O022966P61587K632036P063824K652312l836696j575713j868761
2684F405517N419844M826259k289624p563504q781177N612477J0073884K45850r005282
2675D944244M696805k017072K277115O059489L291250j7203067J5594183J0546952
2667B8189899j1686155J687302k275852J0908885j0484251q089362J4810897m270262
2659A8791101J36043L317800P089706M745183k086132M49886j0567162O860438p932758
2650B0804105N283544M665018O333091M200324M96782o592118l992995N468314j840266
$$ plain form
2709 -5987534 8012817 3042277 -3007805 -7234347 1672499 12966341 -19532127 11935690
2701 11935690 -18942444 -6638369 648365 15590504 8549744 -5532112 -19311358 -3840768
2693 -3840768 -5446038 576928 1338515 3970551 11034375 13686687 9849991 8274278 6405517
2684 6405517 11825361 16651620 14361996 6798492 -1982685 3629792 13703676 13949526 4944244
2675 4944244 9641049 7623977 9901092 15960581 19251831 2048764 17642947 28189899
2667 28189899 16503744 18191046 15915194 26824079 16339828 8250466 23061363 18791101
2659 18791101 18927144 22244944 29334650 34079833 31993701 32443587 21876425 28736863 20804105
2650 20804105 26087649 30752667 37085758 41286082 41782864 35190746 31197751 36666065 34825799
2641C4825799j676364J0830252Q377589l017740l263369m698970J0808549m104939l570182
2632D4510625m252514J0857225r897103J9184807M764032j323627J132658l770341j899771
2623E9305991J1983455n869473N408781L923930M819931p246039Q796446k010717M603932
2614H3716237Q042411N995401k417285q216741J7630273j2097694O440181N641170Q296582
2605A13030535q473826J0948995N814115N137378n290844k503665M662520L197490q523692
2596A17999006J4123226J5190819L48584M033471j6164966R777036J4783261j852607
2588A58237830M359071J8154310M608068j0488234R321795J004783n58845Q516955j34686
2579A93021047M007670l468770M536543O344716Q55856L477109j635632J4748776L288457
$$ plain form
2641 34825799 33149435 43979687 52357276 49339536 46076167 41377197 52185746 48080807 44510625
2632 44510625 40258111 51115336 41218233 60403040 65167072 63843445 64976103 61205762 59305991
2623 59305991 71289446 65419973 70828754 74752684 79572615 72326576 81123022 79112305 83716237
2614 83716237 91758648 97754049 95336764 87120023 104750296 92652602 99092783 104733953 113030535
2605 113030535 104556709 115505704 121319819 126457197 121166353 118662688 123325208 126522698 117999006
2596 117999006 132122232 147313051 147661635 151695106 135530140 145307176 160090437 158237830
2588 158237830 162596901 180751211 185359279 174871045 184192840 185197623 184638778 193155733 193021047
2579 193021047 197028717 193559947 198096490 204441206 205297062 208774171 207138539 221887315 225175772
2570B25175772O99940r436262N953486K467719l243592P98467Q715728N817066k552341
2561B34395983J059308L356935L642425m192864j717696J0352538l99585k116654J2485863
2552B56866253l113403k285553q772678O794471J0756575j2122150L183011K426934
2544B53733460n643234l158471J2159589p868063N149796J1618171j770867j2699494
2536B51520887O083958j0153399q662490K0808280o324514Q62451Q069124R016011o258119
2527B64962189j58446l139250Q325589L225202Q450148n40465j2353772m156506J0379767
2518B74994456J0570501j795963r695755J0911885k511398k386158j108430n650292
2510B73328846J3006991P576183n442703l228739N476542j1239942l735450K175113
$$ plain form
2570 225175772 225875712 216439450 222392936 224860655 221617063 222415530 231131258 236948324 234395983
2561 234395983 235455291 238812226 242454651 238261787 236544091 246896629 246497044 244380390 256866253
2552 256866253 253752850 251467297 242694619 249489090 260245665 248123515 251306526 253733460
2544 253733460 248090226 244931755 257091344 249223281 254373077 265991248 264220381 251520887
2536 251520887 257604845 247451446 238788956 259597236 253272722 254135173 262204297 271220308 264962189
2527 264962189 264803743 261664493 269990082 273215284 281665432 281124967 268771195 264614689 274994456
2518 274994456 285564957 283768994 274073239 284985124 282473726 280087568 278979138 273328846
2510 273328846 286335837 293912020 288469317 285240578 290717120 279477178 275741728 277916841
2502B77916841J4566494j4420188J9718771N71823j0781022K44987P853688q42716
2494B94828678j4823475j789047m227923N638189L923912n479252N058787j5760584
2486B67369285Q519049j0097817o316467j327915J92008j1716457O31435r038473K426419
2477B40641067k862261L196229M843417j0978894k874069j018547m867440p801412N89981
2468B18868071l814369j6338728L799236o775971q138370n874609K436697M730947o099387
2459A82793517j2494545l439328O629650O526359k736039j3546808O140382J24850
2451A69998038j0776025l147663K054595n628496m480631L08555j3439622k490577n816662
2442A26581512J2367703l513127M612555j6212436L367713l99344N918272j0045968
$$ plain form
2502 277916841 292483335 278063147 297781918 298353741 287572719 287817706 295671394 294828678
2494 294828678 280005203 278216156 273988233 279626422 283550334 278071082 283129869 267369285
2486 267369285 275888334 265790517 259474050 258146135 258338143 246621686 247253121 238214648 240641067
2477 240641067 237778806 240975035 245818452 234839558 231965489 230946942 226079502 218278090 218868071
2468 218868071 215053702 198714974 202514210 195738239 187599869 181725260 184161957 188892904 182793517
2459 182793517 170298972 166859644 173489294 180015653 177279614 163732806 169873188 169998038
2451 169998038 159222013 156074350 158128945 152500449 148019818 148328373 134888751 132398174 126581512
2442 126581512 138949215 135436088 140048643 123836207 127203920 126804576 132722848 122676880
2434A22676880J630589j2146350M724993L00076M045438j1579369J4446316j4599435
2426A09499138L266600m797586l810300r279358P841392L923282N009105n204183m207048
2417A02241042r061991N01599O055446j327937M671875j568028l525625P870530j8345131
2408H7511780k96761n629023p362719J2173381M026885j4166055L427446J488255q24730
2399H0348459O487690k1441856L291292J7921515j0156254P42719M14202n048706P312801
2390G9871862j3175077j833856J4760078O600128K534280J684516j0516740R34093
2382H0859284j5218334N958289p37349j023451R009815p464836J2403469q758911K788594
2373G7816570p345488O450022M156140j366845n124482K001341O820200j0904041m368542
$$ plain form
2434 122676880 124307469 112161119 116886112 117186188 121231626 109652257 124098573 109499138
2426 109499138 112765738 107968152 104157852 94878494 102719886 106643168 111652273 106448090 102241042
2417 102241042 93179051 93680650 99736096 98408159 103080034 101512006 97986381 105856911 87511780
2408 87511780 87215019 81585996 74223277 86396658 90423543 76257488 79684934 81173189 80348459
2399 80348459 86836149 65394293 68685585 86607100 76450846 77193565 77607767 72559061 79871862
2390 79871862 66696785 64862929 79623007 86223135 88757415 90441931 79925191 80859284
2382 80859284 65640950 71599239 70861890 69838439 78848254 71383418 83786887 75027976 77816570
2373 77816570 70471082 76921104 81077244 79710399 74585917 76587258 83407458 72503417 68134875
2364F8134875J0475051L653494n475418j368989l374354m55568J3011033l671148L576955
2355H4505931Q639331j5314062Q211083M888397q129553K90475O81413J714661j664723
2346H3822953j345586Q000240j4661497P313140N719946r53671K475059K46023J3967907
2337A04584514n199217l243374o822455o105070J1765625k445914N764515J712968p860942
2328I2150650J2969874K927580j2512803R332104L114543O888065k889422l510760P113166
2319A15582997o684027J1595188p500380M462535m046792J4089685J2770693r332973
2311A30936926N696600Q985650K815872M585150O30545n237947l447116J3839776j7127461
2302A41677995P75624J7282083O132424L772956l96402R415385O800714L548317p414444
$$ plain form
2364 68134875 78609926 82263420 76788002 75419013 72044659 71589091 84600124 80928976 84505931
2355 84505931 93145262 77831200 86042283 90930680 82801127 83091602 83773015 85487676 83822953
2346 83822953 82477367 90477607 75816110 83129250 88849196 87895525 90370584 90616607 104584514
2337 104584514 99385297 96141923 89319468 83214398 94980023 92534109 98298624 100011592 92150650
2328 92150650 105120524 108048104 95535301 104867405 107981948 114870013 111980591 108469831 115582997
2319 115582997 108898970 120494158 112993778 117456313 113409521 127499206 140269899 130936926
2311 130936926 136633526 145619176 148435048 153020198 153650743 148412796 144965680 158805456 141677995
2302 141677995 142453619 159735702 165868126 169641082 169244680 178660065 185460779 189009096 181594652
2293A81594652J6555715K987766M019906j2137896J3786085O873327K990097K0774856
2285B37444508q188909N809965O458235K346349K364862J1892611J2314368M947424
2277B75389413K692025m91470R081964R377959k775222J1473678K556219J4894741
2269C22199307J1288873O84989J662159R821513J1093025k889672j651274O224772
2261C58433692J4649769M210230J5894498O153N636151M408847P756205Q393384n363287
2252D14025642m540881P071463L152624R052660r189897N836185M285997J0299186R24518
2243D40917497q078376J0529868k181171n938364O40898J291520L479806n147210p001215
2234D28513253N19345K218895o443573j1451317J0863903j1458782j159948J0095417
$$ plain form
2293 181594652 198150367 201138133 205158039 193020143 206806228 213679555 216669652 237444508
2285 237444508 229255599 235065564 241523799 243870148 246235010 258127621 270441989 275389413
2277 275389413 278081438 277589968 286671932 296049891 293274669 304748347 307304566 322199307
2269 322199307 333488180 334173169 335835328 345656841 356749866 353860194 352208920 358433692
2261 358433692 373083461 377293691 393188189 393194342 398830493 403239340 410995545 419388929 414025642
2252 414025642 409484761 416556224 419708848 428761508 419571611 425407796 429693793 439992979 440917497
2243 440917497 432839121 443368989 441187818 435249454 435890352 437181872 440661678 435514468 428513253
2234 428513253 429032598 431251493 424807920 413356603 424220506 412761724 411601776 421697193
2226D21697193q430161j5500050L369045r030505o58973k947630q71479j7540075o758857
2217C63328508J2137633J963633n732387k5998686Q250904N347179q549179n275364
2209C45472241q882828j120385n902154k843317j627857J710382j4985872q80778j2377798
2200B98561634L342826m804582O062979m522975q781403l224794j761877l982202M273157
2191B85162763j1668693Q475386k327478q330031J791075j7023746L901229r37827K624536
2182B61667214K699908j2031776l155735N974593L260316o589348j3153006L564106
2174B42236272J2114253j782819J4268668k0323985k837506J654815j2911432J2286154
2166B44704420m966543J653757Q790381N607006j47469K003246k062574n969768L406363
$$ plain form
2226 421697193 413267032 397766982 401136027 392105522 391446549 388498919 387627440 370087365 363328508
2217 363328508 375466141 377429774 371697387 345698701 353949605 359296784 350747605 345472241
2209 345472241 336589413 335469028 329566874 326723557 325095700 326806082 311820210 310939432 298561634
2200 298561634 301904460 297099878 303162857 298639882 289858479 286633685 284871808 280889606 285162763
2191 285162763 273494070 281969456 279641978 271311947 273103022 256079276 259980505 259042678 261667214
2182 261667214 264367122 252335346 249179611 255154204 258414520 251825172 238672166 242236272
2174 242236272 254350525 252567706 266836374 246512389 243674883 245329698 232418266 244704420
2166 244704420 239737877 241391634 250182015 255789021 255641552 257644798 255582224 249612456 253018819
2157B53018819J4826670p78028o862045K924209k513348J0188732K789839n703687J518529
2148B69409690J8196030R3854j2057397L925765R377696k379127K398947l452733P955052
2139B93467777O239515j406550j1662054N596613l61968J7836386L760006l4155p25487
2130C12710083P698456P548210j0497473O665039J1584950k381681j1257653J4011429
2122C36081360J201564P078438j012510n386800J1672348j059663M654409N851519O219286
2113C65299951q116114J450964J06139o367676M250817M413071J1620314N606830K524138
2104C80788434n634929J7105266N655288J457014j2884340l478923J2090298Q541979
2096D03640087K371808j694989n026454O476446P374065o924388l579072r488808L446370
$$ plain form
2157 253018819 267845489 267067461 260205416 263129625 260616277 270805009 273594848 267891161 269409690
2148 269409690 287605720 287699574 275642177 279567942 288945638 286566511 288965458 285512725 293467777
2139 293467777 299707292 298300742 286638688 292235301 291873333 309709719 313469725 313435570 312710083
2130 312710083 320408539 327956749 317459276 324124315 335709265 333327584 322069931 336081360
2122 336081360 337282924 344361362 343348852 337962052 349634400 348574737 353229146 359080665 365299951
2113 365299951 357183837 358634801 358740940 352373264 356624081 361037152 372657466 378264296 380788434
2104 380788434 375153505 392258771 397914059 399371073 386486733 383007810 395098108 403640087
2096 403640087 406011895 404316906 399290452 405766898 413140963 406216575 402637503 393148695 396595065
2087C96595065L432158M581253N976505j103550K637790j0312441R211010L406531n413778
2078D09010543P232859q927008N213281M431671P094182o32226N012140j4258282j5146509
2069C99030651J6912880J1301174k804045j211641j0295400p374042N606138O703247
2061D17868962O233088N263841l164611j1742404Q162526l051717L764171j022136
2053D22311720J8227645j3064125J273514Q109698M554902j2609647K388327K764780
2045D33956814J0073633m416341k715281R216919o088687J0011898p291885N290301
2037D48037371J2392828j5343437r003786p35387J5687514p33841l244241J1165331m87652
2028D57734700j2804341J4789118J329002R85989Q61325m768502P633051O045675J0312028
$$ plain form
2087 396595065 400027223 404608476 410584981 409481431 412119221 401806780 411017790 414424321 409010543
2078 409010543 416243402 407316394 412529675 416961346 424055528 423423302 428435442 414177160 399030651
2069 399030651 415943531 427244705 424440660 423229019 412933619 405559577 411165715 417868962
2061 417868962 424102050 429365891 426201280 414458876 422621402 419569685 423333856 422311720
2053 422311720 440539365 427475240 428748754 436858452 441413354 428803707 431192034 433956814
2045 433956814 444030447 439614106 436898825 446115744 440027057 450038955 442747070 448037371
2037 448037371 460430199 445086762 436082976 435347589 451035103 450301262 447057021 458222352 457734700
2028 457734700 444930359 459719477 461048479 462034468 462895793 458127291 465760342 471806017 482118045
2019D82118045l337345p529330l302084o154247O750165J4642633k3719357L3158497
2011D92626977l3513217r048683K3463966O115559q457972j7985938o663187P538995
2003D54076500J7529513O072706P5658n844275p078497p141471q04758q044350q122969
1994D40718057J892802P365428o046113j0717564M737008l95548m304342j920347k2447172
1985D08882209j583532Q008635j649860l507991J312097n054163l81667M90114j2060762
1976C94455080N32668p006192N679358j198340m150330J0360497K72667j2915483R079501
1967C95109426r369407n036113O426821j0800338P747425P829152m331929j353521j652116
1958C84569400m683035J5491203M173271l228763n401649j164813m431170N456396o943065
$$ plain form
2019 482118045 478780700 471251370 467949286 461795039 468545204 483187837 459468480 492626977
2011 492626977 459113760 450065077 473529043 479644602 471186630 453200692 446537505 454076500
2003 454076500 471606013 477678719 477754377 471910102 464831605 457690134 456885376 448841026 440718057
1994 440718057 442610859 449976287 443930174 433212610 437949618 437554070 433249728 431329381 408882209
1985 408882209 407298677 415307312 413657452 410149461 411461558 406407395 406025728 406515842 394455080
1976 394455080 394987748 387981556 393660914 392462574 388312244 398672741 398945408 386029925 395109426
1967 395109426 385740019 380703906 387130727 376330389 384077814 391906966 387575037 386221516 384569400
1958 384569400 379886365 395377568 399550839 396322076 390920427 389755614 385324444 390780840 383837775
1949C83837775q725073J8772853P633248j4772039N171972m665360p448863O511439
1941C86315952p973153J513044J1450888k160045r386445J876558o723215M063290m993585
1932C73983289k045875O856643j0679487j4923127p47855j286081j680326j0060594
1924C39416587j702222J2407254j2769474j2156413J815114n07657m511896j01985p605268
1915C14284040J2350793j3925173P121509o343369M04769k875528k14641q418835N869676
1906C08253241j4955316K973111r050108M846277j489851O531229m087755j0306434
1898B82714394Q724560m346596K129028o871595r048185M206381N122357l432007r677289
1889B69521048J0170947j604662P92321k38327O31804l586077O823664p223058r78233
$$ plain form
1949 383837775 375112702 393885555 401518803 386746764 391918736 387253376 379804513 386315952
1941 386315952 378342799 379855843 391306731 389146686 379760241 381636799 374913584 378976874 373983289
1932 373983289 371937414 378794057 368114570 353191443 352443588 351157507 349477181 339416587
1924 339416587 337714365 350121619 337352145 325195732 327010846 326503189 321991293 321889308 314284040
1915 314284040 326634833 312709660 319831169 313487800 313892569 311017041 310802400 302383565 308253241
1906 308253241 293297925 296271036 287220928 292067205 290577354 297108583 293020828 282714394
1898 282714394 291438954 287092358 289221386 282349791 273301606 277507987 282630344 279198337 269521048
1889 269521048 279691995 278087333 278879654 278641327 279273131 275687054 282510718 275287660 274309427
1880B74309427r02566L583430o464507K0218479q420675j56590P793779j0658570Q502013
1871B87804220l990608N323199K003442j93390J0291364L894177L021026m377935K101582
1862C05877077r935121K701468R923656o974832p24989R527511P925788Q383626j0915300
1853C15788884R659959N826747p831275P760306M963213j687374n793314K3054710p324181
1844C44417675r521336K642158M009703o776546O803867k30045J1388249J994389k901087
1835C51827027j07853J1857749j846763K014770j502815m179057K204244K138728K020755
1826C64426785m18020K584995N603960M326936J625732K360231N937521Q18697r683267
1817C77583570J7489171o413030m438469P309648m30848J3230651j8161241N643692
$$ plain form
1880 274309427 273406861 276990291 270525784 290744263 282323588 282166998 289960777 279302207 287804220
1871 287804220 283813612 289136811 291140253 290946863 301238227 305132404 308153430 303775495 305877077
1862 305877077 295941956 298643424 308567080 301592248 300867259 310394770 318320558 326704184 315788884
1853 315788884 325448843 331275590 323444315 331204621 336167834 334480460 328687146 351741856 344417675
1844 344417675 334896339 337538497 341548200 334771654 341575521 341345476 352733725 354728114 351827027
1835 351827027 351719174 363576923 361730160 363744930 362242115 358063058 360267302 362406030 364426785
1826 364426785 364008765 366593760 372197720 376524656 378150388 380510619 386448140 387266837 377583570
1817 377583570 395072741 388659711 384221242 391530890 391100042 404330693 386169452 391813144
1809C91813144R835081o73286j2624131Q379138O06825J796052j1011200P624922L134638
1800C98881183n009607K474303R070894M144387j1435844K123445q30703j321059m605777
1791C93491222J371887L548513R018029m051319q857173J5330204j2214727J3531049
1783D11167685N25709q129976k038963O671548r685553j0842863j662505m074182J3371777
1774C95302677r471607k1911642N192444j511104j0027866j847925J22034Q70589o341093
1765C50376507Q336129o843141P02552M316857k912734o259814P446901K58962j2195155
1756C43227064o598872o173238R851213L240257L213210l2852069K824751l135693p73730
1747C12822893r28872n067954m757856K065074Q04727n646344m163930M346588J537743
$$ plain form
1809 391813144 401648225 400974939 388350808 396729946 397336771 399132823 388121623 395746545 398881183
1800 398881183 393871576 396345879 405416773 409561160 398125316 400248761 399418058 398096999 393491222
1791 393491222 394863109 398411622 407429651 403378332 394521159 409851363 397636636 411167685
1783 411167685 411693394 403563418 401524455 408196003 398510450 387667587 386005082 381930900 395302677
1774 395302677 385831070 363919428 369111872 367600768 357572902 355724977 355847011 356717600 350376507
1765 350376507 358712636 351869495 352572047 356888904 353976170 347716356 355163257 355422219 343227064
1756 343227064 336628192 330454954 340306167 343546424 346759634 313907565 316732316 313596623 312822893
1747 312822893 311894021 306826067 302068211 304133285 304938012 299291668 295127738 299474326 301012069
1738C01012069o163103q918410n813801l257992m372495q003533Q159020k138437n128708
1729B65374610m391046m72028L743611j4350575m89479L574680j1366106l816811k866852
1720B34940004l872406q647272J1586769j809481j2412527L527611l668980P223674
1712B26867392j8043022P243391m024241j4514170M886313l433512l412389p258628
1704A88311134l977299O429124q782343M041817J410247j3581034L651016N826883
1696A83329545j0297293j3272532J1377258p206702q575271R971454r176788N93280
1688A56742951K118010m073399O831437j1702257l047320J1172242m639138q163777
1680A45238749N993231n956240l979211j0123151O214251K468183m244646j1642339
$$ plain form
1738 301012069 294848966 285930556 280116755 276858763 272486268 264482735 272641755 270503318 265374610
1729 265374610 260983564 260511536 264255147 249904572 249415093 252989773 241623667 237806856 234940004
1720 234940004 231067598 222420326 234007095 232197614 219785087 223312698 219643718 226867392
1712 226867392 208824370 216067761 212043520 197529350 202415663 198982151 195569762 188311134
1704 188311134 184333835 190762959 181980616 186022433 187432680 173851646 177502662 183329545
1696 183329545 173032252 159759720 171136978 163930276 155355005 165326459 156149671 156742951
1688 156742951 158860961 154787562 161618999 149916742 146869422 158041664 153402526 145238749
1680 145238749 151231980 145275740 141296529 131173378 137387629 139855812 135611166 123968827
1672A23968827L722310m990275r00269L3147m897669K153600O341936k319021q78642
1663A22233944k386337q761458L511391j4472L743647n769380j2548336M956513O018062
1654A10983574l224207O94679J2727681o74743o05897j8374394l631698J2679377M422133
1645A14996505O320742j2337530K767070j430713j0963931m160540q844833P705283
1637I4052053J4116075q294009M18199J1575754q731435M33233M73421j0227005P560799
1628A01377085R65050Q498223q497712J1211887P644699p086656j0989323j863359q853712
1619I2406182J6979132p6609j0811966j329284K0595544K27492j6177387J2672864J291262
1610A15777230P697634j6837793j57580N000213k417356n371502J1639951N857738
$$ plain form
1672 123968827 127691137 122700862 121800593 121833740 116936071 119089671 125431607 123112586 122233944
1663 122233944 119847607 111086149 114597540 114583068 118326715 112557335 100008999 104965512 110983574
1654 110983574 107759367 108454046 121181727 120506984 119901087 101526693 97894995 110574372 114996505
1645 114996505 121317247 108979717 111746787 110316074 99352143 95191603 86346770 94052053
1637 94052053 108168128 99874119 100292318 111868072 103136637 103569870 104043291 93816286 101377085
1628 101377085 102342135 110840358 102342646 113554533 121199232 114112576 103123253 101259894 92406182
1619 92406182 109385314 109308705 98496739 97167455 117762999 117990491 101813104 114485968 115777230
1610 115777230 123474864 106637071 106479491 111479704 109062348 103690846 115330797 121188535
1602A21188535j1658326N081975j34721j279472P326725l780990J556008M370286l620569
1593A19049451N794382N254939N26092L517167r596645Q28668J2423587k152653j1053552
1584A24591436J8997580N899062o139646l061927J949623j513187L796601J4659666
1576A59179208j2497820M454589K221983J4866095m47896m669889K795148M098033L121451
1567A73120902k373924J1315808P584739p508269m666240K1074604j0996077P615636
1559A95167179k16042K794368m568335M74300N564329J2933060N928301K859241O090448
1550B27026849J2283545o94107K685337L568267k823971K368503P762876N176373J0728581
1541B68082253j8815N88561l138969J3408974k386371J2380205L063240M101364k08651
$$ plain form
1602 121188535 109530209 114612184 114477463 113197991 120524716 116743726 118299734 122670020 119049451
1593 119049451 124843833 130098772 130624864 134142031 124545386 125374054 137797641 135644988 124591436
1584 124591436 143589016 149488078 143348432 140286505 142236128 140722941 144519542 159179208
1576 159179208 146681388 151135977 153357960 168224055 167776159 163106270 165901418 169999451 173120902
1567 173120902 170746978 182062786 189647525 182139256 177473016 198547620 187551543 195167179
1559 195167179 194951137 197745505 193177170 193651470 199215799 212148859 218077160 220936401 227026849
1550 227026849 239310394 238616287 241301624 244869891 242045920 244414423 252177299 257353672 268082253
1541 268082253 268063438 268651999 265513030 278922004 276535633 288915838 291979078 296080442 295871791
1532B95871791M111575p178245J6772831k059869L303210Q868595j292040N941024P285229
1523C31624101R34555R137463J485996K532443J1113825J0745610k701212R435559R907732
1514C84216072k383753J859044J3301972J518482P684624j2281135J3539701m724434
1506D02730573J0158303o189920M537415m977053J3421106J6343977j3404600K1535793
1498D44155594r246973J309714Q318874P48761P106101r257881K1322611j3187224
1490D51269577J3365640J935952m610090J642868J3741642J824949N369834O045018
1482D90585390K312289O601054k209147j2823930N323342J9227871P368951k209077
1474E14176743R319809L783510k555360K3644133k592983m772052L055661L299404
$$ plain form
1532 295871791 299983366 292805121 309577952 307518083 310821293 319689888 318397848 324338872 331624101
1523 331624101 332558656 341696119 343182115 345714558 356828383 367573993 364872781 374308340 384216072
1514 384216072 381832319 383691363 396993335 398511817 406196441 393915306 407455007 402730573
1506 402730573 412888876 406698956 411236371 406259318 419680424 436024401 422619801 444155594
1498 444155594 434908621 436218335 444537209 445285970 452392071 443134190 464456801 451269577
1490 451269577 464635217 466571169 461961079 463603947 477345589 479170538 484540372 490585390
1482 490585390 492897679 499498733 497289586 484465656 489788998 509016869 516385820 514176743
1474 514176743 523496552 527280062 524724702 548368835 545775852 541003800 544059461 547358865
1466E47358865J1540528l30741J838327j783021l771159N155873J4127369r170716p21199
1457E64244126J0455609O55938O69952P50653o572450q287703j371798M146663J3450943
1448E78141933j2547668N968489N13782j940990j422095k563331p876891l287986j3378157
1439E41607086k301993O704582m653305k851981k553297p589902o784155N532453J1104541
1430E38214029j6263601l383135k200809l764215K504336o64685n945287l858980j4108735
1421D90528918q262593J4049651L585532M134051k4068994n483731n167574J0456336
1413D79771596p319103j4149372K139382j805647m8993k735194j363555j0087512n786062
1404D38615540q016310l649402j509962m871364j8452602M583127O075929j6525193
$$ plain form
1466 547358865 558899393 558568652 560406979 558623958 554852799 560008672 574136041 564965325 564244126
1457 564244126 574699735 575355673 576025625 576776278 570203828 561916125 560544327 564690990 578141933
1448 578141933 565594265 571562754 572076536 570135546 568713451 566150120 558273229 554985243 541607086
1439 541607086 539305093 546009675 541356370 538504389 535951092 528361190 521577035 527109488 538214029
1430 538214029 521950428 518567293 516366484 512602269 515106605 514441920 508496633 504637653 490528918
1421 490528918 482266325 496315976 499901508 504035559 479966565 474482834 469315260 479771596
1413 479771596 472452493 458303121 460442503 458636856 458587863 455852669 454489114 444401602 438615540
1404 438615540 430599230 426949828 425439866 420568502 402115900 406699027 412774956 396249763
1396C96249763R734483k335322o730927q101758M71199O12477j2444698j0584219Q134880
1387C75005878k386336K38443K81586j0732462o206238P585480j8985453p22241j4870559
1378C29208098j406226J838891L877331K759366j3821499L453527k124964j2068529
1370C11715995L692510K727156j5013377m653817j063618o832722k52062p998133j0144658
1361B72177274N020968J19919o261046J5619564j3337282R13695o181624o018265J1168395
1352B73221598j0322828K16674j5167587R539591q244978p816844n223306J1115453
1344B47317773q018055k049017j9756013J6195210J625311j4297705J831936q028177
1336B14821263J1801198k427822J2684399j9739324l567526N384544p142047K131784
$$ plain form
1396 396249763 405984246 403648924 396917997 388816239 389287438 389899915 377455217 366870998 375005878
1387 375005878 372619542 372857985 373139571 362407109 356200871 363786351 344800898 344078657 329208098
1378 329208098 327801872 329640763 333518094 336277460 322455961 325909488 323784524 311715995
1370 311715995 315408505 318135661 303122284 298468467 297404849 290572127 290320065 282321932 272177274
1361 272177274 277198242 277318161 271057115 286676679 273339397 274253092 268071468 262053203 273221598
1352 273221598 262898770 263115444 247947857 257487448 249242470 241425626 236202320 247317773
1344 247317773 239299718 237250701 217494688 233689898 235315209 221017504 222849440 214821263
1336 214821263 226622461 224194639 236879038 217139714 213572188 218956732 211814685 213946469
1328B13946469k279075J69041k405746L055351m724894k8361012J7966981j0205307
1320A87161808j3342828K4024262M870115o371266j1254070K559637J1417324O214097
1312B05279079l682527p267885n561349j7986989L851969J017556O711860N01583j7334654
1303A65528643n627823J3357101l663043M82789n101154J601392l451450r299016N406445
1294A59233884k170169l614684j1486926J0093639R011604L581084j0403009K624795
1286A56870218n781536N820719r459191L38015n513348J4585932p165959k63157o081247
1277A43350446m389307Q884649R0132m70875p009820J696050k841546n680868J190185
1268A34819046O026020o526235j935066m545277Q08270j603860q089463J995903N33762
$$ plain form
1328 213946469 211667394 211836435 209430689 212486040 207761146 179400134 197367115 187161808
1320 187161808 173818980 197843242 202713357 196342091 185088021 187647658 199064982 205279079
1312 205279079 201596552 194328667 188767318 170780329 174632298 175649854 182361714 182863297 165528643
1303 165528643 159900820 173257921 169594878 170077667 164976513 166577905 163126455 153827439 159233884
1294 159233884 157063715 153449031 141962105 152055744 161067348 164648432 154245423 156870218
1286 156870218 151088682 156909401 147450210 147788225 142274877 156860809 149694850 149431693 143350446
1277 143350446 138961139 147845788 147935920 147465045 140455225 142151275 139309729 133628861 134819046
1268 134819046 140845066 134318831 132383765 127838488 128646758 127042898 118953435 120949338 121483100
1259A21483100P781276M310753l566543n049668O282582P024454j2050121k469483J554140
1250A25300490r088848J2017167J859785J398337R59380M555914j7339451N187651k384217
1241A22466208M522186J116805j1317743m695765J7389720p869254Q464627L407790
1233A33484574j618209l680166j1172889N350397M882549o048863P165412l144570
1225A25218235J0547921j3733581N511331n228873J1677939O366970n3574p402001N212638
1216A38117005l790892j554097j2600220Q566032j009913l637155k147101J1601788
1208A33545447J0772669M79900j0335982m186984Q527766o675O95063J2008732r296135
1199A42203801J257847k284951J0428378k961054j0909856J0866469m865725K971237
$$ plain form
1259 121483100 129264376 133575129 130008586 124958918 131241500 138265954 126215833 123746350 125300490
1250 125300490 116211642 128228809 130088594 131486931 132446311 137002225 119662774 124850425 122466208
1241 122466208 126988394 128105199 116787456 112091691 129481411 121612157 130076784 133484574
1233 133484574 131866365 128186199 117013310 122363707 127246256 121197393 128362805 125218235
1225 125218235 135766156 122032575 127543906 122315033 133992972 140359942 140306368 132904367 138117005
1216 138117005 134326113 132772016 120171796 128737828 127727915 124090760 121943659 133545447
1208 133545447 144318116 144798016 134462034 130275050 138802816 138796141 139491204 151499936 142203801
1199 142203801 143461648 141176697 151605075 148644021 137734165 148600634 143734909 146706146
1191A46706146J1631856j0834102O287985k311096J702184n00151O507169j0635607
1183A48554384J7489365j3630693P460594n599317k440254j527399P029613O031992L56468
1174A63724753j977565K919024P891746l863121O520398p240856j477088J2273545q537660
1165A70233176J1367589N723761j2255906P098524P90931j833613P49443N336819J1466921
1156A98677645m821002L732155N569946j243103n81763P339329M884334K673070l971239
1147B12259372P037772m259368J454670R254253J025510P868318k904508K03426L54194
1138B32293639Q618519n607562Q237971L746208J3128232j264863N686092n140102m299985
1129B55398149R45762n024618P882533J4895406j453628N528761K840580n836086O930736
$$ plain form
1191 146706146 158338002 147503900 153791885 151480789 153182973 152682822 159189991 148554384
1183 148554384 166043749 152413056 159873650 154274333 151834079 150306680 157336293 163368285 163724753
1174 163724753 161747188 164666212 172557958 168694837 175215235 167974379 166497291 178770836 170233176
1165 170233176 181600765 187324526 175068620 182167144 182958075 181124462 181873905 187210724 198677645
1156 198677645 193856643 197588798 203158744 201915641 201333878 208673207 213557541 216230611 212259372
1147 212259372 219297144 215037776 216492446 225746699 226772209 234640527 231736019 231939445 232293639
1138 232293639 240912158 235304596 243542567 247288775 260417007 259152144 264838236 259698134 255398149
1129 255398149 256343911 251319293 259201826 274097232 272643604 278172365 281012945 275176859 282107595
1120B82107595J0386439R698643n598383k259154J1201818m924601O688981R034558
1112C16335896k348656J1555060J233552N394110J009615k393334J1607236J5685724
1104C58079203l911443O515140J669177m849754l172969K3277909p56513q1784N850904
1095C82619870L600430M724348J3016804O753763N208396l551292K2245113O10592K125470
1086D37353494l025103J4215937K512257J2114677J1768384J154479J2330021M53343
1078D88877489P568787J3583142N825026P099834Q959406J41999J9576501R453936R176991
1069E70263111J4949915J498801K0721228J2244924R416261J9409184P792386J6990101
1061F73285911J3424873L606594Q011015J7662471K0230705Q651414J8510281K5572543
$$ plain form
1120 282107595 292494034 302192677 296594294 294335140 305536958 300612357 307301338 316335896
1112 316335896 313987240 325542300 326775852 332169962 333179577 330786243 342393479 358079203
1104 358079203 354167760 360682900 362352077 357502323 354329354 377607263 376850750 376768966 382619870
1095 382619870 386220300 390944648 403961452 410715215 415923611 412372319 434617432 435228024 437353494
1086 437353494 434328391 448544328 451056585 463171262 474939646 476094125 488424146 488877489
1078 488877489 496446276 510029418 515854444 522954278 531913684 532055683 551632184 561086120 570263111
1069 570263111 585213026 586711827 607433055 619677979 629094240 648503424 656295810 673285911
1061 673285911 686710784 690317378 698328393 715990864 736221569 744872983 763383264 788955807
1053G88955807Q567377K2584958K1525366J1230452K9361125K2320505K4500879J2447647
1045I41494116J5771808J1474297K7273619K2853683K2748399K8611951K8661530K5940979
1037A124830382K1319690K1129664L8550268J5839685L3005006K4221122K2783420
1030A301679237L0673825K8031715K9473790L9549274K1473544L7067145J6684211
1023A504632741J4759574J1895870M9378534K0338726K6076904J8501168M0846056
1016A686429573K8300172J0349537K1010060J2551735J9375939J4632654K4066681
1009A816716351J8740140K6694922J5738599J3797041P696994J5683241L217157J2563479
1001A930847924P357228M376106J3970726J3640489l523523k581819K0950664j193234
$$ plain form
1053 788955807 797523184 820108142 841633508 852863960 882225085 904545590 929046469 941494116
1045 941494116 957265924 968740221 996013840 1018867523 1041615922 1070227873 1098889403 1124830382
1037 1124830382 1146150072 1167279736 1205830004 1221669689 1254674695 1278895817 1301679237
1030 1301679237 1332353062 1360384777 1389858567 1429407841 1450881385 1487948530 1504632741
1023 1504632741 1519392315 1531288185 1580666719 1601005445 1627082349 1645583517 1686429573
1016 1686429573 1714729745 1725079282 1746089342 1758641077 1778017016 1792649670 1816716351
1009 1816716351 1835456491 1862151413 1877890012 1891687053 1899384047 1915067288 1918284445 1930847924
1001 1930847924 1938205152 1942581258 1956551984 1970192473 1966668950 1964087131 1985037795 1983844561
993A983844561O751925Q844166O847742j4771354N494147J2015740N936129O255911l41728
984B020877239J0713907r77479Q842577R359860L777967M299271J0070818j2116738
976B054847422Q779202N359555L757896J3241664J8403893L922866m425719J547958
968B105434737J0593226R011743O597140O548267N048873j260422M373824J136259
960B147483647j4718351P588294j4941847M186375j2569919L670759n40610j7065359
952B103092989j3523026j0774681n062226k75387k0758858k4468472o548615j7371193
944B004310531j2728713k7967774l430015k712497k2271715j4360537o108594j2931688
936A901798998j6333803k6222466r361477k0043435j2918485j9326374Q76776k4828456
$$ plain form
993 1983844561 1990596486 1999440652 2006288394 1991517040 1997011187 2009026927 2014963056 2021218967 2020877239
984 2020877239 2031591146 2030613667 2039456244 2048816104 2052594071 2056893342 2066964160 2054847422
976 2054847422 2063626624 2068986179 2072744075 2085985739 2104389632 2108312498 2103886779 2105434737
968 2105434737 2116027963 2125039706 2131636846 2138185113 2143233986 2141973564 2146347388 2147483647
960 2147483647 2132765296 2140353590 2125411743 2129598118 2117028199 2120698958 2120158348 2103092989
952 2103092989 2089569963 2078795282 2073733056 2073457669 2052698811 2028230339 2021681724 2004310531
944 2004310531 1991581818 1963614044 1960184029 1957471532 1935199817 1920839280 1914730686 1901798998
936 1901798998 1885465195 1859242729 1849881252 1829837817 1816919332 1797592958 1798469734 1773641278
928A773641278r600384q620340j5375329k12089q910712j4691284m12260j3090769q664175
919A694063936j060897m065237q29053P379010m676849J302603o563342O995266J8760598
910A711306035k7488650K4299234J4911293r47811n635576R933346P461371J2746355
902A746585597N97724m047571J9916804J6354021R958051N903697J2133993J6121941
894A823524257Q883717L276299J9222056J0408055K799493L705773J0710694J4232545
886A896762889k382776J6635163R222197p087413M622671M324029k312623r807666
878A909976471J7559756q162625k861012j3246016o705290k215422J926791k6395737
870A869876916m176395j9330873j6616674k2965344q801295m715262k4567401k3800002
$$ plain form
928 1773641278 1764040894 1755420554 1740045225 1739833136 1730922424 1716231140 1715818880 1702728111 1694063936
919 1694063936 1693003039 1688937802 1688108749 1695487759 1690810910 1692113513 1685550171 1692545437 1711306035
910 1711306035 1683817385 1708116619 1723027912 1722080101 1716444525 1726377871 1733839242 1746585597
902 1746585597 1747183321 1743135750 1763052554 1779406575 1789364626 1795268323 1807402316 1823524257
894 1823524257 1832407974 1835684273 1854906329 1865314384 1868113877 1871819650 1882530344 1896762889
886 1896762889 1894380113 1911015276 1920237473 1913150060 1917772731 1922096760 1919784137 1909976471
878 1909976471 1927536227 1919373602 1916512590 1903266574 1896561284 1894345862 1896272653 1869876916
870 1869876916 1865700521 1846369648 1829752974 1806787630 1797986335 1793271073 1768703672 1744903670
862A744903670k8660236j8610168j0525258l5964430k3611312k9513782k3496987k3393269
854A551128228j5036544k1981679r778620p3315184j3600235j7549842k3576028j9398640
846A356891456l5588528k1629432j9359187k9365777k2099484j9298959l0093023l0586472
838A148870594k6157955j3667634j5993371k9641896k3758387k6976427j272330k0558367
830I90844227k4553934k8622703N87723l6034284j8659621j2179140j1657794j1155391
822H48569083j9498174j9035018j6573513m582421j9227987l6641144o533173J211586
814G27689239p725396k7757315m822059k102890j9158766j5508032p287871k2722019
806F20604891k1334909j4768082N845463q315650j0634691j2917390j3602737o876850
$$ plain form
862 1744903670 1716243434 1697633266 1687108008 1651143578 1627532266 1598018484 1574521497 1551128228
854 1551128228 1536091684 1514110005 1504331385 1431016201 1417415966 1399866124 1376290096 1356891456
846 1356891456 1321302928 1299673496 1280314309 1250948532 1228849048 1209550089 1179457066 1148870594
838 1148870594 1122712639 1109045005 1093051634 1063409738 1039651351 1012674924 1011402594 990844227
830 990844227 966290293 937667590 938255313 902221029 883561408 871382268 859724474 848569083
822 848569083 829070909 810035891 793462378 788879957 769651970 733010826 726477653 727689239
814 727689239 719963843 692206528 687384469 685281579 666122813 650614781 643326910 620604891
806 620604891 599269982 584501900 590347363 582031713 571397022 558479632 544876895 538000045
798E38000045r041588j7245971k230205j0533231j0917826p158433k0351428N340811
790D65862174j1882360j103103j1881094j8350405l076969j833338r272177j1237161
782C97225567J260544j6809932k439078J585307q137580r934420l293385n280108o998124
773C47178791r504077k143047m387279o978568r278704k525491J327100j8332417O942790
764C02299098j0254462Q975838j4924365j3286435l134246K192407n100420o840295
756B59927120L879048l822752j0853812m570171O246894j6085853j0008188J4157263
748B38869549j2597809O609448J0657956j7932014j6297891J622406j1592874N914053
740B05252824q794669M94324P298877q200659j853199q93874L621638j5020373k007931
$$ plain form
798 538000045 528958457 511712486 509482281 498949050 488031224 480872791 460521363 465862174
790 465862174 453979814 452876711 440995617 422645212 419568243 417734905 408462728 397225567
782 397225567 398486111 381676179 379237101 380822408 372684828 362750408 359457023 354176915 347178791
773 347178791 337674714 335531667 331144388 324165820 314887116 312361625 313688725 295356308 302299098
764 302299098 292044636 301020474 286096109 272809674 269675428 271867835 266767415 259927120
756 259927120 263806168 259983416 249129604 244559433 250806327 234720474 224712286 238869549
748 238869549 226271740 232881188 243539144 225607130 209309239 210931645 199338771 205252824
740 205252824 196458155 196952479 204251356 196050697 194197498 193303624 196925262 181904889 179896958
731A79896958J408311p791481P047246K661126k86671o106879j3608415J2243851j827944
722A73636102j6052807K964985n638555M971129j008542p851536Q53260K229787j1995056
713A42108767R688969o288307j1088942K33655J687190J432273O780999q391052M893009
704A41056561j0326648q183212L374671J907549j508837j678839p242271Q829689l546142
695A22682521l444587N585598j099096n038425j426602k612522N096682l049879q146759
686A08546931O565291K19297k3401187J1158013N271830M610561n428040p198116j727740
677I8616840L568328j1375314P426733l979804K027827J98294j364365J2335998j8345231
668H9109306l270570l601625K534453K268245M169105q760682k078572J0236393m037466
$$ plain form
731 179896958 181305269 173513788 180561034 183222160 182935489 176828610 163220195 175464046 173636102
722 173636102 157583295 160548280 154909725 159880854 158872312 151020776 151874036 154103823 142108767
713 142108767 151797736 145509429 134420487 134654142 136341332 137773605 144554604 136163552 141056561
704 141056561 130729913 122546701 125921372 127828921 126320084 124641245 117398974 126228663 122682521
695 122682521 119237934 124823532 123724436 118686011 117259409 114646887 119743569 116693690 108546931
686 108546931 115112222 115331519 91930332 103088345 108360175 112970736 107542696 100344580 98616840
677 98616840 102185168 90809854 98236587 94256783 96284610 96482904 95118539 107454537 89109306
668 89109306 85838736 82237111 84771564 87039809 91208914 82448232 80369660 90606053 86568587
659H6568587o237681n579085o70162N283059n222049N211291J700248l212929K786687
650H0627966m099333r892296N943658R74294j767679Q471844p219009o970409N858416
641G1927452j57131o14140r206980R39432O717570M076017L538913q550640p025058
632F1645435K793766j771893j1166344k520848J9471556M13206j7461829J561637L990852
623E6955538N076682p242971R606768j2699468l645232o241726N180957K906127m956606
614D4940069j0063895k099849J7079978n184978N322570j635991j2040936m835749
606C1481219J8102382J1750578j4722408o551989j9493549J9499545M125247m208175
598C9982850o981659k91539K940026O746162j0979034k469447J858929j125302N527381
$$ plain form
659 86568587 80330906 74751821 74081659 79364718 74142669 79353960 81054208 77841279 80627966
650 80627966 76528633 66636337 72579995 73554289 71786610 80258454 73039445 66069036 71927452
641 71927452 71770321 71156181 61949201 62888633 69606203 73682220 77221133 68670493 61645435
632 61645435 64439201 62667308 51500964 48980116 68451672 68864878 51403049 52964686 56955538
623 56955538 62032220 54789249 64396017 51696549 48051317 41809591 46990548 49896675 44940069
614 44940069 34876174 32776325 49856303 44671325 49993895 48357904 36316968 31481219
606 31481219 49583601 61334179 46611771 40059782 20566233 40065778 44191025 39982850
598 39982850 33001191 32709652 35649678 42395840 31416806 28947359 30806288 29680986 35208367
589C5208367K347512j4110600J939861J3391663j328496J314967q909183j883079k49582
580B7721430K27467j3294953J0690565P120871L166010r44056k806158o392258l756857
571B1732061k679708j657297J0578674O932299j0425322q009220J0812283p033039M537744
562B4788475J1007967o934540j5822485L400980n44079R657560L58262l428196k089426
553B0394518r672536N174971N008901o173206k298880j0076455M117637P375287M975396
544A8825633M54892j0779956M973077j053993N550796O653907j2792103k819938o474390
535B537925K0011543n649739l944722P405238J1722121j2651017j7116263J172385P07721
526D195192M206219J159105l264219P683954o795500K999604j597652J2121562q606208
$$ plain form
589 35208367 37555879 23445279 25385140 38776803 37448307 38763274 29854091 27971012 27721430
580 27721430 27948897 14653944 25344509 32465380 35631390 34687334 31881176 25488918 21732061
571 21732061 19052353 17395056 27973730 34906029 24480707 16471487 27283770 20250731 24788475
562 24788475 35796442 28861902 13039417 16440397 15896318 25553878 25912140 22483944 20394518
553 20394518 10721982 15896953 20905854 14732648 12433768 2357313 6474950 13850237 18825633
544 18825633 19280525 8500569 13473646 12419653 17970449 24624356 11832253 9012315 2537925
535 2537925 22549468 16899729 12955007 20360245 32082366 19431349 2315086 3487471 4195192
526 4195192 8401411 9560516 6296297 13980251 7184751 10184355 8586703 20708265 12102057
517A2102057k128417k375518L575365q848756n568441M551010J419232J2433703L237214
508A8397449j145170j1715521O020350M659499j3487341O258630O203994P953828j1797502
499A1348216p656604J424468M777572j2136060J0992823j85577n257268r75888P680696
490A0012378q941858K764753l743100L611220m453197L937044n453935M731683n691157
481c226169L224751L685278J0224349o530318m922284M239014k011759l814997n219269
472d351404O242353l598523j825828P628936q073104J782525O108512L218j0664579
463f747894J713756M892962j966248o230332J4837902k747007m677375j0084938L553708
454g455466n948025M682550J1901232l479627m773930j838407J3979403j0226334M417445
$$ plain form
517 12102057 9973640 7598122 11173487 2324731 -3243710 1307300 2726532 15160235 18397449
508 18397449 17252279 5536758 11557108 16216607 2729266 8987896 15191890 23145718 11348216
499 11348216 3691612 5116080 9893652 -2242408 8750415 8564838 3307570 2331682 10012378
490 10012378 1070520 3835273 92173 3703393 -749804 3187240 -2266695 2464988 -3226169
481 -3226169 -1418 3683860 13908209 7377891 2455607 6694621 4682862 867865 -4351404
472 -4351404 1890949 -1707574 -3533402 4095534 -3977570 -2195045 3913467 3916685 -6747894
463 -6747894 -5034138 -141176 -2107424 -8337756 6500146 3753139 -924236 -11009174 -7455466
454 -7455466 -13403491 -8720941 3180291 -299336 -5073266 -6911673 7067730 -3158604 1258841
445A258841o045066J960555M0991n968344O38199j0186834O183656r662014O232465
436a5547551m705586J0971961o743426N701774O060784k522272n167923Q423942l38916
427c867213j1510418K843879N720328j2394280O168795n263060L596851J841711P695737
418e167670m025909J400068j2403598Q366158k738093j3211372L253351j215703J0747365
409a4995403P8724R407544k971046p226324R652189q833720n794036J3384717P532476
400B35121j2839481j2750815J5384553N534884l405633n647967o08141L530457q238742
391a8805764r204111N985742J2986369J2468533j5649052p161085r608445J1906498M38813
382a6642502J2065058M82088j5325596o404097K135959j059118J21023K116437J675746
$$ plain form
445 1258841 -4786225 -2825670 -2784679 -8753023 -8114824 -18301658 -12118002 -21780016 -15547551
436 -15547551 -20253137 -9281176 -16024602 -10322828 -4262044 -6784316 -11952239 -3528297 -3867213
427 -3867213 -15377631 -12533752 -6813424 -19207704 -13038909 -18301969 -14705118 -12863407 -5167670
418 -5167670 -9193579 -7793511 -20197109 -11830951 -14569044 -27780416 -24527065 -25742768 -14995403
409 -14995403 -14916679 -5509135 -8480181 -15706505 -6054316 -14888036 -20682072 -7297355 235121
400 235121 -12604360 -25355175 -9970622 -4435738 -7841371 -13489338 -14097479 -10567022 -18805764
391 -18805764 -28009875 -22024133 -9037764 3430769 -12218283 -19379368 -28987813 -17081315 -16642502
382 -16642502 -4577444 -4095356 -19420952 -25825049 -23689090 -24748208 -24627185 -22510748 -20835002
373b0835002K571369P528895k707585N326636n051424K612065K551149m576247j3095590
364b5675734m831186K2064282n786082l814682k519363M269544K042585m230603j344995
355a9826234J328617N780007o184608k622253J322152N220254J198950r752931P56014
346b2780032k432104J752908J0041090M210886j5851749k860766M283931L755576l261095
337b3141355N577274p852818K967120k464438J1426182k48295K492847p384699l73952
328a9002134m636657o345827p630805R746681J0947541l913746M345944K297195L50929
319a3840879P333666j2184887q730741J472854Q501959k283393m824871N78316m700776
310b8678752O835026L826826j54919q367224M693986R991813k013292p010497n574575
$$ plain form
373 -20835002 -18263633 -10734738 -13442323 -8115687 -13167111 -10555046 -8003897 -12580144 -25675734
364 -25675734 -30506920 -8442638 -14228720 -18043402 -20562765 -16293221 -14250636 -18481239 -19826234
355 -19826234 -18497617 -12717610 -18902218 -21524471 -20202319 -14982065 -13783115 -23536046 -22780032
346 -22780032 -25212136 -23459228 -13418138 -9207252 -25059001 -27919767 -23635836 -19880260 -23141355
337 -23141355 -17564081 -25416899 -22449779 -24914217 -13488035 -13736330 -11243483 -18628182 -19002134
328 -19002134 -23638791 -29984618 -37615423 -27868742 -16921201 -20834947 -16489003 -14191808 -13840879
319 -13840879 -6507213 -18692100 -27422841 -25949987 -17448028 -19731421 -24556292 -23977976 -28678752
310 -28678752 -21843726 -18016900 -18171819 -26539043 -21845057 -11853244 -13866536 -20877033 -26451608
301b6451608j364399L082320k306368j8413368J4063993J1048150j5352287J0431537
293b5262030N218660j0038241R339632p859629Q987992l088277k466007q767998J2317874
284b1618024r542536J862418Q157275r87098M031794j3995239K742086N122980p610806
275c1837150M256715P630466j3384319N829785P061177p082535O53293J621195j006670
266b6258043l197639k693750O811931J1261270m858069L974120m679181r676255o409824
257c5725440N557457R56404O839643K357975N37285q502290l207409P595024p201017
248c0792368Q985659K707539J003433K75966j0560149r059916Q100418J5727136p28860
239a4341142q828607o087542P487090R685949m829640o495545K244768N350693j8587601
$$ plain form
301 -26451608 -27816007 -24733687 -27040055 -45453423 -31389430 -20341280 -35693567 -25262030
293 -25262030 -20043370 -30081611 -20741979 -28601608 -19613616 -22701893 -25167900 -33935898 -21618024
284 -21618024 -31160560 -29298142 -21140867 -22127965 -18096171 -32091410 -29349324 -24226344 -31837150
275 -31837150 -27580435 -19949969 -33334288 -27504503 -20443326 -27525861 -26872568 -25251373 -26258043
266 -26258043 -29455682 -32149432 -25337501 -14076231 -18934300 -14960180 -19639361 -29315616 -35725440
257 -35725440 -30167983 -29211579 -22371936 -20013961 -19476676 -27978966 -31186375 -23591351 -30792368
248 -30792368 -21806709 -19099170 -18095737 -17819771 -28379920 -37439836 -29339418 -13612282 -14341142
239 -14341142 -23169749 -29257291 -21770201 -12084252 -16913892 -23409437 -21164669 -15813976 -34401577
230c4401577Q195710m831157p530825R935892o39187m931929k868566m816783N728697
221c6159725K529873P897159R71438M85290q87428q59441J18628J4002008k0040845
212c1943043j3932863L486712J6066866K908823j2167197M441209k426617L647179J967440
203b7951491N798562o608054m402056l339304l708341Q169175O500250j072316K294277
194b4319298q296800k708782r67521K873138O371229m593026m219506M311887N222831
185b6325848q644844J497232r005667M356590K655990j673916j563619O530718j2031041
176d4204405N121363J5887463r752012p162673Q105646j97918q0070K0119459k0538452
167c2701599q558936L185713J4814130m150877n671493o092354L766966r39837O786484
$$ plain form
230 -34401577 -26205867 -31037024 -38567849 -28631957 -29271144 -34203073 -37071639 -41888422 -36159725
221 -36159725 -33629852 -25732693 -24761255 -24275965 -25163393 -26022834 -25904206 -11902198 -31943043
212 -31943043 -45875906 -42389194 -26322328 -23413505 -35580702 -31139493 -33566110 -29918931 -27951491
203 -27951491 -22152929 -28760983 -33163039 -36502343 -40210684 -32041509 -25541259 -26613575 -24319298
194 -24319298 -32616098 -35324880 -36292401 -33419263 -27048034 -31641060 -35860566 -31548679 -26325848
185 -26325848 -34970692 -33473460 -42479127 -38122537 -35466547 -37140463 -38704082 -32173364 -44204405
176 -44204405 -39083042 -23195579 -32947591 -40110264 -32004618 -32202536 -32282606 -12163147 -32701599
167 -32701599 -41260535 -38074822 -23260692 -27411569 -33083062 -39175416 -35408450 -36348287 -29561803
158b9561803m036594J60005K852795r463685j0638997P844587p902425J1368549L141972
149c6235596o850547k571360J5340527j970664j619168N090013r56949r781468N149842
140c4405370J87682k748894J3635715L708896M860635j5541453m680488n252478n160623
131d5396378K2118979K85789O860203o843905l079637j1921474p34849n87924N10852
122c8788344J3447958o395116p761254R105498k583889r937745P063690j07025j5968558
113e1924785R939872m441909O571000p85479O088981q650718L193827J1354517j0656412
104c9311106P206382m012896K734371L981154k617033o248409P497380Q215411q557205
95c1111951n133478j032107k015437O323799m19194k695406o77041m219842l782160
$$ plain form
158 -29561803 -33598397 -33438392 -30585597 -40049282 -50688279 -42843692 -50746117 -39377568 -36235596
149 -36235596 -43086143 -45657503 -30316976 -32287640 -33906808 -28816795 -29773744 -39555212 -34405370
140 -34405370 -34217688 -36966582 -23330867 -19621971 -14761336 -30302789 -34983277 -40235755 -45396378
131 -45396378 -23277399 -22991610 -16131407 -22975312 -26054949 -37976423 -38711272 -39299196 -38788344
122 -38788344 -25340386 -31735502 -39496756 -30391258 -32975147 -42912892 -35849202 -35956227 -51924785
113 -51924785 -41984913 -46426822 -39855822 -40641301 -34552320 -43203038 -40009211 -28654694 -39311106
104 -39311106 -32104724 -36117620 -33383249 -29402095 -32019128 -38267537 -30770157 -22554746 -31111951
95 -31111951 -36245429 -37277536 -39292973 -32969174 -33388368 -36083774 -36760815 -40980657 -44762817
86d4762817N209338O336647j2559012N512658n578160L680151J755345j092299o79926
77d2178075J320959j182739J6349703j111130q373486k646406O602949L523327o356092
68c4050990j088735r88293L996020J4270992q757288l786111R03337M623722k984921
59b7862267n054963L225357q061175R202432k387632n851816P227292M467687j0289453
50c5384538J0853950j2567925l11492n000881J1602193q24815M230266N61193o333853
41c3175902o777557K188803K454901J77823J1097883O105160k1577608n711649J9695882
32b5522264R790824j0438446l622254n386689K525859l168180l944386K416714J0064240
23b7284582J0737720j6535831j583617P657614j1140779O595885L608960m379603j483953
$$ plain form
86 -44762817 -39553479 -33216832 -45775844 -40263186 -45841346 -42161195 -40405850 -41498149 -42178075
77 -42178075 -40857116 -42039855 -25690152 -26801282 -35174768 -37821174 -31218225 -27694898 -34050990
68 -34050990 -35139725 -36128018 -32131998 -17861006 -26618294 -30404405 -29501068 -24877346 -27862267
59 -27862267 -32917230 -29691873 -37753048 -28550616 -30938248 -36790064 -29562772 -25095085 -35384538
50 -35384538 -24530588 -37098513 -37410005 -42410886 -30808693 -31633508 -27403242 -26842049 -33175902
41 -33175902 -39953459 -37764656 -35309755 -35131932 -24034049 -17928889 -39506497 -45218146 -25522264
32 -25522264 -15731440 -26169886 -29792140 -35178829 -32652970 -35821150 -39765536 -37348822 -27284582
23 -27284582 -16546862 -33082693 -34666310 -27008696 -38149475 -31553590 -27944630 -32324233 -33808186
14c3808186O036831Q605244j0187050P544379j2144025J292786Q799819o152772N029747
5b4983227K411375j0190301j0483946J7328712l665850j064702P479471n158097l268625
-4c1595190K175373r792437j334304O276879J46932q18587o357040K719363l246975
-13d1825986L753144l595903M515661m393245M891318N262823j1380947p38685J0109458
-22c3402362k131003j886929o677052J2276458j3690709j105664J861590J8703788o386924
-31c2438807p92074n165559M957705p057901J0521178Q23026j0711594r22968J6134956
-40b4652038j2462000o683224n263226J5169917m958536K898678k983382J008801j4964904
-49e2889914j139659J4161260r012385P501608q340400P703728J2114887m743117j903372
$$ plain form
14 -33808186 -27771355 -19166111 -29353161 -21808782 -33952807 -32660021 -23860202 -30012974 -24983227
5 -24983227 -22571852 -32762153 -43246099 -25917387 -29583237 -30647939 -23168468 -28326565 -31595190
-4 -31595190 -29419817 -39212254 -40546558 -34269679 -34122747 -34941334 -41298374 -38579011 -41825986
-13 -41825986 -38072842 -41668745 -37153084 -41546329 -36655011 -31392188 -42773135 -43511820 -33402362
-22 -33402362 -35533365 -37420294 -44097346 -31820888 -45511597 -46617261 -44755671 -26051883 -32438807
-31 -32438807 -33230881 -38396440 -33438735 -40496636 -29975458 -29152432 -39864026 -40786994 -24652038
-40 -24652038 -37114038 -43797262 -49060488 -33890571 -38849107 -35950429 -38933811 -37925010 -52889914
-49 -52889914 -54029573 -39868313 -48880698 -41379090 -49719490 -42015762 -29900875 -34643992 -36547364
-58c6547364k582806R048339j7104672J491510q23247K6549399k7312194N146128K513609
-67c9621298O747576M014530k422739K381074o541967j1752104J975589Q295896K852596
-76c4070847n104888m706937O696172j147064J869511l183614p165260p605710j542404
-85e5961041K5719639q968128Q197138K584019m870884q477737O19495J4064724j1705455
-94c8798230k581772o345905J4974358j5088893J0026211Q801274k373526j1294143
-102d2680626J788729m655354l205268J500554j574069j38982O623990Q678942J4038358
-111a9623726j1632120o213722m650263J1516100j769485j7861078O462293K051184
-119d1720817K188837N049259L171959k882684k911462K09179Q401766l23956l443633
$$ plain form
-58 -36547364 -39130170 -30081831 -47186503 -45694993 -46518240 -19968841 -47281035 -42134907 -39621298
-67 -39621298 -32873722 -28859192 -31281931 -28900857 -35442824 -47194928 -45219339 -36923443 -34070847
-76 -34070847 -39175735 -43882672 -37186500 -38333564 -36464053 -39647667 -46812927 -54418637 -55961041
-85 -55961041 -30241402 -39209530 -31012392 -28428373 -33299257 -41776994 -41157499 -27092775 -38798230
-94 -38798230 -41380002 -47725907 -32751549 -47840442 -37814231 -29012957 -31386483 -42680626
-102 -42680626 -40891897 -45547251 -48752519 -47251965 -48826034 -48965016 -42341026 -33662084 -19623726
-111 -19623726 -31255846 -37469568 -42119831 -30603731 -32373216 -50234294 -43772001 -41720817
-119 -41720817 -39531980 -34482721 -31310762 -34193446 -37104908 -36895729 -28493963 -28817919 -32261552
-128c2261552j4026569J5680317r78974j0227318J150786j644719r99324r840588J4834155
-137c8313786P789091j0048624r317797J4674860K50178q243780N173838j281186R0953
-146c9226253k762827M260130L791486j1217138Q738082N25751J034711l017055l6631
-155c7909744p860234M248963O276375l928734k419706j3668104O58831J5193870P772527
-164c1635956j5054471L939577k33642Q560360k828185n398146p122892q510628J6749267
-173d1534716J76543M87633O823328q55361p20180K859490r270104L276919M840503
-182c3915945K150971l977486q213489P371063K562049k130943q286527R800239j446608
-191c6086676o447362j373853K443319O493j0509276O552014n971482j007754J4620878
$$ plain form
-128 -32261552 -46288121 -30607804 -31586778 -41814096 -40663310 -42308029 -43307353 -53147941 -38313786
-137 -38313786 -30524695 -40573319 -49891116 -35216256 -34966078 -43209858 -38036020 -39317206 -39226253
-146 -39226253 -41989080 -37728950 -33937464 -45154602 -36416520 -35890769 -34856058 -37873113 -37909744
-155 -37909744 -45769978 -41521015 -35244640 -39173374 -41593080 -55261184 -54602353 -39408483 -31635956
-164 -31635956 -46690427 -42750850 -42984492 -34424132 -37252317 -42650463 -49773355 -58283983 -41534716
-173 -41534716 -41358173 -40870540 -34047212 -34902573 -35622753 -32763263 -42033367 -38756448 -33915945
-182 -33915945 -31764974 -35742460 -43955949 -36584886 -34022837 -36153780 -44440307 -34640068 -36086676
-191 -36086676 -42534038 -43907891 -41464572 -41458079 -51967355 -45415341 -51386823 -52394577 -37773699
-200c7773699Q267565p896852n341126j1149227Q112005L576165k621851J4019022O946629
-209b3861369p762938p324209j1937621J5899669J680238l238277L286949q426613R565761
-218c2118410j0561109m689889l755139J0525390j134952j4375177J295272j974929
-226e6788943J2285656N520974r86775R434529j8395652M260249R571611j983880K045714
-235c5036517Q017152j797391l220301r768949K470963K826906o253206q333151K221166
-244d8873328l437984L650284K0168967m902156p66247p644833N36290L373918Q47033
-253c7048056j1586502n451439R676729M268295P235925J2802145j8465781p695710
-261d6264394J2792955o51677j688237R143195j4414198L067716l465998K991353N94589
$$ plain form
-200 -37773699 -29506134 -37402986 -42744112 -53893339 -45781334 -42205169 -44827020 -30807998 -23861369
-209 -23861369 -31624307 -38948516 -50886137 -34986468 -33306230 -36544507 -33257558 -41684171 -32118410
-218 -32118410 -42679519 -47369408 -51124547 -40599157 -41734109 -56109286 -54814014 -56788943
-226 -56788943 -44503287 -38982313 -39969088 -30534559 -48930211 -44669962 -35098351 -37082231 -35036517
-235 -35036517 -27019365 -28816756 -32037057 -41806006 -39335043 -36508137 -42761343 -51094494 -48873328
-244 -48873328 -52311312 -48661028 -28492061 -33394217 -34160464 -41805297 -41269007 -37895089 -37048056
-253 -37048056 -48634558 -54085997 -44409268 -40140973 -32905048 -20102903 -38568684 -46264394
-261 -46264394 -33471439 -34123116 -35811353 -26668158 -41082356 -38014640 -41480638 -38489285 -37894696
-270c7894696O70675q747729J4102089q617766j0996403L990088k975397M509812J133540
-279d4825787j2834169K4926028m258418J2827143j3694816j1917312J7644213k685338
-287c4818456j3736428J2692633j0274317J0368049j3340700N797911Q789305j264895
-295c5786898k915008j634111M057404j441571K096792j2083908O022238M355158Q86465
-304c6443439j490868m416108K950737R86936k788632m842606N537026o308275P670981
-313c9144248l120447l206588M35518J324317J1359695n322904j699675l048489J1263560
-322c1159261l832592j4923761J5257059j3849876O244818J8610404o938165o457228
-330c7048602q313799O458673M284819L810177j7345160r292427J3403921l471183P619731
$$ plain form
-270 -37894696 -37224021 -45971750 -31869661 -40487427 -51483830 -47493742 -50469139 -45959327 -44825787
-279 -44825787 -57659956 -32733928 -36992346 -24165203 -37860019 -49777331 -32133118 -34818456
-287 -34818456 -48554884 -35862251 -46136568 -35768519 -49109219 -43311308 -34522003 -35786898
-295 -35786898 -38701906 -40336017 -36278613 -37720184 -35623392 -47707300 -41685062 -37329904 -36443439
-304 -36443439 -37934307 -42350415 -39399678 -38412742 -41201374 -46043980 -40506954 -46815229 -39144248
-313 -39144248 -42264695 -45471283 -45035765 -43711448 -32351753 -37674657 -39374332 -42422821 -31159261
-322 -31159261 -34991853 -49915614 -34658555 -48508431 -42263613 -23653209 -30591374 -37048602
-330 -37048602 -45362401 -38903728 -34618909 -30808732 -48153892 -57446319 -44042398 -47513581 -39893850
-339c9893850M587592J367232L79314j0558224O905729j7336680n42756P253236P430410
-348d0407997j6434434j845955J5277866j0030644J0222747K55409O800919p848864
-356d4010953m240267N93124N602303N27250j115305N012857k354327o296018K809990
-365d3471346j0173137J1991968m415768k741955l58536O886249J0947094r441508o904477
-374d7681416J0318617j1340155P521946O031060q422438L230481P44695O380990n743588
-383c8959808l158394j0415605L544402M201655J570156o885170O389664o257618J1170362
-392c8800356J5548723j2840539q388315o392921p436783J3117867O059098j1433857
-400e0567083J0088785j3334219J1947747Q696850q699857l386205J1965770j1645469
$$ plain form
-339 -39893850 -35306258 -33939026 -33559712 -44117936 -37212207 -54548887 -55091643 -47838407 -40407997
-348 -40407997 -56842431 -58688386 -43410520 -53441164 -43218417 -42963008 -36162089 -44010953
-356 -44010953 -48251220 -47658096 -42055793 -41528543 -42643848 -37630991 -39985318 -46281336 -43471346
-365 -43471346 -53644483 -41652515 -46068283 -48810238 -49168774 -42282525 -31335431 -40776939 -47681416
-374 -47681416 -37362799 -48702954 -41181008 -35149948 -43572386 -40341905 -39597210 -33216220 -38959808
-383 -38959808 -42118202 -52533807 -48989405 -44787750 -43217594 -50102764 -43713100 -49970718 -38800356
-392 -38800356 -23251633 -36092172 -44480487 -50873408 -58310191 -45192324 -39133226 -50567083
-400 -50567083 -40478298 -53812517 -41864770 -33167920 -41867777 -45253982 -33288212 -44933681
-408d4933681Q94090J1229393j0314842N125542m326270l753857K844048j488651m715135
-417d9439363K128408J3733263K549464J076802k0152957J0127128L854458j6670362
-425e2793159n380225Q514133l34364J5334849M701688q584390l649124k731588j4723867
-434e9646047N669690P133382q699270N85030J3292076j162867q870605J486426J1537627
-443c8674558L748556Q56496j1044440Q6752p079039P345720J2989860j3591299l343093
-452d8705045L881456j59835O286788j1881625K141781P351744l609958J0289227R3650
-461c4311817n913981p219288j474406q18342R702808J030998R4175M254035j3884671
-470d8540489q407772J8496941p962407N681960p15060Q539535j4411269K042184J4361539
$$ plain form
-408 -44933681 -44039591 -32810198 -43125040 -37999498 -42325768 -46079625 -43235577 -44724228 -49439363
-417 -49439363 -47310955 -33577692 -31028228 -29951426 -50104383 -39977255 -36122797 -52793159
-425 -52793159 -58173384 -49659251 -49993615 -34658766 -29957078 -38541468 -42190592 -44922180 -59646047
-434 -59646047 -53976357 -46842975 -55542245 -54957215 -41665139 -42828006 -51698611 -50212185 -38674558
-443 -38674558 -34926002 -34069506 -45113946 -45027194 -52106233 -44760513 -31770653 -45361952 -48705045
-452 -48705045 -44823589 -44983424 -38696636 -50578261 -48436480 -41084736 -44694694 -34405467 -34311817
-461 -34311817 -40225798 -47445086 -48919492 -49737834 -40035026 -39004028 -38909853 -34655818 -48540489
-470 -48540489 -56948261 -38451320 -46413727 -40731767 -41446827 -32907292 -47318561 -45276377 -30914838
-479c0914838j6927965M701774N591139M357395p095086j1705462R427546J6429840
-487b6135657j9253957L230904q605925r70242Q119874K215176J898919L949437j2090272
-496d7641743L781004K479218m371331N007858L806039j3219379o408673J0225600N835438
-505d0505969p149340k326045J419128J002572n664967O292442P225640n436327R636512
-514c5506354o771610O696873k704634K718505M881659j5856090k73482O751687P25827
-523c9337619J1535582j5039959J416316p390652K138725N295147K515530k218199j302292
-532d2387421k891688j978653J4529794l865120j105080j4264722j800330O970976P244836
-541c9547408r567378M315133J381641k789732J848138J4806537p163578j3350886R961195
$$ plain form
-479 -30914838 -47842803 -43141029 -37549890 -33192495 -40287581 -51993043 -42565497 -26135657
-487 -26135657 -45389614 -42158710 -50764635 -51734877 -43615003 -41399827 -39500908 -35551471 -47641743
-496 -47641743 -43860739 -41381521 -45752852 -40744994 -36938955 -50158334 -56567007 -46341407 -40505969
-505 -40505969 -47655309 -49981354 -48562226 -47559654 -53224621 -46932179 -39706539 -45142866 -35506354
-514 -35506354 -42277964 -35581091 -38285725 -35567220 -30685561 -46541651 -46815133 -40063446 -39337619
-523 -39337619 -27802037 -42841996 -41425680 -48816332 -46677607 -41382460 -38866930 -41085129 -42387421
-532 -42387421 -45279109 -47257762 -32727968 -36593088 -37698168 -51962890 -53763220 -46792244 -39547408
-541 -39547408 -49114786 -44799653 -43418012 -46207744 -44359606 -29553069 -36716647 -50067533 -40106338
-550d0106338O364118k324480k381950j3481656P580271j532913P140694K004063J307546
-559c5430645J060787j4676236J7957037j0312068j8178947k492167N670268M487502
-567e1914469Q043459N256230k934237k902042j1979L072014r2429o574046n05799n526989
-577e4090287P842343o77682J0921586j230742M438184m580796J049290l515522m919334
-586d4762960n97006M678613o762848J0340381j2817302N26811J349153K127368m734414
-595e0652204P024659m756475L886022M013532o530976L496876o365088L204240J582282
-604d5097132k330818R199649j1531298J0709256r795012J2673571Q58747r994593P656951
-613c7650679K543124N314672n908386q831848l680857j482181k936690R462710J603820
$$ plain form
-550 -40106338 -33742220 -36066700 -38448650 -51930306 -44350035 -45882948 -38742254 -36738191 -35430645
-559 -35430645 -34369858 -49046094 -31089057 -41401125 -59580072 -62072239 -56401971 -51914469
-567 -51914469 -43871010 -38614780 -41549017 -44451059 -44463038 -41391024 -41483453 -48057499 -48563298 -54090287
-577 -54090287 -46247944 -46925626 -36004040 -37234782 -32796598 -37377394 -36328104 -39843626 -44762960
-586 -44762960 -45359966 -40681353 -47444201 -37103820 -49921122 -49394311 -48045158 -45917790 -50652204
-595 -50652204 -43627545 -48384020 -44497998 -40484466 -47015442 -43518566 -49883654 -46679414 -45097132
-604 -45097132 -47427950 -38228301 -49759599 -39050343 -48845355 -36171784 -35313037 -45307630 -37650679
-613 -37650679 -35107555 -29792883 -35701269 -44533117 -48213974 -49696155 -52632845 -43170135 -41566315
-622d1566315r460611O818754l375691K247179n466395N534554N77912r65714J968180
-631d3688147p622992J809800N579848J1685728L133597m260990J270779n796766K580853
-640c5308290j0971766J0055887M282887q395139N319347o285047q072527N010797P243288
-649c7120563J368528j6270441N811186J653598l395957M056275m614719q41385R649649
-658c9703829N828319j4144858n487865O227901Q931461L626723p344236k860761J702642
-667d3224503Q462354r098575J245314n864787p9828O886373Q02171k329181J4316702
-676b8883960j4304292R781484k753267j611488m746136r789485J3760860m495461Q464782
-685c4576963l725744m401347K56935J2800154j2921036m148369L705792M774591J461367
$$ plain form
-622 -41566315 -51026926 -44208172 -47583863 -45336684 -50803079 -45268525 -44690613 -45656327 -43688147
-631 -43688147 -51311139 -49501339 -43921491 -32235763 -29102166 -33363156 -32092377 -37889143 -35308290
-640 -35308290 -46280056 -36224169 -31941282 -40336421 -35017074 -41302121 -49374648 -44363851 -37120563
-649 -37120563 -35752035 -52022476 -46211290 -44557692 -47953649 -43897374 -48512093 -49353478 -39703829
-658 -39703829 -33875510 -48020368 -53508233 -47280332 -38348871 -34722148 -42066384 -44927145 -43224503
-667 -43224503 -34762149 -43860724 -42615410 -48480197 -48560025 -41673652 -40871481 -43200662 -28883960
-676 -28883960 -43188252 -33406768 -36160035 -37771523 -42517659 -52307144 -38546284 -43041745 -34576963
-685 -34576963 -38302707 -42704054 -42447119 -29646965 -42568001 -46716370 -43010578 -38235987 -36774620
-694c6774620l863679K58900J0080386j7202744R743386j4295808K1834570m059097
-702c4278706j3889845J0129450L148011p15138j1546174Q296893L11901q409127l664226
-711e0616961j7230694L6113832j7036520j930361k368354M431045R907703o395598
-719d5125908P246533j0004537J1180021m065084j10241l51341o877786J1828041l98436
-728c6678738j252115p222260M802596p924138R178094j789517j4609430R14074n683976
-737f0265410J8933214J6405733k0658093L97820N811829r008055m35429L684361L699399
-746d1434631j1203747L528341n463011p676673J5701636r371264K0048268j952104
-754c7823185K929832k765915L365361k259968Q913019j2141209M4976o33858M784484
$$ plain form
-694 -36774620 -40638299 -40379399 -30299013 -47501757 -37758371 -52054179 -30219609 -34278706
-702 -34278706 -48168551 -38039101 -34891090 -35606228 -47152402 -38855509 -38543608 -46952735 -50616961
-711 -50616961 -67847655 -31733823 -48770343 -50700704 -53069058 -48638013 -38730310 -45125908
-719 -45125908 -37879375 -47883912 -36703891 -40768975 -40879216 -41230557 -48108343 -36280302 -36678738
-728 -36678738 -37930853 -45153113 -40350517 -48274655 -39096561 -40886078 -55495508 -54581434 -60265410
-737 -60265410 -41332196 -24926463 -45584556 -45186736 -39374907 -48382962 -48818391 -45134030 -41434631
-746 -41434631 -52638378 -49110037 -54573048 -62249721 -46548085 -55919349 -35871081 -37823185
-754 -37823185 -34893353 -37659268 -34293907 -36553875 -27640856 -39782065 -39737089 -40370947 -35586463
-763c5586463q317865k015766p09851P231863M046252j1720078L805628L889764j4282905
-772e3659421Q660954R04416m555781J3680472j7510895K587354K0882732j4576771
-780d3586940j211231l208172k697749J4109701k891850J387492j3075948R508938M071195
-789c7594564r965651Q623593k673199o2430o508007J2730368k451789L97514o733301
-798d4237466r661771J143287J1675936r23738p565863J2632152j6996163k669095k772862
-807e9375583M188007J2965701J1166810j6569423o301394N456575K871677M718613
-815d0879017m153639L509149J068546R895173m059253m919999L38890l619063k718547
-824d5537760L754021K832218J567996P553925m284783k195594l896616M92634l213512
$$ plain form
-763 -35586463 -43904328 -45920094 -46629945 -39398082 -35351830 -47071908 -43266280 -39376516 -53659421
-772 -53659421 -44998467 -44094051 -48649832 -34969360 -52480255 -49892901 -29010169 -43586940
-780 -43586940 -44798171 -48006343 -50704092 -36594391 -39486241 -38098749 -51174697 -41665759 -37594564
-789 -37594564 -47560215 -38936622 -41609821 -41672251 -48180258 -35449890 -37901679 -37504165 -44237466
-798 -44237466 -53899237 -52755950 -41080014 -42003752 -49569615 -36937463 -53933626 -56602721 -59375583
-807 -59375583 -55187576 -42221875 -31055065 -47624488 -53925882 -48469307 -45597630 -40879017
-815 -40879017 -45032656 -41523507 -40454961 -30559788 -34619041 -39539040 -39200150 -42819213 -45537760
-824 -45537760 -41783739 -38951521 -37383525 -29829600 -34114383 -36309977 -40206593 -39713959 -42927471
-833d2927471J2497428j6014011M915018K04230M744003K919304o676069M698748L06680
-842c5332140L109623l509532p18920r282764P622760m256535K377804J823714K844099
-851c5321891k593945j1378654J1104060r720125M74046J1854613J927948p521253o751025
-860d7926226J5165730o657571l714683l771492o639903M621412L438301L872648j1657654
-869e3269438O627704M787974L705957R90066k763146j4741473J0729668J616611l154915
-878d5470992m331227J0433347K602383j968142j862614m842254m406948j775607j485163
-887e3107217J4749022k580489m249099J002808k294645M567725N268615j0072200
-895d6715480j2480569K1939020j1474733J7605546M73022K529378o136305o684598
$$ plain form
-833 -42927471 -30430043 -46444054 -41529036 -41324806 -36580803 -33661499 -40337568 -35638820 -35332140
-842 -35332140 -32222517 -35732049 -36450969 -45733733 -38110973 -42367508 -39989704 -38165990 -35321891
-851 -35321891 -37915836 -49294490 -38190430 -47910555 -47436509 -35581896 -33653948 -41175201 -47926226
-860 -47926226 -32760496 -39418067 -43132750 -46904242 -53544145 -48922733 -45484432 -41611784 -53269438
-869 -53269438 -46641734 -41853760 -38147803 -37157737 -39920883 -54662356 -43932688 -42316077 -45470992
-878 -45470992 -49802219 -39368872 -36766489 -38734631 -40597245 -45439499 -49846447 -51622054 -53107217
-887 -53107217 -38358195 -40938684 -45187783 -44184975 -46479620 -41911895 -36643280 -46715480
-895 -46715480 -59196049 -37257029 -48731762 -31126216 -30653194 -28123816 -34260121 -40944719
-903d0944719K495468m783108n567812m538424K889907k179068J2415074q58827M19941
-912d0651568j2023734q746376J1395457J5928870o656495N071532j3690024J5256228
-920c4116110j8876032O418708p709721J4405526l627470J610390r076134k203392Q073055
-929d5101180m61527L519824n728183R214319n641219o864820P885281n385847n67960
-938d9131312L806560M6025M798051j4384412k825013l448222L655290P392109m942907
-947e5033831N778043N057919o713067R462258J989095j9944073J1108764j4006559
-955f2301451J3716862l991917q82668r833217N520332O751835L478652j2208802R945295
-964d9805079O384332J111560P572382j1982585R135310l977153K511004k681393J600724
$$ plain form
-903 -40944719 -38449251 -43232359 -48800171 -53338595 -50448688 -52627756 -40212682 -41071509 -40651568
-912 -40651568 -52675302 -61421678 -50026221 -34097351 -40753846 -35682314 -49372338 -34116110
-920 -34116110 -52992142 -46573434 -54283155 -39877629 -43505099 -41894709 -50970843 -53174235 -45101180
-929 -45101180 -45562707 -42042883 -47771066 -38556747 -44197966 -51062786 -43177505 -48563352 -49131312
-938 -49131312 -45324752 -45278727 -40480676 -54865088 -57690101 -61138323 -57483033 -50090924 -55033831
-947 -55033831 -49255788 -44197869 -50910936 -41448678 -39459583 -59403656 -48294892 -62301451
-955 -62301451 -48584589 -52576506 -53459174 -63292391 -57772059 -51020224 -47541572 -59750374 -49805079
-964 -49805079 -43420747 -42309187 -34736805 -46719390 -37584080 -41561233 -39050229 -41731622 -40130898
-973d0130898o874841p241019m412733K3921195M84130m503774j2379366j769342J7580633
-982c5326015p582752N164371p2538j0672729m93495J0969559K865668j4644829J711745
-991d8081015N904289L331485p46878p841712J614123r646868J5095405K091763j224497
-1000c9503905K715099l253128L656028p250228L605027k99637N748283j2608259r893302
-1009e7084022q60212P962027L997525m718789n393593r29971P867225j826512P534411
-1018d3451911m757976R834519j1453600J012409N930063n955445R051169J0962454
-1026b8828318o248645O373109j0260139j0675636J4994046j6178190K887513l346110
-1034e1282370O761364J408489j3943832L343372J3220305j8288226J4051395J459452
$$ plain form
-973 -40130898 -47005739 -54246758 -58659491 -34738296 -34254166 -38757940 -51137306 -52906648 -35326015
-982 -35326015 -42908767 -37744396 -37816934 -48489663 -48983158 -38013599 -35147931 -49792760 -48081015
-991 -48081015 -42176726 -38845241 -39592119 -47433831 -45819708 -55466576 -40371171 -38279408 -39503905
-1000 -39503905 -36788806 -40041934 -36385906 -43636134 -40031107 -40330744 -34582461 -47190720 -57084022
-1009 -57084022 -57944234 -49982207 -45984682 -50703471 -56097064 -57027035 -49159810 -50986322 -43451911
-1018 -43451911 -48209887 -38375368 -49828968 -48816559 -42886496 -48841941 -39790772 -28828318
-1026 -28828318 -35076963 -28703854 -38963993 -49639629 -34645583 -50823773 -47936260 -51282370
-1034 -51282370 -44521006 -43112517 -57056349 -53712977 -40492672 -58780898 -44729503 -43270051
-1042d3270051K190224j0063668J0928817l003636j2122371J2120530j270002m049411
-1050d8539568R973792q880722m786326J162136j5160L76170K872780J0043042o747118
-1059d4540974R417220j658715M394658k3747220J5416703K70133k936578k517028
-1067d5901801J3321169j3161672j1497461J6052317K423344m316436J0120768j0280342
-1075d3240114L697784m964186l988855k804165k154848J0743442J508934l884186N085064
-1084d0001130K906794n499048J39260O90252n48583L79301O90896m261508J810055
-1093d3693711J0502902q985588q41005N099758p172028Q435835J105875o412737p603018
-1102d9563717j718486O7522J1248007j4645261J0305309n245099P107601j2013956
$$ plain form
-1042 -43270051 -41079827 -51143495 -40214678 -43218314 -55340685 -43220155 -44490157 -48539568
-1050 -48539568 -38565776 -47446498 -52232824 -51070688 -51085848 -50709678 -47836898 -37793856 -44540974
-1059 -44540974 -35123754 -36782469 -32387811 -56135031 -40718328 -40448195 -43384773 -45901801
-1067 -45901801 -32580632 -45742304 -57239765 -41187448 -38764104 -43080540 -32959772 -43240114
-1075 -43240114 -39542330 -44506516 -48495371 -51299536 -53454384 -42710942 -41202008 -45086194 -40001130
-1084 -40001130 -37094336 -42593384 -42454124 -41763872 -42312455 -41933154 -41242258 -45503766 -43693711
-1093 -43693711 -33190809 -42176397 -43017402 -37917644 -45089672 -36653837 -35547962 -41960699 -49563717
-1102 -49563717 -51282203 -51214681 -39966674 -54611935 -44306626 -49551725 -42444124 -54458080
-1110e4458080K883622J2591863k2853051K513327O625284M02581M953120n774709
-1118e3116043J6687274K129504J768510j3391771P653306l387281j630545J852225
-1126d1434821M318462Q891884q915910K563496j345895k506308j0068230J593959Q465998
-1135c8437365m044103J861413K366346M71989r593373J6196385M662825m168381j426120
-1144c2110384m850609O94236K841257J179397J637368n675074P82674l685207J2631087
-1153b6555255K4450717j02955900L9507754L495383O718593l392723n444143L592707
-1161f0582867L133338J1440652q341190P413969L617225m440993k197964k19966O853739
-1170d3324057o751615r9299j184151p044107O648255J0339941j4505495K0450305
$$ plain form
-1110 -54458080 -51574458 -38982595 -61835646 -59322319 -52697035 -52294454 -47341334 -53116043
-1118 -53116043 -36428769 -34299265 -32530755 -45922526 -38269220 -41656501 -43287046 -41434821
-1126 -41434821 -37116359 -28224475 -37140385 -34576889 -35922784 -38429092 -48497322 -46903363 -38437365
-1135 -38437365 -42481468 -40620055 -38253709 -37781720 -47375093 -31178708 -26515883 -30684264 -32110384
-1144 -32110384 -36960993 -36266757 -33425500 -32246103 -30608735 -36283809 -35501135 -39186342 -26555255
-1153 -26555255 -2104538 -105060438 -65552684 -62057301 -55338708 -58731431 -64175574 -60582867
-1161 -60582867 -57449529 -46008877 -54350067 -46936098 -43318873 -47759866 -49957830 -50177796 -43324057
-1170 -43324057 -50075672 -50174971 -51359122 -58403229 -51754974 -41415033 -55920528 -35470223
-1178c5470223j6680754M744655L603772m555511J767988m431841m173406M301568K36241
-1187e0657511J095136J0765867L594570p664487j599448j1501735J267924J085371
-1195e3614313j0456633L791318J775164Q817988n388738N101251N408727o119700k628365
-1204e3313301m371360R814039o33726R022775n059538J1404254p341215r166611n233182
-1213e4877865K1518953j142239j2020309l617303k481203j191252K00375P518128K490086
-1222d3602629K518706o717333N779931j195398n470522L467654N156509p656188K868023
-1231d4851247L171441L416001p176778j6371739J5733368l180813P390550L337417
-1239c8531800j5819005M054179J0600724k72918O28425j3606325K148190K323667k569627
$$ plain form
-1178 -35470223 -52150977 -47406322 -43802550 -48358061 -46590073 -51021914 -55195320 -50893752 -50657511
-1187 -50657511 -49562375 -38796508 -35201938 -42866425 -44465873 -55967608 -54699684 -53614313
-1195 -53614313 -64070946 -60279628 -58504464 -49686476 -55075214 -49973963 -44565236 -50684936 -53313301
-1204 -53313301 -57684661 -47870622 -48504348 -39481573 -44541111 -33136857 -40478072 -49644683 -54877865
-1213 -54877865 -33358912 -34501151 -46521460 -50138763 -52619966 -53811218 -53610843 -46092715 -43602629
-1222 -43602629 -41083923 -47801256 -42021325 -43216723 -48687245 -45219591 -40063082 -47719270 -44851247
-1231 -44851247 -41679806 -38263805 -45440583 -61812322 -46078954 -49259767 -41869217 -38531800
-1239 -38531800 -54350805 -50296626 -39695902 -39968820 -39340395 -52946720 -50798530 -48474863 -51044490
-1248e1044490j552575J2094520j2739889j550545K411800J453006K509874p916669
-1256e6334968M891823j378991p7659J2355019l186583J870243j337984P179503r209805
-1265d5229402j0732825R361727j025772m655500M76513J6054634N3230k1024067O564470
-1274e0156992N763823L087687Q332748l704303r948827J0881802l900109j5620000n25977
-1283e5790148N082909q860409J6881725j817696j563263o592430L920502J246764M081758
-1292d3410288N050171m195300j0544372L777528J707361r474524m149828K0328303
-1300d0910949K764624l241517o4501O00255j4862813P223163R160263j4276755J0144447
-1309d3463783q620627J255934P156781k744462M834054R86587K068979m851989K136923
$$ plain form
-1248 -51044490 -52597065 -40502545 -53242434 -54792979 -52381179 -50928173 -48418299 -56334968
-1256 -56334968 -51443145 -52822136 -52899795 -40544776 -43731359 -41861116 -43199100 -36019597 -45229402
-1265 -45229402 -55962227 -46600500 -47626272 -52281772 -51805259 -35750625 -35697395 -56721462 -50156992
-1274 -50156992 -44393169 -41305482 -32972734 -36677037 -46625864 -35744062 -39644171 -55264171 -55790148
-1283 -55790148 -50707239 -59567648 -42685923 -44503619 -46066882 -52659312 -48738810 -47492046 -43410288
-1292 -43410288 -38360117 -42555417 -53099789 -49322261 -47614900 -57089424 -61239252 -40910949
-1300 -40910949 -38146325 -41387842 -41452343 -40852088 -55714901 -48491738 -39331475 -53608230 -43463783
-1309 -43463783 -52084410 -50828476 -43671695 -46416157 -41582103 -40595516 -38526537 -43378526 -41241603
-1318d1241603j1375216J003394J4510562j4460353P657741K71808k041284p908171
-1326e3583122J4622125J1237732j5957712L242069j0835596P690242j234740J679018
-1334d3139984K357138m476139P408997k0229060j92622N718294j124636Q961001q857012
-1343e3574023K404372R859709m90114m664556K211249k356403J781769K29682l292589
-1352d7890904P087101n50989j250903k890930k411039k329152R302823K346498n893953
-1361d4481448R47093o088709K444273K666172L726670q391838r174929N102549l696102
-1370e6946269J9413341l03161j7130946M028531n094914k623105J4500600j5390935
-1378e9546858N891735J3192249O754953k059379N020355o314545p830193m846806p878401
$$ plain form
-1318 -41241603 -52616819 -51613425 -37102863 -51563216 -43905475 -43633667 -45674951 -53583122
-1326 -53583122 -38960997 -27723265 -43680977 -40438908 -51274504 -43584262 -44819002 -43139984
-1334 -43139984 -40782846 -45258985 -37849988 -58079048 -58271670 -52553376 -53678012 -44717011 -53574023
-1343 -53574023 -51169651 -41309942 -41800056 -46464612 -44253363 -46609766 -44827997 -44598315 -47890904
-1352 -47890904 -40803803 -41354792 -42605695 -45496625 -47907664 -50236816 -40933993 -38587495 -44481448
-1361 -44481448 -43534355 -49623064 -47178791 -44512619 -40785949 -49177787 -58352716 -53250167 -56946269
-1370 -56946269 -37532928 -37836089 -54967035 -50938504 -56033418 -58656523 -44155923 -59546858
-1378 -59546858 -53655123 -40462874 -33707921 -35767300 -30746945 -37061490 -44891683 -49738489 -57616890
-1387e7616890k797153J1167049L492761k286689Q476542j6302474R115993j1728172
-1395e8479033J2420006j9475434J5283560j3105167M476182l533157J3942210j667293
-1403e0138126L86864K350679Q338201M643753j7406319N669272j999033L142514r147173
-1412e4159368J09488K846834K153295J7833141p955611R832188j8395717p011680
-1420e4747430J2871480K22209L673775q336410O476319K325701l192257p216295p594713
-1429e5517621O080107P124561j1225539m179041Q483161q781368J5413038O195366
-1437c6407336r603298p170245J1258955k90886K032634k505013n185749N269309n389600
-1446d7991229l377187J7527111r549014N20152O323816j7643994R576762j7618266
$$ plain form
-1387 -57616890 -60414043 -49246994 -45754233 -48040922 -39564380 -55866854 -46750861 -58479033
-1395 -58479033 -46059027 -65534461 -50250901 -63356068 -58879886 -62413043 -48470833 -50138126
-1403 -50138126 -49751262 -47400583 -39062382 -34418629 -51824948 -46155676 -48154709 -45012195 -54159368
-1412 -54159368 -54049880 -51203046 -49049751 -31216610 -39172221 -29340033 -47735750 -54747430
-1420 -54747430 -41875950 -41653741 -37979966 -46316376 -39840057 -37514356 -40706613 -47922908 -55517621
-1429 -55517621 -49437514 -42312953 -53538492 -57717533 -49234372 -58015740 -42602702 -36407336
-1437 -36407336 -46010634 -53180879 -41921924 -42212810 -40180176 -42685189 -47870938 -42601629 -47991229
-1446 -47991229 -51368416 -33841305 -43390319 -42870167 -36546351 -54190345 -44613583 -62231849
-1454f2231849K506561J6163972l460099Q919072k061115K691482J0184593j0197608
-1462c7484991p129464q498174p610159Q536059l827947k225137J214612M054765m089088
-1471e7059524k635700J5337K550098P332825N477183J740893q574948L51452m977748
-1480e5780132M968481J0226724R37668j2792494L199631l211284L077515J8094700
-1488c1279191r061436j0300037o0455L783806M1813n670726O644006M462645N986184
-1497c5453391j5284878p755030O233342k316443k362081k941969J3390161q44361P61750
-1506d6572900j0599102j272067J2229273r354950N956543k979805K860414O828320
-1514d2904274k882728o711597P909930K728423l188632Q755082p122963j1370303J579354
$$ plain form
-1454 -62231849 -59725288 -43561316 -47021415 -38102343 -40163458 -37471976 -27287383 -37484991
-1462 -37484991 -44614455 -53112629 -60722788 -52186729 -56014676 -58239813 -57025201 -52970436 -57059524
-1471 -57059524 -59695224 -59679887 -57129789 -49796964 -44319781 -42578888 -51153836 -50802384 -55780132
-1480 -55780132 -50811651 -40584927 -39647259 -52439753 -49240122 -52451406 -49373891 -31279191
-1488 -31279191 -40340627 -50640664 -50701119 -46917313 -46875500 -52546226 -45902220 -41439575 -35453391
-1497 -35453391 -50738269 -58493299 -52259957 -54576400 -56938481 -59880450 -46490289 -47334650 -46572900
-1506 -46572900 -57172002 -58444069 -46214796 -55569746 -49613203 -52593008 -49732594 -42904274
-1514 -42904274 -45787002 -52498599 -44588669 -41860246 -45048878 -36293796 -43416759 -54787062 -53207708
-1523e3207708O124926p276935J1996408n810687k734701J3054023n181506j4993764
-1531e8029944L788002J2221999r09687Q108433r658346Q700213j0339434J0500201Q88450
-1540c4730113p331858j9203517N359995J6945030j5116803L526591J0514136K635267
-1548c7401272j7017966Q876148j0069222P914963Q1440o254124l831100R627849J096166
-1557d6977118K437817L514683L660601p967472J833502K90555j4219912R280612r304383
-1566e7451115J6395099j3012154O18386O098927N635937n285001K773871P014295
-1574c7211755j3984684L261378l561520J5673066k3020068M780162J6349368R83990
-1582c6730063q364154l840165n718928J4534255o401376K193467p931797L16938O403411
$$ plain form
-1523 -53207708 -47082782 -54359717 -42363309 -48173996 -50908697 -37854674 -43036180 -58029944
-1531 -58029944 -54241942 -42019943 -42929630 -34821197 -44479543 -35779330 -46118764 -35618563 -34730113
-1540 -34730113 -42061971 -61265488 -55905493 -38960463 -54077266 -50550675 -40036539 -37401272
-1548 -37401272 -54419238 -45543090 -55612312 -47697349 -47615909 -53870033 -57701133 -48073284 -46977118
-1557 -46977118 -44539301 -41024618 -37364017 -45331489 -43497987 -43207432 -57427344 -48146732 -57451115
-1566 -57451115 -41056016 -54068170 -53449784 -47350857 -41714920 -46999921 -44226050 -37211755
-1574 -37211755 -51196439 -47935061 -51496581 -35823515 -58843583 -54063421 -37714053 -36730063
-1582 -36730063 -45094217 -48934382 -54653310 -40119055 -46520431 -44326964 -52258761 -51941823 -45538412
-1591d5538412j0705681O563575l358905K276194J1525824L543964k189938m863266
-1599d2746645k297753n280094N773562j277011m96215M115738K420263j0319015Q125084
-1608d1982086l340706m012106Q043873j6160120L771055O885451Q824390j371954k494974
-1617d1837177Q98502r401530N365663K764211j2928401j0161929K199265J4440272
-1625d8661124M694692N134136q532272n02431p406253k445589K0816702k384710o469393
-1634d5756242j680924J695407j013998J7457427j2296283K01572m855082o581573
-1642e2829696J3277499j5192268J1556904O987883j1161279K085356o89706k345956
-1650d8311263J019023M073553m986515r837910J4012310k48466r777210P048771o590380
$$ plain form
-1591 -45538412 -56244093 -49680518 -53039423 -50763229 -39237405 -35693441 -37883379 -42746645
-1599 -42746645 -45044398 -50324492 -44550930 -45827941 -46324156 -42208418 -39788155 -50107170 -41982086
-1608 -41982086 -45322792 -49334898 -41291025 -57451145 -53680090 -46794639 -37970249 -39342203 -41837177
-1617 -41837177 -40938675 -50340205 -44974542 -42210331 -55138732 -65300661 -63101396 -48661124
-1625 -48661124 -43966432 -38832296 -47364568 -47866999 -55273252 -57718841 -36902139 -39286849 -45756242
-1634 -45756242 -47437166 -45741759 -46755757 -29298330 -41594613 -41393041 -46248123 -52829696
-1642 -52829696 -39552197 -54744465 -43187561 -36199678 -47360957 -45275601 -45965307 -48311263
-1650 -48311263 -47292240 -43218687 -48205202 -58043112 -44030802 -44279268 -54056478 -47007707 -53598087
-1659e3598087J056084J8196086m505921q826915n874336Q726189j3651498M973529
-1667e3504869O129085k46947M429998p628307R89335j4955775J5467063j501183O048803
-1676d4772797q009821J0526903o625970J971380k829254J407194n362756n517887P609778
-1685e1603230Q186678j3103898L450584P54600O327558p135635p390570J9608065
-1693d0905848j4565810J0962956n600025n987027M48561N1363J2386435n911447j0983619
-1702f0104461Q289075K573315K017491n791604p847492l978754J560789J459352J8753932
-1711d3068357n361120J1597588K388052j3662133l399042k573576J3140519m811612
-1719d5749681o350189P784549r605032M745875J0912575r248264J6481052o339084
$$ plain form
-1659 -53598087 -52542003 -34345917 -38851838 -47678753 -53553089 -44826900 -58478398 -53504869
-1667 -53504869 -47375784 -47622731 -43192733 -50821040 -49831705 -64787480 -49320417 -50821600 -44772797
-1676 -44772797 -52782618 -42255715 -48881685 -46910305 -49739559 -48332365 -53695121 -59213008 -51603230
-1685 -51603230 -43416552 -56520450 -53069866 -52315266 -45987708 -53123343 -60513913 -40905848
-1693 -40905848 -55471658 -44508702 -50108727 -56095754 -55647193 -55595830 -43209395 -49120842 -60104461
-1702 -60104461 -51815386 -49242071 -47224580 -53016184 -60863676 -64842430 -63281641 -61822289 -43068357
-1711 -43068357 -48429477 -36831889 -34443837 -48105970 -51505012 -54078588 -40938069 -45749681
-1719 -45749681 -52099870 -44315321 -53920353 -49174478 -38261903 -47510167 -31029115 -37368199
-1727c7368199j897427j3940441k091622J4375888j631589L895864l866622N058093
-1735c7466055J1649729j6287031O60764m671273N84355o326552K1545939q374226m269073
-1744d2953423j90716m04522p844700p508743J2073595O607912j2888273N697368J670819
-1753d5740683M840628j4803894J6436146l914886j677038o604885Q412699n573891
-1761d8625804k711078J3887496M23651j2895207P939123m267062l62181Q04521L680768
-1770d2125773p903723J0728821o142064p532451o459182J0055467r626292K6346856
-1778c2658341q112530p624208N078410o629271J2360917j1620046J0471651J307410
-1786c7426008o554031m432875P47109O117649r707443M567534J0478158j1366739l392377
$$ plain form
-1727 -37368199 -39265626 -53206067 -55297689 -40921801 -42553390 -38657526 -42524148 -37466055
-1735 -37466055 -25816326 -42103357 -41442593 -46113866 -45529511 -51856063 -30310124 -38684350 -42953423
-1744 -42953423 -43144139 -43548661 -51393361 -58902104 -46828509 -40220597 -53108870 -47411502 -45740683
-1753 -45740683 -40900055 -55703949 -39267803 -43182689 -44859727 -51464612 -43051913 -48625804
-1761 -48625804 -51336882 -37449386 -37025735 -49920942 -41981819 -46248881 -46611062 -45806541 -42125773
-1770 -42125773 -50029496 -39300675 -45442739 -52975190 -59434372 -49378905 -59005197 -32658341
-1778 -32658341 -40770871 -48395079 -43316669 -49945940 -37585023 -49205069 -38733418 -37426008
-1786 -37426008 -43980039 -48412914 -47665805 -41548156 -51255599 -46688065 -36209907 -47576646 -50969023
-1795e0969023L019744J1671582m504661o44160L509437j6698742M573688J1209063
-1803c8833072k0790209L014555j120117J5555948n082941O553146L572106r992215
-1811d7122799N029313j823141o635054l53797j10632M815325N173052n955327o738554
-1820e3721614J0144056j0700494O192943J0207005m357761L248291j0137520j1148206
-1828f0273300R680261p357J2845752r083056j0494092o32927Q617249Q436813L265295
-1837c7645362r331715P757152q400661k702153n201950J289568M087617P165282j702983
-1846d4685205N092488J23276r832739J6993955o923545M369247m020741m145518M621887
-1855c8406895J574007p254980m803912J0480955j756678r361983P642289n982497k256543
$$ plain form
-1795 -50969023 -47949279 -36277697 -40782358 -41426518 -37917081 -54615823 -50042135 -38833072
-1803 -38833072 -59623281 -56608726 -57728843 -42172895 -47255836 -40702690 -37130584 -47122799
-1811 -47122799 -42093486 -43916627 -50551681 -50905478 -51016110 -46200785 -41027733 -46983060 -53721614
-1820 -53721614 -43577558 -54278052 -48085109 -37878104 -42235865 -38987574 -49125094 -60273300
-1828 -60273300 -50593039 -50600396 -37754644 -46837700 -57331792 -57964719 -49347470 -40910657 -37645362
-1837 -37645362 -46977077 -39219925 -47620586 -50322739 -55524689 -54235121 -50147504 -42982222 -44685205
-1846 -44685205 -39592717 -39469441 -49302180 -32308225 -39231770 -34862523 -38883264 -43028782 -38406895
-1855 -38406895 -36832888 -44087868 -48891780 -38410825 -40167503 -49529486 -41887197 -47869694 -50126237
-1864e0126237R826251m558353m055358n247695J5050687q993040K577798M400726
-1872d1125221J5022523j5185963L446243j3145723r028208K0900228j2944333k656848
-1880e4717302M897182R292105J324535r295141O195017j2369115O094538N080874
-1888d3497307J3396927p911138j3309796P215309L560820l581802j2957363L392426
-1896e3691924K3007533j0469400Q20177P761614j1749866J4851646q631657j2379851
-1904e0481728n937545J0519947l583595L169829M80515p788688M393712P279587m541683
-1913d6489649o29325l3065j211594p37983k634209N383830l966020O061905m18729
-1922d4674839J538231j7577803Q556791O183729P665967k082261r857512l321149K114744
$$ plain form
-1864 -50126237 -40299986 -44858339 -48913697 -54161392 -39110705 -48103745 -45525947 -41125221
-1872 -41125221 -26102698 -41288661 -37842418 -50988141 -60016349 -39116121 -52060454 -54717302
-1880 -54717302 -49820120 -40528015 -39203480 -48498621 -42303604 -54672719 -48578181 -43497307
-1888 -43497307 -30100380 -38011518 -51321314 -44106005 -40545185 -44126987 -57084350 -53691924
-1896 -53691924 -30684391 -41153791 -40333614 -32572000 -44321866 -29470220 -38101877 -50481728
-1904 -50481728 -56419273 -45899326 -49482921 -46313092 -45832577 -53621265 -49227553 -41947966 -46489649
-1913 -46489649 -47118974 -47152039 -48363633 -49101616 -51735825 -46351995 -50318015 -44256110 -44674839
-1922 -44674839 -43136608 -60714411 -52157620 -45973891 -38307924 -40390185 -50247697 -53568846 -51454102
-1931e1454102k568569k007969K787507Q080253J576254P688384r067769Q543008N820371
-1940c0602632J258727j7712655J0649190J1506204j6777916m014015n609448j350517
-1948e2653062M430062p711072M690439P136886r123539l323398J541029n858836J6194624
-1957d4676867j865214J013236p611226K529190J3119098q945468l904399L58043l52490
-1966e0336097p214062K939257R728816n596888k401175m481808L841714J637493j013626
-1975e2896376J3172952q810443m012622j1730626J4254775l476240n469633O056179
-1983e2912034K751822j29305L503778J1594479m585016N702003m966162J446582k624711
-1992d0218564j1335268J1037613q176422j0621940O108471M485959K802218j342945
$$ plain form
-1931 -51454102 -54022671 -56030640 -53243133 -45162880 -43586626 -35898242 -44966011 -36423003 -30602632
-1940 -30602632 -29343905 -47056560 -36407370 -24901166 -41679082 -45693097 -51302545 -52653062
-1948 -52653062 -48223000 -55934072 -51243633 -44106747 -53230286 -56553684 -55012655 -60871491 -44676867
-1957 -44676867 -46542081 -45528845 -53140071 -50610881 -37491783 -46437251 -50341650 -49983607 -50336097
-1966 -50336097 -57550159 -54610902 -44882086 -50478974 -52880149 -57361957 -53520243 -51882750 -52896376
-1975 -52896376 -39723424 -48533867 -52546489 -64277115 -50022340 -53498580 -58968213 -52912034
-1983 -52912034 -50160212 -50289517 -46785739 -35191260 -39776276 -34074273 -39040435 -37593853 -40218564
-1992 -40218564 -51553832 -40516219 -48692641 -59314581 -53206110 -48720151 -45917933 -47260878
-2000d7260878O657529m387612r689505P142208j460588L239962n507802l821757R093802
-2009d5994641J1475816o188837j1581872j287339P222286L308506J861078j1306924
-2017e2491927k885856J0044093K068389p782057L283385O103520K37187R44891J921432
-2026c8556943j799007j0021929q186089N8711K851134J2156517K490044j3285126
-2034e4292688j1124778M340406n5347P214350J1316293K612906o046151o057825q376582
-2043f0469416k406582J3723532O664157o215383q03746p907385K5468786j1187086
-2051d3133123n824146N627133N174109m764959o357740q01407O873997P161829j0310464
-2060d6354771l452948k25614J887481N196549o799108K037137J0847736r556439j2923018
$$ plain form
-2000 -47260878 -40603349 -44990961 -54680466 -47538258 -48998846 -45758884 -51266686 -55088443 -45994641
-2009 -45994641 -34518825 -40707662 -52289534 -53576873 -46354587 -43046081 -41185003 -52491927
-2017 -52491927 -55377783 -45333690 -43265301 -51047358 -47763973 -41660453 -41423266 -40478375 -38556943
-2026 -38556943 -40355950 -50377879 -58563968 -58505257 -55654123 -43497606 -41007562 -54292688
-2034 -54292688 -65417466 -61077060 -61132407 -53918057 -42601764 -39988858 -46035009 -52092834 -60469416
-2043 -60469416 -62875998 -49152466 -42488309 -48703692 -49507438 -57414823 -31946037 -43133123
-2051 -43133123 -48957269 -43330136 -38156027 -42920986 -49278726 -50080133 -43206136 -36044307 -46354771
-2060 -46354771 -49807719 -50033333 -48145852 -42949303 -49748411 -47711274 -36863538 -46419977 -59342995
-2069e9342995K3205929J232140q966907o829133N609160m63948L665484l444548K676138
-2078d2658680n155489N852802l120829n080589R274821q446901M184146j981280L595917
-2087d3536082k263695O000594k16947m401141l426529p318252O313792m130668J1248294
-2096d1730634l04324k395508q307478M97393P117771j027309n353486K415613n815351
-2105e4903313P550462M172146j0082778P675817p901991J0623177n221246M151818
-2113d3935908L830086K756309l90560j4071995m350893J5536715q153295Q361391r391332
-2122d9809482j0985757J4020503j722189m758505m366224J3118059j5553203N55542
-2130e9501256P296671O11944k797267j0974919J6614329k266954P969430l763814R683104
$$ plain form
-2069 -59342995 -36137066 -34904926 -43871833 -50700966 -45091806 -45555754 -41890270 -45334818 -42658680
-2078 -42658680 -47814169 -41961367 -45082196 -50162785 -40887964 -49334865 -45150719 -47131999 -43536082
-2087 -43536082 -45799777 -39799183 -40016130 -44417271 -47843800 -55162052 -48848260 -52978928 -41730634
-2096 -41730634 -42034958 -44430466 -52737944 -52240551 -45122780 -46150089 -51503575 -49087962 -54903313
-2105 -54903313 -47352851 -43180705 -53263483 -45587666 -53489657 -42866480 -48087726 -43935908
-2113 -43935908 -40105822 -37349513 -37740073 -51812068 -56162961 -40626246 -48779541 -40418150 -49809482
-2122 -49809482 -60795239 -46774736 -48496925 -53255430 -57621654 -44503595 -60056798 -59501256
-2130 -59501256 -52204585 -51592641 -54389908 -65364827 -48750498 -51017452 -43048022 -46811836 -37128732
-2139c7128732q272008K495552P479054r30300j7616877K872794p310158J1917060J081211
-2148d5412404r517046J6394601m222577n018115k902503Q843692p057987n180518R189709
-2157d4883148p733154K621107n092144M723590N078429L402908o59162j9488621r16677
-2166f2946872K3445587j117895o260748p924947K1065435r594151j1516874Q548999
-2174d6301466l89058J0104409o474912k008897L961953j8104995L909966R729320k183513
-2183d7757193r24829r689692N253798q309662R557956o080447O592641P176404m969223
-2192d9150247N504195m147820q553074L994578O458183K438125j213632j1569360l110761
-2201e9349813O118543k500828j597571J1382767j9261478K6667178m377738K337161
$$ plain form
-2139 -37128732 -45400740 -42905188 -35426134 -36356434 -53973311 -51100517 -58410675 -46493615 -45412404
-2148 -45412404 -54929450 -38534849 -42757426 -47775541 -50678044 -41834352 -48892339 -54072857 -44883148
-2157 -44883148 -52616302 -49995195 -55087339 -50363749 -45285320 -41882412 -42541574 -62030195 -62946872
-2166 -62946872 -39501285 -40619180 -46879928 -54804875 -33739440 -43333591 -54850465 -46301466
-2174 -46301466 -46690524 -36586115 -43061027 -45069924 -41107971 -59212966 -55303000 -45573680 -47757193
-2183 -47757193 -48682022 -58371714 -53117916 -61427578 -51869622 -57950069 -51357428 -44181024 -49150247
-2192 -49150247 -43646052 -47793872 -56346946 -52352368 -45894185 -43456060 -44669692 -56239052 -59349813
-2201 -59349813 -53231270 -55732098 -57329669 -45946902 -65208380 -38541202 -42918940 -40581779
-2209d0581779j7069549J2474168l988444L741684K161636K283039j1513469J1636069
-2217d0856645j444698n197205o478291P75903J0618646o05260o168329j1237133O27096
-2226e9965916Q968522K631459r444833J11721M675666n491776J1455609k711388J5748398
-2235c4022538q112611K513056J131312O24445l404462j4495161J887851Q451209R57298
-2244d4469601L303875q785876J0201812m657198k6835110J6659945N837519K967415
-2252d5777219m249153k31485m30510J1897212q828574K087000m139280R322913j7328048
-2261e7677144j587490K613433J9632695o333813N78780n037844j977220J189085n091068
-2270e3690586M394671k273181L969614N39049j2978305M997861j791528J2631547m972254
$$ plain form
-2209 -40581779 -57651328 -45177160 -49165604 -45423920 -43262284 -40979245 -52492714 -40856645
-2217 -40856645 -42301343 -47498548 -53976839 -53200936 -42582290 -43187550 -49355879 -60593012 -59965916
-2226 -59965916 -50997394 -48365935 -57810768 -57699047 -53023381 -58515157 -47059548 -49770936 -34022538
-2235 -34022538 -42135149 -39622093 -38490781 -37866336 -41270798 -55765959 -53878108 -45426899 -44469601
-2244 -44469601 -41165726 -49951602 -39749790 -44406988 -71242098 -54582153 -48744634 -45777219
-2252 -45777219 -50026372 -50257857 -50688367 -38791155 -47619729 -45532729 -49672009 -40349096 -57677144
-2261 -57677144 -59264634 -56651201 -37018506 -43352319 -42773539 -47811383 -49788603 -48599518 -53690586
-2270 -53690586 -49295915 -51569096 -47599482 -47060433 -60038738 -55040877 -56832405 -44200858 -49173112
-2279d9173112J698586M298986M78473p714649J2822026j3553954j019811J4139231
-2287c8024224j2153562Q208847m287934m252158P952757K484336K838762j1404593l48055
-2296d8985824O073089K667312l671098l213621K958835j963625O163648k580445n710003
-2305d8261732q057949k476930J7808142k345555k129552m091694q219995R937185J497287
-2314d6340793O84493K732099J775284K936668m742208j8063633J828239K052448J7803283
-2323c9334120o108311N31897o960367j486632j2353J2432212l82599o417163P468831
-2332d0268605j0337144O438120m156556n42180M161265j2597030P32159N921283k582696
-2341e3231384O705105j2319040Q853916m444037J4991749j266265l542108L044661
$$ plain form
-2279 -49173112 -47474526 -43175540 -42697067 -50411716 -37589690 -51143644 -52163455 -38024224
-2287 -38024224 -50177786 -41968939 -46256873 -50509031 -42556274 -40071938 -37233176 -48637769 -48985824
-2296 -48985824 -42912735 -40245423 -43916521 -47130142 -44171307 -46134932 -39971284 -42551729 -48261732
-2305 -48261732 -56319681 -58796611 -40988469 -43334024 -45463576 -49555270 -57775265 -47838080 -46340793
-2314 -46340793 -45656300 -42924201 -41148917 -38212249 -42954457 -61018090 -59189851 -57137403 -39334120
-2323 -39334120 -45442431 -44910534 -51870901 -53357533 -53369886 -40937674 -41320273 -47737436 -40268605
-2332 -40268605 -50605749 -44167629 -48324185 -48866365 -44705100 -57302130 -56569971 -50648688 -53231384
-2341 -53231384 -46526279 -58845319 -49991403 -54435440 -39443691 -40709956 -44252064 -41207403
-2349d1207403l536983M158015J527328q880667J336363L039507K104612o535501m307700
-2358e2302429l324134N315691K397012J279598J885804l989807m000710L151766M284610
-2367d5302599n432052J1365878l634210o555561R736068p387834n216265N242175Q200806
-2376c8983594j2486404n26878q978266J897680K0195713o587967k248764M761625l223607
-2385d6180462Q200536m694500p07272L306681K191246j7786556J0213355M935131
-2393d0521841j0759880j8521912J4376528O54150n197907J5427862L243583j7071853
-2401e8371270p046908P408769J0157092L590403K649504k927327o098808k945587J237936
-2410e2346196K544110p208443j753764J0352885J097709m331516j75698O992504j306298
$$ plain form
-2349 -41207403 -44744386 -40586371 -39059043 -47939710 -46603347 -43563840 -41459228 -47994729 -52302429
-2358 -52302429 -55626563 -50310872 -47913860 -46634262 -44748458 -48738265 -52738975 -49587209 -45302599
-2367 -45302599 -50734651 -39368773 -43002983 -49558544 -39822476 -47210310 -52426575 -47184400 -38983594
-2376 -38983594 -51469998 -51996876 -60975142 -59077462 -38881749 -45469716 -47718480 -42956855 -46180462
-2385 -46180462 -37979926 -42674426 -43381698 -40075017 -37883771 -55670327 -45456972 -40521841
-2393 -40521841 -51281721 -69803633 -55427105 -54772955 -59970862 -44543000 -41299417 -58371270
-2401 -58371270 -65418178 -58009409 -47852317 -44261914 -41612410 -44539737 -50638545 -53584132 -52346196
-2410 -52346196 -49802086 -57010529 -58764293 -48411408 -47313699 -51645215 -51820913 -44828409 -46134707
-2419d6134707j890321M02875J898455J7056111j4409141n97271j771383J1557914
-2427c3887468j0082438o217250j612504J4910172k1517440N3117L300321n498822N185017
-2436e5367295J286894N268007M541952j0166382n626190Q868080R256329j687079m550909
-2445d8176593j0078805J2266537r07501j636926j096481m263694K743739l301064J435534
-2454e3015254n344482O01640M942180N635470J0409548j2694991L859877L1656l739721
-2463d9314077n906478R907167l426802R143467K553589r457602j588962q223675R599661
-2472d6713712l922926q558310J6273731J218023P31964K960001j1235740M150549L181640
-2481d1914780j4448765J8317786Q080587m063384j0074628j3506669N161100P605267
$$ plain form
-2419 -46134707 -48025028 -47622153 -45723698 -28667587 -43076728 -43673999 -45445382 -33887468
-2427 -33887468 -43969906 -50187156 -51799660 -36889488 -58406928 -58353811 -55053490 -60552312 -55367295
-2436 -55367295 -54080401 -48812394 -44270442 -54436824 -60063014 -51194934 -41938605 -43625684 -48176593
-2445 -48176593 -58255398 -45988861 -46896362 -48533288 -49629769 -53893463 -51149724 -54450788 -53015254
-2454 -53015254 -58359736 -57758096 -52815916 -47180446 -36770898 -49465889 -45606012 -45574356 -49314077
-2463 -49314077 -55220555 -45313388 -48740190 -39596723 -37043134 -46500736 -48089698 -56313373 -46713712
-2472 -46713712 -50636638 -59194948 -42921217 -41703194 -40971230 -38011229 -49246969 -45096420 -41914780
-2481 -41914780 -56363545 -38045759 -29965172 -34028556 -44103184 -57609853 -52448753 -44843486
-2489d4843486m273014o21304O348090J0211897n351083O821146o099538n327266q816362
-2498e1950920N793345K159674j107205K576163o010711k2379664J4691986K610501
-2506e3616831J0829553j4133679N560843P828666q728261q781748M17525J3599214
-2514d7024718l381795n97959R424140m102507j235112n787316l940738n260976J2316776
-2523d9590205J633414P204053n767229n951865O099903L6545n036237m36970Q119503
-2532d3689088n986413L649667J839907n593601Q760410j628144n475537p27719J727734
-2541d7122784k143829l965493O95839O592761j979693j6400714K216094R293332k581888
-2550e5396375q181917O899441K748380R26181j1330738K0222220P99502j8915103K757196
$$ plain form
-2489 -44843486 -49116500 -49737804 -43389714 -33177817 -38528900 -31707754 -37807292 -43134558 -51950920
-2498 -51950920 -46157575 -43997901 -45105106 -42528943 -48539654 -70919318 -56227332 -53616831
-2506 -53616831 -42787278 -56920957 -51360114 -43531448 -52259709 -61041457 -60623932 -47024718
-2514 -47024718 -50406513 -51004472 -41580332 -45682839 -46917951 -52705267 -56646005 -61906981 -49590205
-2523 -49590205 -47956791 -40752738 -46519967 -52471832 -46371929 -46335384 -51371621 -51808591 -43689088
-2532 -43689088 -49675501 -46025834 -44185927 -49779528 -41019118 -42647262 -48122799 -48850518 -47122784
-2541 -47122784 -49266613 -53232106 -52536267 -45943506 -47923199 -64323913 -62107819 -52814487 -55396375
-2550 -55396375 -63578292 -56678851 -53930471 -53004290 -64335028 -44112808 -43313306 -62228409 -59471213
-2559e9471213L089737k443725O50585J5023778M847863J5455741k3141075m440765
-2567e0429074j0204680Q789367n605504O859658m279083l751706m831455o471544
-2575f9924021L3577480J1651862j9205564M4018l190768P433087L853746r726127k876638
-2584d8362925n482353J4143470r760225J0229390l946463R06566k095465j411933M842045
-2593d0937893R06635O696103L174954j4107572J840378r513617J085060R446269o828600
-2602d8238283K413484k926795M468993j6534830O717073j588362o528912Q475425Q780204
-2611d4962003J1513424j2620672m86246l321098J9918270j495803n383980n469203
-2619d2307311M893100n709226Q049219j1349646j1121403l856469M910200Q668528
$$ plain form
-2559 -59471213 -56381476 -58825201 -58174616 -43150838 -38302975 -22847234 -45988309 -50429074
-2567 -50429074 -60633754 -51844387 -57449891 -50590233 -54869316 -58621022 -63452477 -69924021
-2575 -69924021 -36346541 -24694679 -43900243 -43856225 -47046993 -39613906 -35760160 -45486287 -48362925
-2584 -48362925 -53845278 -39701808 -49462033 -39232643 -43179106 -42272540 -44368005 -45779938 -40937893
-2593 -40937893 -40031258 -33335155 -30160201 -44267773 -42427395 -51941012 -50855952 -41409683 -48238283
-2602 -48238283 -45824799 -48751594 -44282601 -60817431 -54100358 -55688720 -62217632 -53742207 -44962003
-2611 -44962003 -33448579 -46069251 -46555497 -49876595 -29958325 -31454128 -36838108 -42307311
-2619 -42307311 -37414211 -43123437 -35074218 -46423864 -57545267 -61401736 -56491536 -47823008
-2627d7823008N738158j2930661N154381R565604L798640r918754N910824P697568r992965
-2636d2800213k943986m927282j5185888J8239580K004299r94535P241903j050164k9236
-2645d0445522l385224Q302278n28658l731965k1626115l512131J4758673K113058p954554
-2654e6010160L341P841484J6287300j3739816o101029P30319J494279K460402L841233
-2663d3192647P940023k956311N3887j598602J19144j0717117k556953J8518789J247805
-2672c3141982O489527q482884L27197j0627690O372931q404594L297297j625569N074338
-2681d0721429j2412800j439954k946813J6634689M603415n586490P14829q694315P165753
-2690d2683115l702830k961568o091946j005213L520514m879305M689099O634612L141195
$$ plain form
-2627 -47823008 -42084850 -55015511 -49861130 -40295526 -36496886 -46415640 -40504816 -32807248 -42800213
-2636 -42800213 -45744199 -50671481 -65857369 -47617789 -45613490 -46608025 -39366122 -40416286 -40445522
-2645 -40445522 -43830746 -35528468 -36057126 -39789091 -61415206 -64927337 -50168664 -48055606 -56010160
-2654 -56010160 -56006819 -48165335 -31878035 -45617851 -51718880 -50988561 -49494282 -47033880 -43192647
-2663 -43192647 -35252624 -38208935 -38155048 -39753650 -39634506 -50351623 -52908576 -34389787 -33141982
-2672 -33141982 -26652455 -35135339 -34808142 -45435832 -39062901 -47467495 -44170198 -45795767 -40721429
-2681 -40721429 -53134229 -54574183 -57520996 -40886307 -36282892 -41869382 -41154553 -49848868 -42683115
-2690 -42683115 -46385945 -49347513 -55439459 -56444672 -52924158 -57803463 -53114364 -46479752 -43338557
-2699d3338557p874159m080906J6473200k105280o456490N409188j0629013O489489
-2707d6112528j0331060K113893M263962J802569p002377o169462j549952J5668273
-2715d7316682l455002L456545k123479p954240O056062M336044q176719K619391J1615800
-2724d0942280k47534o36867K183017j2803781M578778l89930
$$ plain form
-2699 -43338557 -51212716 -55293622 -38820422 -40925702 -47382192 -41973004 -52602017 -46112528
-2707 -46112528 -56443588 -54329695 -50065733 -48263164 -55265541 -61435003 -62984955 -47316682
-2715 -47316682 -50771684 -47315139 -49438618 -57392858 -51336796 -47000752 -55177471 -52558080 -40942280
-2724 -40942280 -41189814 -41826681 -39643664 -52447445 -47868667 -48258597
-2730d8258597  $$ checkpoint
##PAGE= N=2
##DATA TABLE=(X++(I..I)), XYDATA
13653d0902908j017770Q87666N740471r037292J2040671j3112625K8325O107847l497870
13644d2763485m018555r39183J205888m654626L06206K615852K63361P992957L912153
13635c6079432j2898556K607379J5299858K057747j1399774J0588537n079806o507938
13627d1411985n832029l356064J0020905K066797l12418K324092m309085n55577P169940
13618c4195424j1862278P265461M868080j3158730P272382J835358O785536j0745497
13610d1935112l698682R460331r69992n880977n981577J0744153o33845O61926o105737
13601d4339512m737973J826203P744896m813896N557525P581763L5965j1850338j458731
13592d4454098J0520596j0204226L757952M373356K305133m991033J13912M639650p975087
$$ plain form
13653 -40902908 -41920678 -41033012 -35292541 -44329833 -32289162 -45401787 -45373462 -39265615 -42763485
13644 -42763485 -46782040 -47721223 -46515335 -51169961 -50863755 -48247903 -47984542 -39991585 -36079432
13635 -36079432 -48977988 -46370609 -31070751 -29013004 -40412778 -29824241 -34904047 -41411985
13627 -41411985 -47244014 -50600078 -40579173 -38512376 -38824794 -36500702 -40809787 -41365364 -34195424
13618 -34195424 -46057702 -38792241 -33924161 -47082891 -39810509 -37975151 -31189615 -41935112
13610 -41935112 -45633794 -36173463 -37143455 -43024432 -49006009 -38261856 -38895701 -38233775 -44339512
13601 -44339512 -49077485 -47251282 -39506386 -44320282 -38762757 -31180994 -31145029 -42995367 -44454098
13592 -44454098 -33933502 -44137728 -40379776 -36006420 -33701287 -38692320 -38578408 -33938758 -41913845
13583d1913845p825579J5572965k499722L385790o690846J280806m999264J3398896
13575c0290799q469053k543547o038014Q390860M58317l248555j210843m812104P963184
$$ plain form
13583 -41913845 -49739424 -34166459 -36666181 -33280391 -39971237 -38690431 -43689695 -30290799
13575 -30290799 -38759852 -41303399 -47341413 -38950553 -38492236 -41740791 -42951634 -47763738 -39800554
$$ [...]
-2730d8258376  $$ checkpoint
##END NTUPLES=
##END=
