##TITLE= S#395145
##JCAMP-DX= 5.00 $$ JEOL NMR v1.10
##DATA TYPE= NMR SPECTRUM
##DATA CLASS= NTUPLES
##NUM DIM= 1
##ORIGIN= DELTA_NMR
##OWNER= NMR
##SPECTROMETER/DATA SYSTEM= DELTA_NMR
##.OBSERVE FREQUENCY= 3.00529655924288E+02
##.OBSERVE NUCLEUS= ^1H
##.DELAY= (2.195E+02,2.195E+02)
##.ACQUISITION MODE= SIMULTANEOUS
##.FIELD= 7.0586013
##.FILTER WIDTH= 1.81675738660864
##.ACQUISITION TIME= 3.6339712
##.SPINNING RATE= 14
##.OBSERVE 90= 9.2
$$ ------------------------
$$ JEOL SPECIFIC PARAMETERS
##$FILENAME= C:\NMR/vanceoxidation-4.jdf
##$TITLE= S#395145
##$AUTHOR= NMR
##$CREATION=  1-FEB-2018 10:51:55
##$REVISION=  1-FEB-2018 10:59:07
##$CONTENT= PROTON NMR EXPERIMENT
##$INSTRUMENT= DELTA_NMR
##$SITE= Center College ECP+ 300
##$NODENAME= nmr2
##$DIMENSIONS= 1
##$STORAGE= FLOAT
##$X_FORMAT= COMPLEX
##$X_CURR_POINTS= 16384
##$X_START= 12.50103 $$ppm
##$X_STOP= -2.50012 $$ppm
##$X_TITLE= 1H                             
##$X_ZERO_POINT= 0.33329
##$X_FREQ_FLIP= FALSE
##$X_POINTS= 16384
##$X_PRESCANS= 0
##$X_DOMAIN= 1H
##$X_OFFSET= 5 $$ppm
##$X_FREQ= 300.52966 $$MHz
##$X_SWEEP= 4.50857 $$kHz
##$X_RESOLUTION= 0.27518 $$Hz
##$SOLVENT= CHLOROFORM-D
##$TEMP_GET= 20.5 $$dC
##$ACQ_DELAY= 0.2195 $$ms
##$DIGITAL_FILTER= FALSE
##$FILTER_FACTOR= 1
##$FILTER_WIDTH= 2.254 $$kHz
##$FILTER_MODE= BUTTERWORTH
##$TRANSITION_RATIO= 0.9
##$ORDERS
##$FACTORS
##$LOCK_STRENGTH= 249
##$LOCK_LEVEL= 200
##$LOCK_GAIN= 26
##$LOCK_OSC_OFFSET= 25.6519 $$kHz
##$LOCK_PHASE= 187 $$deg
##$LOCK_OSC_STATE= 2H OSC ON
##$X_ANGLE= 45 $$deg
##$X90= 9.2 $$us
##$X90_HI= 10 $$us
##$X90_LO= 50 $$us
##$X_90_WIDTH= 9.2 $$us
##$X_PULSE= 4.6 $$us
##$RELAXATION_DELAY= 4 $$s
##$SCANS= 1
##$PROBE_ID= 1412
##$ITERATIONS= 1
##$FIELD_STRENGTH= 7.0586 $$T
##$TEMP_SET= 25 $$dC
##$SPIN_SET= 15 $$Hz
##$SPIN_GET= 14 $$Hz
##$HE_LEVEL= 75 $$%
##$N2_LEVEL= 83 $$%
##$CHANGER_SAMPLE= 0
##$ADC_CARD= 16/1MHz/20
##$EXPERIMENT= single_pulse.exp
##$OBS_NOISE= WAUGH
##$IRR_NOISE= WALTZ
##$TRI_NOISE= WALTZ
##$QUA_NOISE= WAUGH
##$OBS_PWIDTH= 1 $$us
##$IRR_PWIDTH= 50 $$us
##$TRI_PWIDTH= 1 $$us
##$QUA_PWIDTH= 1 $$us
##$RECVR_GAIN= 4
##$IRR90= 9.2 $$us
##$TRI90= 10 $$us
##$QUA90= 10 $$us
##$IRR90_HI= 10 $$us
##$QUA90_HI= 10 $$us
##$IRR90_LO= 50 $$us
##$TRI90_LO= 10 $$us
##$QUA90_LO= 10 $$us
##$MOD_RETURN= 1
##$TOTAL_SCANS= 1
##$X_ACQ_DURATION= 3.63397 $$s
##$DELAY_OF_START= 1 $$s
##$ACTUAL_START_TIME= 886330301
##$CLIPPED= FALSE
##$DC_BALANCED= FALSE
##$TRI90_HI= 10 $$us
##$SPIN_LOCK_90= 100 $$us
##$SPIN_LOCK_ATTN= 24.4 $$dB
##$DEUT_GRAD_SHIM_90= 213 $$us
##$DEUT_GRAD_SHIM_ATTN= 9 $$dB
##$IRR_CODE= 146
##$LOCK_STATE= LOCK ON
##$AUTOLOCK_LEVEL= 200
##$SAWTOOTH_RANGE= 4
##$LOCK_STATUS= IDLE
##$LOCK_SETTLE_POINT= 4096
##$LOCK_ACHIEVE_POINT= 0
##$SPIN_ACTION= SPIN ON
##$SPIN_STATE= SPIN ON
##$SPIN_STATUS= SPIN ON
##$SPIN_GAS_SOURCE= AIR
##$TEMP_ACTION= TEMP OFF
##$TEMP_STATE= TEMP OFF
##$TEMP_STATUS= TEMP OFF
##$TEMP_COMP= 0
##$TEMP_DELAY= 0 $$s
##$TEMP_LIMIT_HI= 150 $$dC
##$TEMP_LIMIT_LO= -100 $$dC
##$TEMP_MELTING= -63 $$dC
$$ [...]
##$VT_PID_STD_WB_H_CBL= 10
##$VT_PID_STD_WB_H_CBH= 0
##$VT_PID_STD_WB_H_HC= 2.4
##$VT_PID_STD_WB_H_HL= 70
##$VT_PID_STD_WB_M_PB= 1.5
##$VT_PID_STD_WB_M_TI= 30
##$VT_PID_STD_WB_M_TD= 5
##$VT_PID_STD_WB_M_CBL= 9.9
##$VT_PID_STD_WB_M_CBH= 2.3
##$VT_PID_STD_WB_M_HC= 2.5
##$VT_PID_STD_WB_M_HL= 70
##$VT_PID_STD_WB_L_PB= 1.3
##$VT_PID_STD_WB_L_TI= 29
##$VT_PID_STD_WB_L_TD= 5
##$VT_PID_STD_WB_L_CBL= 20
##$VT_PID_STD_WB_L_CBH= 20
##$VT_PID_STD_WB_L_HC= 0.6
##$VT_PID_STD_WB_L_HL= 100
##$VT_PID_LONG_0_H_PB= 1.5
##$VT_PID_LONG_0_H_TI= 30
##$VT_PID_LONG_0_H_TD= 5
##$VT_PID_LONG_0_H_CBL= 9.9
##$VT_PID_LONG_0_H_CBH= 2.3
##$VT_PID_LONG_0_H_HC= 2.5
##$VT_PID_LONG_0_H_HL= 70
##$VT_PID_LONG_0_M_PB= 1.5
##$VT_PID_LONG_0_M_TI= 30
##$VT_PID_LONG_0_M_TD= 5
##$VT_PID_LONG_0_M_CBL= 9.9
##$VT_PID_LONG_0_M_CBH= 2.3
##$VT_PID_LONG_0_M_HC= 2.5
##$VT_PID_LONG_0_M_HL= 70
##$VT_PID_LONG_40_H_PB= 1.5
##$VT_PID_LONG_40_H_TI= 30
##$VT_PID_LONG_40_H_TD= 5
##$VT_PID_LONG_40_H_CBL= 9.9
##$VT_PID_LONG_40_H_CBH= 2.3
##$VT_PID_LONG_40_H_HC= 2.5
##$VT_PID_LONG_40_H_HL= 70
##$VT_PID_LONG_40_M_PB= 1.5
##$VT_PID_LONG_40_M_TI= 30
##$VT_PID_LONG_40_M_TD= 5
##$VT_PID_LONG_40_M_CBL= 9.9
##$VT_PID_LONG_40_M_CBH= 2.3
##$VT_PID_LONG_40_M_HC= 2.5
##$VT_PID_LONG_40_M_HL= 70
##$SAMPLE_ACTION= LOADED
##$SAMPLE_STATE= LOAD
##$SAMPLE_STATUS= LOADED
##$AUTOSHIM_MODE= AUTOSHIM OFF
##$AUTOSHIM_DELAY= 3600 $$s
##$AUTOSHIM_TRACK= AUTOSHIM OFF
##$SHIM_MAX_RECALL= MAX FOUND
##$SHIM_NAMES= SHIM_Z0
##$SHIM_Z0= 9167
##$SHIM_Z1= 5211
##$SHIM_Z2= 22
##$SHIM_Z3= -2829
##$SHIM_Z4= -240
##$SHIM_Z5= 46
##$SHIM_Z6= -33
##$SHIM_X= -14
##$SHIM_XZ= 16
##$SHIM_XZ2= 0
##$SHIM_XZ3= 0
##$SHIM_X2= -7
##$SHIM_X2Z= -40
##$SHIM_X3= 0
##$SHIM_Y= 1608
##$SHIM_YZ= 13
##$SHIM_YZ2= 10
##$SHIM_YZ3= 0
##$SHIM_Y2= -11
##$SHIM_Y2Z= -20
##$SHIM_Y3= 0
##$NUM_SCANS= 1
##$END_TIME= 886330315
##$LOCAL_TIME= 886330315
##$PROBE_ATN= 0
##$PROBE_TUNE= 0
##$PROBE_MATCH= 2077
##$PROBE_COARSE= NONE
##$LF_TUNE_DIAL= 0
##$LF_MATCH_DIAL= 0
##$HF_TUNE_DIAL= 0
##$HF_MATCH_DIAL= 0
##$PASS_RIPPLE= 0.01 $$dB
##$STOP_RIPPLE= 60 $$dB
##$PROBE_RECOVERY= 0 $$us
##$AF_DELAY_RATIO= 0
##$VERSION= 4.3.3
##$X_ACQ_TIME= 3.63397 $$s
##$DEAD_TIME= 0 $$us
##$DELAY= 0 $$us
##$PHASE_PRESET= 3 $$us
##$UNBLANK_TIME= 2 $$us
##$INITIAL_WAIT= 1 $$s
##$NORMALIZED= TRUE
$$ END OF JEOL SPECIFIC PARAMETERS
$$ -------------------------------
##NTUPLES= NMR SPECTRUM
##VAR NAME= FREQUENCY,    SPECTRUM/REAL, SPECTRUM/IMAG, PAGE NUMBER
##SYMBOL=   X,            R,             I,             N
##VAR TYPE= INDEPENDENT,  DEPENDENT,     DEPENDENT,     PAGE
##VAR FORM= AFFN,         ASDF,          ASDF,          AFFN
##VAR DIM=  16384, 16384, 16384, 2
##UNITS= PPM,     ARBITRARY UNITS, ARBITRARY UNITS, 
##FIRST=  1.2501033903057E+01, -4.56703920547902E-01, -3.51903767556582E-01, 1
##LAST=  -2.50011824950436, -3.25556518771397E-01, -3.83058619423611E-01, 2
##FACTOR=  9.1565355261926E-04, 8.78784992936955E-05, 8.78784992936955E-05, 1
##PAGE= N=1
##DATA TABLE=(X++(R..R)), XYDATA
$$ [...]
7616 -42039097 -37230270 -31098289 -27292810 -49681061 -43776264 -44733405 -40329850 -42497179 -42031367
7607 -42031367 -49368777 -58002285 -53485111 -44183274 -46298345 -38981129 -46197894 -45494996 -35008407
7598 -35008407 -39126971 -41941013 -45253817 -40629014 -47516898 -41698904 -43006420 -55406635 -45801547
7589 -45801547 -39353717 -43453806 -43320980 -47197212 -39309062 -34895734 -37498940 -41938265 -50148243
7580 -50148243 -37317760 -34534135 -37694280 -42418883 -47221746 -29669558 -42059959 -46330783
7572 -46330783 -42098071 -45326420 -48428854 -45299462 -41253705 -35889151 -44113632 -45194036 -44664276
7563 -44664276 -39465597 -40763583 -29861593 -34348988 -40507758 -45185176 -41768205 -32527711 -27304410
7554 -27304410 -38100305 -34926577 -32055630 -14409359 -44731078 -49038286 -45196642 -40255705
7546 -40255705 -42750767 -43439449 -43336867 -40069537 -51751221 -47282183 -60449580 -53911732 -43356702
7537 -43356702 -32792753 -33883473 -60772217 -38094086 -46908464 -44255436 -27362923 -37458084
7529 -37458084 -28450463 -25457358 -34325136 -27963002 -39681761 -44973386 -54772994 -41543333 -40889356
7520 -40889356 -49883657 -34918082 -45280731 -39762591 -41368251 -44575690 -35837850 -48204829
7512 -48204829 -40651189 -35634575 -44403188 -38559364 -32509800 -34014714 -38256165 -32161710 -30774981
7503 -30774981 -42905823 -36794323 -39090741 -24086451 -39192074 -34176589 -46686258 -26005073
7495 -26005073 -26696115 -26889545 -44587801 -32453087 -49037457 -48827042 -48165875 -35285610 -54723967
7486 -54723967 -36769563 -45232073 -46038602 -42377294 -45429978 -48893242 -46064504 -45419100 -44506050
7477 -44506050 -42872821 -48010022 -48857473 -54578850 -45301193 -32977602 -40413382 -38454840 -44019430
7468 -44019430 -39799135 -37092100 -35322079 -49438434 -55667592 -44360083 -56604943 -49426020
7460 -49426020 -44565642 -47614190 -48896439 -40030973 -31604698 -41963050 -48143236 -35260299 -44789026
7451 -44789026 -42953415 -49896557 -49398736 -44306579 -44858185 -51289298 -47833687 -44144313 -41573440
7442 -41573440 -47398470 -42189676 -40309795 -45432459 -36257489 -48105299 -57732695 -49359006 -45309008
7433 -45309008 -44835568 -45066843 -46006526 -42500705 -41149012 -34990970 -22329514 -31320663 -34812923
7424 -34812923 -37916336 -41263077 -56905156 -59056821 -57268399 -38800027 -52527226 -43926874
7416 -43926874 -33769024 -51066422 -56901778 -39809770 -30889373 -50349617 -42435508 -42714486
7408 -42714486 -46390901 -43290568 -39497182 -31689602 -40705563 -47955562 -34870081 -36207253 -58363021
7399 -58363021 -50185550 -41811815 -55506568 -48688767 -60013708 -40370698 -40999920 -46178850 -44446502
7390 -44446502 -46159195 -48087594 -49102105 -51897309 -34899796 -34423730 -43998321 -43872641 -39468598
7381 -39468598 -49532586 -28573976 -39073914 -45957032 -46492590 -43421474 -36431650 -50444130
7373 -50444130 -39618724 -40781192 -31254055 -40114184 -52846540 -50845997 -41863968 -47438538 -48881206
7364 -48881206 -50829722 -53960981 -55842597 -45561820 -35475366 -39415607 -31294622 -41718723
7356 -41718723 -53612367 -50570904 -41026960 -44946973 -53855127 -55245571 -56051111 -48730741 -49173831
7347 -49173831 -47154989 -45862578 -41226629 -45882877 -54254451 -52383975 -49692573 -42035342 -39914558
7338 -39914558 -44205251 -46871022 -45607584 -47240643 -33644417 -46575963 -37920828 -36846670
7330 -36846670 -49079573 -53015266 -53425247 -52525001 -51224030 -56432533 -52216442 -36784037 -52866211
7321 -52866211 -48357311 -65299317 -62554013 -52798702 -47697234 -47927611 -53536310 -55027548 -50470193
7312 -50470193 -55892029 -34366270 -40369120 -51517222 -46387813 -40468076 -28549558 -37865165
7304 -37865165 -46706658 -44137964 -39076012 -44696166 -49205174 -48133273 -39093826 -42763700 -39056877
7295 -39056877 -42719279 -45019237 -49683208 -47474325 -49544261 -48233366 -49798334 -45502648 -43222183
7286 -43222183 -50382881 -42540604 -36789117 -50761162 -50495121 -53503614 -47240644 -47311044 -45503014
7277 -45503014 -50890916 -46803436 -47060457 -44728989 -44218284 -47019314 -44236318 -53337770 -48790030
7268 -48790030 -48125509 -44303705 -44533223 -49157852 -40429202 -32092288 -44829241 -46617055 -43743163
7259 -43743163 -47620427 -37471784 -48122229 -49955784 -46126613 -31960240 -44590601 -48252018
7251 -48252018 -48877571 -43705370 -52295755 -48551979 -44340406 -46287809 -49430540 -41719763 -42557691
7242 -42557691 -36983367 -36639725 -35654185 -32156406 -40065076 -47401213 -34264666 -39666627 -43738239
7233 -43738239 -39267525 -40832676 -44051380 -44473844 -38672880 -45693037 -43587370 -45641524 -49129161
7224 -49129161 -43932631 -41494233 -50935819 -45297997 -40413863 -45320480 -43692647 -40472056 -44717926
7215 -44717926 -51631732 -51108852 -38547836 -36817310 -44091296 -29185358 -32885637 -39370827 -46023217
7206 -46023217 -75495510 -59338631 -58041263 -44839383 -44018429 -50896974 -45153048 -39299518
7198 -39299518 -49790043 -49947656 -43393821 -54777388 -42429712 -54509604 -52889448 -49335164
7190 -49335164 -56920026 -42847063 -33678880 -32285440 -39340130 -34301104 -31187573 -36055081 -42582393
7181 -42582393 -46759017 -42407804 -56291421 -52073114 -45491979 -50146048 -39247202 -40882889 -37150862
7172 -37150862 -52073253 -66226656 -57924985 -50694487 -48319151 -54658649 -56091647 -54614975 -58741250
7163 -58741250 -52448511 -39209679 -46637599 -40578007 -41973433 -49829066 -42142268 -43896111 -58880474
7154 -58880474 -42913180 -43935816 -44576793 -42089582 -47339790 -54662934 -47112236 -45399126 -51577366
7145 -51577366 -55668848 -45770710 -42602463 -42154171 -50128362 -54222739 -51107507 -47133093 -47872094
7136 -47872094 -42410227 -50028262 -59001266 -49989580 -60889608 -58262404 -47358256 -49285703 -45196680
7127 -45196680 -42744264 -50487787 -40161254 -55136587 -51594050 -49417361 -39843444 -49527105 -47922309
7118 -47922309 -52930490 -43388714 -43735560 -47884402 -46241191 -49904314 -49069028 -49073931 -42117776 -50019796
7108 -50019796 -51918387 -55627963 -59087057 -37255507 -55929558 -48766006 -55145637 -59852109
7100 -59852109 -48095716 -49306195 -50676073 -47301456 -40148840 -48704893 -44457200 -48411187 -51184067
7091 -51184067 -46349415 -47127465 -51826099 -45900963 -41673711 -51025196 -45468316 -46992356 -46806319
7082 -46806319 -41698910 -35540509 -49330521 -65797161 -54107449 -55025036 -61607541 -53812460 -55495193
7073 -55495193 -47622098 -30530980 -38157695 -40965398 -39584146 -45430631 -47501623 -31728604
7065 -31728604 -52786642 -50161507 -52930733 -50094832 -45627791 -46747460 -53007474 -52354552 -51204374
7056 -51204374 -46812049 -39011915 -60750096 -52914135 -38220788 -45091773 -46071957 -42290638 -52421938
7047 -52421938 -60089001 -57946754 -46968337 -42135420 -48207880 -39725042 -42448645 -29464676
7039 -29464676 -40948097 -40008986 -55694917 -41960403 -59848231 -59514588 -47135011 -52668202
7031 -52668202 -49237473 -45556980 -45474422 -48210400 -45880528 -35092800 -40266565 -53248614 -52744276
7022 -52744276 -50404161 -46530532 -42144641 -54727252 -53479031 -36075765 -37438942 -56700884
7014 -56700884 -50000896 -36889405 -43486757 -36447567 -39036395 -38104447 -55746507 -36048078
7006 -36048078 -49679893 -57705071 -56425972 -34334585 -35821523 -42511801 -41263935 -39639707 -39701735
6997 -39701735 -46833771 -50433826 -35353954 -37379194 -50785062 -51998017 -47120540 -52195459 -42216232
6988 -42216232 -51485605 -41075530 -49009565 -50065900 -44243173 -49020771 -37455984 -41647872
6980 -41647872 -24778577 -36740557 -53530208 -53063788 -41191946 -41175017 -32793765 -36137439 -41457677
6971 -41457677 -47842803 -48642981 -50793242 -56163925 -51034782 -52188992 -40931554 -56916757 -54219791
6962 -54219791 -43472404 -46562337 -50924789 -42863105 -49017693 -46593576 -53845928 -49160094 -49651334
6953 -49651334 -47503111 -41537204 -46728198 -43188007 -57671758 -48651827 -52709123 -49183064 -49301940
6944 -49301940 -63242127 -47034623 -45760746 -56591030 -37862238 -32418631 -38466973 -35691413
6936 -35691413 -54842302 -43642156 -49273097 -51548439 -56622230 -50812981 -52338558 -48850891 -51105788
6927 -51105788 -53155740 -52744920 -48825500 -41276018 -51501017 -52369384 -50599464 -50393936 -45809136
6918 -45809136 -43084490 -41162583 -44978093 -46721215 -50703955 -47186365 -45851857 -44157012 -45436752
6909 -45436752 -50489630 -44501307 -44678718 -50050857 -46009588 -41580287 -41760610 -46755568 -51926432
6900 -51926432 -49843426 -49289856 -47883029 -38906569 -33724948 -44887736 -39525577 -54722501 -40561184
6891 -40561184 -45686113 -47364457 -50114260 -42132791 -38472449 -38127504 -43365925 -51424871 -46289112
6882 -46289112 -52359111 -48850038 -44259007 -46093310 -48580891 -47167248 -44573597 -40342400 -41890611
6873 -41890611 -42410935 -52297512 -52013185 -45501813 -51018021 -54529355 -51473706 -52693407 -46791300
6864 -46791300 -47181681 -37148198 -37352668 -40754884 -48717295 -53293605 -54214923 -40292252 -52746612
6855 -52746612 -46217561 -30750970 -45031413 -54799478 -56451944 -53942186 -47899311 -50393938 -45040557
6846 -45040557 -39169636 -17325036 -42014264 -43156946 -42130966 -52285881 -51747985 -61082109 -69083504
6837 -69083504 -56383303 -45543403 -49009644 -50411598 -53436199 -44964473 -39569047 -48406320 -43254798
6828 -43254798 -46125756 -50850319 -44799602 -44930895 -38759363 -43173421 -43302401 -48796270 -45507783
6819 -45507783 -46980318 -42755688 -51567750 -53280610 -57590454 -49185502 -41949686 -45072250 -44288314
6810 -44288314 -48429829 -44619694 -48693866 -53841323 -43767010 -40571854 -42172020 -50316126 -50825442
6801 -50825442 -51466202 -54453730 -40805901 -40180455 -44908433 -40749351 -48727874 -52758778 -42449075
6792 -42449075 -52851379 -47094889 -45900593 -45252877 -43839074 -51050365 -45616736 -45507995 -48236146
6783 -48236146 -51406569 -37970901 -47561370 -45766180 -48398618 -37714099 -42725390 -45984062 -40817039
6774 -40817039 -48313947 -43220107 -41692653 -49391616 -47017126 -38892132 -51132717 -45998907 -48436164
6765 -48436164 -43204997 -40310792 -53945599 -33413001 -36258179 -32515677 -41793570 -53221940
6757 -53221940 -51472224 -48780237 -62533363 -61756581 -49177441 -48409137 -54468381 -38322332 -49195807
6748 -49195807 -40956550 -55594982 -58287360 -50669989 -45925201 -51462830 -42401483 -40592503 -55674360
6739 -55674360 -56254137 -46677788 -64671625 -60253579 -53180783 -51568657 -53367681 -45652200 -36694725
6730 -36694725 -43874634 -36411814 -41230501 -53947514 -51866075 -45118769 -46926999 -52662228 -53308060
6721 -53308060 -53164606 -52661031 -57394989 -49533111 -40858479 -50026929 -48168250 -43632006 -51706329
6712 -51706329 -50209710 -33741867 -45991319 -41559460 -54198234 -55711434 -59897591 -45327171
6704 -45327171 -44588010 -41120436 -52125719 -45600184 -51421516 -48723045 -48745989 -34278171 -32685769
6695 -32685769 -45310852 -36438340 -41820289 -50715854 -40092832 -54384186 -57644104 -55981103 -56482307
6686 -56482307 -49971540 -44063012 -61620054 -52902561 -44999265 -36680080 -50926057 -58619479
6678 -58619479 -46866540 -42000693 -38000158 -52520331 -40737892 -39788743 -52633474 -46103894
6670 -46103894 -43321802 -45293907 -47560850 -48793657 -48018085 -45776280 -59490401 -55741978 -50445921
6661 -50445921 -57131765 -46176402 -49415054 -49942906 -53342921 -43371796 -42162377 -44468396 -38578743
6652 -38578743 -51365466 -34142410 -51122231 -47760847 -61603807 -59344294 -48522686 -56487874
6644 -56487874 -44619815 -46615477 -40899773 -33076534 -29717155 -38668685 -40803375 -59042210 -63561103
6635 -63561103 -55795747 -41618322 -43318359 -41028079 -46696434 -44270076 -53098167 -45276771 -44921512
6626 -44921512 -57689088 -55719503 -46968934 -52937769 -44688838 -45879109 -47409715 -43851416 -42158561
6617 -42158561 -55419403 -51595852 -58931560 -56721294 -54612198 -45776015 -44689124 -47027425 -52639078
6608 -52639078 -56336343 -57685533 -60625333 -47778763 -55916022 -45306182 -50119633 -50983926 -54527591
6599 -54527591 -50834868 -52712332 -54822331 -50017799 -61695081 -50381368 -47014340 -45288377 -52063831
6590 -52063831 -58588157 -51537176 -57295856 -49570216 -53591399 -51135651 -48073665 -47854264 -57437156
6581 -57437156 -47123275 -56205671 -63372180 -48259748 -56854628 -51431168 -42513974 -40774904 -36722773
6572 -36722773 -50050851 -58363240 -50926873 -54800955 -59410607 -51265856 -36680444 -36412971 -49980364
6563 -49980364 -56968341 -48055531 -52394115 -45362630 -48061456 -47699870 -37289498 -39750825 -51433862
6554 -51433862 -44703251 -59111475 -68713666 -46127262 -42157409 -29377132 -37955628 -42047274
6546 -42047274 -40963491 -32857150 -47965243 -56886111 -43910676 -42292295 -52881746 -55298434
6538 -55298434 -56771495 -48409244 -48623265 -52929094 -46487457 -51419744 -55218423 -62352341 -57821525
6529 -57821525 -63224187 -55834590 -53706774 -61561742 -49136795 -42262654 -48098454 -49599413 -46562321
6520 -46562321 -37383034 -38526878 -44032328 -61248042 -52579292 -58191289 -59148922 -43868947 -44748481
6511 -44748481 -48390940 -54657094 -45996116 -38056312 -47747966 -48550071 -51857464 -44083571 -47699100
6502 -47699100 -65861189 -60014526 -43846095 -54400909 -58445760 -55489610 -58160612 -47983261
6494 -47983261 -45044513 -46357436 -45688202 -39932511 -43908067 -38126868 -50950729 -56424400 -54187154
6485 -54187154 -41939572 -39042923 -52625913 -35380174 -49033561 -51308677 -45230872 -42570772
6477 -42570772 -37362410 -44989008 -50223459 -44160607 -29151226 -35671461 -44857330 -41883397 -59537658
6468 -59537658 -42146529 -59267753 -54339353 -50121012 -46845268 -45115355 -53365222 -48200130 -39748462
6459 -39748462 -49204266 -42808253 -36620188 -58053313 -50661632 -54483465 -54346265 -47326920 -48424599
6450 -48424599 -49821659 -48688344 -50062591 -46872236 -44345643 -53927059 -43127082 -59391068
6442 -59391068 -42919324 -40508718 -40542066 -48058476 -49020038 -54149015 -57993210 -49797209 -62232547
6433 -62232547 -54772939 -34988807 -35202012 -47321788 -50946522 -48067015 -56551616 -46901508 -51502216
6424 -51502216 -50881375 -50499211 -57817359 -38435383 -38120946 -47000526 -52562681 -45924038 -47254553
6415 -47254553 -48286236 -47324080 -58662811 -43911951 -41281879 -53351740 -47822176 -56537722 -59119916
6406 -59119916 -55082214 -38972270 -45980226 -45550010 -48242028 -41431347 -49486670 -58478052 -56745888
6397 -56745888 -43587408 -49357546 -52844801 -42473679 -50144220 -47575303 -42881412 -48074225 -47739881
6388 -47739881 -52580319 -48685560 -51791720 -39160173 -43454458 -45523816 -56137508 -69739931
6380 -69739931 -57566745 -54486272 -47483588 -54196278 -50948659 -48392907 -56410489 -54808787 -50345446
6371 -50345446 -49049734 -46027722 -51819883 -58031101 -60834089 -46432978 -41340067 -44673464 -37174293
6362 -37174293 -42640272 -42851910 -46049128 -44752985 -52063646 -57155160 -50439734 -52357383 -49047073
6353 -49047073 -47144580 -35955542 -43366991 -58145512 -52144277 -53514082 -47004188 -61958713
6345 -61958713 -66446995 -64756904 -54704967 -44966805 -45650356 -47807956 -56259589 -58094435 -54023164
6336 -54023164 -50593317 -50667803 -50588583 -48388928 -41415667 -43891973 -53501536 -46042536 -50220463 -49786683
6326 -49786683 -47093678 -46201898 -40477287 -38158984 -41114167 -44437925 -44835773 -49004035 -51515948
6317 -51515948 -40205788 -36083399 -41910222 -31979608 -44293170 -51546445 -53716897 -38561699
6309 -38561699 -34055663 -37115434 -33080979 -40680220 -45145577 -49746492 -56236615 -54692793 -48717029
6300 -48717029 -37405216 -53469344 -51225846 -48252038 -43527682 -51735203 -51600593 -62926445
6292 -62926445 -51779781 -53649281 -38158537 -48779549 -40906275 -52230158 -45312722 -49476505
6284 -49476505 -37912292 -49122944 -46090353 -35053989 -48418599 -64532956 -50541954 -49868648
6276 -49868648 -47937285 -51571293 -48570614 -55032746 -54698357 -54306510 -35341422 -41612702 -38717109
6267 -38717109 -49653118 -52023491 -50070726 -47342352 -44884280 -48005860 -61099323 -55313706 -61032802
6258 -61032802 -58489598 -61720247 -49348331 -48535726 -44624656 -49396339 -34901500 -39518966 -50807410
6249 -50807410 -50637750 -43092565 -51454578 -52226931 -43981687 -45847580 -52538123 -36105942 -43302548
6240 -43302548 -35704179 -43120003 -40355391 -52222802 -40346150 -45100440 -40801071 -41887656
6232 -41887656 -54779020 -52138132 -54535263 -55682312 -53000435 -46150818 -45742557 -41640637 -38151805
6223 -38151805 -40654160 -52103546 -52170973 -59675825 -60843324 -51525549 -50919280 -47812772 -43542937
6214 -43542937 -53320510 -54158844 -50589629 -37738018 -24994295 -37933051 -38263908 -41913462 -43160558
6205 -43160558 -49155628 -38967993 -40686916 -45390937 -46884255 -50185009 -47708694 -52219917 -48825712
6196 -48825712 -58943763 -59909621 -43664805 -44310889 -44444127 -46595277 -47847057 -48885343 -53346236
6187 -53346236 -50522856 -47136808 -50964631 -52395980 -59874138 -52511687 -59231093 -51494404 -44188875
6178 -44188875 -55385734 -38447259 -44013921 -58432202 -56276029 -40421129 -35663335 -51808942
6170 -51808942 -43613342 -50992381 -47932461 -47059045 -51194162 -44984561 -44762504 -41507584 -58161547
6161 -58161547 -63150266 -56941132 -57833925 -46694211 -56748846 -50293503 -53197959 -40328337 -39187915
6152 -39187915 -49681040 -49024973 -42211586 -41790899 -41281007 -43324932 -50434159 -49107439 -55452078
6143 -55452078 -61303532 -59331953 -46838647 -53943539 -47219977 -44991146 -56136463 -36739197
6135 -36739197 -49058612 -54575999 -57662379 -44840396 -45026732 -51878999 -41737621 -45596603 -42605390
6126 -42605390 -50593556 -45295994 -39753272 -40063282 -45389679 -46945377 -53507746 -51032125 -61258615
6117 -61258615 -46617447 -17396340 -26385491 -31278999 -46691266 -52872245 -46736138 -43898511
6109 -43898511 -52535015 -46324648 -45855834 -52851516 -36320505 -47880648 -47180933 -27453991 -38606970
6100 -38606970 -41373588 -46993723 -42798624 -46233232 -43081976 -43244081 -53145366 -49016270 -38680768
6091 -38680768 -38907908 -48094364 -45903704 -50137369 -57052749 -58754553 -47547495 -50667199 -49948336
6082 -49948336 -47412697 -54979649 -57427182 -53066371 -54527580 -46005955 -47065069 -53230993 -50334598
6073 -50334598 -54252692 -48029332 -39052317 -43127639 -56016696 -57491190 -57846853 -47459654 -46276764
6064 -46276764 -39733849 -45909610 -40738119 -56664450 -47148670 -48035379 -53612070 -45635955 -44069243
6055 -44069243 -48914280 -53780905 -50550154 -35851776 -42007690 -55279326 -46791698 -62605865
6047 -62605865 -47518244 -40363450 -45500170 -47335426 -52182141 -39682218 -51149637 -48043470
6039 -48043470 -39646336 -44143807 -53019512 -49566456 -43127550 -38624417 -52103135 -54901417 -39890708
6030 -39890708 -38574870 -48857847 -44744771 -50731093 -36605605 -43327839 -49691955 -46192918 -47630482
6021 -47630482 -34630936 -51045631 -48382187 -50965410 -43451720 -45077459 -38202236 -43819904 -47657969
6012 -47657969 -50900945 -51890923 -48384588 -38697128 -32941161 -40894428 -48422193 -43092297 -46508431
6003 -46508431 -43069563 -46842144 -59929710 -53284888 -64080907 -59029675 -55909763 -52503986 -53229522
5994 -53229522 -51436880 -65474640 -58352302 -44620193 -59926468 -67977151 -51808691 -52893097
5986 -52893097 -53284212 -39357962 -57801093 -62894724 -58390275 -44440884 -50005687 -41636440 -46098532
5977 -46098532 -46783490 -47023341 -46546874 -54321880 -58242759 -32487033 -51211235 -45377472 -49785841
5968 -49785841 -46535021 -45657112 -47248073 -45161548 -52497733 -49884623 -52003244 -48109024 -46627682
5959 -46627682 -37633816 -41882156 -32450889 -40138170 -35259095 -52613861 -39703754 -39921347 -44045377
5950 -44045377 -50069617 -51494166 -46144508 -45315372 -53189046 -42370693 -51635549 -44857842 -38578472
5941 -38578472 -31279479 -45299446 -54927928 -49732045 -51374004 -48169315 -35848872 -44376086 -44073854
5932 -44073854 -37702976 -47415886 -35301942 -41789356 -52353922 -39583242 -45640307 -57075500
5924 -57075500 -54076436 -47853933 -54097352 -58658144 -47761996 -41539656 -40141639 -44983353 -46393635
5915 -46393635 -30900603 -33748658 -44161960 -41896234 -30424299 -31891115 -35560799 -39117230
5907 -39117230 -35049817 -31882613 -42877902 -43108181 -44235793 -43744919 -49853070 -52327267 -50780184
5898 -50780184 -66661883 -33535472 -34084174 -44126209 -56311693 -35998377 -46220407 -56239252
5890 -56239252 -55498601 -65860646 -54435714 -49085624 -50311673 -46150328 -35222639 -53923686
5882 -53923686 -60116596 -48751105 -37369983 -44897742 -38367981 -42355662 -51278320 -47988900 -43258540
5873 -43258540 -50806659 -38942771 -38002554 -35004753 -50975872 -56619976 -52803945 -44694422 -53085853
5864 -53085853 -55417798 -38347246 -53444450 -46289477 -54748089 -51007185 -47846731 -38087243 -40155680
5855 -40155680 -43418358 -37294756 -48636234 -44234955 -47406414 -54304659 -48888485 -49349980 -47253290
5846 -47253290 -41092943 -39517558 -38325359 -44111160 -39372362 -43976229 -43973455 -44697499 -44873825 -47432996
5836 -47432996 -47326371 -50222119 -42081734 -35291693 -41624806 -40301966 -38965007 -49746461 -47806502
5827 -47806502 -43372816 -28594285 -30965327 -43831043 -35127818 -23566447 -31691696 -42022129
5819 -42022129 -30991892 -49220465 -49592879 -37618024 -30369366 -36882170 -38028607 -43971105 -47862018
5810 -47862018 -36563339 -46098218 -41633892 -42825260 -40600355 -33986275 -31576473 -32127837 -31239308
5801 -31239308 -38335196 -43722478 -42439710 -31571468 -27711807 -33898052 -26898189 -24639973 -27567218
5792 -27567218 -30023005 -30812103 -12622304 -24531954 -30710963 -24794270 -15741716 -39723097
5784 -39723097 -29165556 -34729773 -33463762 -27435406 -17064976 -17232629 -26445935 -22753149 -26763311
5775 -26763311 -24322987 -19922902 -20942959 -19228040 -7851617 -26059219 -7269938 -11935194 -11196187
5766 -11196187 -11385431 -6016753 -1788476 -2364860 -5862424 -19736131 -10333002 -13222803 -11023197
5757 -11023197 -14675485 -316687 -784726 -3769456 -3691271 -11541519 -11872285 -10418444 -15716849
5748 -15716849 -16118586 -7977375 7389957 -8016194 -7832541 -18159572 -6626387 -7662857 -5945937
5739 -5945937 -4023344 -14739197 -8007326 -7215718 -15063498 -8323783 -15859146 -3583792 -8384609
5730 -8384609 -13131143 -18370175 -25037183 -34013470 -27950237 -37497643 -30106993 -22521959 -13297720
5721 -13297720 -21482774 -14469535 -24135657 -16976225 -23731703 -31210869 -24165924 -22154423 -40191361
5712 -40191361 -27578286 -22388665 -28441352 -35336184 -41785558 -31664180 -21234761 -28214523
5704 -28214523 -22452091 -35032013 -29308840 -37099612 -42249531 -41592180 -33075203 -30778887 -27557526
5695 -27557526 -29114714 -23121548 -37502459 -41581195 -33290742 -28289608 -32353037 -18682738
5687 -18682738 -41313299 -30345177 -29111760 -37002798 -40186100 -39041528 -30360283 -7484889
5679 -7484889 -30083716 -35632599 -27851853 -33506136 -48297928 -36626238 -47187381 -38456949
5671 -38456949 -29328592 -41232107 -37643195 -39599700 -47105111 -47996585 -47017502 -46980769 -40421338
5662 -40421338 -39566467 -36841886 -39172778 -31755185 -48221396 -42925337 -46410355 -35344185 -44632031
5653 -44632031 -32835613 -31422190 -31132788 -43990017 -35137122 -35874133 -46001741 -41670152 -32473623
5644 -32473623 -41177879 -37126291 -37056288 -44084929 -48642195 -40053116 -48062504 -40058784 -34165858
5635 -34165858 -35113296 -48176460 -39734016 -51242774 -51598078 -36268833 -42680706 -35506645 -37275179
5626 -37275179 -49074972 -36262068 -47070092 -53864745 -43368308 -39343320 -28675587 -36460081
5618 -36460081 -32847628 -34587131 -41367782 -44060545 -36734774 -39383020 -54360886 -48144907 -43509125
5609 -43509125 -48805067 -49796912 -37963323 -48408164 -43190342 -44211736 -37708145 -38652704 -34940005
5600 -34940005 -49017217 -46640842 -36902434 -43573348 -44712584 -48990338 -47579417 -35121829 -33859519
5591 -33859519 -45509775 -38979279 -32458522 -39469352 -44107868 -47398278 -50858551 -56231885 -37339835
5582 -37339835 -48692897 -38053770 -39960223 -46967312 -46226084 -47858116 -49030884 -53477942 -44547399
5573 -44547399 -46243467 -45399154 -38847613 -46930906 -58334771 -52767696 -48112863 -50372045 -47071517
5564 -47071517 -51876984 -46885679 -46330021 -40515735 -32255827 -31719732 -37938442 -47206869 -35729427
5555 -35729427 -42408815 -51713192 -52363431 -59060234 -56061956 -48755243 -52600755 -50671972 -48050042
5546 -48050042 -63220312 -60522964 -50874126 -57246727 -42515119 -44338372 -34756918 -49967821
5538 -49967821 -48641820 -46189176 -40494023 -42792159 -43316410 -29305169 -45984732 -45715179 -51301767
5529 -51301767 -41062854 -38894585 -48745169 -49425598 -42721027 -39017222 -47898065 -38789013 -35748580
5520 -35748580 -45988201 -45938054 -49767145 -57508534 -50254035 -46172229 -46886485 -52929680 -44294027
5511 -44294027 -52063608 -39541595 -48656537 -28743842 -53637867 -40276530 -38749847 -49545489
5503 -49545489 -47028093 -43008562 -45822803 -57366090 -42697248 -50000657 -50801093 -56649496 -36748911
5494 -36748911 -38426041 -35836232 -33886612 -49823955 -50622769 -43521877 -39189089 -47216525 -60483862
5485 -60483862 -45464163 -47547534 -42625490 -48818703 -43918140 -62003754 -48200453 -40985241
5477 -40985241 -47624336 -50152667 -45554637 -39117473 -45385564 -41657937 -58831868 -41505923
5469 -41505923 -67932875 -42389866 -24914446 -38378384 -35061579 -24512544 -34067757 -45531115
5461 -45531115 -53576249 -71979259 -101167048 -81469924 -74761287 -52817725 -51345756 -59782492
5453 -59782492 -50661704 -73975038 -53171218 -40906598 -41174040 -47920805 -38818832 -65832946
5445 -65832946 -56373415 -50869263 -52327048 -31030286 -35035731 -41971468 -46594978 -60875835 -57109041
5436 -57109041 -49009800 -46535113 -50769639 -47882959 -45167939 -60790228 -50506968 -39707989
5428 -39707989 -62232885 -51097973 -42175179 -53846112 -44325883 -44453870 -37203502 -49285010 -48349234
5419 -48349234 -42211844 -39696109 -39852474 -51306494 -58601090 -56699273 -58185891 -45104048 -40716425
5410 -40716425 -37808919 -41374620 -43891896 -60751744 -62430284 -43232427 -47957246 -41478221 -33869297
5401 -33869297 -43443691 -51688671 -47861710 -56063398 -54569956 -42552689 -37259557 -59326052 -54599855
5392 -54599855 -47626297 -56109686 -45119249 -57171732 -46480092 -43049631 -41271078 -48512054
5384 -48512054 -54718183 -59550614 -48779296 -52695351 -55817545 -48697184 -39671915 -42968723 -38198489
5375 -38198489 -50512732 -46070519 -43453514 -56826607 -44968565 -38591629 -53903497 -40656723
5367 -40656723 -48910094 -38892490 -42636275 -56105349 -50476927 -35939164 -49763854 -54631212
5359 -54631212 -46309777 -51640259 -39708451 -51894927 -47900500 -50827438 -46112427 -56373555
5351 -56373555 -60485108 -46143540 -44500120 -46531801 -60624394 -45196691 -29130526 -50877580
5343 -50877580 -52395745 -42196005 -44216665 -41061988 -46036165 -45390362 -44781684 -45126024 -45563993
5334 -45563993 -52305070 -52843763 -46067610 -56284868 -54582672 -34907538 -45635060 -47406616 -48344452
5325 -48344452 -43005869 -50158897 -43535575 -44778666 -50725011 -48727100 -43637758 -57375196 -46510737
5316 -46510737 -51834007 -45680402 -43176304 -48228184 -43388736 -44260783 -47993085 -49903464 -50574399
5307 -50574399 -52500126 -54070543 -55391077 -54802300 -46080628 -46235260 -47341024 -58412208 -58643642
5298 -58643642 -52717553 -58084237 -45129752 -54689429 -59875484 -45988719 -42755790 -39654979
5290 -39654979 -53685249 -57223306 -57600271 -59994873 -57091181 -47112666 -47709856 -39741311 -59287545
5281 -59287545 -57577219 -34764056 -54301925 -43440212 -45708909 -56757403 -39842730 -46401642
5273 -46401642 -32576388 -39836222 -34966259 -35901843 -42857374 -51395671 -46303888 -40903572 -48061346
5264 -48061346 -47348611 -41018102 -48933915 -34659871 -38205466 -44406381 -50268445 -55603797 -46030882
5255 -46030882 -45331293 -41967247 -41348241 -56984746 -51020428 -51684727 -41725991 -33432234 -41287658
5246 -41287658 -47872277 -37293621 -18569287 -37679600 -41405777 -44257189 -48972088 -44939139
5238 -44939139 -48303154 -45954820 -45803672 -44710406 -42816577 -37586670 -34992173 -40118551 -29539775
5229 -29539775 -30389988 -42681129 -48399909 -44863092 -40202787 -35818881 -41470223 -48583487 -47062993
5220 -47062993 -49142292 -30170735 -49540983 -44660588 -39800395 -38565063 -41410281 -34038903
5212 -34038903 -44260391 -45492620 -37047136 -31300475 -32430517 -42905107 -39375565 -33212000 -32275661
5203 -32275661 -30462423 -38383189 -45065729 -36622661 -32516573 -48316582 -41838326 -44040251 -44159021
5194 -44159021 -46824706 -37798103 -32317884 -39841472 -33181193 -37344886 -39211672 -46270720 -40182865
5185 -40182865 -46418803 -42183577 -44078448 -41485521 -33858657 -39554266 -46518405 -39311138 -36920013
5176 -36920013 -32100095 -37915882 -44897696 -45492467 -40930922 -43795511 -49911820 -49576998 -34594933
5167 -34594933 -43993519 -35762488 -40916376 -45086985 -38426075 -51198425 -36731808 -39223730 -44000637
5158 -44000637 -33358650 -52416253 -51998667 -64770342 -50841955 -42633703 -48262655 -56653093
5150 -56653093 -46549024 -39969335 -50661794 -56613378 -59276621 -46882247 -45683376 -48859077
5142 -48859077 -43892212 -50804505 -29843442 -41141124 -46001010 -38220810 -46071178 -50005617
5134 -50005617 -37746367 -40202746 -41983123 -45086772 -57681416 -53883348 -56758167 -61995836 -57920884
5125 -57920884 -53157784 -45030734 -39113555 -46324508 -52174551 -44802802 -43167782 -48549251 -50982860
5116 -50982860 -39574708 -55195224 -51727358 -45830615 -51850789 -51503517 -39418412 -43282579 -49681776
5107 -49681776 -41542462 -35265746 -37796181 -49342008 -43622804 -40847482 -42498955 -33853721 -44404471
5098 -44404471 -46538838 -53001288 -51518303 -58614700 -57101630 -42981548 -53099459 -44242725
5090 -44242725 -56407752 -50271714 -38750231 -35833804 -53284819 -54181177 -62426238 -61295258 -54985964
5081 -54985964 -48207455 -55246384 -50163241 -49516867 -62709849 -40044883 -39544997 -45748979 -44469572
5072 -44469572 -51109389 -60273930 -61269560 -57825863 -48204719 -43536345 -43812129 -43195746 -46912669
5063 -46912669 -44770764 -43594205 -41412771 -34325626 -45422930 -51676235 -57689703 -48587481 -44353381
5054 -44353381 -58725849 -58580219 -51917279 -39962961 -45376429 -49997312 -48445321 -54176229 -40763890
5045 -40763890 -54261001 -56761820 -45431913 -49431653 -41180168 -49189272 -55891745 -66254765
5037 -66254765 -48789598 -43214159 -36372963 -55987523 -47068141 -45487615 -40532282 -49635634 -54227233
5028 -54227233 -49459206 -59622703 -69712497 -46010923 -58029167 -59324194 -56113846 -53649791
5020 -53649791 -40377123 -45907366 -56929047 -48003240 -47791462 -55068236 -47961771 -57634702 -46901007
5011 -46901007 -61794624 -46970508 -35081538 -40584819 -47941483 -49560866 -52632922 -45239495
5003 -45239495 -48364821 -39059125 -47305009 -48003442 -41441279 -44873593 -41752715 -33504424 -56035002
4994 -56035002 -44897242 -45794413 -48957387 -46352602 -47185200 -51547690 -51559110 -43517589 -56808524
4985 -56808524 -49675044 -49247886 -47183429 -41713447 -52922864 -48438022 -43058984 -47423927 -47241578
4976 -47241578 -51632079 -55432315 -49835179 -52201270 -54551561 -47769941 -51154847 -43682911 -49391858
4967 -49391858 -55793907 -53332463 -51360069 -38319296 -52067402 -47489081 -45422740 -42043581 -44145074
4958 -44145074 -50897624 -48208474 -39205971 -44396984 -54869998 -51070225 -57512374 -52557353 -64733655
4949 -64733655 -56302412 -44278652 -46059093 -54615847 -53422047 -47443617 -57055141 -52696139 -59647687
4940 -59647687 -52661079 -53597654 -62881891 -57901509 -61811947 -59919683 -69552662 -47065169 -38375317
4931 -38375317 -55382744 -50233772 -61246707 -46128270 -60086061 -44901706 -42710357 -51339272
4923 -51339272 -54289047 -45724227 -45574478 -55837051 -56254684 -40693495 -35410316 -42686764 -39558306
4914 -39558306 -40704636 -45943330 -53456528 -45416311 -51762523 -48964994 -48442569 -46543654 -39105318
4905 -39105318 -52857807 -45283200 -38040903 -41327353 -42147868 -53415856 -53394954 -44746804 -41590538
4896 -41590538 -42552360 -50278515 -48670052 -42031950 -44913238 -54364718 -44208464 -56181319 -52102662
4887 -52102662 -48413377 -59073506 -58666459 -59067478 -47988473 -56118673 -52216008 -54292222 -48735713
4878 -48735713 -32973707 -52142701 -48596369 -38153641 -43603918 -59507032 -53057436 -54436227
4870 -54436227 -53200195 -40583491 -52344632 -50850844 -58734887 -37114059 -48908301 -55459486
4862 -55459486 -59989535 -58878950 -55383050 -46478744 -40427534 -49848128 -47113985 -43441824 -41586145
4853 -41586145 -33459198 -38874197 -38134692 -53553411 -58598217 -47503930 -50251243 -58305827 -58553142
4844 -58553142 -55159390 -43627179 -45269629 -38810991 -60063183 -53162605 -42934640 -36978831
4836 -36978831 -48732680 -56305685 -50717900 -46114658 -43674647 -46621793 -50374857 -51570913 -53775486
4827 -53775486 -56043991 -52253614 -43671187 -44851416 -45989998 -44771843 -44154467 -47896780 -40884070
4818 -40884070 -48502690 -52626353 -54150786 -53317794 -49194599 -54516033 -44747202 -49350226 -37767408
4809 -37767408 -50626809 -49839472 -52935433 -51510138 -63109507 -53980299 -54247615 -55853080 -51571054
4800 -51571054 -38390080 -51339901 -46556826 -56224969 -49266234 -53043055 -47909095 -46800582
4792 -46800582 -58496313 -52668186 -52721850 -53783504 -52632721 -59517289 -68614102 -52026051 -51245962
4783 -51245962 -48451597 -54668457 -59076189 -49383723 -62288169 -54422957 -53709493 -50706224 -51124151
4774 -51124151 -35455555 -53120230 -60241895 -48464426 -66323850 -62088492 -59999106 -53331170
4766 -53331170 -57229121 -44845805 -43617886 -46043945 -47688999 -54158050 -57239125 -60425144 -46938796
4757 -46938796 -49938251 -45761130 -49587148 -51943732 -44736125 -36890370 -58493819 -50642281 -47465599
4748 -47465599 -62431922 -55481640 -48336183 -50912610 -40486697 -46191055 -58216889 -57943147
4740 -57943147 -45180736 -28507862 -53762149 -43458613 -55353843 -48835976 -46704220 -49322661
4732 -49322661 -42959163 -50890519 -58503512 -61844266 -52971820 -44075066 -37043951 -54356460 -65577276
4723 -65577276 -57467794 -45024967 -53803947 -53815087 -52137942 -55250070 -42157093 -58523203 -63876515
4714 -63876515 -51545511 -41070159 -51207036 -44817405 -45073553 -53493773 -47786008 -44781979 -47142098
4705 -47142098 -53350298 -50868593 -42561832 -51941687 -48730647 -46685840 -67259109 -59982203 -63174285
4696 -63174285 -69256640 -55853485 -53643236 -54007840 -49251369 -57941753 -44830348 -51239297 -49321418
4687 -49321418 -51356922 -45814965 -54369135 -48366999 -58174581 -40457442 -36334899 -39775634 -49194032
4678 -49194032 -58719115 -50526691 -56200105 -60791762 -46772986 -40619254 -51195158 -49937751 -45436758
4669 -45436758 -50338058 -54594703 -59153511 -45573856 -34299403 -47445560 -45160184 -55395699
4661 -55395699 -41731191 -52157606 -51924898 -42958397 -38456357 -47101170 -49421402 -52144467 -40992426
4652 -40992426 -40989954 -38510910 -52396221 -39309451 -45993799 -52016404 -45881646 -51616928 -54879482
4643 -54879482 -63010428 -45554144 -48860669 -52127503 -58597850 -51196082 -68032447 -47414366
4635 -47414366 -41638793 -46554946 -52332213 -39733483 -43896178 -41984026 -49100113 -53434615 -47700819
4626 -47700819 -56783858 -51329409 -58997026 -44786088 -48457318 -45897878 -48447934 -50176596 -48772695
4617 -48772695 -51636053 -45131517 -47598623 -49128761 -41418436 -63388778 -54896556 -45687995 -56598580
4608 -56598580 -41920735 -60600497 -42204692 -48866764 -56304602 -48379636 -44935448 -56016607
4600 -56016607 -53254672 -45869431 -44044907 -51543751 -42965737 -43230224 -42526615 -39572195 -53041188
4591 -53041188 -53648008 -50006406 -57815433 -50890673 -54182224 -54915733 -50963999 -62484467 -52872198
4582 -52872198 -52905448 -45885692 -43444642 -47013501 -47018237 -37923974 -39867975 -47688891 -52378966 -45401134
4572 -45401134 -56063748 -64581947 -66418376 -53286879 -43776732 -50491408 -49848027 -55306365 -47449646
4563 -47449646 -50136522 -49095961 -55463106 -68046382 -52399937 -39139777 -37034428 -34762581
4555 -34762581 -42503462 -38797396 -44121610 -49840069 -44261963 -38215237 -41988780 -32671440 -32518161
4546 -32518161 -46592337 -46336690 -45825690 -55040172 -52392461 -51014292 -49084909 -61928936 -41977729
4537 -41977729 -45794477 -52327148 -53730376 -56193271 -64130901 -44907668 -50061029 -60468342 -57868341
4528 -57868341 -42406666 -57967999 -58612298 -48216035 -49941675 -44358496 -54355894 -47442564 -51121603
4519 -51121603 -50347853 -46486190 -47784720 -46514381 -60836737 -56835891 -46185066 -49431193 -48270331
4510 -48270331 -43456788 -48614369 -63924209 -45627072 -49470993 -46696401 -40006384 -44383212 -47673268
4501 -47673268 -44411407 -28457379 -47150150 -38234785 -45244126 -47797870 -46022670 -52199527 -57467960
4492 -57467960 -51699471 -50204322 -52645578 -47624906 -37338702 -30156449 -42261492 -41007577 -50204170
4483 -50204170 -51081580 -38860876 -49488730 -43829486 -43979220 -49744334 -50838806 -52957714 -42911325
4474 -42911325 -42304492 -37590692 -40413869 -46795255 -46527944 -47039006 -46351641 -44847871 -46787118
4465 -46787118 -38985728 -35314065 -47843802 -54179497 -54276105 -46969367 -52354050 -59999713 -57308168
4456 -57308168 -58983356 -57447224 -45544517 -37858262 -33982738 -43322170 -47432283 -41448355 -59331837
4447 -59331837 -55413454 -41435828 -51462157 -59974365 -51064954 -47417518 -46858299 -44936809 -48935009
4438 -48935009 -49609944 -53924407 -50162209 -53205814 -43012491 -33547856 -34855083 -40027460 -41117210
4429 -41117210 -50435305 -56491629 -44934109 -43152528 -30737410 -48894308 -43572767 -53028625
4421 -53028625 -38964384 -32720004 -35045181 -36200861 -45237741 -41409444 -44295032 -43727713 -46653835
4412 -46653835 -49758548 -49496351 -39413087 -27362968 -31614700 -33164451 -42332026 -38841619 -31297956
4403 -31297956 -31799742 -32373075 -37081562 -33429721 -38050906 -33333837 -35423622 -30954250 -38720510
4394 -38720510 -24200860 -22510096 -21737578 -33620088 -35414063 -38682565 -39890384 -42148248 -29407084
4385 -29407084 -12176547 -16297543 -25621207 -34206397 -37359236 -31700752 -24493982 -28238733 -30512934
4376 -30512934 -26099418 -31451323 -34137179 -36673173 -66829602 -22368526 -19639974 -25128431 -31023356
4367 -31023356 -27200338 -18086208 -15945561 -25894743 -15235981 -9543312 -16281049 -27622297 -19877943
4358 -19877943 -29189362 -27168998 -11090237 -5837290 -14133082 -23196918 -19806190 -14002002 -15448192
4349 -15448192 336712 -8850477 -10904735 -12300248 -6099804 -2746883 -8049744 -17295408 -19268598
4340 -19268598 -6259929 -6353171 -64215 -11620658 -20387118 -24003048 -25652769 -16941029 -11108411
4331 -11108411 -18486180 -18650288 -4953056 -6573918 -9882971 4193584 203206 10154414 -4985882
4322 -4985882 -6448652 -2909516 -4530313 -2177006 -5586764 -2019473 -1344747 -2043626 -7680799
4313 -7680799 -8825051 -6275610 -7568658 -13838718 -6306722 5723461 -6155541 -5845066 782594
4304 782594 -362937 -2985521 -4764445 -5535815 -6624229 -12277270 -16555337 -12024415 -12658626
4295 -12658626 -4085837 -9234783 -7583387 -10829269 10300540 124366 -10581327 -14489235
4287 -14489235 -7887964 -15627206 -14723393 -12260696 -13853165 -13287794 -11514354 -24055905 -21951740
4278 -21951740 -16883295 -21837657 -7842663 -13246243 -21558795 -20348787 -23781162 -26379127 -24279212
4269 -24279212 -29161009 -37836600 -34422473 -22791251 -30938780 -24216721 -23705937 -20545101 -31402624
4260 -31402624 -25917446 -26014301 -26721508 -36219937 -42055494 -44515597 -43678644 -29310872 -37871456
4251 -37871456 -26577100 -34283711 -39960258 -30787762 -26715324 -33257069 -33138032 -33753880 -39409216
4242 -39409216 -30397009 -41000038 -37851084 -31628516 -36715030 -36248038 -40154643 -26442079 -29648864
4233 -29648864 -31990658 -38089983 -37552143 -42536570 -46463295 -40930786 -44762184 -54406603 -38483086
4224 -38483086 -51213353 -44374301 -42308309 -51173009 -51262971 -56420560 -40882408 -39018691 -45742923
4215 -45742923 -46850193 -47109595 -42702841 -45088202 -44851588 -33491663 -35081694 -38681620 -41406977
4206 -41406977 -38056178 -37092583 -36067904 -42554162 -47602499 -50825714 -53693871 -53191504 -36489048
4197 -36489048 -40994101 -47978781 -51787026 -38350115 -48154113 -40810906 -50861607 -42449514 -48076599
4188 -48076599 -39814993 -52839391 -44539129 -40224179 -50409653 -38538834 -38484128 -44456523 -43073946
4179 -43073946 -49184429 -53783653 -47934414 -44475410 -45441597 -54403825 -49956094 -46164690 -45173202
4170 -45173202 -44745875 -40724459 -51888319 -57470197 -43916802 -42983199 -47657933 -42156567 -35559637
4161 -35559637 -30880921 -42759617 -46760542 -44768878 -48247850 -63678499 -50585282 -39348591
4153 -39348591 -41688697 -46346293 -59196934 -49053799 -57240888 -44520400 -37810802 -39902567 -39890814
4144 -39890814 -37999145 -37858568 -39530761 -38876994 -36938210 -36499204 -33944221 -45610970 -46731480
4135 -46731480 -42038492 -43421921 -41102490 -49850165 -57506651 -48866881 -56302061 -62514795 -55560839
4126 -55560839 -47720308 -41283841 -36076765 -38031433 -32846837 -49663932 -56380501 -55224382 -49321276
4117 -49321276 -55738580 -55296852 -43557768 -38382845 -37979919 -39666402 -49518806 -52742074 -51563526
4108 -51563526 -42238541 -44071969 -45540299 -43969430 -54805446 -47320057 -50100844 -54249000 -50948206
4099 -50948206 -43843700 -50700622 -51745130 -43403722 -47613201 -46739603 -45057682 -48087635 -60078206
4090 -60078206 -49461861 -43029088 -49199145 -46211644 -47340463 -44443638 -40647770 -44088476 -33387957
4081 -33387957 -63970414 -26312515 -51273862 -56469516 -58494550 -48945793 -46584171 -45523983
4073 -45523983 -29814285 -29179307 -37056299 -47225771 -70346389 -33723485 -55844615 -44029876
4065 -44029876 -39182376 -46703453 -34468943 -36764350 -44591630 -42910078 -44658716 -42329985 -48985155
4056 -48985155 -51495220 -52140315 -46934056 -39852008 -44916677 -41914251 -48538927 -56902474 -47372552
4047 -47372552 -48521413 -37634158 -28325997 -39096396 -37233861 -45785813 -43537777 -45033149 -44364716
4038 -44364716 -48496185 -51312392 -49986741 -51651884 -38755535 -34204634 -44841455 -51997761 -49474454
4029 -49474454 -35037670 -51519743 -45764420 -47581469 -48515594 -49589458 -55204558 -61767343 -43201840
4020 -43201840 -49325333 -33933583 -43281834 -37542223 -48929915 -42790944 -39820194 -41701986
4012 -41701986 -59181349 -54587731 -51954989 -48997326 -34515651 -40835829 -53791829 -47754756
4004 -47754756 -39794947 -53214009 -41511826 -47470878 -46618756 -41923512 -54087821 -46489495 -42726105
3995 -42726105 -54305002 -36013355 -48350150 -42821841 -51182880 -46971561 -35859131 -40107716
3987 -40107716 -46258841 -29997377 -34566720 -40780735 -43495188 -54796078 -39133915 -32236247
3979 -32236247 -41271194 -51125936 -42377329 -40084953 -37967571 -32691939 -39082048 -44973523 -35147053
3970 -35147053 -42104527 -46468230 -38859420 -32152679 -39364525 -45779158 -48429574 -49380504 -40046810
3961 -40046810 -41436376 -35390213 -39163617 -51030658 -46037523 -52586977 -48994122 -40615081 -29885945
3952 -29885945 -31993755 -43536377 -43858360 -39987369 -43374412 -42179420 -31969127 -42580802 -46079587
3943 -46079587 -57347687 -48949637 -43943516 -40115780 -47544803 -44165063 -55726729 -57513593
3935 -57513593 -35381345 -51875229 -43315768 -33613960 -41491524 -44302467 -56366313 -50423132
3927 -50423132 -46313241 -46363117 -44607741 -53847646 -43800369 -34766187 -31841420 -35054025 -32627961
3918 -32627961 -33682130 -36784111 -31895716 -41660387 -49999412 -47381117 -48792026 -52815271 -44620766
3909 -44620766 -40642847 -49848996 -53452640 -42147237 -55419144 -51259247 -54421262 -51879856 -48149759
3900 -48149759 -45254282 -46553797 -36983810 -41918683 -55715175 -44648636 -36417737 -36392960 -40270959
3891 -40270959 -43591875 -40279398 -48117990 -42484433 -30559851 -31484050 -44960415 -38406131 -47718097
3882 -47718097 -52260015 -50879440 -50566925 -54170119 -52510650 -57340844 -39664824 -41370184 -46564232
3873 -46564232 -52437892 -42356956 -35568724 -40214586 -52304091 -50661520 -53776071 -54160612 -54332979
3864 -54332979 -57672344 -57024065 -42524858 -34519162 -43455125 -53737038 -43912997 -54578007 -48055143
3855 -48055143 -47473954 -44564450 -40177279 -46066557 -36946220 -52362443 -61597584 -56410228 -53723020
3846 -53723020 -64934850 -50011432 -52207147 -47789412 -48566929 -52664003 -38735788 -41031836 -43893085
3837 -43893085 -45445831 -40463762 -39538639 -50042765 -44407077 -47110013 -54693635 -38733838 -44018681
3828 -44018681 -44530820 -49880025 -49317744 -44979021 -47086300 -58816992 -41594553 -36134722 -49578188
3819 -49578188 -58091842 -48372251 -63010167 -44079871 -44717495 -48249668 -48041900 -36118321 -47084418
3810 -47084418 -47097124 -43753881 -48258843 -47437743 -59590624 -52870136 -44799287 -43929408 -48632761
3801 -48632761 -53187130 -43542587 -50788916 -49659765 -47369042 -39891568 -43120648 -41185481 -61805281
3792 -61805281 -35614446 -37908509 -38662708 -45437550 -36694510 -44805542 -40690167 -36459040 -45148502
3783 -45148502 -40832125 -36460926 -34251925 -51723270 -57804399 -47741998 -48906487 -47242761 -49259319
3774 -49259319 -51025393 -54252794 -44950111 -51732219 -51602191 -44905723 -42594543 -40761154 -45697879
3765 -45697879 -58238450 -55984024 -49439626 -49762246 -55578124 -45035518 -36252003 -45612818 -45581064
3756 -45581064 -47283055 -53351348 -43361789 -48344467 -49762711 -41081696 -45906000 -53778426 -45525038
3747 -45525038 -52273059 -46402045 -56318608 -48923066 -45634903 -46726534 -55169828 -59993761 -50981884
3738 -50981884 -41409136 -40318936 -50224336 -58860558 -53011243 -55037501 -50909578 -42899281 -43883309
3729 -43883309 -52750068 -40420437 -63086525 -58802118 -62230652 -57367244 -59902257 -54507415 -49624463
3720 -49624463 -51481709 -49689752 -26370708 -49182684 -53977987 -54790153 -49412595 -50064303 -50210345
3711 -50210345 -43644205 -48136280 -50388681 -36723082 -47864787 -51015684 -49038943 -48009457 -44985423
3702 -44985423 -50256076 -53104512 -45007654 -47964947 -54250825 -50223402 -54458243 -50233643 -51495692
3693 -51495692 -48639817 -53398707 -51629162 -53854663 -56456549 -53386543 -55156964 -53553617 -68332307
3684 -68332307 -68622842 -67735503 -59998836 -55669582 -49914419 -55396268 -54492831 -52334136 -55969467
3675 -55969467 -50623952 -46054824 -47600394 -53305833 -37441647 -35325668 -42329579 -54302381 -53129167
3666 -53129167 -51671363 -53330119 -49706902 -54437241 -53180719 -53191475 -43335104 -64105416 -58504205
3657 -58504205 -49673186 -49664742 -48855816 -49589131 -48695547 -39863264 -47941158 -52702340 -49372987 -58260934
3647 -58260934 -53204536 -50468924 -48026606 -45563302 -48141032 -44781965 -49434757 -56199438 -50738217
3638 -50738217 -60613530 -62135103 -52816897 -51232303 -46995902 -53959313 -55312106 -57310683 -51284297
3629 -51284297 -44430452 -48878252 -42286719 -47008411 -42687535 -47309572 -44501443 -44413695 -38946730
3620 -38946730 -54570840 -48093972 -59606795 -69332785 -63663071 -65330650 -66428763 -44512440
3612 -44512440 -55747293 -47337338 -38093514 -44998456 -54043224 -55286504 -49203905 -44012224 -44105620
3603 -44105620 -41760854 -46260930 -44816087 -55095280 -51996095 -53862610 -56018227 -56253537 -47889651
3594 -47889651 -52876627 -52847586 -61865068 -48614420 -46251054 -53705739 -51138041 -45725539 -45054640
3585 -45054640 -55652839 -56893402 -66063490 -54199050 -47255446 -48862504 -60271137 -55315267
3577 -55315267 -44969806 -51826067 -53301348 -43457714 -58209858 -54505644 -52349344 -49715995 -53909650
3568 -53909650 -49596332 -52862384 -53386380 -49228680 -49847322 -58634154 -48815117 -45853604 -50746734
3559 -50746734 -54475703 -44671141 -44246965 -45002171 -41898256 -48447369 -55756239 -59696185 -44138335
3550 -44138335 -51414742 -49131190 -56841243 -51896427 -58697717 -46020393 -48771983 -46789330 -49822666
3541 -49822666 -65630285 -46270904 -47643773 -42759415 -45080526 -47141236 -53531474 -58018921 -51924571
3532 -51924571 -44228008 -45761704 -40801765 -50077303 -44208503 -37523117 -44891315 -48079183 -56130365
3523 -56130365 -62334145 -65889328 -58601390 -57453104 -33827398 -45476793 -44301432 -44579011 -51043716
3514 -51043716 -38781056 -49996513 -60617935 -55385090 -53756112 -37316214 -37150129 -51389484
3506 -51389484 -52228192 -55897178 -67601247 -62000046 -52143657 -56162292 -33054346 -46081869
3498 -46081869 -56480399 -60149268 -54029898 -43158278 -48420156 -42597476 -41715297 -57868622
3490 -57868622 -47485105 -50443804 -50735016 -53827653 -61771795 -57651562 -54569309 -57426807 -48104700
3481 -48104700 -53177544 -39041367 -45256098 -52100206 -40143314 -48697040 -48420849 -51815484 -56374794
3472 -56374794 -64669099 -54200637 -56302295 -59821196 -41092633 -47260276 -49427138 -55404585
3464 -55404585 -75458849 -51301018 -44224904 -49964504 -53830987 -56608699 -57290989 -59303641 -49618999
3455 -49618999 -56806009 -59280017 -55346667 -52423987 -63499344 -60156857 -54129662 -55743417 -55963731
3446 -55963731 -50084683 -52731244 -55133880 -49948035 -43481220 -48494079 -52465265 -47930383 -57770069
3437 -57770069 -39164193 -44532424 -49258448 -42470027 -43025147 -48982367 -45248754 -34611056 -48033446
3428 -48033446 -57910821 -45577861 -44678454 -52301873 -52924531 -51610099 -48921418 -53614364 -46273064
3419 -46273064 -45820330 -39600578 -50665791 -50674117 -44077985 -54402823 -62920069 -53578292 -51331183
3410 -51331183 -67591032 -56257330 -45770263 -53144534 -50954795 -50714712 -46299877 -58659180
3402 -58659180 -61799685 -44375376 -55567929 -52949138 -68995057 -71835955 -64773265 -56363388
3394 -56363388 -52569999 -52570965 -65326607 -62668686 -46035140 -51973740 -42762224 -65473640 -79458010
3385 -79458010 -72128386 -57674036 -52619432 -36952839 -37591671 -36829294 -47547810 -60217238
3377 -60217238 -45602959 -50182941 -44199368 -38220498 -34199168 -53187905 -60334667 -47333104
3369 -47333104 -50706581 -48227563 -37141040 -57855894 -59570401 -59142795 -59668374 -54723576 -43737880
3360 -43737880 -45376497 -43096995 -42506559 -49557947 -54862252 -49193433 -51780539 -52820259 -49276307
3351 -49276307 -40761452 -48848910 -45305337 -47918455 -51234814 -39923490 -52821467 -56665311 -52982310
3342 -52982310 -51922155 -45326079 -42173127 -46031643 -49722159 -48554006 -47062948 -44246327 -51258445
3333 -51258445 -51247914 -62050067 -48734857 -58195739 -48058006 -44941931 -45008505 -54180634 -51192196
3324 -51192196 -50173007 -50384105 -49552829 -56690501 -52687197 -49550499 -50013957 -59560143 -51381273
3315 -51381273 -50058431 -45371071 -51861643 -44635301 -39617994 -53577189 -47907720 -50722315 -48103718
3306 -48103718 -47201562 -49200946 -64324630 -50595615 -53690280 -55712355 -60097031 -49677053 -48610012
3297 -48610012 -43411474 -41993719 -48925320 -46795107 -55967512 -54186921 -51700335 -37998423 -61954519
3288 -61954519 -48989766 -47694708 -56030320 -44292022 -60223856 -42336077 -59227400 -40596276
3280 -40596276 -37927203 -36082860 -53410928 -49674537 -43771376 -53577260 -58804055 -44760949 -43327418
3271 -43327418 -48282621 -41591761 -33801818 -38480107 -46009371 -44621653 -41716389 -50509301 -45292821
3262 -45292821 -45313272 -56551954 -52099643 -45491073 -51711947 -47836053 -47541319 -42701777 -46630171
3253 -46630171 -45988039 -53819692 -56084345 -51049966 -45021742 -35602258 -44871227 -34117712 -41878333
3244 -41878333 -53180315 -36858647 -41309112 -39200577 -53639352 -52549590 -50982322 -54063130
3236 -54063130 -63154735 -54321756 -49536534 -51049173 -44830195 -47768026 -45582024 -45150150 -46654440
3227 -46654440 -46079225 -48995712 -50776935 -51179738 -43383777 -37737624 -45633939 -37067306 -37303392
3218 -37303392 -48193470 -46504549 -55214348 -45627085 -58474836 -52951409 -49352531 -51235322
3210 -51235322 -62528691 -64994096 -54546244 -56752947 -53301174 -63680262 -48214970 -54417155
3202 -54417155 -52157242 -58671305 -62877602 -51798035 -55429769 -44510441 -58843231 -68774097
3194 -68774097 -62762945 -51513078 -42124912 -55353607 -54738432 -49370437 -41156254 -54129667 -52134787
3185 -52134787 -57643373 -41927542 -57563851 -57742809 -48905369 -52603822 -51941821 -48022929 -59765227
3176 -59765227 -57731032 -42702163 -50701428 -47361067 -50280192 -55606453 -55885812 -51247517 -50115881
3167 -50115881 -52955760 -46490345 -51851419 -58136283 -52329695 -37202802 -47391826 -59869393
3159 -59869393 -45172578 -51157033 -43498368 -57967910 -59251902 -65705076 -53453720 -60178654
3151 -60178654 -57484159 -38990648 -54109982 -51224548 -54442003 -54716471 -48432107 -56169154 -63102708
3142 -63102708 -53255429 -51742732 -46746811 -48822527 -50482727 -47823202 -45008839 -47388156 -45934674
3133 -45934674 -44320269 -37196091 -40474923 -37342433 -51938867 -44188190 -44260610 -35623375 -44551678
3124 -44551678 -43705054 -55152127 -63982064 -55894379 -42912090 -57700795 -47070260 -47421025 -45060674
3115 -45060674 -52280391 -54303346 -50709579 -55894413 -53266871 -48906478 -45433470 -54203169 -53516000
3106 -53516000 -49518059 -54046243 -57439239 -48144797 -35579970 -63010170 -51459230 -39092631
3098 -39092631 -50688438 -53914095 -57797959 -35892729 -37457112 -45098098 -42524333 -32511705
3090 -32511705 -56810737 -48476453 -48127240 -43868141 -47293660 -50825978 -44284144 -45547882 -59522720
3081 -59522720 -47383612 -52458302 -36623454 -41342364 -49012135 -61049315 -44221753 -51662939
3073 -51662939 -33415262 -41655234 -36604080 -51658577 -49228834 -58002667 -53306579 -39865626
3065 -39865626 -40983018 -35308002 -55852970 -49562291 -47978600 -43044578 -46253085 -44538954 -45591417
3056 -45591417 -42903463 -41448883 -53791213 -50527894 -49226687 -55790577 -46106982 -39036308 -36813645
3047 -36813645 -42252376 -37061492 -48311509 -51044152 -52105853 -49977449 -50394568 -43951837 -58183332
3038 -58183332 -52040260 -45508744 -47813295 -43603334 -51456715 -55985933 -61125350 -52939585 -55672530
3029 -55672530 -46592419 -41102222 -39494591 -47748538 -51330886 -50760194 -40414034 -44073891 -50019631
3020 -50019631 -44474123 -47199813 -44399863 -30593995 -44597474 -49323306 -43023701 -56803586
3012 -56803586 -46156372 -43498151 -50781483 -49039196 -49073080 -46457983 -50401608 -55472799 -57208868
3003 -57208868 -53260681 -50004437 -45348570 -57388319 -52546630 -51910275 -52036881 -35102589 -33159940
2994 -33159940 -40050316 -45897727 -54002046 -49778692 -40291099 -41600369 -51081648 -51604067 -55019332
2985 -55019332 -51550240 -54341396 -46152291 -42361878 -39930036 -46303446 -57209629 -56028862 -45107622
2976 -45107622 -46721109 -48019453 -44123484 -43637924 -37380506 -55457160 -53859388 -48121073 -32802391
2967 -32802391 -41205169 -60529930 -63651218 -48630536 -43382142 -49375412 -49707695 -52096653 -50187275
2958 -50187275 -45878572 -47395982 -47746941 -60636028 -53672593 -46895388 -40542641 -45806813 -42848253
2949 -42848253 -49978886 -50573873 -51205815 -50000579 -51243625 -48962061 -42188478 -54675813 -49426545
2940 -49426545 -50301697 -47644399 -50610415 -51557180 -51356326 -43090347 -36822989 -32213981 -34838816
2931 -34838816 -45687437 -51085984 -39357162 -33779378 -40100992 -41455926 -48023009 -53403976 -55722092
2922 -55722092 -42683551 -32367239 -49816138 -59738373 -52781192 -44865808 -41303306 -45229254
2914 -45229254 -42339377 -52813106 -44220082 -47644478 -53622961 -45512632 -45612415 -54985882 -44734223
2905 -44734223 -45343623 -58598833 -50209220 -47279217 -57185895 -43724691 -39914821 -34949298 -43682354
2896 -43682354 -43038942 -42551435 -35677093 -46945118 -50144626 -39192901 -37357711 -47699446 -28898156
2887 -28898156 -45884813 -50186352 -47027627 -47997580 -49231798 -50857928 -47613657 -48965410 -48981911
2878 -48981911 -47211573 -51714260 -50967359 -47863300 -50421417 -54551221 -39580759 -35377259 -44432958
2869 -44432958 -48805471 -51628677 -51133199 -52113578 -40012221 -41245103 -25568440 -26896175 -36998184
2860 -36998184 -37483586 -34238695 -25487313 -38907380 -41641218 -28199116 -38452350 -33944674 -39595398
2851 -39595398 -29515947 -29940492 -40523652 -45793987 -45375297 -40707847 -47020847 -41430664 -42837192
2842 -42837192 -38043582 -47454994 -42021689 -45206802 -50933319 -36457841 -42617859 -41572045 -49345329
2833 -49345329 -45848803 -38926824 -34402498 -33800160 -46968251 -32253017 -42965166 -40295732 -42872851
2824 -42872851 -32900499 -47554605 -41917356 -33696331 -35829651 -43283844 -41005651 -37791320 -45831730
2815 -45831730 -38683029 -39760819 -46149663 -42365253 -34385164 -49211929 -36972414 -50984958
2807 -50984958 -36513429 -36037227 -36370298 -42058598 -41132238 -37961619 -37706975 -39710443 -49336645
2798 -49336645 -39395715 -32996137 -29161295 -35849137 -29730911 -41587991 -42106886 -41541381 -38164842
2789 -38164842 -28065341 -29574306 -24966132 -30538585 -37986895 -38764508 -37215243 -36353328 -21398873
2780 -21398873 -31328564 -34315447 -27541658 -30631465 -30085119 -35460476 -38103322 -34773462 -26661885
2771 -26661885 -28317855 -33847262 -24512184 -34226799 -31080632 -43154362 -36437254 -31489908 -29144413
2762 -29144413 -27635194 -20323352 -24313442 -26217816 -27994639 -28290540 -22615816 -24802678 -22216188
2753 -22216188 -31413513 -29289441 -31218030 -34409710 -34273403 -20389386 -29203125 -23864546 -17732293
2744 -17732293 -34770167 -30168688 -29390769 -15272802 -21591563 -30184119 -15420858 -22292633 -23151972
2735 -23151972 -26162204 -22840877 -20996630 -18456812 -14263423 -17452308 -31302947 -38032067 -23172735
2726 -23172735 -21141338 -23639737 -21375024 -19886472 -25871697 -16499934 -22980116 -21187587 -11729738
2717 -11729738 -19198180 -22852443 -14026024 -17168893 -9782612 -24634222 -12921703 -2461843
2709 -2461843 -8135815 -9914083 -17098953 -18671893 -26877461 -23584146 -21138783 -15253114 -12515082
2700 -12515082 -19569300 -1586839 -31093486 -2224210 3441445 -13091640 -35634168 -22195317
2692 -22195317 -6100412 8939755 8420118 12176351 1929273 -612252 11136260 12553879
2684 12553879 6934931 1723825 -5535888 -1509362 11156542 3439705 2648873 2242462 2154880
2675 2154880 5267169 2197413 13495087 8432519 8842357 2236856 3569226 13706251 13090406
2666 13090406 21127411 11089552 5662910 -699193 5845302 14252563 5874628 7536150 -340896
2657 -340896 14322063 12839735 1901007 7856698 18531687 21213520 12603365 19338182 20616801
2648 20616801 17602953 28666200 24669515 29336889 23801358 31430143 41800938 39526110 48123133
2639 48123133 35019277 45055572 56636397 49673517 47079484 48074639 41395233 36023174 44076705
2630 44076705 47809983 58781126 55081365 55826307 56628726 54511551 64022838 50463453 50635144
2621 50635144 72226127 72152484 70722862 72825078 68960742 75911102 68932177 76649920 90400449
2612 90400449 84431054 87469070 90019587 89761861 95242511 101707649 102233452 109118349 126956687
2603 126956687 109391941 118816806 120612218 121554563 124786475 128143653 129702504 131608704 135730598
2594 135730598 135653313 143002477 146210002 150629646 151109804 159083841 157298671 158495111 157148794
2585 157148794 170484130 166813108 176229167 176441288 180052605 196633672 197242896 202808674 211961018
2576 211961018 200774895 192959598 199673635 204385950 203782065 205648384 217437315 223041370 229941830
2567 229941830 231582127 230782302 219275182 229144110 230608858 229983326 228961915 235898446 242227132
2558 242227132 243293963 242351025 239928848 238878693 229472987 221554171 230000151 239724670 250041572
2549 250041572 253061819 244261694 245271313 250057265 238735469 245684274 236704257 237247858 241507884
2540 241507884 244143998 241796288 244489231 244062738 234151475 246307653 243086416 247255853 247266605
2531 247266605 243136927 241785408 255986618 246966071 253313944 251833504 249281641 248819232 263030286
2522 263030286 259964279 272542003 260010642 263140684 261997685 271146067 267995029 269845388
2514 269845388 267289938 264816865 279635487 264714666 266213255 274517424 279026755 269387159
2506 269387159 279859427 270196868 274114973 278389334 276691982 267864461 265930366 270366838 273697977
2497 273697977 270134852 275492006 277366436 267871411 268477159 264172858 261962485 254732404 261415655
2488 261415655 263686602 252799708 252836292 247838620 245099456 241505881 238184276 232704357 238154674
2479 238154674 231743860 228408655 218065076 226519346 221846159 222237932 205323325 201519102
2471 201519102 188991420 186735904 197710178 194517717 200078728 188753788 191170787 184348271
2463 184348271 176149751 182868060 169138562 168505068 158623341 155800442 166584469 166800751 155867477
2454 155867477 150717819 149086336 152093961 130456044 133419507 133531414 126286498 122318924 128066233
2445 128066233 128981665 133548698 123969550 118773788 118043403 108207897 99901937 102023691 105436651
2436 105436651 119600671 114956300 114058090 107653237 97775526 98344331 108875250 104815399 102271365
2427 102271365 90008489 95719572 89639244 94229538 85164949 99155402 90743008 103053867
2419 103053867 102079430 90687958 89661460 84650767 79469989 95661095 88789488 87499716 85161320
2410 85161320 74833941 58170197 63946158 65844523 80045313 79739351 67812198 67976169 68921599
2401 68921599 72204984 57979677 68621296 70377261 55366972 68337667 75319653 75956132
2393 75956132 71516269 70706214 67214130 61207469 64652279 65141895 59753453 63048822 62799632
2384 62799632 61954138 66939032 65678090 63491748 61075542 70168242 62467581 65551959 66573493
2375 66573493 62201802 75824001 59961101 70431410 63866364 59699455 64800084 59873922 60725937
2366 60725937 61373634 64584964 68956388 65678745 67296216 47267122 59644877 65928611 67163702
2357 67163702 76428075 62932563 58022621 59182129 57362332 68600848 77572182 63225775
2349 63225775 70533621 77667011 72193826 68383518 73360223 75481301 78186320 83527125 82314664
2340 82314664 77564983 89390346 92437447 95278558 93270381 84123206 100428144 96984546 100104366
2331 100104366 102928531 105783856 96876106 95541633 91741263 109226251 113916250 95706687
2323 95706687 93787664 99887061 95338234 94476225 108427876 108603144 110384471 104955383 116805184
2314 116805184 117041682 128311067 132697583 140502347 152875461 136022325 133815728 140528010
2306 140528010 149524219 145013291 145322837 166692136 166379596 171027858 172352643 166796431 175038643
2297 175038643 174950632 187096121 188344476 189850570 195158855 200630849 211110220 212661209 222909279
2288 222909279 213053822 227110860 233715544 229663065 243421370 234234482 246415813 247066888
2280 247066888 251873303 261241177 258591932 274739543 287210337 285997517 298526578 307521966
2272 307521966 304017527 308411401 305725805 316862888 328104459 338627061 347389551 347021861
2264 347021861 353918827 364078601 380980161 392995639 375699982 368290765 374437768 377596793
2256 377596793 387727814 394093302 400971663 404835966 400266646 401463674 415847211 404495816
2248 404495816 413853266 421847306 418801996 432078410 430340222 426133111 422547138 431394958 428212037
2239 428212037 425624379 434185761 428718713 431287856 415813317 426979296 431925574 432154048 422328981
2230 422328981 413457789 404843976 407372484 403194312 390243796 383015077 382561406 377257797 380021655
2221 380021655 379572247 379074369 371970059 367739014 360663196 352133733 350916695 342866159 345967488
2212 345967488 324571138 334120674 326369819 331521680 325872007 310181408 303217452 308642932
2204 308642932 303318701 298696737 289058741 286267683 287256062 284530824 289432595 282121634 269223290
2195 269223290 279156617 268421078 265541133 248643022 256889885 257516249 248321925 248966997 244347301
2186 244347301 244749331 243849472 248860224 247569607 244635288 246835605 252239445 240807410 249337745
2177 249337745 251920773 242936317 240664970 234683409 238766223 233345628 237797897 236300862 247639016
2168 247639016 233213737 223784598 232372099 231170156 235747143 236912388 230811226 248573124
2160 248573124 246629698 237904039 244713374 249806374 242510381 257507210 262183373 264643121 267502447
2151 267502447 269891389 263984713 272768156 272795692 278435695 264673468 264377328 268719597 280001331
2142 280001331 276148165 279498008 284773517 290945559 287340177 284627297 306096363 300923994 304561504
2133 304561504 304730876 298837357 311191484 317214201 312165752 328534800 322815928 322045402 326831174
2124 326831174 330071169 330471304 334635770 342439426 343268656 349297559 350890944 350248182 354832027
2115 354832027 357740014 353293176 364404881 374817108 372854609 378542077 375833215 363033542
2107 363033542 364224111 370743006 377852977 370357110 373410041 382856638 385210273 389070997 385107250
2098 385107250 385252518 398056738 390670044 393335537 398802746 400166137 404980953 406920157 392793672
2089 392793672 394805078 404178241 389162729 406356051 398429817 407538682 405147480 412916147
2081 412916147 407473291 407187563 422530564 410931146 410493158 404124585 408984794 401835879 411481012
2072 411481012 407043861 407305651 415432740 421388383 413123639 408196661 414598156 412589930 413158386
2063 413158386 409823061 410046924 405941156 424631362 418604068 428354428 418195127 415180462 418111580
2054 418111580 416500170 411936053 416920363 427377793 431459106 431035907 424765966 422519417 430122137
2045 430122137 433702616 437093294 435279534 431846889 433980579 431860212 432797995 424985877 436042443
2036 436042443 439419594 419161284 435145089 446806964 440817359 447552833 442720489 439088917
2028 439088917 441426987 452872365 453672650 461518385 470041962 467544927 458535935 458875064 465285675
2019 465285675 467073376 454054775 454656244 471826305 466132166 453256299 447570652 453945539
2011 453945539 469194851 462640945 459873101 478700900 460740370 444351610 472578402 467994623
2003 467994623 437718187 441506073 446422141 457261077 456166646 474704399 459052981 445987197
1995 445987197 454011535 428389109 442293191 422840447 422148335 423353560 411830012 404289229
1987 404289229 403305041 402282089 397270162 407757004 403689575 411137258 402309011 401241460 403638624
1978 403638624 399187451 391936088 384268471 380382231 365829704 381510498 386842359 386527317 386964365
1969 386964365 386417789 381100654 376686496 385264856 371731941 372496105 387364941 373274271 381769321
1960 381769321 380047291 371304716 366658952 379383950 381971619 371613885 379205247 372535515
1952 372535515 385725948 386535319 381002949 385907074 379322391 374287084 377533560 371783771 376396219
1943 376396219 385288309 374246493 368648623 369097140 367760151 366590073 373408771 374957598 361821403
1934 361821403 367395850 366678100 357745726 355450501 343373933 345456059 348566080 344371112 335519522
1925 335519522 330489722 335061528 336262814 330713015 332388967 328427936 318437482 312226227 323074722
1916 323074722 312101227 306743147 314502391 317716192 317797745 304698296 304775845 298044144 300787131
1907 300787131 292899086 289688795 292680192 287735162 288542566 285436580 290843386 284235848 272019758
1898 272019758 276084784 269968256 275029673 273644794 280168227 280737118 268950118 267894368 264517956
1889 264517956 261841789 263596727 264554271 267048246 268659911 277334452 266449388 270830456 268151646
1880 268151646 276158065 268727367 276272902 282125138 283204746 279284657 278464527 276623057 278990879
1871 278990879 278739959 286427916 286266942 294306833 291197105 301438764 300175402 304369695 314380669
1862 314380669 305049708 310032740 304268553 307523680 318400407 310891283 324117806 321071026 320511785
1853 320511785 322863912 325438096 324997202 317731707 327152358 329815154 323602712 324252272 335009722
1844 335009722 341572290 339190784 345222955 341825933 340454675 348701336 345872607 348915374 348025538
1835 348025538 361307798 354479163 355696163 366637723 369965066 358131610 362790412 350921046
1827 350921046 356907667 376947133 386344134 375383755 372251363 369190630 382702781 379628761
1819 379628761 371736634 377712612 381008497 376591474 382806773 389924625 388376915 389028533 396939795
1810 396939795 395991736 403935643 402441902 397624213 398562887 401672002 401306044 405307801 396288317
1801 396288317 396361160 405312760 405077654 407920002 390514783 397671092 397275880 404169799 404521153
1792 404521153 407175277 408313570 399151457 395264030 386624663 379683045 370337780 387323801 389294617
1783 389294617 384823821 379579979 385181377 390644538 375223914 384780332 385716030 373088758
1775 373088758 362349684 368114849 366757942 367455418 358863961 355176038 353877424 346094922 342095972
1766 342095972 348223326 340547758 353027580 344701985 340641373 342456066 333901127 339260574 336893610
1757 336893610 322065604 323797677 331813022 336127570 324772457 313324716 309224605 293595247
1749 293595247 295619922 305603955 298716343 307997605 290270287 302140790 294432162 285889182
1741 285889182 272239853 276151113 278498434 280920289 276635277 272391313 266243020 256166099
1733 256166099 263276384 256262877 244507513 245466841 247202739 249085785 253921601 236261569 228306162
1724 228306162 228539938 225381586 222861417 229194467 231309873 223063082 225692319 217492253 206995262
1715 206995262 204020539 199353353 199988399 206316314 195256383 191365112 198822222 191762886 180776387
1706 180776387 178686260 184624031 182184294 180124438 173537201 182711870 168059766 165563605
1698 165563605 153766015 146268800 145356175 146656578 148730040 155286680 156441731 147521101 134398230
1689 134398230 147365793 133942602 123543827 135542357 128608498 148262514 142668988 139323391
1681 139323391 139373073 131675038 123721942 124329546 124847028 118629504 109710273 115571348 117116353
1672 117116353 115613822 119355910 123362098 120583647 111164346 112502177 113135923 103506357 98994583
1663 98994583 101283189 100794544 104113685 104794803 102839233 102442238 100582454 96545595 96730872
1654 96730872 113683621 112080584 95851350 105727428 111088465 99883899 89479947 98668787
1646 98668787 99765309 98721978 97624002 99001077 93048821 94883282 99730272 96202382 104987614
1637 104987614 105479693 95936667 95156057 84440391 92497643 80965310 97323060 99720985 94123950
1628 94123950 95976547 92081070 89443283 86420200 85113906 92528323 98090217 93329593 99847854
1619 99847854 100192693 102833486 91446791 93886806 97614237 96045527 89271613 114252587 117709132
1610 117709132 102464267 108944498 105060929 103774174 108487782 114589509 113264780 111120309 110717321
1601 110717321 109022732 108053532 117534238 110450678 114745161 121704332 123230726 122211168 105792485
1592 105792485 125501281 116723828 129782010 126803914 139270703 137895977 137922133 129928564 129151257
1583 129151257 138579111 136687068 138051654 139264498 142371908 145237353 162073449 151466085
1575 151466085 149655308 155919148 162089857 174269488 159148886 162875255 167794926 178465000
1567 178465000 178832872 184933900 185942240 179282881 183411190 194535024 182628573 187896325 195361475
1558 195361475 201012279 210234849 216891318 209414592 225833703 213206125 218882267 235145610
1550 235145610 228200149 235506387 246353126 254215628 251256502 250634020 261357309 264908844 272789174
1541 272789174 279289604 277185709 274687571 274748331 283314591 290987736 295539648 299826908 304934081
1532 304934081 305707843 307827206 320583749 332121570 335097608 338856091 339756064 341032060 350859143
1523 350859143 359043616 352794231 362183954 365379091 377196362 372405371 363705895 380064239 379874479
1514 379874479 374772044 391058376 386959415 413036696 408025729 410796179 403312977 407588823
1506 407588823 409365940 427141571 423623642 425869654 430953083 432762497 443087180 448478980
1498 448478980 440182793 446680005 450029909 445173611 446316613 461460463 473330070 462478197
1490 462478197 478561204 482501511 491152001 477850300 481377838 478965180 491545537 499059149
1482 499059149 492696154 494816791 500046839 504364339 521599060 524465196 521697717 533599900
1474 533599900 516424842 515527566 519463803 540685796 531011802 534844103 542824362 542124520 559903414
1465 559903414 551082402 553747850 555443818 551733675 561407085 557676742 567652129 569667449 573427264
1456 573427264 574874443 570926890 566448952 568345350 569621863 574169000 582149471 565424433 567695646
1447 567695646 558272897 557255998 557829936 550842825 551532766 551430899 559800938 557477285 534936788
1438 534936788 540910086 533876349 537554068 530276362 518782305 527453697 512398213 512096336 503387885
1429 503387885 506448067 510281823 504373084 501890395 500367344 502915448 497072039 489852715 495857753
1420 495857753 479870274 486516342 465487873 459773857 470582316 466622841 458019256 450768627
1412 450768627 456060051 447781790 445808666 430704666 438420915 441219457 432705851 430153235 426313381
1403 426313381 424827473 403482384 407793249 412373966 405566640 401306890 400537423 386832235 382961930
1394 382961930 385107594 380367454 369766866 369511813 363349743 371828113 372322361 372204238 360970937
1385 360970937 353196108 360683712 346028078 336255195 342105495 334176978 334347691 334950415 321361670
1376 321361670 320315038 321804442 312816123 321320258 298530785 316783151 308864758 295256029
1368 295256029 293996367 290730990 278949013 278720127 277083222 281893191 274628739 276118754 275140895
1359 275140895 279418215 259433205 268398228 266158766 262847710 255588036 253408321 249811838
1351 249811838 236372789 240142972 245849632 247065761 253117990 242169119 234661713 227489698
1343 227489698 237804262 224531014 214468761 213227128 209902071 209382707 218981272 232487222
1335 232487222 219075735 222065866 223122119 220525717 197396420 192639075 203229286 203997751
1327 203997751 191696508 190656531 192175094 196184873 193898877 189855888 195741657 186741867 183079722
1318 183079722 187773880 181355239 204981017 179417955 172378219 177089297 177912785 167900701
1310 167900701 156534991 167360642 179900694 185499315 174922264 168976045 165805312 154684149
1302 154684149 159158050 162107770 161946112 149319794 160853665 166891877 163680924 150083294 149515164
1293 149515164 139390668 147580127 150395165 143744783 147640846 149346654 151501978 153211215
1285 153211215 141969278 136479698 142760778 127785269 129187611 150154505 134255629 128870925
1277 128870925 127895353 118366892 140604568 129915070 131892488 136415308 132065052 131610403 125456208
1268 125456208 128672413 130118165 126842470 129074122 122003032 123846107 127539908 122102076 123024919
1259 123024919 112019926 119244358 122869263 119212898 127911499 134476348 115575442 105622233
1251 105622233 111930896 108177338 112469049 112025748 113496199 119309736 117096641 110309673 108347575
1242 108347575 118147926 111358680 119765404 118715277 133006402 124425954 114301543 115028578 124541888
1233 124541888 114257927 114869159 117461946 118513370 127987607 132075509 114208901 111690301
1225 111690301 121738687 115847587 115870144 124446588 117818016 113095252 117998639 127193634 132272713
1216 132272713 131277629 127546279 113863606 118373900 124322105 126149001 117987801 122078588 123759701
1207 123759701 122220746 117166972 123730829 130098898 130290292 135112650 134845823 134742757 127910507
1198 127910507 123200180 119867822 132404146 135139618 140383916 133309762 135534806 127312871 127778535
1189 127778535 132380365 136413833 143686521 147134034 146474873 149537970 134427362 140160286 138002610
1180 138002610 145599732 149562201 150912574 146414388 145761445 147166335 149863750 151574126 149498134
1171 149498134 152043621 157808169 166903169 164968815 166668484 159877932 160241525 172086898 171185193
1162 171185193 165520184 169109341 168138903 180375158 182237937 188700699 189584621 190143427 182518707
1153 182518707 180719769 196114264 196772548 205896160 201713358 197051709 212825942 212019074 216310637
1144 216310637 210855299 205464108 212591771 222779671 222657327 218828952 229838193 222105136
1136 222105136 233997195 232987525 234409962 238308024 238813316 242192331 254219185 245187338
1128 245187338 256732034 265992098 262744734 260430833 271284944 269528214 281277573 275254038
1120 275254038 282532517 286284859 282987042 284208747 297018470 309216265 310245988 300363471
1112 300363471 301968885 324978216 321475752 327913327 321903722 326509756 343099263 348339677
1104 348339677 341559138 356071680 365604314 368428633 372505362 373681388 371864652 386447090
1096 386447090 390531117 381414492 383000890 406472106 407633797 417365255 428186193 440300511
1088 440300511 450910193 458932550 454811511 448553619 464444262 481922493 487032019 496202477
1080 496202477 512742840 514702505 515564545 528983725 545386535 556996534 568091846 583336348
1072 583336348 589075053 597345616 610398737 631846960 636781690 644652101 650832217 664878017
1064 664878017 688935545 689336656 714389440 717170506 733414980 751365892 771279942 782231009
1056 782231009 809804584 824567027 838692235 860561558 881856142 894397482 912835328 927358446
1048 927358446 942427313 973511446 995259209 1010908473 1031704673 1052654213 1072953358 1099493021
1040 1099493021 1117566753 1144953380 1169593449 1203781892 1222771643 1242027621 1276554167
1033 1276554167 1301945524 1327297460 1352578149 1386792787 1401163257 1429361952 1451362639
1026 1451362639 1494069767 1519560095 1549385333 1578864426 1610400909 1631795768 1665645936
1019 1665645936 1692775959 1719562320 1732409279 1752800440 1785481368 1798277873 1828535456
1012 1828535456 1842994863 1859091414 1886090778 1899655697 1907341785 1921963757 1948472960 1950665711
1004 1950665711 1954129946 1971666877 1976563644 1988586810 1993293025 2016847038 2012003814 2009353211
996 2009353211 2019207198 2017408575 2027638525 2036575876 2035019186 2043873967 2045816084 2051516638 2050968488
987 2050968488 2048024111 2044145773 2052613781 2055203240 2061821874 2069656208 2077122583 2075342087 2074862850
978 2074862850 2065741022 2081503038 2088269905 2093155046 2092528443 2102475630 2098995363 2112465233
970 2112465233 2095696000 2111675979 2117722726 2131766169 2124493327 2129402131 2129726014 2128208937
962 2128208937 2130554289 2140877773 2132270858 2147483647 2143897904 2133318716 2124383959 2128834938
954 2128834938 2123273017 2131795502 2109591755 2086027846 2089731424 2086244353 2078197148 2051870911
946 2051870911 2029222272 2025820115 2003642419 1982193284 1982986545 1964443195 1949894546 1940432431
938 1940432431 1929034838 1918660863 1903769012 1877462391 1856026258 1855635039 1829565789 1817009879
930 1817009879 1810695778 1805482215 1786013911 1776070530 1776820901 1755564491 1761236630 1741489251
922 1741489251 1728867280 1728124955 1728269248 1716812478 1708736360 1704943832 1705550676 1700289819 1699046950
913 1699046950 1701537900 1706382290 1700173037 1703661678 1708408796 1714095800 1714618664 1724369938 1724570573
904 1724570573 1736856723 1749489135 1750313881 1757048103 1762051141 1781803497 1781998712 1803040877
896 1803040877 1807011038 1820153811 1827666984 1843157613 1847165731 1856065094 1865850434 1878261762
888 1878261762 1893843651 1891101660 1898531925 1891036057 1900802625 1910221265 1904569263 1918386089
880 1918386089 1931292767 1914552586 1910478311 1917451790 1911514390 1910419431 1912593154 1898126612
872 1898126612 1895646649 1884143367 1871716752 1856319370 1845563745 1826074988 1810008554 1801267795
864 1801267795 1774549279 1762192477 1716505797 1707866949 1683811212 1661918994 1634396601 1622237143
856 1622237143 1591313349 1561854510 1524551133 1522168221 1495463154 1419883454 1431498716 1407217555
848 1407217555 1378136858 1355611945 1324281011 1303613538 1266832502 1241252006 1217247810 1176767008
840 1176767008 1158410970 1136974680 1105908803 1088886420 1073930756 1052275317 1045796027 1016838219
832 1016838219 991053032 950879027 935126589 910553096 900906991 887547710 861825324 849055207
824 849055207 834882722 817100831 807483852 793138663 783001247 761085391 738442781 736987308
816 736987308 715031573 708683878 693005839 682513941 660273075 646645019 626088982 614646344
808 614646344 617914029 606857588 595319890 582597729 566666805 555749013 555873389 542583435
800 542583435 530059349 518835370 503284835 497257174 505128921 495143810 486598425 480931946
792 480931946 469144564 465377707 455382728 452542592 436870322 426205178 427100615 416026276
784 416026276 404866219 404159018 405500334 402924226 390390059 379544883 385367389 378001821
776 378001821 366490246 366899479 368218173 353912970 333320867 345043506 339060169 333496178
768 333496178 336801142 317386682 327179357 333344368 324222540 319734140 299165055 299352894 294526422
759 294526422 277456724 285275637 286593131 282320158 279093796 277555415 272244478 278500147 261985808
750 261985808 251992429 255437704 252166444 250015950 251419373 251455186 246250501 253024889 245870895
741 245870895 232825600 239007804 236163614 226911436 222481965 233084842 232111149 215319037 211218561
732 211218561 203585599 205120056 210434579 217152806 214631699 213615790 204931634 200635769 203151652
723 203151652 193866567 188347247 191716652 196714413 201624823 182354106 183685310 185249106 185461550
714 185461550 178896487 173179501 173225690 179740797 186986510 169539701 148951581 163856444 163650784
705 163650784 153600139 150581279 159027791 163296757 150823235 156018779 158706898 151302561 143176814
696 143176814 155721911 142774394 141939753 133985561 145811948 148718625 149689539 146397025 156698765
687 156698765 156134567 154373165 145215900 139076677 140909054 149237424 145102242 130561093 133131719
678 133131719 125937118 125096853 124332600 125933020 130368295 120760564 127711056 124804948 125051251
669 125051251 120351766 120046949 120077210 122188346 117291210 120814024 116055152 115166631 101458500
660 101458500 116783775 112598792 109286861 109056382 97561864 99707889 110392611 110998467 104827097
651 104827097 101090399 96532593 103448622 97917704 116881731 103771937 90729683 92127890 92860888
642 92860888 105080574 93214742 92321371 99669167 101048399 94940513 88448568 100993267 84416247
633 84416247 76323361 82550323 84884963 80803967 86031161 72980011 93494939 79381018 88911031
624 88911031 89786555 74723957 75807199 84456885 87469494 74579778 60688481 87462699 82769527
615 82769527 84470608 88224310 81365326 67626544 68454957 72020873 75066745 71048955 71315225
606 71315225 74634927 74372678 63407995 61190846 53058904 52942784 55532071 59421827 72998930
597 72998930 68086704 62807632 59396291 53899763 56276701 58618765 64321496 60563046 54480790
588 54480790 45090266 63385032 66121157 62508929 50450936 59781907 51596948 63639411
580 63639411 50643382 62360427 52339619 57515963 40833199 56350618 49249228 47845047
572 47845047 51292281 57412693 56069798 56986224 49980832 47375383 46441339 49381048 54884651
563 54884651 48424345 53889314 46969673 39232787 45019632 46962791 35159492 45077913 44143894
554 44143894 27534441 29057226 39376314 27665439 32338461 38544472 33115738 38191179 40203081
545 40203081 40613395 37362520 40346394 33744153 29170060 32857356 40607287 36241196 43517252
536 43517252 38175186 27702125 39290377 40434911 34708709 32854936 40423218 40808809 38686400
527 38686400 21603162 29735869 47804736 37512087 34385970 34556362 30238733 26189630 22568920
518 22568920 31984015 32520403 39106580 31110995 34013719 31879454 15709715 28792780 30887261
509 30887261 20500110 32736298 37886095 38808999 32436079 10526653 30747517 29307290 23635805
500 23635805 28724908 33481606 23832264 31397403 44393908 22363661 25199778 24968897 22505304
491 22505304 15874527 14539905 24078718 10269693 14473776 12562466 12768960 20791420 12026896
482 12026896 21140476 31384218 30779367 22700096 19396213 21084816 15984091 4310037 10772978
473 10772978 11467832 13556303 22169182 9751679 11909647 26254824 24926885 17048028 3904371
464 3904371 -1111544 13487238 20263833 22257561 17898985 14469686 18064872 17356401 13276154
455 13276154 13144644 12174021 20204612 15969196 27538510 18107412 2955776 29902295 22015544
446 22015544 12638494 14226376 6599238 10303996 4998706 9955534 17904854 -819670 12137557
437 12137557 20692145 -2517039 9759242 15319322 9812843 19077032 20662656 21020216 2854325
428 2854325 7261674 12769100 11011490 9590735 1023132 9579806 11958783 15128255 6206118
419 6206118 12009524 -3015934 1764409 -888218 2623092 15185784 14956239 13974794 7551938
410 7551938 6972141 20324807 3348117 -4689249 6453753 -4289659 2446442 2407732 -10495588
401 -10495588 -6792807 4446046 653707 3852393 7695059 -6903724 14467826 9491025
393 9491025 -7807180 -6377023 -582690 8780839 -260853 17218 8081870 3938036 15607088
384 15607088 13632192 15656278 7643402 6651506 3733246 -7286635 -10334253 6497185 15429203
375 15429203 11614059 4345446 5271766 2367710 -17780971 -7783176 -10144880 198107 -18978416
366 -18978416 -1213566 -3638143 2105981 1404397 -7770822 -11020329 5759440 -2497570 -630554
357 -630554 9762943 5228824 13296692 1244429 -7076321 649442 14209976 7411207 -9801032
348 -9801032 -2802077 -8490820 -4632765 -5636284 -9570761 -4276559 -7840496 -6930792 -767438
339 -767438 4803038 9651027 2598814 3496399 4256907 821364 548424 -13693866 4040722
330 4040722 14534979 796427 -15482771 -5871459 -12253245 -9130304 -17014663 -13880460 -10272415
321 -10272415 -5934752 -7519472 -2165730 2323147 -3163620 9053003 2080661 8211143 8971320
312 8971320 812181 7668982 -2855993 -11819879 -7688554 -8373734 -892680 -9537562 -5284271
303 -5284271 1518483 1878161 -4293281 -8249056 -4774207 -12723866 -8997741 -2983024 706567
294 706567 -17677680 -4310483 -15289759 -12477231 -16451324 -15400685 -650950 -9759410 -21657528
285 -21657528 -15527090 -22047845 -7044184 -22570582 -20028890 -12698458 -15854667 -10301642 -21390900
276 -21390900 -1328486 -1585191 -7554814 -16909486 -9460398 -5820607 -7093904 -12401211 -9892838
267 -9892838 -8250215 -4508680 -3349028 -15053684 -12440629 -14982360 -1016379 -7421821 -14917470
258 -14917470 -8796640 -14945406 -1063426 -17230887 -5891837 -13417399 -8369044 -10626197 -13264171
249 -13264171 161927 -12334392 -10927573 -1115307 718645 -12221179 -11532680 -2165066 -8022957
240 -8022957 1722438 -17329461 -13331780 1317025 1262308 -9609170 -22194395 -16217222 -12442964
231 -12442964 -21799293 -31610746 -40932380 -18662994 -19983347 -31073452 -20886522 -15272933 -13576810
222 -13576810 -2994862 -8342666 -22866223 -19264011 -10696201 -24458192 -17724969 -17181613 -17219237
213 -17219237 -15925274 -6453582 -5839661 -23271584 1719596 -18450609 -18120789 -17222903 -11799149
204 -11799149 -14708865 -17440076 -25525525 -10016586 -9035230 -14665089 -20686183 -17821278 -21338627
195 -21338627 -19482029 -28829109 -1777257 -19189334 638651 -12865515 -17573229 -8791360
187 -8791360 -14104953 -20134004 -17924082 -21385436 -26524200 -21224843 -12245578 -26003123 -23754251
178 -23754251 -14125707 -21250404 -18521783 -14983917 -20435198 -12872658 -7792693 -11017296 -18204996
169 -18204996 -13548921 -17613006 -18536769 -23293529 -24368922 -18328499 -21526855 -31753902 -24890512
160 -24890512 -23801009 -18156022 -17798947 -14198482 -9455399 -12150588 -23775435 -16994888 -12198385
151 -12198385 -14128909 -14882700 -16302447 -23608462 -30360133 -23193714 -26433930 -28430223 -19430373
142 -19430373 -8678901 -12784443 -19743276 -5922941 -8848373 -13868124 -25425618 -24101459 -14419943
133 -14419943 -10040321 -18228403 -21940446 -6497168 -15858209 -18560709 -21799964 -21744272 -23063844
124 -23063844 -10166142 -13329802 -20992571 -26553075 -20887372 -12086954 -12353473 -10574852 -11838444
115 -11838444 -19412190 -20324364 -20930715 -24136606 -31528704 -23005710 -26508159 -16376210 -29323848
106 -29323848 -17571576 -13698795 -17312138 -15167968 -457405 -7672132 -21371373 -13400234 -14350422
97 -14350422 -22740308 -27671637 -22308442 -32118131 -27771327 -16972288 -32259902 -26995171 -21196881
88 -21196881 -18594640 -16298809 -29834158 -19215870 -12892946 -8291272 -17851021 -24937904 -26880598
79 -26880598 -17423986 -31849497 -28982399 -24447231 -26177200 -17276142 -12443566 -15879872 -12992686
70 -12992686 -3503675 -6198088 -20281554 -25406304 -35225320 -26294542 -22901558 -18872952 -11539070
61 -11539070 -22944435 -22840424 -22981451 -26728823 -29359948 -33025705 -28537440 -27734870 -33474024
52 -33474024 -19891871 -16808896 -22016905 -18941738 -26672335 -29112477 -33622665 -21786691 -21498804
43 -21498804 -17026572 -13138323 -10580010 -717762 -6086040 -9404199 -7230331 -9783559 -18677648
34 -18677648 -11987321 -4389496 -11862702 -32775028 -25126330 -21137200 -17032288 -16355134 -14267233
25 -14267233 -20930116 -29858218 -35134259 -23539115 -25817974 -31763391 -31466891 -20766400 -20277421
16 -20277421 -30244508 -18726709 -19255384 -17558110 -18334954 -24049757 -21223484 -22211555 -21403780 -19295047
6 -19295047 -25528322 -22120610 -19560924 -30092465 -30712190 -33345178 -32559512 -22884587 -19356405
-3 -19356405 -27296037 -19613070 -15998055 -20035841 -24417845 -21714788 -33141681 -30186098 -28316236
-12 -28316236 -24537445 -33218581 -22344407 -31223829 -29156199 -22350391 -13470816 -12869665 -17053186
-21 -17053186 -19779299 -17732516 -25250407 -22917629 -6694426 -21567850 -22350347 -23604520 -17956475
-30 -17956475 -18854063 -9026239 -15733143 -21171631 -23392856 -23202309 -22983735 -16781748 -23504420
-39 -23504420 -20291056 -28545479 -30259491 -21842624 -18562442 -20613764 -15303859 -14357488 -3145323
-48 -3145323 -9788668 -11326705 -19662639 -24603797 -17955217 -13099372 -22225944 -15562101 -12387402
-57 -12387402 -21351467 -30551761 -20723381 -28227911 -25144015 -27454728 -21899681 -25309192 -11305942
-66 -11305942 -33856864 -25356425 -19934799 -30517199 -31107547 -36017857 -29939697 -21128271 -25113690
-75 -25113690 -25415643 -15644875 -2277172 -13447065 -16864039 -22008552 -13235016 -26021876 -26495922
-84 -26495922 -26064873 -20549932 -37585680 -22691686 -25376284 -27262487 -41952447 -28998430 -38791615
-93 -38791615 -38506296 -26296585 -28381109 -38695626 -28404013 -34596710 -29337398 -27975253 -24521443
-102 -24521443 -26481572 -19946503 -37056842 -39455485 -27721478 -32726212 -21345627 -42865879
-110 -42865879 -34755055 -36301801 -30952221 -31248474 -28959148 -35399796 -17685425 -30905094 -29936857
-119 -29936857 -31132124 -19132795 -27123892 -26643182 -27775025 -38661333 -21714591 -19272142 -18687534
-128 -18687534 -30092661 -33324942 -32537639 -35198535 -40137825 -34029568 -41834927 -35390962 -28870413
-137 -28870413 -30118753 -27317042 -38781425 -37829460 -33033865 -28678029 -26899058 -34723650 -31502646
-146 -31502646 -35814368 -24653330 -39561919 -41849452 -23505830 -24391540 -23157093 -31970518 -22025216
-155 -22025216 -28990808 -35819085 -28037504 -23172040 -33653592 -34965735 -41367291 -25764081 -28000382
-164 -28000382 -19553470 -25923135 -33677053 -42773127 -30718670 -32930886 -19724034 -27668181 -35596671
-173 -35596671 -30587610 -35989334 -24126785 -26052874 -38103487 -35933649 -39749605 -36789363 -33210156
-182 -33210156 -29415231 -26827260 -28264803 -16574235 -22059317 -27426476 -26650575 -20598017 -16995334
-191 -16995334 -23178839 -28764406 -27376946 -31690520 -33493940 -22553121 -20686903 -17511048 -8420601
-200 -8420601 -21726667 -24250304 -28711320 -31791183 -31702390 -33279103 -33430393 -30186210 -29621752
-209 -29621752 -18761445 -26265565 -41095230 -38951903 -36521236 -23917599 -25135770 -25526894 -30152655
-218 -30152655 -26367198 -35143013 -30291595 -20603369 -32470151 -27649063 -28955881 -35547152 -42698193
-227 -42698193 -24489695 -32515917 -36446716 -32770215 -32226958 -27509656 -20279183 -31304755 -35182397
-236 -35182397 -38683010 -28604898 -34295608 -54504951 -50725108 -44806856 -30960971 -35774788
-244 -35774788 -28899268 -38237891 -33745543 -30126238 -28830465 -33129258 -20101192 -37964790
-252 -37964790 -25032714 -23503852 -32065370 -34034460 -27175384 -23914929 -29053862 -40599234
-260 -40599234 -27691321 -31891795 -39444515 -39284805 -38807067 -30768813 -16729689 -22656620 -29010420
-269 -29010420 -34980388 -25766172 -27486732 -27805205 -32866204 -28684610 -25157745 -21237641 -30719688
-278 -30719688 -41630768 -39955096 -31603826 -37519868 -28245734 -22122265 -20708659 -34124693 -36097862
-287 -36097862 -38109876 -38208088 -26142923 -41881237 -35346223 -36030298 -39174853 -39076228 -38767434
-296 -38767434 -40433118 -29850274 -37807531 -34861037 -38637619 -27400032 -31553416 -29169075 -24415572
-305 -24415572 -30944934 -24198848 -36082829 -29396491 -15462892 -30953053 -22866599 -32636559 -33123034
-314 -33123034 -25226070 -36142255 -38044157 -45464572 -39180997 -40846097 -34104623 -37669544 -21361656
-323 -21361656 -23179106 -32804723 -31862790 -47873237 -40588114 -29446519 -34216883 -37311770 -35056023
-332 -35056023 -28750353 -29156064 -25866336 -28466043 -37346979 -43402875 -36948786 -41022616 -34032735
-341 -34032735 -29715019 -34723663 -42541349 -36459590 -33611722 -34567813 -25341190 -13249233 -20807098
-350 -20807098 -30148099 -34222532 -37696146 -30709243 -22222070 -28857294 -33360094 -31844042 -27659368
-359 -27659368 -26644832 -29324371 -25134013 -28058651 -39151407 -40703169 -32699141 -41078347 -30818236
-368 -30818236 -23063137 -28080881 -32385001 -40972154 -46324393 -25076669 -42654603 -40280873 -38647990
-377 -38647990 -43937261 -45247791 -35861348 -29001748 -40865509 -37627646 -36224094 -39681259 -34300439
-386 -34300439 -26694298 -34688627 -38652406 -32391276 -26597407 -33187526 -34246903 -30962497 -28139656
-395 -28139656 -35663371 -37161170 -40602623 -34914283 -30774613 -37263766 -39723618 -41862993 -36022639
-404 -36022639 -45201373 -40137030 -35473961 -33875554 -27361491 -34518525 -31994020 -31529656 -36648680
-413 -36648680 -31131742 -26160703 -24683770 -35410815 -36770711 -35553214 -33043373 -45555487 -45526455
-422 -45526455 -45329091 -32200108 -25701722 -27495027 -29201853 -40781596 -30347656 -38619396 -39431415
-431 -39431415 -24787033 -25560633 -28229172 -24996613 -32496837 -41239808 -30864445 -37235473 -26728459
-440 -26728459 -28923586 -17396814 -16487328 -32576597 -40635827 -31668793 -28793295 -34600882 -45299570
-449 -45299570 -34000799 -44060791 -32159150 -40064664 -51139321 -46754989 -47896389 -47184423
-457 -47184423 -44961526 -50062864 -38899691 -34733255 -32259307 -25795864 -30044423 -34310317 -37557620
-466 -37557620 -37541520 -36562510 -36461902 -27815055 -33003047 -35599276 -24101064 -25609546 -29552946
-475 -29552946 -41324726 -36871532 -35304128 -36572766 -39242913 -31303114 -34935106 -29288675 -29651994
-484 -29651994 -28379321 -35621445 -37379418 -45040266 -53725198 -37850061 -40053322 -51650464 -42671972
-493 -42671972 -28287121 -31229525 -22017399 -39420433 -32728524 -44711081 -38950556 -31670836
-501 -31670836 -40550039 -34670180 -33773092 -48775401 -35335792 -32490288 -36180449 -32328860 -32647804
-510 -32647804 -36680506 -37877266 -34967462 -19517296 -26828339 -44730528 -31333018 -38226830
-518 -38226830 -33207702 -36960624 -33749419 -36257453 -23000985 -40946420 -49631689 -41530307 -37080625
-527 -37080625 -37985235 -29350063 -37921896 -40214290 -46006909 -30573802 -37708908 -31999946 -34842552
-536 -34842552 -37274807 -25105385 -21172762 -19528538 -35320351 -32837661 -42971949 -50753649
-544 -50753649 -39008276 -32722891 -41187841 -34765142 -25124636 -42791817 -30222555 -27559804
-552 -27559804 -35373542 -28562426 -29561649 -39950648 -44896419 -40015622 -44805715 -29129730 -29642253
-561 -29642253 -42813154 -32106365 -39193337 -42634686 -49774057 -43310068 -37868546 -43881675 -40624705
-570 -40624705 -31016260 -28884085 -33596374 -26275882 -27078345 -23111898 -24429157 -29713224 -47373554
-579 -47373554 -31682913 -29890876 -37382272 -31150524 -32955615 -42094456 -45308693 -37105516 -37406464
-588 -37406464 -33975860 -37444226 -37112932 -29577348 -34826694 -39005889 -37906046 -46503442 -39449993
-597 -39449993 -40398023 -47693951 -35043511 -27781456 -37934577 -30206324 -39911284 -30284320 -29022958
-606 -29022958 -38409416 -39434566 -37615775 -38510430 -29488634 -32567264 -44505623 -43795318 -45226081
-615 -45226081 -39105949 -44333798 -26993317 -50081060 -44785508 -45696259 -43629434 -42242086 -33422566
-624 -33422566 -41584848 -30385751 -36247439 -34975861 -27494464 -30414022 -35732365 -39323479 -38819973
-633 -38819973 -33435493 -35840167 -42821471 -37849523 -36092219 -30248944 -30797128 -44681930 -23620001
-642 -23620001 -34580853 -28546267 -36978462 -40517886 -33626072 -40672001 -31518467 -39427547 -33573066
-651 -33573066 -32947393 -36579362 -39765839 -46726904 -53135536 -43852247 -38815744 -34362375 -38240289
-660 -38240289 -23467615 -31159052 -33488593 -39404388 -53264486 -33521490 -36164787 -31150404
-668 -31150404 -35607263 -39195604 -45597185 -56871188 -45424632 -31004172 -39465101 -41067468
-676 -41067468 -33199543 -37298146 -35058518 -32286821 -33329609 -24538253 -30258697 -34207314 -31101644
-685 -31101644 -27928883 -35351538 -40839164 -42006742 -35850887 -28363498 -34652123 -31661355 -29477579
-694 -29477579 -34297230 -29248951 -40378642 -28604556 -37416539 -37448839 -33130836 -22752881 -21853873
-703 -21853873 -36201938 -44437659 -44505905 -43612310 -35899836 -40192195 -52093246 -38303628 -30377023
-712 -30377023 -16512179 -47426924 -41453309 -52067622 -38426851 -34323137 -46928692 -43689021
-720 -43689021 -36788867 -29518613 -27489681 -33432375 -34778284 -38772282 -47047918 -35072828 -26248679
-729 -26248679 -30006964 -31481980 -31998137 -24495873 -41014320 -48528847 -34458094 -40331010 -38217109
-738 -38217109 -55609291 -37491401 -37732131 -50163982 -50916610 -46296744 -59159087 -39301492 -39696580
-747 -39696580 -46127851 -29953337 -46967726 -37584520 -30638409 -35633616 -30159045 -43459464
-755 -43459464 -36669209 -32710089 -39237074 -54848352 -34659143 -37558393 -33222856 -35900092 -34998111
-764 -34998111 -20889276 -43607145 -37647642 -25068737 -33870595 -30942434 -23752114 -28511632
-772 -28511632 -43859129 -43345884 -33394839 -41099153 -41132855 -45193942 -38287781 -50345289 -33773910
-781 -33773910 -28452223 -42961223 -42268074 -40887460 -38813391 -39988221 -34939858 -37031329 -40126140
-790 -40126140 -43020748 -47255858 -41793459 -45624514 -41120717 -43441896 -52365451 -44916454 -38112836
-799 -38112836 -46412216 -42372611 -33134264 -44088703 -33779298 -42680042 -37786790 -27998441 -26250267
-808 -26250267 -30163011 -31381967 -35958340 -32950823 -30045711 -30182125 -34835023 -36056356 -39010675
-817 -39010675 -50299861 -40926222 -43990540 -48611655 -38355414 -44044069 -47370357 -44767501
-825 -44767501 -32628725 -37025482 -37391971 -47398174 -38038113 -46879787 -48454888 -44910936 -25314421
-834 -25314421 -29378832 -33375167 -31778397 -34693170 -35739400 -27121108 -41008123 -44748640 -43243756
-843 -43243756 -28263748 -37393768 -41333478 -40943680 -36404993 -37992154 -44155643 -45017010 -41746773
-852 -41746773 -34364186 -36967467 -40206441 -48941410 -46943556 -33888317 -34187737 -35996075 -36222051
-861 -36222051 -36593926 -42315699 -39089425 -41308369 -49183529 -45457820 -33225816 -40275606 -33741200
-870 -33741200 -46370563 -37753465 -54268815 -44535305 -37297515 -34251251 -36567627 -37098397 -34524642
-879 -34524642 -40782460 -44729147 -57103935 -37259511 -42733106 -38943954 -37584452 -31004033
-887 -31004033 -48821933 -44138539 -44875525 -40014319 -44620123 -53458122 -44007340 -53096048 -44065529
-896 -44065529 -37862448 -35882353 -34946675 -32397082 -44806285 -32904377 -35611661 -39505605 -32205330
-905 -32205330 -36245869 -40309044 -32718331 -34942079 -39186995 -40297641 -36993186 -28819333 -47117255
-914 -47117255 -36414585 -31020530 -43345723 -49015122 -40680250 -47027594 -44530789 -32356900 -33077666
-923 -33077666 -42178197 -38557536 -40701210 -42482321 -38127935 -33575372 -41306454 -39436449 -52869254
-932 -52869254 -47686552 -50544128 -44500911 -38843059 -47860345 -31835394 -44355206 -32186835
-940 -32186835 -29934297 -31372088 -27708232 -35051251 -44428066 -39878617 -35506298 -37485552 -33149127
-949 -33149127 -25579951 -38343364 -39821187 -39063311 -43902900 -34478491 -31526174 -44256302 -37397264
-958 -37397264 -46870033 -41486417 -41293196 -43829071 -42925033 -49751916 -31351778 -33638304 -41657225
-967 -41657225 -47350901 -53105762 -55590814 -53642581 -38792790 -42403854 -45727248 -34850878
-975 -34850878 -45934490 -54411056 -49757735 -44256333 -35859358 -46100606 -37313602 -44021471 -49566030
-984 -49566030 -43454120 -45535054 -36321802 -39791932 -35262486 -41445124 -38692647 -40251098 -37401356
-993 -37401356 -44864082 -50293206 -50014682 -33043465 -25396301 -35169134 -37112016 -46546324 -50299202
-1002 -50299202 -47006240 -41792189 -34868656 -47085335 -41407169 -43862005 -36704304 -46466605
-1010 -46466605 -30752613 -37597293 -30639714 -30066732 -29224374 -42846672 -41835601 -46813097 -38103098
-1019 -38103098 -26012578 -46208777 -48116119 -35014297 -28918895 -18177712 -38398166 -44601053
-1027 -44601053 -42998089 -51894393 -44560496 -41161478 -36612186 -41121336 -33201159 -43171060 -56515337
-1036 -56515337 -43349259 -52140907 -49675701 -52663555 -48713896 -45248545 -34634267 -33945504
-1044 -33945504 -47614253 -40133986 -47199469 -44628800 -41413300 -33711252 -45378532 -57993243
-1052 -57993243 -44992319 -45103425 -43689877 -47866045 -55081097 -60668358 -53445157 -36818409 -33956872
-1061 -33956872 -45237771 -41575985 -52113524 -51515510 -41892841 -50577195 -47805484 -50023856 -50218824
-1070 -50218824 -56527613 -45126077 -30239768 -45902250 -44594615 -43658647 -43418846 -37147734 -42153617
-1079 -42153617 -39244592 -39620168 -43637230 -26779522 -35814685 -48623091 -39287076 -38182570 -42255875
-1088 -42255875 -43076358 -35674895 -46769897 -45012295 -42661872 -41561324 -43043405 -48149038 -40329218
-1097 -40329218 -33229190 -39208010 -39284933 -41434816 -39699528 -45435576 -44401321 -34005821 -30723939
-1106 -30723939 -43539187 -36549297 -42538936 -43018403 -60951666 -56711862 -49383691 -39744888 -41907049
-1115 -41907049 -38629920 -52298532 -43154717 -32355885 -34072142 -54544491 -38822327 -36078776
-1123 -36078776 -35581158 -39951184 -38763855 -31760720 -42832755 -39394669 -35129349 -25694218 -31093678
-1132 -31093678 -33473358 -32890283 -37583657 -36421009 -46447931 -53638195 -33030725 -41126055
-1140 -41126055 -54734243 -46059638 -54183996 -55000780 -36997868 -39772384 -47649662 -38535595 -33082049
-1149 -33082049 -36117187 -24734152 -35623896 -28236554 -24645058 -35772393 -33489800 -31253655
-1157 -31253655 -29243175 -42652317 -44392539 -35622075 13665762 -102635546 -101345898 -74395554
-1165 -74395554 -61299133 -56956001 -41581056 -26304439 -47119742 -40745783 -45151668 -46919781
-1173 -46919781 -48568738 -50468335 -52390866 -42759429 -37463154 -47937684 -34411411 -49961524
-1181 -49961524 -46155718 -50430245 -44783458 -47938069 -43394895 -41904121 -37402038 -44545134 -50640431
-1190 -50640431 -52923774 -52096756 -31176683 -45872209 -52053686 -43393351 -31232850 -48089584
-1198 -48089584 -45438322 -47095849 -37069979 -37013900 -36017685 -45290833 -24471733 -36984413 -50383010
-1207 -50383010 -54850861 -44693667 -32572626 -32908041 -48020219 -43739179 -41784929 -41142761 -48004384
-1216 -48004384 -30370301 -39485363 -42681034 -44138885 -41985770 -43062399 -48503142 -41384112 -40731411
-1225 -40731411 -51929217 -52374759 -49791418 -43748503 -39397270 -41872642 -49305244 -33872443 -34869994
-1234 -34869994 -36506606 -43476673 -42581118 -44049396 -38948273 -61888541 -47802522 -45937021 -38798712
-1243 -38798712 -51943505 -45124252 -48496843 -50161175 -44477599 -41690920 -37685260 -31949660 -39665924
-1252 -39665924 -39845807 -29024013 -32979842 -36413742 -25051093 -42576609 -39141028 -34122993
-1260 -34122993 -52195625 -60814336 -48251120 -45070913 -36137864 -37424959 -44260027 -34887137
-1268 -34887137 -28028762 -40391795 -38548405 -42643998 -39913618 -42219282 -42614847 -35378172 -48562803
-1277 -48562803 -45514619 -38143665 -45153336 -42333762 -43217313 -46596396 -38060731 -35236397 -38348544
-1286 -38348544 -48695327 -36636392 -39126991 -42289238 -48069328 -46188829 -49332047 -47762739
-1294 -47762739 -33675454 -42503119 -46176471 -37168747 -27912765 -33320162 -50469034 -38167989
-1302 -38167989 -39373475 -57691245 -50257011 -54890978 -51238206 -48032319 -34758286 -25976558
-1310 -25976558 -35684624 -33954677 -30401818 -44518399 -43336967 -42195292 -42945089 -42488218 -52881145
-1319 -52881145 -42114986 -45594121 -41160600 -46288477 -42894250 -45530230 -37587550 -37754712 -35797807
-1328 -35797807 -41074596 -36865387 -35977215 -39540667 -41448792 -35985730 -33788070 -37779751 -34866562
-1337 -34866562 -35328688 -39352955 -40607853 -40086207 -43948047 -40820710 -39987021 -53692396 -43665302
-1346 -43665302 -36274536 -44349533 -29078224 -37868479 -35965667 -34882825 -37069192 -42264861 -43403467
-1355 -43403467 -49934514 -43263730 -31889628 -47510071 -50947485 -48199513 -34673639 -47106289
-1363 -47106289 -39348736 -43193187 -49822933 -41753141 -47498184 -40397010 -43128444 -47888557 -40764640
-1372 -40764640 -43569291 -45614057 -37553165 -38357296 -42755042 -32676626 -43764494 -42282386 -35079688
-1381 -35079688 -43908111 -41371987 -45975221 -45309365 -33016302 -35933737 -45578640 -41655646 -34102910
-1390 -34102910 -43048679 -29443669 -30369657 -44249188 -44975912 -49063556 -50426505 -55045840 -46145766
-1399 -46145766 -32095910 -30320898 -33559036 -39707737 -33864190 -35550288 -41741656 -48348639 -39347732
-1408 -39347732 -26887542 -43984501 -46846772 -44113623 -42619879 -37537782 -43689450 -44051529 -45344008
-1417 -45344008 -34409641 -37816305 -34423103 -48254564 -51005687 -46626978 -44314151 -54649743
-1425 -54649743 -50005385 -46054117 -45870114 -49050525 -42106967 -45054553 -43249241 -56075781 -43627391
-1434 -43627391 -55479584 -41423060 -22078447 -25967022 -34507562 -40288006 -37808921 -33998651
-1442 -33998651 -45330202 -44135234 -40927134 -40422945 -38214078 -49087980 -38868535 -45993744
-1450 -45993744 -52113960 -47321511 -36587890 -32229591 -36209592 -47968675 -43551200 -33567940
-1458 -33567940 -39453536 -33826102 -41339807 -49448949 -36166914 -43427308 -49069837 -48936513 -49995612
-1467 -49995612 -56788021 -51819016 -50382411 -45377998 -48113078 -39959947 -38536290 -35575278 -44891589
-1476 -44891589 -36959559 -43296595 -40929984 -38140500 -38292410 -49448094 -42864027 -47168959 -45189249
-1485 -45189249 -46504504 -46542365 -42535122 -44944641 -46522651 -44111833 -45790102 -41470743 -42778848
-1494 -42778848 -41574025 -39210905 -42899004 -41315468 -36365059 -42083456 -48136471 -47148384 -42192866
-1503 -42192866 -42712950 -34563900 -38811916 -36333420 -36061790 -50938919 -46512229 -45604850 -34623514
-1512 -34623514 -41271325 -27072359 -46158125 -38768999 -36572761 -40903476 -38939396 -41614015
-1520 -41614015 -38488751 -32280392 -35705954 -45760174 -38812647 -37502498 -47807003 -48720463 -52164622
-1529 -52164622 -31344010 -41856522 -48594393 -44873190 -29580127 -31104635 -37807189 -30328408
-1537 -30328408 -38461296 -30930419 -31868635 -48554225 -58613064 -68941258 -39711149 -35722774
-1545 -35722774 -39004059 -40563160 -46284880 -47747732 -48466904 -35899718 -27096867 -42523406 -43937774
-1554 -43937774 -38604834 -44561290 -41161395 -41556835 -38053033 -39360079 -39494988 -23497854 -37288147
-1563 -37288147 -30939906 -43496379 -44069150 -39237163 -44852378 -50287420 -60825053 -53628154 -54188135
-1572 -54188135 -54868476 -50086888 -46981692 -42826590 -36434113 -41515271 -44927019 -48839981 -36017986
-1581 -36017986 -42516305 -62172258 -60513132 -53220799 -57979093 -60311373 -44386151 -58622399
-1589 -58622399 -42892076 -43088599 -42904120 -39899226 -51281186 -38635874 -36155641 -33230247 -36782746
-1598 -36782746 -34321677 -32132723 -45586355 -50453278 -50620530 -46455391 -44934682 -38386427 -40291783
-1607 -40291783 -31007053 -35692299 -41199526 -44654526 -41410147 -32001286 -38828766 -44146015 -43747835
-1616 -43747835 -49393950 -42827938 -40124030 -28528347 -30360036 -39325094 -46406243 -43947100 -43893922
-1625 -43893922 -41380029 -47135461 -45407000 -39230955 -43519802 -39313473 -37066262 -45457961 -31655716
-1634 -31655716 -31950657 -38600958 -37194327 -50490281 -49519099 -50238595 -41289214 -33104550 -32862318
-1643 -32862318 -48025719 -32602111 -44532290 -53998289 -32345368 -30996443 -43300276 -41073328
-1651 -41073328 -51268617 -42699232 -40365290 -35309946 -33045522 -36801705 -22061644 -43655442
-1659 -43655442 -40825393 -33957392 -44905655 -46368650 -44539382 -41717823 -46532882 -46615804 -38091565
-1668 -38091565 -43032681 -35649089 -36769439 -47719000 -46311726 -41049432 -43544599 -43421817 -45480291
-1677 -45480291 -36816872 -40285752 -46109351 -49898474 -45570930 -43059132 -42745285 -49846595 -43045683
-1686 -43045683 -30098636 -36596595 -37825537 -48260866 -44574130 -32739183 -46681586 -37822749
-1694 -37822749 -45746245 -43566854 -43148001 -47381844 -33918220 -51454409 -47557627 -34787977 -34334880
-1703 -34334880 -43475003 -40681328 -31723561 -53339959 -47985576 -39524847 -43857410 -41041966 -45860503
-1712 -45860503 -41615663 -43490674 -32451071 -36203758 -39228021 -43756510 -48307446 -40979089 -43389556
-1721 -43389556 -39971074 -42666036 -36342792 -49337435 -48449182 -43395936 -47109392 -43065837 -41341010
-1730 -41341010 -46232105 -34905817 -47663008 -51875304 -39012937 -44742328 -50765884 -38497045
-1738 -38497045 -42075412 -43486801 -44504819 -50190356 -43147949 -46500904 -43746034 -43202901 -31704705
-1747 -31704705 -51728362 -38074778 -47287153 -43379706 -44312321 -49760123 -56602743 -44997881 -44766884
-1756 -44766884 -36217755 -46725357 -41915609 -36424398 -33002886 -37547427 -41936225 -57330633
-1764 -57330633 -53779656 -55232742 -51674750 -36562849 -48090695 -51480636 -44666870 -31742943
-1772 -31742943 -48720014 -54213104 -48943582 -42967889 -38265460 -30317832 -20816250 -33186624
-1780 -33186624 -28580199 -38967896 -37809540 -37759698 -39819018 -40600265 -33831432 -47595456 -46717063
-1789 -46717063 -39746205 -43416678 -47471013 -48427883 -41446037 -38328717 -42013588 -38125116 -40760334
-1798 -40760334 -51349057 -50384143 -41319886 -40535616 -43145441 -52070217 -38834577 -31939648 -36007028
-1807 -36007028 -30961973 -39120643 -39400971 -22121737 -30955410 -50683949 -39599497 -40474084
-1815 -40474084 -51692255 -48776142 -46225428 -37570643 -34811267 -30050526 -46529200 -51888395
-1823 -51888395 -42673267 -39450783 -38931258 -51263759 -52262954 -48667753 -43876214 -22527739 -34092094
-1832 -34092094 -50802620 -50804979 -37121276 -31319922 -35275937 -44845427 -42739363 -42211673 -46480730
-1841 -46480730 -41082004 -38514201 -47592955 -48677179 -63973120 -51052108 -52755479 -44175260
-1849 -44175260 -41462321 -50581504 -49755835 -48292110 -42873014 -38778080 -37237652 -35968343 -43544042
-1858 -43544042 -34440700 -44867311 -39889538 -51558001 -40719705 -41619620 -46788049 -42354267
-1866 -42354267 -32341942 -42234239 -44972074 -48773070 -49501939 -44480843 -50955517 -49144538 -44918665
-1875 -44918665 -50950950 -50940488 -47111341 -35756217 -46216671 -36190457 -41431337 -41395735 -37883978
-1884 -37883978 -33265693 -45681950 -40607275 -40620790 -31207107 -51346161 -39128597 -55543336
-1892 -55543336 -45964503 -44035325 -38399429 -48338184 -49057579 -37232982 -44221346 -41740402 -49540030
-1901 -49540030 -38449325 -53496055 -38802709 -41417554 -38526127 -38081255 -37487840 -44026221 -43030009
-1910 -43030009 -31590675 -45238784 -40559885 -32628552 -34409896 -35446127 -42473826 -34623560
-1918 -34623560 -43686533 -40047123 -40589354 -33213945 -44149068 -56533483 -47344541 -30999764 -30929654
-1927 -30929654 -33466717 -39302060 -42794365 -38570534 -40597902 -42992223 -51684506 -47218711 -45424910
-1936 -45424910 -38974960 -29209579 -32095256 -46348631 -31637314 -43081535 -47696017 -32955141
-1944 -32955141 -40301931 -40987238 -43301465 -45572726 -47606113 -53096341 -44371181 -51302866 -39595829
-1953 -39595829 -48998419 -41819172 -41379072 -48221494 -48266816 -50516476 -48686951 -49877136 -33327584
-1962 -33327584 -30138678 -30722983 -42238798 -49223945 -43306691 -42947320 -49539346 -50866807 -56953535
-1971 -56953535 -44442038 -47360394 -53540666 -43876059 -53553339 -22981931 -40332920 -47367373
-1979 -47367373 -41510468 -53434725 -40453943 -45059293 -49311206 -38076877 -44463314 -43013639
-1987 -43013639 -38329693 -46331210 -49877560 -52127528 -58081078 -41164017 -52463039 -55223335
-1995 -55223335 -52010064 -38926716 -54917253 -45183287 -45459833 -49293516 -52192524 -38318350
-2003 -38318350 -41645996 -44418628 -37919502 -45136307 -36746282 -33436208 -43212082 -34644492 -48643574
-2012 -48643574 -41840535 -44799998 -52842720 -59547795 -50465829 -45721538 -38160202 -36902466 -40890329
-2021 -40890329 -44357307 -51389800 -42312080 -44676043 -40766546 -38846530 -39083985 -34857198 -41700551
-2030 -41700551 -38183630 -56682126 -49710841 -43853084 -39993160 -47836389 -33973370 -43113235
-2038 -43113235 -40765151 -58109640 -51075673 -44204509 -48320042 -60790925 -48920712 -53407237
-2046 -53407237 -51710913 -54347604 -49912564 -42085809 -38420615 -33006654 -43664131 -49227149 -39783611
-2055 -39783611 -35635154 -43020594 -27405901 -31556032 -40600545 -30299991 -38986613 -49595411
-2063 -49595411 -42168860 -43972711 -48986742 -55755139 -54313990 -39325111 -45392150 -48848687 -42463086
-2072 -42463086 -38480805 -57258431 -48476862 -44053072 -48750736 -45550592 -32863227 -28897354
-2080 -28897354 -40689717 -49180735 -38789196 -43994354 -43403212 -53844583 -47547601 -54104071
-2088 -54104071 -44338499 -24638688 -36549984 -34256265 -42233371 -48259009 -38691475 -43049245
-2096 -43049245 -44485126 -44017751 -45331226 -51456632 -49284336 -49145649 -36975822 -43335900 -42310026
-2105 -42310026 -41055116 -39474766 -48026701 -52204548 -34506033 -37032197 -33374221 -38173382 -37591400
-2114 -37591400 -49644615 -44962612 -29688016 -39694991 -59717667 -46648325 -42599692 -41441970
-2122 -41441970 -39531758 -37907587 -45578199 -56068738 -53708688 -40178935 -45879788 -47748216 -47325318
-2131 -47325318 -44656056 -45319838 -44438637 -38165227 -40711097 -43071156 -50476719 -33128695 -41533794
-2140 -41533794 -36418312 -35412797 -44251138 -38826880 -42093356 -44418282 -47799871 -63130313
-2148 -63130313 -53052686 -43841668 -44274264 -38152187 -49403065 -48533095 -37597496 -38790364 -45331439
-2157 -45331439 -42257672 -32166950 -39075004 -46426852 -36635347 -39898773 -44832737 -42005865 -50996334
-2166 -50996334 -37357973 -45216754 -44005598 -43876572 -42509954 -42614245 -35111105 -35527221 -41059373
-2175 -41059373 -38134598 -39929528 -49556922 -45271502 -45819627 -41907116 -40977767 -35435243 -36686075
-2184 -36686075 -47655137 -46835916 -46941751 -36073832 -42108427 -48828092 -60706518 -49875321
-2192 -49875321 -43768010 -55090173 -48121911 -40047606 -46567910 -38027884 -38636879 -46255273 -45025332
-2201 -45025332 -44020403 -44710942 -52836041 -45794971 -49378839 -55428216 -62034250 -54262052 -56770679
-2210 -56770679 -58699358 -51224169 -49155455 -44893629 -43497151 -34602079 -32730989 -48841819
-2218 -48841819 -38571456 -31846350 -31835102 -37599009 -57138276 -45976613 -47030967 -40046021 -43481320
-2227 -43481320 -39378857 -42338287 -42538947 -41634203 -48473334 -49477884 -36266916 -50275024 -60110499
-2236 -60110499 -47903255 -45718606 -51771356 -36421110 -45280486 -46453875 -34717290 -41113138
-2244 -41113138 -40504939 -55617404 -50894094 -59170778 -50076541 -28384327 -38048147 -38387205 -39393869
-2253 -39393869 -42490622 -43070347 -46302398 -34324456 -38493762 -31496297 -36083276 -41799470 -29976581
-2262 -29976581 -45020852 -45978005 -43622019 -47946372 -40769492 -29649549 -47584934 -48481307 -46547659
-2271 -46547659 -56915352 -52788976 -54774900 -41503283 -49903515 -46256440 -42361475 -47812294
-2279 -47812294 -55614656 -38065080 -46403503 -44146148 -36852711 -39065940 -48158714 -44168346 -44411020
-2288 -44411020 -54893902 -43356126 -41534920 -47485440 -45439069 -34977021 -40591539 -44545006
-2296 -44545006 -44800255 -43431639 -49941217 -47531588 -50198983 -42790862 -55450934 -46671133 -44213269
-2305 -44213269 -44327853 -36518998 -36807484 -52215946 -46009442 -51034376 -42268521 -43290255 -41608764
-2314 -41608764 -36463378 -34024242 -38833246 -37206546 -46699907 -44205734 -46703948 -38991008 -33579132
-2323 -33579132 -29110586 -45052968 -47178081 -41943808 -36740932 -46196554 -51549511 -37045438
-2331 -37045438 -42439021 -49153995 -37307193 -47141832 -38836045 -42043963 -42042156 -40033964 -51980937
-2340 -51980937 -57406029 -47834161 -40204930 -40195040 -42810867 -42666520 -44357861 -43779475 -51507574
-2349 -51507574 -55766455 -45921919 -52499950 -39455274 -42971387 -31443316 -32191088 -42333560
-2357 -42333560 -51822355 -53107381 -39184272 -51786903 -50192556 -48573648 -46958985 -49342572
-2365 -49342572 -55515598 -51405216 -41351837 -44830935 -46087825 -47968850 -44263014 -45706206 -43918158
-2374 -43918158 -46141214 -45406499 -51796905 -55089585 -38567185 -43290330 -43477234 -31544952 -42823831
-2383 -42823831 -38058508 -47418088 -41050024 -36710723 -43603789 -45523639 -47116136 -35272577
-2391 -35272577 -52218682 -56621363 -47269113 -51877475 -49351133 -42912699 -48786064 -47471670 -43266336
-2400 -43266336 -46227251 -53378675 -51456258 -44573263 -48636774 -42403332 -44270934 -43191124 -36920839
-2409 -36920839 -35127210 -36113612 -47569353 -40515427 -46642330 -35003930 -34915994 -42159384 -36673251
-2418 -36673251 -33433318 -45935199 -46249301 -46888430 -46111388 -55010697 -45868240 -47455554 -48252213
-2427 -48252213 -48414955 -35841089 -41266126 -38348501 -46593526 -57705283 -44868992 -37846374
-2435 -37846374 -43139046 -43909757 -42129709 -39556572 -34334196 -36062596 -47145845 -41132711 -33093637
-2444 -33093637 -33912422 -35706071 -47254214 -48074413 -36400385 -43000779 -46022036 -45827694 -26562654
-2453 -26562654 -34406623 -37964701 -46759715 -28765587 -37259732 -35180483 -47211817 -49626932
-2461 -49626932 -48259481 -43270294 -37360784 -47801047 -43942465 -46203483 -35388499 -43237833
-2469 -43237833 -54651939 -37964982 -42188441 -36524335 -35138187 -33998821 -53558898 -46378406
-2477 -46378406 -37189099 -38307535 -36680547 -41398678 -47470371 -49462595 -45334592 -46162096 -41587363
-2486 -41587363 -44504501 -45410366 -41696070 -41444417 -49795868 -37361999 -41121273 -44388271 -53096001
-2495 -53096001 -41995018 -41338270 -59201295 -46334419 -44576507 -49972302 -52367958 -47283958
-2503 -47283958 -40674640 -44802251 -46392678 -46543751 -44295453 -42697088 -49515594 -42973802 -33774151
-2512 -33774151 -44992026 -37789605 -43448394 -49512844 -55765953 -41161210 -51977934 -42215745
-2520 -42215745 -36590582 -31124659 -45627643 -50781776 -46304820 -33895589 -39585285 -27734750
-2528 -27734750 -42711029 -43502386 -46292466 -46234111 -48318704 -39461175 -51751559 -49337754 -52762454
-2537 -52762454 -43498737 -51839051 -55140971 -50624032 -33659161 -38793930 -29517677 -41958825 -41858465
-2546 -41858465 -37678787 -36069481 -24833729 -21867182 -44583299 -35523845 -45901917 -67788706
-2554 -67788706 -73824991 -29257740 -56851229 -43917661 -65578297 -58519392 -41562666 -46251726
-2562 -46251726 -47766728 -54446906 -54373870 -36935265 -35900970 -54326197 -56340524 -50073334 -45277280
-2571 -45277280 -39011851 -43241531 -28351232 -47582885 -51939277 -50475649 -46586524 -44685603
-2579 -44685603 -48937393 -38825136 -41712777 -44171767 -44386835 -44598585 -25099741 -43345049 -50688222
-2588 -50688222 -45058745 -53611906 -48364280 -47058363 -43477815 -44287547 -39254136 -43219136 -53140845
-2597 -53140845 -45868834 -42848427 -51880098 -47975642 -36506852 -40272363 -45792653 -38724779 -39109476
-2606 -39109476 -47846906 -41664938 -51484972 -42551948 -38215654 -30027577 -30390930 -37596410 -39078342
-2615 -39078342 -49041785 -59571920 -45131265 -50715279 -55842717 -56987104 -50020900 -46157415
-2623 -46157415 -39436104 -49569169 -42993344 -39401657 -39522385 -40006842 -26164033 -23581963 -40194890
-2632 -40194890 -45986537 -56183508 -53008937 -49078947 -47676011 -50017846 -41543315 -37347951 -39828615
-2641 -39828615 -50877548 -29803011 -41942393 -48721501 -46892279 -47877635 -44970298 -43439266
-2649 -43439266 -36467572 -42631662 -32699340 -42131179 -42417144 -37377536 -37308262 -49579760 -51110329
-2658 -51110329 -58780965 -56024571 -54412992 -50813057 -53268295 -43727295 -42968030 -48558985 -39020176
-2667 -39020176 -45951080 -41304796 -48608179 -37436801 -41603222 -34941640 -48293426 -42104587
-2675 -42104587 -45156494 -35067618 -42105784 -40199111 -47300218 -39420354 -38645883 -43860588 -50617561
-2684 -50617561 -41933932 -40037499 -24961220 -26220065 -33457411 -32845982 -40964387 -42933441 -34730711
-2693 -34730711 -41904797 -47852244 -43772976 -39122545 -48431900 -37893400 -46377881 -45764612 -37356552
-2702 -37356552 -44485008 -52540373 -57958449 -55040726 -48816008 -42915371 -36837884 -46128226 -39430318
-2711 -39430318 -39838308 -38335798 -37022297 -34586323 -45368710 -44765883 -42827004 -48006252 -46136832
-2720 -46136832 -32183002 -48973076 -52398124 -39113824 -45038371 -43057378 -49062922 -49324374
-2728 -49324374 -57433157 -42156169
-2730d2156169  $$ checkpoint
##PAGE= N=2
##DATA TABLE=(X++(I..I)), XYDATA
13653 -45567862 -45933187 -46811684 -41537104 -34243543 -47180668 -59905417 -51459459 -48163657 -44654170
13644 -44654170 -41596137 -43875196 -28888468 -38375330 -42569003 -48874473 -57144646 -41992138
13636 -41992138 -57343237 -52548062 -38385646 -47518099 -46086972 -36422445 -48215603 -47284639
13628 -47284639 -45181126 -48433577 -43915661 -40898397 -40692174 -53620115 -43138689 -52787794 -51205927
13619 -51205927 -46982127 -52473792 -44177070 -52211153 -58913610 -46996967 -46415813 -40061643 -51067171
13610 -51067171 -38894442 -49309421 -41977935 -34204604 -30794079 -34097519 -47632475 -55304379
13602 -55304379 -37053243 -40827678 -47979972 -40919058 -48225378 -45702963 -36646869 -37361789 -44762590
13593 -44762590 -33500610 -33679582 -38989811 -50013829 -36494749 -39876099 -52709415 -46148317
13585 -46148317 -52844646 -59237157 -41182925 -40034948 -38697005 -39363175 -38862967 -40047782 -52961028
13576 -52961028 -39894545 -51582319 -46480543 -42729731 -36957060 -40265525 -45572666 -52073626
13568 -52073626 -39240777 -49510368 -41413364 -38005817 -33257337 -36241591 -49736793 -47300936
13560 -47300936 -33272655 -40952204 -35164386 -35173333 -45023274 -44649211 -44791630 -30341630 -43334098
13551 -43334098 -26830273 -38824121 -33811698 -39950523 -56401830 -45057715 -49181934 -43045072
13543 -43045072 -59273747 -48980959 -45689288 -50732614 -42858292 -43418716 -42943457 -41154228 -37759914
13534 -37759914 -50646811 -34818861 -33716464 -30462795 -44825387 -59703324 -53475825 -40238675
13526 -40238675 -59000287 -47371090 -31582638 -46947747 -47493013 -37238107 -55990489 -35359066
13518 -35359066 -34120186 -37396063 -39158839 -33732671 -34242600 -34563655 -36781449 -34012247 -35370644
13509 -35370644 -37453649 -43044198 -46954129 -45727166 -38130379 -39564339 -43848842 -46225552 -42893354
13500 -42893354 -34609024 -38818634 -50843868 -39141677 -38672588 -41258534 -41865967 -43971212 -46248004
13491 -46248004 -46223527 -28413002 -39290721 -38098557 -38880432 -33011286 -44835292 -39185663 -34591539
13482 -34591539 -45757890 -41477442 -35033245 -35861753 -24538807 -52124214 -59774784 -53574850
13474 -53574850 -47357516 -48094923 -33180260 -54686150 -43420735 -42193679 -43299480 -34451312 -33482676
13465 -33482676 -28425991 -43916482 -44163891 -45001631 -33033310 -34247255 -42096116 -42001602 -29178306
13456 -29178306 -33722246 -36907009 -30689470 -32926583 -47214142 -45776413 -46463944 -41335340 -43921284
13447 -43921284 -49871413 -44885576 -44935064 -48164746 -46719836 -39181268 -28740906 -36489775 -45422014
13438 -45422014 -44929861 -34717074 -43017169 -40718540 -38060321 -43167611 -49716222 -49181355 -47276392
13429 -47276392 -32310471 -35794194 -43589793 -36636880 -45548021 -32961524 -39186929 -34594698
13421 -34594698 -44624353 -41918446 -34700063 -41790001 -48323703 -50785110 -37029769 -37841636 -34930871
13412 -34930871 -36605116 -33115013 -40572657 -34919180 -37952690 -45173049 -39384820 -37026855 -37007392
13403 -37007392 -41742578 -45496697 -34858861 -33982589 -45355766 -46855676 -41860293 -36334065 -28740736
13394 -28740736 -38209366 -46286078 -37737456 -26736013 -38148626 -35695079 -39775622 -47877189 -48814357
13385 -48814357 -31849361 -46298439 -42785073 -30681005 -30278587 -33591184 -38103439 -39972780
13377 -39972780 -24562767 -35938434 -36828161 -42994184 -42339792 -40827432 -29462698 -39001872 -38606650
13368 -38606650 -44495805 -34123102 -33354079 -50570201 -45554164 -52743819 -40780248 -38881493
13360 -38881493 -32863153 -39420150 -36507491 -51254298 -43570448 -44554173 -35001639 -39600563 -34262032
13351 -34262032 -28491015 -23981732 -39512965 -42924134 -49423106 -38086789 -44957992 -53386773
13343 -53386773 -35321715 -43645561 -32184273 -36427822 -43255289 -35939997 -31503307 -30272974
13335 -30272974 -37900546 -40758408 -41129119 -45603113 -38906276 -34554963 -41718791 -39860694 -32250971
13326 -32250971 -30028690 -35996180 -26155600 -27149386 -39955792 -44737734 -41982372 -42160278 -40043877
13317 -40043877 -35806901 -32296929 -38200651 -40134354 -38643806 -49538429 -31829178 -32390714 -41445148
13308 -41445148 -36741312 -31149781 -40361932 -39377056 -30226185 -41864210 -47940594 -40713920 -35652647
13299 -35652647 -30736290 -25383799 -32322268 -39610149 -45697513 -53148392 -38466818 -26489536
13291 -26489536 -31366304 -29287426 -42655461 -27292674 -35880404 -30745598 -31920065 -21903374
13283 -21903374 -27587070 -39574456 -33666736 -37041050 -42241999 -53431528 -33121167 -31233201
13275 -31233201 -38756169 -43497520 -43732639 -38800562 -36458759 -46265064 -50158217 -49600159 -26004101
13266 -26004101 -44279528 -41334558 -31647959 -29824311 -46875857 -46823326 -29140841 -30791932 -33677544
13257 -33677544 -42753676 -49268742 -35709170 -22755792 -22544982 -30477968 -31296617 -35573180 -38985756
13248 -38985756 -28102360 -38424712 -37528573 -36593905 -44171494 -26748674 -32856139 -24365778 -24954795
13239 -24954795 -28657781 -48850690 -30049369 -35390253 -44496804 -36430004 -37245834 -30640747 -32516039
13230 -32516039 -41906387 -28561306 -32277852 -34072197 -40316710 -36567345 -39720164 -46828757 -38659503
13221 -38659503 -28879045 -31253409 -30565503 -42407858 -42565785 -47293543 -39438354 -41897316 -32642225
13212 -32642225 -29984836 -30649385 -23095413 -31991926 -34119673 -44525390 -34860327 -43005509 -34796042
13203 -34796042 -32052898 -34492924 -40462529 -49669362 -56081314 -40997996 -37137565 -25516839
13195 -25516839 -37905489 -44734631 -30858225 -40022637 -44254742 -34419819 -47825587 -38125112
13187 -38125112 -31902897 -42717168 -35450552 -37074702 -45862022 -38846181 -30361105 -46324283
13179 -46324283 -37426846 -47580290 -40264383 -39301027 -37564949 -34134895 -76702795 -31758680
13171 -31758680 -45951437 -35683557 -32495313 -34930479 -23830037 -32298462 -35122541 -39218770
13163 -39218770 -48492832 -38876463 -40066881 -28064739 -33395671 -43348139 -34613282 -38874047
13155 -38874047 -27846855 -34056197 -45516342 -41547126 -37911692 -30682312 -45817865 -25518954
13147 -25518954 -30169428 -26954586 -38979040 -42760050 -40421781 -35172475 -36889128 -23785661
13139 -23785661 -17806923 -30661170 -36443380 -39200264 -37958836 -28206755 -25055141 -32681298 -39073852
13130 -39073852 -30690155 -28810403 -38404957 -34557566 -34281280 -32159520 -37019183 -33817048 -48746748
13121 -48746748 -49860002 -32355794 -37790971 -41337860 -47218065 -39613660 -38703663 -29075333 -33699756
13112 -33699756 -31229332 -41782865 -30795560 -26054250 -29783482 -31184244 -37393809 -37032833 -29862849
13103 -29862849 -31876335 -30005649 -37721820 -32937498 -22550189 -33973686 -46154753 -34057763
13095 -34057763 -29578923 -31036499 -38992588 -32454770 -31343661 -37687731 -34370858 -34002190 -32900138
13086 -32900138 -21419409 -30619661 -31505365 -26255988 -19387093 -29200726 -23614778 -39071616 -38980872
13077 -38980872 -23632671 -27382443 -37719285 -26769659 -23795064 -28720549 -21229058 -25074912
13069 -25074912 -19842273 -29809614 -35084289 -37348999 -38805042 -32624651 -29537135 -33475334 -32772109
13060 -32772109 -25976371 -28545133 -38071041 -39035451 -32660933 -35549102 -37875908 -29979754 -29875541
13051 -29875541 -25382050 -34708576 -23347628 -18434305 -30781939 -43976299 -26097808 -25436390
13043 -25436390 -17518981 -23597288 -32700873 -39504653 -33117083 -39265873 -35717811 -32661838 -29139165
13034 -29139165 -33469412 -34800560 -34573504 -31795382 -32659300 -36110788 -30093044 -36285418 -32810237
13025 -32810237 -33233781 -44192348 -38533863 -33835941 -40745845 -33443561 -33907661 -37942917 -34774864
13016 -34774864 -38326968 -26789780 -37898892 -34783901 -21674660 -21881164 -30880304 -26305986
13008 -26305986 -32876717 -34798489 -30984666 -21097594 -32593142 -32145105 -30485554 -6918772
13000 -6918772 -27574019 -32021841 -23198187 -37213616 -25262340 -25843358 -43623175 -39179304
12992 -39179304 -40708633 -28252230 -40355147 -26827784 -15678547 -23541214 -35597296 -29189978
12984 -29189978 -27101712 -34865865 -29750959 -15768018 -30493539 -30931723 -29253167 -26555740 -17852787
12975 -17852787 -33310424 -23371338 -17231856 -28083641 -27562745 -29241593 -29535542 -20820549 -18817549
12966 -18817549 -42810051 -31960722 -19684337 -31884916 -25003220 -29354686 -24830886 -21625115
12958 -21625115 -32159548 -32180666 -32746535 -40928892 -34648982 -30386143 -27369739 -28082258 -40315794
12949 -40315794 -25423169 -24843475 -15170204 -27124678 -26241556 -33437979 -25439885 -28978989 -42980715
12940 -42980715 -29297911 -35404399 -25472992 -33398983 -25977205 -26743738 -36549848 -36233838 -28552578
12931 -28552578 -27721903 -34909245 -32886118 -20954236 -25512689 -28658672 -24430969 -19181441 -36500912
12922 -36500912 -26647654 -37116142 -31187684 -30455991 -23119563 -26479754 -26020454 -31557591 -33537414
12913 -33537414 -30199226 -26485579 -28735713 -16264902 -23956506 -22847459 -22288872 -22250997 -10953604
12904 -10953604 -28558398 -27150914 -34494779 -29926972 -27670456 -25573716 -27748260 -25051191 -34047714
12895 -34047714 -23592567 -25998695 -33964967 -29451464 -23737042 -24633309 -28152253 -22401388 -26488375
12886 -26488375 -25817251 -23032033 -29589662 -18853383 -23730507 -21655891 -31904468 -29483980 -27449040
12877 -27449040 -35552894 -30913684 -32389203 -20324850 -27924052 -32826455 -25867710 -32995910
12869 -32995910 -18986057 -25554293 -14485285 -16423312 -21026074 -32024939 -16179610 -21969169
12861 -21969169 -20373386 -19860282 -38083417 -25704899 -21450310 -14767048 -34351065 -29364263
12853 -29364263 -23954709 -9818098 -25223919 -26984909 -37960603 -30197527 -28332594 -34619977
12845 -34619977 -30511385 -23793452 -25296162 -25492085 -33396848 -25995910 -26398546 -32507085 -27970801
12836 -27970801 -18923222 -23362655 -30755617 -24242513 -14579644 -12824297 -24212432 -29834561
12828 -29834561 -40508416 -19677893 -29141442 -29427413 -18436400 -16906741 -29157104 -38629635
12820 -38629635 -24174182 -33683217 -18736322 -26675857 -33306133 -31857540 -27540281 -28121151 -31569258
12811 -31569258 -29346334 -27744959 -32394986 -25056316 -35114736 -31490546 -27280723 -41596686
12803 -41596686 -29168135 -30426545 -36806604 -25292041 -19735614 -17236425 -24826866 -27746472
12795 -27746472 -24373239 -20761731 -41710856 -27573536 -28862272 -23408287 -31310279 -29818566
12787 -29818566 -37173610 -31440008 -27691665 -32441075 -25548914 -26434662 -36409695 -36401330 -34477826
12778 -34477826 -25131565 -21304228 -20581457 -23192380 -17629404 -9789526 -12950152 -13829947 -24390611
12769 -24390611 -21878278 -25687397 -16284289 -17252897 -17301603 -32039598 -29846809 -40675412 -40875511
12760 -40875511 -31107733 -27221850 -32559946 -29877040 -19876508 -18474998 -18435480 -21581604 -18155134
12751 -18155134 -29654186 -24958414 -28312145 -13135354 -16653867 -20529255 -25992267 -33233411
12743 -33233411 -40080015 -18972835 -13841009 -13584409 -35546508 -30979716 -27826211 -35577055 -33600587
12734 -33600587 -23485424 -26057332 -26647914 -33682363 -21940113 -14392437 -24813777 -26604680
12726 -26604680 -16307053 -35021019 -29812358 -29839844 -15385596 -14813151 -31157277 -33488500 -24347626
12717 -24347626 -37593119 -35698182 -39000077 -27944213 -22453616 -19352627 -23755871 -25195351
12709 -25195351 -35126847 -31642313 -32939028 -32297833 -25302447 -17864960 -27186325 -15241558 -422850
12700 -422850 -17229844 -18273610 -24210508 -27683875 -26418963 -25482381 -33307295 -19576289 -24069308
12691 -24069308 -24052223 -20117357 -25823332 -31896208 -29158617 -14965126 -18149010 -32451108 -21193114
12682 -21193114 -25674878 -25052414 -16091038 -24721105 -20375957 -12346172 -22312911 -33716746 -40580332
12673 -40580332 -21691447 -32698429 -39054817 -29279345 -28457129 -34398096 -30498166 -24122786 -26165016
12664 -26165016 -24475274 -16094526 -19546680 -28180219 -29626122 -23716109 -26774363 -22528920 -22883935
12655 -22883935 -20809362 -16954886 -14396029 -17344006 -15705975 -39146266 -34939895 -23826693
12647 -23826693 -14498222 -18701867 -27945542 -21207836 -25960849 -17564777 -13626661 -22033214 -22325762
12638 -22325762 -24326104 -28819698 -30451815 -31959884 -26964715 -19863523 -18421251 -17299761 -28753430
12629 -28753430 -25544266 -25876843 -11469278 -27482500 -26516359 -25077329 -20700821 -41866070 -34352430
12620 -34352430 -32151203 -26702439 -26989813 -35932681 -35922609 -30343140 -19704426 -22486351 -14864343
12611 -14864343 -27464803 -24924387 -33205841 -32006180 -24146256 -20167323 -20661715 -17289299 -17935661
12602 -17935661 -27511382 -26893952 -30107442 -15192430 -18728520 -18172259 -20015171 -21942613 -21444764
12593 -21444764 -28299123 -28595499 -10813313 -12062882 -18355683 -25548012 -21999506 -18471870 -15797873
12584 -15797873 -15733681 -12005277 -23482267 -32553448 -22267025 -12654540 -19920315 -23993232 -34785470
12575 -34785470 -27280415 -13488844 -18111626 -28838073 -28098292 -32201989 -36074224 -35340990 -37403028
12566 -37403028 -25530497 -18467436 -17250210 -25261182 -17396214 -25146020 -23253477 -18701305 -10267012
12557 -10267012 -19779629 -18006717 -20112382 -10750703 -15781326 -22200142 -24127573 -28074456 -31080917
12548 -31080917 -28038320 -19944814 -34819949 -18863868 -16405188 -24302282 -12618118 -16279846
12540 -16279846 -37117637 -16817504 -18247217 -22968889 -8956276 -26089459 -34502149 -21944745
12532 -21944745 -22113531 -24193299 -25814019 -30615359 -33645073 -32779842 -28438130 -32397963 -32478639
12523 -32478639 -19625694 -26497316 -16072389 -20854444 -17563035 -28218103 -46744030 -27619205
12515 -27619205 -25202799 -11711303 -6881617 -15800320 -25719940 -19916468 -15147941 -12542618 -17907076
12506 -17907076 -14578466 -11805126 -17030605 -28488677 -23606509 -26437221 -20835625 -15141938 -20308933
12497 -20308933 -18700507 -21886908 -24198740 -20340851 -17712346 -19225911 -11739173 -17173997 -32383634
12488 -32383634 -20718853 -21016670 -10446734 -13786656 -20315887 -18853232 -16850212 -36270898
12480 -36270898 -27443469 -17283255 -27804328 -25894618 -17186350 -32533914 -15094534 -14207854
12472 -14207854 -26553114 -16661364 -18311779 -29280732 -21020323 -22368630 -14571638 -19353568
12464 -19353568 -15871127 -14527214 -32536951 -25101723 -22703652 -27640919 -16965984 -24911540
12456 -24911540 -28873642 -23101210 -15034579 -26293820 -29128739 -28805848 -30351237 -16252601 -21389933
12447 -21389933 -22190094 -11910567 -12945453 -19791844 -17755531 -7866996 -17689365 -8149087 -17278995
12438 -17278995 -18114527 -12393890 -11684406 -15164781 -11185291 -32469077 -22647613 -23989344 -28618000
12429 -28618000 -17106776 -19749915 -16088384 -16094854 -20363347 -17065843 -19485398 -17305255 -11724921
12420 -11724921 -10184556 -11877344 -13516498 -19578749 -24175720 -21227598 -15765806 -15495842 -29294883
12411 -29294883 -22678387 -20625537 -30653552 -34240853 -26285923 -8967471 -10917309 -22678793
12403 -22678793 -23984347 -26326818 -24810035 -1442169 -14235570 -29398429 -23900013 -24601451
12395 -24601451 -13855115 -19919525 -10126644 -27596785 -18603375 -10824416 -21524464 -19747090
12387 -19747090 -28648992 -25228896 -13214945 -26064597 -29220331 -12993434 -16141712 -23901060
12379 -23901060 -9503138 -1478693 -18830941 -23379226 -19305043 -21635438 -19336187 -2523420 -2527433
12370 -2527433 -20627282 -20564189 -30772174 -10153553 -12597723 -13622924 -26031933 -19416169 -16262301
12361 -16262301 -20377066 -16179495 -21724052 -20825989 -21555588 -20408844 -15667873 -25014692 -25495651
12352 -25495651 -22978597 -10479787 -19365022 -19315632 -19122370 -11705617 -19229805 -6881580 -16717321
12343 -16717321 -9459061 -12066539 -27062163 -42940546 -36578832 -34618841 -32606350 -24112586 -24628081
12334 -24628081 -17595029 -14694925 -21615392 -21259725 -17030733 -21275077 -22324837 -24158209 -28027634
12325 -28027634 -23885236 -18698341 -18977631 -31008371 -27807279 -24171270 -12335047 -27151493
12317 -27151493 -25868856 -16212193 -8715312 -28678815 -22300213 -24314034 -24358582 -16953618 -15276941
12308 -15276941 -18189559 -7910604 -1684516 -17692864 3312807 -10102669 -6669622 -14642967
12300 -14642967 -16236592 -20873345 -27354041 -18332268 -12057226 -14888557 -18728713 -10027986 -17204690
12291 -17204690 -20081225 -5448461 -12048332 -20515070 -18360076 -28485903 -13534011 -18154281
12283 -18154281 -20359524 -29012096 -29406419 -14671315 -23870708 -13894378 -17214111 -27884914 -31327019
12274 -31327019 -30908651 -22182137 -16403781 -21561158 -28603337 -30285181 -29136510 -24550248 -24809271
12265 -24809271 -29934594 -28611033 -28738199 -18281673 -18893607 -1444026 -8005612 -14426662 -19770955
12256 -19770955 -22219890 -17728926 -29169462 -20115362 -21064195 -29907515 -13459592 -11289006 -18236132
12247 -18236132 -18910376 -17194229 -7456055 -9271281 -10705562 -16421861 -12058426 -15498411 -21251868
12238 -21251868 -11135006 -11990990 -7247034 -5312245 -23377679 -18764382 -11358668 -23269547
12230 -23269547 -28454496 -22059154 -25204365 -18578995 -22407555 -18770217 -31163671 -24441607 -26840593
12221 -26840593 -26531907 -21295721 -11264589 -23584432 -22979272 -16583359 -23795863 -22357849 -18730515
12212 -18730515 -6498501 -20278377 -39647790 -31403315 -32979324 -26881267 -11726256 -15436180
12204 -15436180 -16577646 -15658382 -19800624 -19119061 -28277691 -27682830 -24971052 -16597046 -12792802
12195 -12792802 -14672704 -17095201 -13063447 -19396061 -25033938 -21407566 -26778858 -27678954 -30483803
12186 -30483803 -13104216 -19916322 -28610517 -30083121 -18676471 -18387048 -15256240 -12403079 -10235462
12177 -10235462 -9563147 -11930182 -32239983 -25288686 -27064995 -16560959 -27158449 -26578526 -28754712
12168 -28754712 -9127994 -23026578 -21097867 -23059047 -23357718 -17727887 -20735662 -13074529 -19002769
12159 -19002769 -13556118 -13860780 -24334193 -20545640 -16260073 -5153721 -15956582 -22422686 -22541429
12150 -22541429 -39457600 -19947579 -15943105 -15846614 -12154936 -19931906 -15772572 -24782616 -20994609
12141 -20994609 -10367409 -13061204 -15888124 -18956832 -14725499 -11334586 -8992675 -17397565 -10797616
12132 -10797616 -17446191 -12376538 -9758127 -14888000 -19439703 -1645170 -7814586 -17255522 -13350920
12123 -13350920 -14133244 -19243205 -8692537 -9991627 -6500707 -15123717 -18218822 -12514176 -20798384
12114 -20798384 -28413045 -32641536 -23211474 -25784016 -22271574 -9153193 -22717515 -10881458
12106 -10881458 -19149021 -6575618 -11501295 -16112547 -608828 -12034287 -4522749 -13961560
12098 -13961560 -14637849 -3811689 -6497151 -13105606 -6959470 -8368617 -17821611 -12074398 -17966867
12089 -17966867 -6684358 8773977 34022671 50744283 -56364037 -10730022 -10242012 -1154692
12081 -1154692 -4216927 -18140933 -20908487 -11851268 -8179061 -12922461 -15632963 -7805441 -20696906
12072 -20696906 -12215953 -29893130 -15435801 -4256263 -8889475 -20406702 -20842276 -23985114
12064 -23985114 -11526251 -8156627 -28872080 -16801183 -25443355 -36078320 -28492819 -18479798
12056 -18479798 949906 -15162190 -8123061 -18515730 -27966116 -26779465 -21353625 -14561439
12048 -14561439 -7878367 -6424757 -10963702 -13945867 -21438003 -19186071 -18769935 -6718217 -10179713
12039 -10179713 -16794926 -17190216 -12329154 -13312205 -20840909 -22514942 -2299696 -16970045 -20769811
12030 -20769811 -19848075 -22766556 -20774055 -24036333 -22760428 -17035538 -17294901 -11370507 -13087541
12021 -13087541 -3979543 829140 -1295960 -5302208 -21448512 -21294455 -14637585 -6003331 -15427008
12012 -15427008 -20952081 -15704393 -23865006 -15722295 -15807930 -12863171 -19112285 -17549965 -16487709
12003 -16487709 -8178146 -5988249 -4621517 -10311190 -18675956 -13176728 -1963671 -19390723
11995 -19390723 -10271971 -21024031 -9153943 -16347738 -578617 -3281957 -7714178 -14073828
11987 -14073828 -13797637 -2887941 -11901296 -17031595 -8727865 -2995681 -6683216 -26769171 -23739709
11978 -23739709 -17873816 -14137480 -27249980 -9945298 -13198184 -16953200 -4553497 -6243164
11970 -6243164 -23733820 -20835619 -30842357 -25397035 -21686311 -15116471 -7159100 -9075222 -6864253
11961 -6864253 -10430567 -8667035 -15828965 -17708708 -12960235 -14075186 -20332172 -17266875 -10460506
11952 -10460506 -5725826 -6004202 -18334222 -27104178 -19188445 -4913363 -23519856 -15369750
11944 -15369750 -18311353 -26253671 -11582777 -23078964 -17671027 -16833566 -26330023 -19535607 -19364477
11935 -19364477 -26202338 -12836915 -24029828 -25806170 -12546848 -11753347 -2646927 -9161214
11927 -9161214 -1492238 -19730361 -21794082 -19948057 -8806319 -12469339 -16002165 -19209674 -14053894
11918 -14053894 -8525845 -16033095 -15191285 -16037252 -9982044 -19370332 -11967931 -9611111 -4556805
11909 -4556805 -14351658 -14905097 -11581225 -7877329 -10089744 -21338538 -170719 -17343858 -10445945
11900 -10445945 -9320945 -16971035 -21852740 -20545409 -24786042 -20778807 -18635490 -20572769 -14146671
11891 -14146671 -9429928 -8638480 -18011260 -1644556 -4168573 -15898888 -14308068 -6456824 -12209840
11882 -12209840 -14853881 -12880303 -16536885 -9529833 -16059263 -19455062 -11343547 -7130960 -5702555
11873 -5702555 -13599650 -4539272 -15245837 -22677371 -15673419 -6387466 -16791734 -27856281
11865 -27856281 -16878969 -21831131 -30042373 -23349251 -19803403 -13612195 -12916068 -10022474 -10311899
11856 -10311899 -22232960 -17351135 -8227569 -23880065 -14900131 -15022643 -14912655 -17235204 -16683571
11847 -16683571 -7810448 -7989893 -19842945 -12451907 -17853073 -15841166 -8327800 -21612743 -25067645
11838 -25067645 -21935887 -1426873 -7297456 -20078631 -8986062 -21211885 -4118378 -9624809
11830 -9624809 -15696934 -12026814 -22150940 -18199425 -12882700 -6232357 -17445792 -13633135
11822 -13633135 -25158554 -15046181 -11933988 -21629103 -12530014 -13482525 -13735665 -3838645 -13383530
11813 -13383530 -10454481 -19501101 -16504908 -16720256 -19199304 -4829421 -14528603 -14887170 -7491738
11804 -7491738 -11428706 -13419327 -15215821 -9581622 -6911798 -11601701 -9340963 -10233378 -21713210
11795 -21713210 -11071076 -6372271 -6389418 -14272673 -10742608 -12390782 -10272703 -7260346 -6142220
11786 -6142220 -5384388 -11836732 -17818416 -16879328 -20310817 -17791011 -8323175 -15461762 -21524294
11777 -21524294 -14164370 -10297500 -16184509 -16492851 -13937742 -18455296 -9089057 -12063387 -8842593
11768 -8842593 -6319091 -14312016 -7981950 -28003135 -17166202 -10889065 -13761904 -8772251 -15090322
11759 -15090322 -29077741 -17218771 -15232621 -14129676 3045317 -2732664 -9740562 -17641130
11751 -17641130 -11698840 -11988935 -9044360 1915693 -20592915 -10513675 -13836330 -7295008
11743 -7295008 -4868521 -13187556 -15987329 -8893167 -1094715 868286 -611494 -10640603 -2147726
11734 -2147726 376865 -486179 -407121 -7648815 -7161164 -21345920 -13099979 -19790960 -24767356
11725 -24767356 -15798193 -2216014 -18574138 -24283553 -10660588 -12253749 -1347122 -7200291
11717 -7200291 -8078083 -8989778 -12820324 -4381644 -9258236 -19271172 -22274409 -19171685 -19613675
11708 -19613675 -4137022 -9807835 -8378911 -5284882 -7561261 -6711509 7536009 -5316994
11700 -5316994 -2605925 356163 -6344271 -3841990 -8079126 -21576929 -24673855 -14897203 -16433469
11691 -16433469 -13237862 -15771233 -10319517 -10865617 -9940531 -3751396 -4221005 -18536239 -19531118
11682 -19531118 -1455558 -10177907 -17280365 -2164935 -7907051 -23118472 -16010852 -8844231
11674 -8844231 -21451129 -12508241 -23174705 -17760440 -15507978 -8437126 -16343123 -13734890
11666 -13734890 -2547347 -18056389 -8222835 -7788096 -10640522 6649256 6625641 -2626526 -5214769
11657 -5214769 -15277344 -19745786 -30981647 -8898671 -13334235 -10890183 -9219398 -15569033
11649 -15569033 -17093496 -8972846 -13936717 -145919 -9017314 -9339847 -14228035 -10277670 -1845099
11640 -1845099 -4437590 -15234221 -14727769 -1849111 -3337714 -5908100 -4537411 -2068034 -9716166
11631 -9716166 3176899 -7802637 -15277660 -5721892 -975044 -5140010 -11116607 -16074870 -9814443
11622 -9814443 -19443957 -20442235 -11619935 -4709392 3977011 2747762 -19861027 -5967538 -12375457
11613 -12375457 -7630764 1316719 828565 -12299430 -12363525 -7538046 -13484185 -15865752 -675152
11604 -675152 -13586874 -7069701 -3743454 -14430359 -7632582 -4575518 3072611 -7395313 -10976015
11595 -10976015 -19084966 -18589719 -12601793 -12848918 -12951221 -14537973 -3220264 -14073357 -4985021
11586 -4985021 -11292128 -9559265 -11010365 -1860057 -15357551 -16912067 -19532227 -20733209 -13574943
11577 -13574943 -6740801 -4076690 -3468559 -2003606 -20888028 -18637450 -19291508 -18754463 -18601274
11568 -18601274 -13481924 -26122008 -11770903 -18775154 -13395121 -5111294 -6889870 -9034881
11560 -9034881 -1727493 -5583311 -10553894 -10063627 -5677343 -14019499 -7432246 -16518564 -3948882
11551 -3948882 -7716199 -7932102 1834385 -9028313 1716688 -7990173 -23121544 -14156839 -21981261
11542 -21981261 -18483964 -9761516 -12180176 3437760 -5125240 -13473877 -11582210 -5746139 -8966669
11533 -8966669 -11685737 -9959566 -10396698 -15788554 -18020544 -7482299 -3785935 -10588600 -3045220
11524 -3045220 -12754239 -3486292 -12660510 -13902733 -8387784 -8192765 -7968605 -1769179 -4634927
11515 -4634927 -4482735 -7456526 -16152103 -7208289 -3567436 -13563609 -11503078 -13419384 -15222455
11506 -15222455 -4356848 -4589191 -17709276 -10920982 -2786426 -9595990 -251450 1622545 -4425016
11497 -4425016 -13196844 -8184255 -7745136 -6588853 -10095696 -8570157 -4560833 2846148 -12949582
11488 -12949582 -3435143 1901313 -3419172 7616408 -11626336 1407096 -8854635 -7001337
11480 -7001337 7871163 -2527604 -18420077 -16511296 -477597 -8124658 -13949835 -12169704
11472 -12169704 -10226539 -6807395 -3021098 -4532579 -2392535 -5792661 -2097307 -8340326 -14664992
11463 -14664992 -21185752 -14799649 -18857887 -334990 -8598391 -2945399 -7198854 -4027541 -12613068
11454 -12613068 -13943959 -5506510 -12955580 -13897701 -18185005 -15242677 -10782423 -9216585 -10425015
11445 -10425015 -12400886 -9804426 -11110726 -9329179 -15367702 -11473080 -8489922 -83167 -917114
11436 -917114 -5727557 -3620653 -8161553 -4059130 -4050556 7372107 3076338 6224711 -1317490
11427 -1317490 -5307887 -5456850 114236 -67533 -4668942 -12413776 -8561742 -10598402 -9277550
11418 -9277550 -7696289 -7785730 -5684823 -11851660 -13576305 -11036031 -9295096 -7638975 -5342707
11409 -5342707 25812 -11550417 -11913656 165038 4197778 -4496050 -9350557 -4113357 -11777750
11400 -11777750 -4770794 -9160570 -24973321 -7849547 -15794101 -20817765 1744174 845272
11392 845272 5078962 -12473416 -6634448 -13978059 -710194 -3745971 -11313167 2295390 3300495
11383 3300495 -440846 -724165 -1851385 1965793 -6657133 -1509473 -10409400 -15568190 -13513260
11374 -13513260 -5494197 -16155552 -19782016 -9787630 -7049889 3763503 2231754 -9963235
11366 -9963235 -12301291 -5738608 -2756650 -15775142 -15254738 -2321441 -8283247 -17989554 -2597402
11357 -2597402 -17544729 -5783816 -6962965 -7310002 -5702619 -3884698 -5544730 -8576236 -4450095
11348 -4450095 697760 -6462617 6075668 -384140 -4007301 -8704170 -1351435 4315288 -9337577
11339 -9337577 -19008335 -7172669 -970761 -7424351 -684152 -9066913 -9634740 -9209287 -5435849
11330 -5435849 -10403854 -1980149 -4632151 11549151 -4547611 -6327692 -6184425 -15151551 -14874157
11321 -14874157 -11579468 -12137186 -477078 1169443 -8812890 626203 -4450602 7818583
11313 7818583 -7830093 -13673359 -10687260 -6556099 4982528 -5558045 -17077549 -2135194
11305 -2135194 -8164954 -6537898 5834277 -1701788 -17475400 -18405094 -7457334 -10569396 -4858596
11296 -4858596 -5043063 8374321 -11920609 -17385030 -14570202 -5912676 -1499099 -11849466 -4478321
11287 -4478321 1504232 -17122635 -22394391 -15379766 -14448531 -7772645 -9558006 -10090217 -13130812
11278 -13130812 -6737909 -3042504 -13414480 -4737917 -11778632 -2796922 -646393 -3809326 -11590692
11269 -11590692 -5666488 -275405 836637 -15325630 -16728139 -8773515 2766377 -10223352
11261 -10223352 1026778 -2677275 11886652 710041 -3875541 -6295246 -8212029 118925
11253 118925 -366974 -8380818 -5539856 -13257418 -10693775 -14390288 -463157 2180078 -1588080
11244 -1588080 9346102 7882221 180413 -88073 -552717 -4403748 -6064825 -191054 10153379
11235 10153379 -256077 -4799763 -5740408 -2127765 -5553294 -10825286 872679 -10641740
11227 -10641740 -20165913 -3943004 -10927649 -9117921 7133863 591882 5683298 -14187768
11219 -14187768 -11250155 286346 1898409 -15447480 -21387374 -13205995 -4361164 -10615645
11211 -10615645 -6313403 2208375 -685216 454255 1805942 -1240672 -1222595 -9332200 -9535063
11202 -9535063 -5436799 -8300604 -3982295 -11188244 -16454365 1223808 6927136 13135470 10981473
11193 10981473 -3801270 -16692034 -13431348 -7436576 9392172 -60362 306753 -15789386
11185 -15789386 -1916828 4861496 6019016 220295 659568 2340671 3651838 -2405950 -8319834
11176 -8319834 -6167193 -4195327 -11164310 -17795092 -5926646 -10866537 -8818228 -3003455 -4894225
11167 -4894225 -9609489 -4008517 1909599 -13997311 -10037360 -4935680 -6299957 -17071319
11159 -17071319 1040191 -3970108 -9857339 -10501038 -12924935 311396 -3690451 -12566337 -12054304
11150 -12054304 -2374586 -11069984 -7952905 835497 -9185134 3869673 9781402 5490962
11142 5490962 819544 6051623 1347568 7068842 111044 7283095 4160228 11922314 -9914885
11133 -9914885 -3693992 6461955 9646069 -157888 9807903 1236852 5914073 -2427306 -1938118
11124 -1938118 -6381448 -2707092 55902 2993875 -486306 -8864651 2319278 4976156 -4303374
11115 -4303374 2071869 5245343 3342372 4397798 2563895 3498981 5545578 4872259 2496967
11106 2496967 -4620190 1012529 -1333276 4171221 -1903192 14930453 1228319 -6731406 -3498940
11097 -3498940 4511658 -13809896 -5615655 416009 -6525322 -10032286 -3839879 4091616 2139441
11088 2139441 -8318703 6882306 -5337503 5568097 2945709 -2160485 9234643 3258636
11080 3258636 9301932 12370901 8440364 4231514 12980617 -3765372 -9352704 -3744121 -3096833
11071 -3096833 1863611 13909517 -1188072 -5655574 -8221256 -2447176 -7199540 -10537941 -3341483
11062 -3341483 -1157605 -3048702 1826849 -1570257 4115663 -4608482 -12205504 -3237138 -7262924
11053 -7262924 -10613373 -9562818 -3427590 -9697288 -5224515 -1476333 -3747930 -4076566 -2415137
11044 -2415137 -1956396 3194222 12915801 -1059037 -10505468 -15176153 -570738 -3747357 -1358670
11035 -1358670 -13578344 5947790 -594739 -2951466 3306329 -984498 6113378 -6708925
11027 -6708925 -10758793 3548247 4546951 -8172833 -508783 777534 2857798 -9031035
11019 -9031035 2046325 -6807457 -7812042 -16863427 -277865 2372999 1024929 2733472 3469918
11010 3469918 -859886 6705436 11178359 6562367 5024248 3119548 5751944 -4735203 -24272008
11001 -24272008 -26891200 -17305434 -8348048 -5433673 6143116 7521484 2414775 7763882
10993 7763882 -7808418 -11839411 -4967120 10286571 -10045906 4688570 133778 7493194
10985 7493194 -2031251 -6571816 -7279127 -17737817 -980034 2851837 13450442 18057255
10977 18057255 -6150474 -4938441 -1499663 2350470 1657087 -3149810 -6936900 6399430 -2241721
10968 -2241721 3414790 -2958521 -761662 -4388901 -1124798 2844034 1741505 703251 -1963595
10959 -1963595 -10030099 -9052064 -5615390 -13506529 -6240360 -6832675 1096291 -761285 8425
10950 8425 670731 -2518857 -384258 1248828 4559589 -2473384 -2949498 5126366 38930
10941 38930 -15264526 -8782650 -6307262 -5931535 7411911 -1737962 -2632017 4467193 5249221
10932 5249221 4276243 -4186205 -8800898 -5135780 -1140375 2848499 -10296559 -5095972 10137397
10923 10137397 8675545 -5894572 -6457086 5909028 -8554594 -2167884 -3769389 4293403
10915 4293403 -7353648 -4045072 -2858038 -1340533 -6343982 5911477 -5823048 6402119
10907 6402119 -1232622 -6572283 1620790 5385566 11005420 4215855 6719108 2678174 -12728072
10898 -12728072 -7374975 7748541 664416 -1083333 -3958126 -6446819 -870362 405799 84543
10889 84543 5914660 9818336 1670870 6059631 7032025 8428200 8455210 9640448 7255464 -494157
10879 -494157 2136157 -8494675 -10233904 -8081320 749381 -4309939 -4667982 -293690 -7355756
10870 -7355756 -1091043 -7661672 3508189 725226 6869369 3572342 -1446255 -5989252 1291393
10861 1291393 -6320185 243318 10362278 -4783171 -16045767 -16265771 -4783416 3147754
10853 3147754 -2728572 -3333455 -7006437 -10253466 911036 7395759 11646026 -4570246 8113279
10844 8113279 818014 -13189337 -12265794 6525232 15872487 8244387 -377210 5831990 -1090121
10835 -1090121 5202312 1360996 -2103500 -1085374 9615372 6717275 200810 9605517 2682352
10826 2682352 -2705581 6685345 14243617 14034 -8991884 15137984 5187569 -4924705
10818 -4924705 10422257 -12888458 -12573156 -140165 -3923433 -10031657 8488823 5278626
10810 5278626 1213219 -1301385 3027869 -1018023 -1588691 9010520 -912349 -1476640 -2398036
10801 -2398036 -3029643 -10584213 -5736585 -4589978 -2846563 3630429 11213649 -9261050 9121922
10792 9121922 16730306 5283234 4187440 7236773 3620707 4858353 -1153124 17461570
10784 17461570 5189986 -5202675 -3102953 8177996 18055755 9334270 9908920 8924884 7599751
10775 7599751 4234074 -944807 -15936819 7975353 9686016 9653602 -1627424 9043831 11496004
10766 11496004 2049229 -577596 -865175 4561306 11174228 7861126 4069808 -7302100 3021280
10757 3021280 5406094 -6304310 11603934 14942229 3925679 243830 6447488 17448520
10749 17448520 7687482 19050034 17103154 17576064 1815570 13374816 4792362 5152296 14201153
10740 14201153 9429258 17416390 -12664375 716655 415844 4521678 8135641 -1653554 7309347
10731 7309347 15936535 830597 4098526 -9721247 8830647 5511927 7207040 14507326
$$ [...]
-2730d9602090  $$ checkpoint
##END NTUPLES=
##END=
