##TITLE= S#395417
##JCAMP-DX= 5.00 $$ JEOL NMR v1.10
##DATA TYPE= NMR SPECTRUM
##DATA CLASS= NTUPLES
##NUM DIM= 1
##ORIGIN= DELTA_NMR
##OWNER= NMR
##SPECTROMETER/DATA SYSTEM= DELTA_NMR
##.OBSERVE FREQUENCY= 3.00529655924288E+02
##.OBSERVE NUCLEUS= ^1H
##.DELAY= (2.195E+02,2.195E+02)
##.ACQUISITION MODE= SIMULTANEOUS
##.FIELD= 7.0586013
##.FILTER WIDTH= 1.81675738660864
##.ACQUISITION TIME= 3.6339712
##.SPINNING RATE= 14
##.OBSERVE 90= 9.2
$$ ------------------------
$$ JEOL SPECIFIC PARAMETERS
##$FILENAME= C:\NMR/vanceoxidation-5.jdf
##$TITLE= S#395417
##$AUTHOR= NMR
##$CREATION=  1-FEB-2018 10:53:15
##$REVISION=  1-FEB-2018 11:00:28
##$CONTENT= PROTON NMR EXPERIMENT
##$INSTRUMENT= DELTA_NMR
##$SITE= Center College ECP+ 300
##$NODENAME= nmr2
##$DIMENSIONS= 1
##$STORAGE= FLOAT
##$X_FORMAT= COMPLEX
##$X_CURR_POINTS= 16384
##$X_START= 12.50103 $$ppm
##$X_STOP= -2.50012 $$ppm
##$X_TITLE= 1H                             
##$X_ZERO_POINT= 0.33329
##$X_FREQ_FLIP= FALSE
##$X_POINTS= 16384
##$X_PRESCANS= 0
##$X_DOMAIN= 1H
##$X_OFFSET= 5 $$ppm
##$X_FREQ= 300.52966 $$MHz
##$X_SWEEP= 4.50857 $$kHz
##$X_RESOLUTION= 0.27518 $$Hz
##$SOLVENT= CHLOROFORM-D
##$TEMP_GET= 20.5 $$dC
##$ACQ_DELAY= 0.2195 $$ms
##$DIGITAL_FILTER= FALSE
##$FILTER_FACTOR= 1
##$FILTER_WIDTH= 2.254 $$kHz
##$FILTER_MODE= BUTTERWORTH
##$TRANSITION_RATIO= 0.9
##$ORDERS
##$FACTORS
##$LOCK_STRENGTH= 246
##$LOCK_LEVEL= 200
##$LOCK_GAIN= 26
##$LOCK_OSC_OFFSET= 25.6519 $$kHz
##$LOCK_PHASE= 187 $$deg
##$LOCK_OSC_STATE= 2H OSC ON
##$X_ANGLE= 45 $$deg
##$X90= 9.2 $$us
##$X90_HI= 10 $$us
##$X90_LO= 50 $$us
##$X_90_WIDTH= 9.2 $$us
##$X_PULSE= 4.6 $$us
##$RELAXATION_DELAY= 4 $$s
##$SCANS= 8
##$PROBE_ID= 1412
##$ITERATIONS= 1
##$FIELD_STRENGTH= 7.0586 $$T
##$TEMP_SET= 25 $$dC
##$SPIN_SET= 15 $$Hz
##$SPIN_GET= 14 $$Hz
##$HE_LEVEL= 75 $$%
##$N2_LEVEL= 83 $$%
##$CHANGER_SAMPLE= 0
##$ADC_CARD= 16/1MHz/20
##$EXPERIMENT= single_pulse.exp
##$OBS_NOISE= WAUGH
##$IRR_NOISE= WALTZ
##$TRI_NOISE= WALTZ
##$QUA_NOISE= WAUGH
##$OBS_PWIDTH= 1 $$us
##$IRR_PWIDTH= 50 $$us
##$TRI_PWIDTH= 1 $$us
##$QUA_PWIDTH= 1 $$us
##$RECVR_GAIN= 4
##$IRR90= 9.2 $$us
##$TRI90= 10 $$us
##$QUA90= 10 $$us
##$IRR90_HI= 10 $$us
##$QUA90_HI= 10 $$us
##$IRR90_LO= 50 $$us
##$TRI90_LO= 10 $$us
##$QUA90_LO= 10 $$us
##$MOD_RETURN= 1
##$TOTAL_SCANS= 8
##$X_ACQ_DURATION= 3.63397 $$s
##$DELAY_OF_START= 1 $$s
##$ACTUAL_START_TIME= 886330328
##$CLIPPED= FALSE
##$DC_BALANCED= FALSE
##$TRI90_HI= 10 $$us
##$SPIN_LOCK_90= 100 $$us
##$SPIN_LOCK_ATTN= 24.4 $$dB
##$DEUT_GRAD_SHIM_90= 213 $$us
##$DEUT_GRAD_SHIM_ATTN= 9 $$dB
##$IRR_CODE= 146
##$LOCK_STATE= LOCK ON
##$AUTOLOCK_LEVEL= 200
##$SAWTOOTH_RANGE= 4
##$LOCK_STATUS= IDLE
##$LOCK_SETTLE_POINT= 4096
##$LOCK_ACHIEVE_POINT= 0
##$SPIN_ACTION= SPIN ON
##$SPIN_STATE= SPIN ON
##$SPIN_STATUS= SPIN ON
##$SPIN_GAS_SOURCE= AIR
##$TEMP_ACTION= TEMP OFF
##$TEMP_STATE= TEMP OFF
##$TEMP_STATUS= TEMP OFF
##$TEMP_COMP= 0
##$TEMP_DELAY= 0 $$s
##$TEMP_LIMIT_HI= 150 $$dC
##$TEMP_LIMIT_LO= -100 $$dC
##$TEMP_MELTING= -63 $$dC
$$ [...]
##$VT_PID_STD_WB_H_TD= 5
##$VT_PID_STD_WB_H_CBL= 10
##$VT_PID_STD_WB_H_CBH= 0
##$VT_PID_STD_WB_H_HC= 2.4
##$VT_PID_STD_WB_H_HL= 70
##$VT_PID_STD_WB_M_PB= 1.5
##$VT_PID_STD_WB_M_TI= 30
##$VT_PID_STD_WB_M_TD= 5
##$VT_PID_STD_WB_M_CBL= 9.9
##$VT_PID_STD_WB_M_CBH= 2.3
##$VT_PID_STD_WB_M_HC= 2.5
##$VT_PID_STD_WB_M_HL= 70
##$VT_PID_STD_WB_L_PB= 1.3
##$VT_PID_STD_WB_L_TI= 29
##$VT_PID_STD_WB_L_TD= 5
##$VT_PID_STD_WB_L_CBL= 20
##$VT_PID_STD_WB_L_CBH= 20
##$VT_PID_STD_WB_L_HC= 0.6
##$VT_PID_STD_WB_L_HL= 100
##$VT_PID_LONG_0_H_PB= 1.5
##$VT_PID_LONG_0_H_TI= 30
##$VT_PID_LONG_0_H_TD= 5
##$VT_PID_LONG_0_H_CBL= 9.9
##$VT_PID_LONG_0_H_CBH= 2.3
##$VT_PID_LONG_0_H_HC= 2.5
##$VT_PID_LONG_0_H_HL= 70
##$VT_PID_LONG_0_M_PB= 1.5
##$VT_PID_LONG_0_M_TI= 30
##$VT_PID_LONG_0_M_TD= 5
##$VT_PID_LONG_0_M_CBL= 9.9
##$VT_PID_LONG_0_M_CBH= 2.3
##$VT_PID_LONG_0_M_HC= 2.5
##$VT_PID_LONG_0_M_HL= 70
##$VT_PID_LONG_40_H_PB= 1.5
##$VT_PID_LONG_40_H_TI= 30
##$VT_PID_LONG_40_H_TD= 5
##$VT_PID_LONG_40_H_CBL= 9.9
##$VT_PID_LONG_40_H_CBH= 2.3
##$VT_PID_LONG_40_H_HC= 2.5
##$VT_PID_LONG_40_H_HL= 70
##$VT_PID_LONG_40_M_PB= 1.5
##$VT_PID_LONG_40_M_TI= 30
##$VT_PID_LONG_40_M_TD= 5
##$VT_PID_LONG_40_M_CBL= 9.9
##$VT_PID_LONG_40_M_CBH= 2.3
##$VT_PID_LONG_40_M_HC= 2.5
##$VT_PID_LONG_40_M_HL= 70
##$SAMPLE_ACTION= LOADED
##$SAMPLE_STATE= LOAD
##$SAMPLE_STATUS= LOADED
##$AUTOSHIM_MODE= AUTOSHIM OFF
##$AUTOSHIM_DELAY= 3600 $$s
##$AUTOSHIM_TRACK= AUTOSHIM OFF
##$SHIM_MAX_RECALL= MAX FOUND
##$SHIM_NAMES= SHIM_Z0
##$SHIM_Z0= 9167
##$SHIM_Z1= 5211
##$SHIM_Z2= 22
##$SHIM_Z3= -2829
##$SHIM_Z4= -240
##$SHIM_Z5= 46
##$SHIM_Z6= -33
##$SHIM_X= -14
##$SHIM_XZ= 16
##$SHIM_XZ2= 0
##$SHIM_XZ3= 0
##$SHIM_X2= -7
##$SHIM_X2Z= -40
##$SHIM_X3= 0
##$SHIM_Y= 1608
##$SHIM_YZ= 13
##$SHIM_YZ2= 10
##$SHIM_YZ3= 0
##$SHIM_Y2= -11
##$SHIM_Y2Z= -20
##$SHIM_Y3= 0
##$NUM_SCANS= 1
##$END_TIME= 886330395
##$LOCAL_TIME= 886330395
##$PROBE_ATN= 0
##$PROBE_TUNE= 0
##$PROBE_MATCH= 2077
##$PROBE_COARSE= NONE
##$LF_TUNE_DIAL= 0
##$LF_MATCH_DIAL= 0
##$HF_TUNE_DIAL= 0
##$HF_MATCH_DIAL= 0
##$PASS_RIPPLE= 0.01 $$dB
##$STOP_RIPPLE= 60 $$dB
##$PROBE_RECOVERY= 0 $$us
##$AF_DELAY_RATIO= 0
##$VERSION= 4.3.3
##$X_ACQ_TIME= 3.63397 $$s
##$DEAD_TIME= 0 $$us
##$DELAY= 0 $$us
##$PHASE_PRESET= 3 $$us
##$UNBLANK_TIME= 2 $$us
##$INITIAL_WAIT= 1 $$s
##$NORMALIZED= TRUE
$$ END OF JEOL SPECIFIC PARAMETERS
$$ -------------------------------
##NTUPLES= NMR SPECTRUM
##VAR NAME= FREQUENCY,    SPECTRUM/REAL, SPECTRUM/IMAG, PAGE NUMBER
##SYMBOL=   X,            R,             I,             N
##VAR TYPE= INDEPENDENT,  DEPENDENT,     DEPENDENT,     PAGE
##VAR FORM= AFFN,         ASDF,          ASDF,          AFFN
##VAR DIM=  16384, 16384, 16384, 2
##UNITS= PPM,     ARBITRARY UNITS, ARBITRARY UNITS, 
##FIRST=  1.2501033903057E+01, 3.74336843940891, 2.5866995650868, 1
##LAST=  -2.50011824950436, 3.12018687429661, 3.26552763022582, 2
##FACTOR=  9.1565355261926E-04, 3.38591299054216E-04, 3.38591299054216E-04, 1
##PAGE= N=1
##DATA TABLE=(X++(R..R)), XYDATA
$$ [...]
4886i076074j183617j424117j538060p55852o56854j246002p33247j102445j147393l39936
4876a9203597k016911l45330j903617j334994j382898q34851k80108j157638j192028
4867b9651972l82092j356079j448516n08231j212300j477699j144990j91889k405078
4858c9778846k55949j410885m26943j702508o50760j782618r87671k6503j146814k020388
4848e0189885J033894p28287k196327m44250n2766j129690j54318k76258o40939j093134
4838e5871960p54888l69855j090039k36204l98534J150323r68991O27634j339128j86202
4828e9437844j336886J286937j537627P88664n99148K69128O85024l83225M09693Q31326
4818e9023958J491797j326369J087787l72323J615615q0622l34357J139759Q34255J576243
$$ y = [-9076074, -10259691, -11683808, -13221868, -13977720, -14634574, -15880576, -16613823, -17716268, -18863661, -19203597, -21220508, -21565838, -23469455, -24804449, -26187347, -27022198, -27302306, -28459944, -29651972, -30034064, -31390143, -32838659, -33346890, -34559190, -36036889, -37181879, -37373768, -39778846, -40034795, -41445680, -41872623, -43575131, -44225891, -46008509, -46996180, -47022683, -48169497, -50189885, -49155991, -49884278, -52080605, -52524855, -52577621, -53707311, -53861629, -54137887, -54778826, -55871960, -56626848, -56996703, -58086742, -58322946, -58721480, -57571157, -58540148, -57912514, -59251642, -59437844, -60774730, -59487793, -61025420, -60236756, -60835904, -60566776, -59881752, -60264977, -59855284, -59023958, -57532161, -58858530, -57770743, -58143066, -56527451, -56608073, -56942430, -55802671, -54968416, -53392173]
4808e3392173k415667M52991J086774J486381Q10215R43764R60675K497359Q51809J87257
4798d6530615J237857P08742P11440J938484J611897J268575J066586J078214L86329
4789c6522491N37324J831906J195646K758570J574469P01390L72098J185940K497269
4780b3867879J216201K290665J461851J216709Q41355N33259J855549K191646J234954
4771a1025690J530148J222835m14109M85463M852414P62107J226144K440006J78061
4762A257379J287709J949139J345218J253702J828140K109339k65378J092686J484460
4753A3342394J563550J693332j49650J502422N08831J114455Q88993M67495J309209M19401
4743B2660432R83078J429041J80657O37904K072608L87022j96838P13228M36418P29904
$$ y = [-53392173, -55807840, -55354849, -54268075, -52781694, -51971479, -51027715, -50067040, -47569681, -46717872, -46530615, -45292758, -44584016, -43872576, -41934092, -40322195, -39053620, -37987034, -36908820, -36522491, -35985167, -34153261, -32957615, -30199045, -28624576, -27923186, -27551088, -26365148, -23867879, -22651678, -20361013, -18899162, -17682453, -16841098, -16307839, -14452290, -12260644, -11025690, -9495542, -8272707, -8686816, -8201353, -3348939, -2586832, -1360688, 1079318, 1257379, 2545088, 4494227, 5839445, 7093147, 8921287, 11030626, 10765248, 11857934, 13342394, 14905944, 16599276, 16449626, 17952048, 18460879, 19575334, 20464327, 20931822, 22241031, 22660432, 23643510, 25072551, 25253208, 25891112, 27963720, 28350742, 28153904, 28867132, 29303550, 30033454]
4733C0033454M48384P2505J657593J77605j373874O09571l95540K366170n20405P86471
4723C3861934j144145J13135K91249Q77201j220508j518529J003913J688583l86398p31453
4713C2834982n13479j038891O13798j01068n83433q5445j162326K19035j76725o61846
4703B9344602m42206K19994j162467j38847j96785j365647j142895o40028K16118o24418
4693B4067421q08167J68035l17453k760j603814k29652j197186m1853n38061Q37078q23474
4682A9510114j254098l09098Q13834n55559n65818N62174j165539m18595l27037N294
4672A6295672j29278k99248O56115l02290p70639L91070L23433j402281R06176l62212
4662A5306518J18572P35715M5635M97107m09671J170574J48027j85300j7631P42101o85956
$$ y = [30033454, 30481838, 30554343, 32211936, 32389541, 31015667, 31625238, 31229698, 33595868, 33075463, 33861934, 32717789, 32830924, 33122173, 33999374, 32778866, 31260337, 32264250, 33952833, 33566435, 32834982, 32321503, 31282612, 31896410, 31795342, 31211909, 31126464, 29964138, 30183173, 30006448, 29344602, 28902396, 29122390, 27959923, 27821076, 27624291, 26258644, 25115749, 24475721, 24691839, 24067421, 23259254, 23427289, 23109836, 23107076, 21503262, 21273610, 20076424, 20034571, 19496510, 20333588, 19510114, 18256016, 17946918, 18760752, 18205193, 17639375, 18201549, 17036010, 16617415, 16290378, 16295672, 16166394, 15867146, 16523261, 16220971, 15450332, 15841402, 16164835, 14762554, 15668730, 15306518, 15425090, 16160805, 16206440, 16703547, 16293876, 17464450, 17612477, 17427177, 17409546, 18151647, 17465691]
4651A7465691J474535J98885J117686O36734K08563J597954q6250N58589M52691L82172
4641B4007250J105365J332626J831457K97483J034126J288228L0084J691100K61209P53281
4631C3632209J55810L92997J823928R51908J527641N58276J444478Q32108N08441J201156
4621D3028952J128110P60863l22881J503633R14058J147975J750770R25292L78428J755615
4611E2970815L8456P80272J810173Q62905q24421J852623P75670N72811j41069J10437
4601E8808672J550260L2148N13540K73530o05818J590558N88381k547L84248j40500O28134
4590F3620606l48417J91015K07836Q20188l70779k080644m5471n6547o22961j007378
4580F0307448l33785l77121L75981n71359n15828o63923k227129j50271r20060j687129
$$ y = [17465691, 18940226, 19139111, 20256797, 20893531, 21102094, 22700048, 22613798, 23172387, 23625078, 24007250, 25112615, 26445241, 28276698, 28574181, 29608307, 30896535, 30926619, 32617719, 32878928, 33632209, 33788019, 34181016, 36004944, 36956852, 38484493, 39042769, 40487247, 41319355, 41827796, 43028952, 44157062, 44917925, 44595044, 46098677, 47012735, 48160710, 49911480, 50836772, 51215200, 52970815, 53009271, 53789543, 55599716, 56462621, 55638200, 57490823, 58266493, 58839304, 58698235, 58808672, 60358932, 60391080, 60904620, 61178150, 60572332, 62162890, 62751271, 62748724, 63132972, 62992472, 63620606, 63272189, 63463204, 63671040, 64491228, 64120449, 62039805, 61994334, 61937787, 61314826, 60307448, 59973663, 59596542, 59972523, 59401164, 58885336, 58221413, 55994284, 55844013, 54923953, 53236824]
4570E3236824r87626r98517q67932j506806m64049j042620k406989o31451o45129k608974
4560D1076731k297569m14702j564323j161396r04883k474190j831792j187660j778846
4551B7461370j812645k426639k066780j802284j126873k238450j409051k458395j358680
4542A0761573l076372k204055j554455k303171j206168k239208k019683k510245o92778
4533g044562k670513j807634l723188j505524o86069j203017k245513k989192k113486
4524b5988698j064586j764400j522545k560248j482994k291652j566112j433588k191977
4515d1866800k831542L98687j293040k341646j687802p06378j302040j081059k586489
4506e5298109p61111j416122l52194j951190j118604n43676j079734j150428j025476
$$ y = [53236824, 52249198, 51250681, 50382749, 48875943, 48411894, 47369274, 44962285, 44330834, 43685705, 41076731, 38779162, 38364460, 36800137, 35638741, 34733858, 32259668, 30427876, 29240216, 27461370, 25648725, 23222086, 21155306, 19353022, 18226149, 15987699, 14578648, 12120253, 10761573, 7685201, 5481146, 3926691, 1623520, 417352, -1821856, -3841539, -6351784, -7044562, -9715075, -11522709, -15245897, -16751421, -17437490, -18640507, -20886020, -23875212, -25988698, -27053284, -28817684, -30340229, -32900477, -34383471, -36675123, -38241235, -39674823, -41866800, -44698342, -44299655, -45592695, -47934341, -49622143, -50328521, -51630561, -52711620, -55298109, -56059220, -57475342, -57827536, -59778726, -60897330, -61441006, -62520740, -63671168, -64696644]
4497f4696644o39725r64789j680186j043023L11216j261844J65904q61717r51891j5444
4487g1638143j80658k50857j9661l96685M40413q74928m20352L8547Q5095j387377M8133
4476g4556473O04743o63370O62800p91504K73882R8415R21329k83669n71845K55330R75618
4465g3074744L62689j400367J226912P49620L25348R04360k073546P97680J575851J08041
4455g0498156J16595j27527R9612j12418J059750n82562r16478K097739l11289M11940
4445f8762794Q47659P92787o25720Q504O80885m22937M8116n70943k94974P00696J98582
4434f7400139q55437n75398K36399M1755O92975k67501P2816l17537R609m70031P43838
4423f8088651n15729j375732m21862J64421L93469r36528J192404j706749l60269m56522
$$ y = [-64696644, -65336369, -66301158, -67981344, -69024367, -68713151, -69974995, -69809091, -70670808, -71622699, -71638143, -71818801, -72069658, -72089319, -72486004, -72045591, -72920519, -73340871, -73302324, -73217229, -74604606, -74556473, -73951730, -74615100, -73952300, -74743804, -74469922, -74371507, -73450178, -73733847, -74305692, -74050362, -73074744, -72712055, -74112422, -72885510, -72135890, -71810542, -70906182, -72979728, -72182048, -70606197, -70498156, -70381561, -70509088, -70409476, -70521894, -69462144, -70044706, -70961184, -68863445, -69174734, -68762794, -67915135, -67122348, -67748068, -67739564, -67058679, -67481616, -67433500, -68004443, -68299417, -67598721, -67400139, -68255576, -68830974, -68594575, -68552820, -67859845, -68127346, -68054530, -68372067, -68362458, -68832489, -68088651, -68604380, -69980112, -70401974, -70237553, -69844084, -70780612, -69588208, -71294957, -71655226, -72111748]
4413g2111748j509506L2302P6505K55942r28026q82715M85612j498873j016927k007185
4403g9104619R10018j05204n66388j419956L29837l0328n61523j526898M77468q39165
4393h2436758k79471j240161Q07324q91283p32340n57996M64053N35067n11022k198909
4383h7041496k2237N22386J19203j57184N089l61256j89771Q29078j400583J423521K64547
4372h6008703L804186l829170K44588Q31334k56697q4593J918050m53609R75586R48601
4362h1910427j16805J676451Q95259J118650O73809J477134J732589r66069J630676
4353g3788733J231673K952466J321336J201450J842544J407099O62810K498768K274056
4344e8396531J636542J419256K137972J251506L046465O06683K674069K475321K009055
$$ y = [-72111748, -73621254, -73588952, -73512447, -73256505, -74184531, -75067246, -74581634, -76080507, -77097434, -79104619, -78194601, -78299805, -78866193, -80286149, -79956312, -79986640, -80548163, -82075061, -81597593, -82436758, -82716229, -83956390, -83149066, -84040349, -84772689, -85330685, -84866632, -84331565, -84842587, -87041496, -87063733, -86541347, -86422144, -86579328, -86574239, -86935495, -87125266, -86296188, -87696771, -86273250, -86008703, -82204517, -86033687, -85789099, -84957765, -85214462, -85299055, -83381005, -83834614, -82859028, -81910427, -82027232, -80350781, -79455522, -78336872, -77663063, -76185929, -74453340, -75419409, -73788733, -72557060, -69604594, -68283258, -67081808, -65239264, -63832165, -63169355, -60670587, -58396531, -56759989, -55340733, -53202761, -51951255, -48904790, -48298107, -45624038, -43148717, -41139662]
4335d1139662K456633R86113L056007J910593K167691L745207L232500J993131J771232
4326a9820555K821073K822231K546986L131296L328283K005972J758800K585554K546450
4317C726090J901857K350292M206493K113028K661589K020686L247363K454937K155001
4308B6837336L545511J842845J642458L325186K208073L594618Q40478K875402K919710
4299D9631617J822844O24235K398788K456941K201112J587922Q60024K042453J972435
4290F5598371J944259J564065K722574R97597P81252J651251J524466K72604K054171J606
4280G9112216Q30041J513251M32608R04739K85804J497878q83291P11788K22016m4034
4270H4583016J031233L71337r90493P28165K97316r63215p58024K59747j424388l7350
$$ y = [-41139662, -38683029, -37696916, -34640909, -32730316, -30562625, -26817418, -23584918, -21591787, -19820555, -16999482, -14177251, -11630265, -8498969, -5170686, -3164714, -1405914, 1179640, 3726090, 5627947, 7978239, 12184732, 14297760, 16959349, 18980035, 22227398, 24682335, 26837336, 30382847, 32225692, 33868150, 37193336, 39401409, 42996027, 43836505, 46711907, 49631617, 51454461, 52078696, 54477484, 56934425, 59135537, 60723459, 61583483, 63625936, 65598371, 67542630, 69106695, 71829269, 72826866, 73608118, 75259369, 76783835, 77056439, 79110610, 79112216, 79942257, 81455508, 81888116, 82792855, 83078659, 84576537, 83693246, 84405034, 84627050, 84583016, 85614249, 85985586, 84995093, 85723258, 86020574, 85057359, 84299335, 84559082, 83134694, 83097344]
4260H3097344o86748j163990N20983m69034o85320k051395j327171r1281p36160k598443
4250G3808785k16728j353010j487631j318403j800030j140911k100569k272694j058782
4241F1060027j532608j898820r61134k582838j299356k218501j889228j739671j429448
4232D5508423k299803j972293j684047j195216k207507k842000j108027k158348k301531
4223B7739651o85727k090916j986974k091579r55773k319407k471066k451287L18013
4214A3004935k616699j143071j408189j168627k161088j178698q29721k609917p85617
4205h96692j706474L48761m78006k107621p06252r62675j737136o28590l87198j403671
4195a0665554m16245K33813m18596j007036r95139K48878M17553j137858j57824N04377
$$ y = [83097344, 82410596, 81246606, 81767589, 81298555, 80613235, 78561840, 77234669, 77143388, 76407228, 73808785, 73592057, 72239047, 70751416, 69433013, 67632983, 66492072, 64391503, 62118809, 61060027, 59527419, 57628599, 56667465, 54084627, 52785271, 50566770, 48677542, 46937871, 45508423, 43208620, 41236327, 39552280, 38357064, 36149557, 33307557, 32199530, 30041182, 27739651, 27053924, 24963008, 22976034, 20884455, 19928682, 17609275, 15138209, 12686922, 13004935, 10388236, 9245165, 7836976, 6668349, 4507261, 3328563, 2498842, -111075, -896692, -2603166, -2254405, -2732411, -4840032, -5546284, -6508959, -8246095, -8874685, -9261883, -10665554, -11081799, -10847986, -11266582, -12273618, -13268757, -13019879, -12602326, -13740184, -13898008, -13393631]
4185a3393631Q7887N37094m22565L62020O92435Q05197M83034j67011j01378Q50803N80192
4174i685923J238298J069573J367538Q15765R23089J028503K07546J475778K306236L66576
4164A112979J810969J667936L20362J996683N01892J915692J517633L98339K602019
4155A3844504J970505K99409R92555K352002J731134J380792J026829J655812K563010
4146B7816552N28047J758203J157599R98295J477803J983229J627846J443421J84623
4137C8975618K321619J149964J51218J932355J377601J091794J542384J582295Q53375
4128E0978223j3314P07690J545584Q49824M91844L59601N08380J119806J460989R73799
4118E8982426j12182J567666K44087j005424J68163J330803m48081l1460J083935j391321
$$ y = [-13393631, -13305744, -12768650, -13191215, -12829195, -12136760, -11331563, -10848529, -11015540, -11116918, -10266115, -9685923, -8447625, -7378052, -6010514, -5194749, -4271660, -3243157, -3035611, -1559833, 746403, 1112979, 2923948, 4591884, 4912246, 6908929, 7410821, 9326513, 10844146, 11242485, 13844504, 15815009, 16114418, 17106973, 19458975, 21190109, 22570901, 23597730, 25253542, 27816552, 28344599, 30102802, 31260401, 32258696, 33736499, 35719728, 37347574, 38790995, 38975618, 41297237, 42447201, 42598419, 44530774, 45908375, 47000169, 48542553, 50124848, 50978223, 50964909, 51672599, 53218183, 54068007, 54559851, 54919452, 55427832, 56547638, 58008627, 58982426, 58870244, 60437910, 60681997, 59676573, 59844736, 61175539, 60727458, 60695998, 61779933, 60388612]
4108F0388612Q52153J89099j180981k57975O68245R3036j178110o12542J56880j124197
4098E7994220L21890q8611j334087r46933N55745j544537p33166j489499j273914j135103
4088E0326005q98988k71264o35502n30365j872053n55877p40749o56160j714533k62215
4078D2188299j653383k828463j235373j40863m686j734199q75554j537604r31177o68592
4068C0578405j323694j064647j711830l92104r02733o92439j041477n90809k236699q09169
4058A9812804j692886p9313q14390j212264J28300J99039o09421J56130j874669l80172
4048A3633158q87690J12940O13066o95091N3068p91829k37608Q70996o38026n53472
4038A1479512J355255K54516N82398N69406p4796n30488n44591K156357k73039J035360
$$ y = [60388612, 61240765, 61429864, 60248883, 59990908, 60659153, 60752189, 59574079, 58961537, 59118417, 57994220, 58316110, 58227499, 56893412, 55946479, 56502224, 54957687, 54224521, 52735022, 51461108, 50326005, 49427017, 49155753, 48520251, 47989886, 46117833, 45561956, 44821207, 44165047, 42450514, 42188299, 40534916, 37706453, 36471080, 36330217, 36325531, 34591332, 33715778, 32178174, 31246997, 30578405, 29254711, 28190064, 26478234, 26086130, 25183397, 24490958, 23449481, 22858672, 20621973, 19812804, 18119918, 18040605, 17226215, 16013951, 16142251, 16341290, 15731869, 15887999, 14013330, 13633158, 12745468, 12858408, 13471474, 12776383, 12829451, 12037622, 11800014, 12671010, 12032984, 11479512, 12834767, 13089283, 13671681, 14241087, 14166291, 13635803, 13091212, 15247569, 14974530, 16009890]
4028A6009890M05599O86967k60665P57905m68652J625752L237397O33589L14733J503018
4018B4445533K774867j002235J790867P22796Q49365J246200L92951J221302J777501
4009C4219147J231731O83230Q76685J618093J205154J804337J606648J168855M43276
4000D4857156J318584J597698n61099J642583J376903J894803J092342O27356N69551
3991E4415877O33046J844596P25754J268607j93933J590153J092732Q02724P66739l01614
3981F2644681L06690J57293Q00711Q55159R17463Q23242q18126K76478Q51938j100758
3971F5714771O36261J86506o85826j89770n43098l94728l57857p31229j46617l86983
3961F3101430q64651k413158O14926j351949o58182j468166k233383L45887j598097J21914
$$ y = [16009890, 16415489, 17102456, 16841791, 17599696, 17131044, 18756796, 21994193, 22627782, 22942515, 24445533, 27220400, 26218165, 28009032, 28731828, 29581193, 30827393, 31220344, 32441646, 34219147, 35450878, 36134108, 37010793, 38628886, 39834040, 41638377, 43245025, 44413880, 44857156, 46175740, 47773438, 47212339, 48854922, 50231825, 52126628, 53218970, 53846326, 54415877, 55048923, 56893519, 57619273, 58887880, 58693947, 60284100, 61376832, 62179556, 62946295, 62644681, 62951371, 63108664, 63909375, 64764534, 65681997, 66505239, 65687113, 65963591, 66815529, 65714771, 66351032, 66537538, 65851712, 65661942, 65118844, 64724116, 64366259, 63635030, 63488413, 63101430, 62236779, 59823621, 60438547, 59086598, 58428416, 56960250, 54726867, 55072754, 53474657, 53596571]
3951E3596571k408344q41591l083727o93992j426157j873735j474035k794911j064509
3942C7935570j380332p92910k303967j777089j433385k916806l390232J001469l407581
3933B1534737j858625j102276k132955j999350j217275k068756k849098j689447j804925
3924D812030k047432q70815l187074j118461j592904j898956k384839r60951j846067
3915a1095469j713767j648720j536950j601028j710861n28917j131335j10235j777786
3906b2855068r65765j424724K91255j414792j173879M0851j867017J032365j34610m18896
3896b8890280j88963j005039R12500k9824L92562M36031J157547L18592K0775J331666
3886b5544433P10716J036049O80695J407280J461659J282783M00644K270977J967850
$$ y = [53596571, 51188227, 50346636, 47262909, 46568917, 45142760, 43269025, 41794990, 39000079, 37935570, 36555238, 35762328, 33458361, 31681272, 30247887, 27331081, 23940849, 24942318, 21534737, 19676112, 18573836, 16440881, 14441531, 13224256, 11155500, 8306402, 6616955, 4812030, 2764598, 1893783, -1293291, -2411752, -4004656, -5903612, -8288451, -9249402, -11095469, -12809236, -14457956, -15994906, -17595934, -19306795, -19835712, -20967047, -21077282, -22855068, -23820833, -25245557, -24954302, -26369094, -27542973, -27502122, -29369139, -28336774, -28471384, -28890280, -29079243, -30084282, -29171782, -29201606, -28809044, -28373013, -27215466, -26896874, -26876099, -25544433, -24833717, -23797668, -23116973, -21709693, -20248034, -18965251, -18564607, -16293630, -14325780]
3877a4325780M44752J807563K794717K144301J984560J802721K762938K863003J656586
3868C935361L113012J394797L792282L785838L756372K181460K998143L136888L093609
3859C1187762K784526L778340K000676M011143L142236L955047L119751M012777L409362
3850F1401620L656303L255439L272637K751348N662115K525978M975404K441336L214823
3841I3157003L892340L605011L969663M729595L909737J650762L571931L664759M137917
3832A26288718K922923K947266L968041M210478K771766L420199J111784K928485K352698
3823A52922358L454056K704017K765398L449852J231969L563931J412631K905275K260426
3814A76669913J736878K235105K020276K456027Q05838K647498J153669m74503K558287
$$ y = [-14325780, -13881028, -12073465, -9278748, -7134447, -5149887, -3347166, -584228, 2278775, 3935361, 7048373, 8443170, 12235452, 16021290, 19777662, 21959122, 24957265, 28094153, 31187762, 33972288, 37750628, 39751304, 43762447, 46904683, 50859730, 53979481, 57992258, 61401620, 65057923, 68313362, 71585999, 74337347, 79999462, 82525440, 87500844, 89942180, 93157003, 97049343, 100654354, 104624017, 109353612, 113263349, 114914111, 118486042, 122150801, 126288718, 129211641, 132158907, 136126948, 140337426, 143109192, 146529391, 147641175, 150569660, 152922358, 156376414, 159080431, 161845829, 165295681, 166527650, 170091581, 171504212, 174409487, 176669913, 178406791, 180641896, 182662172, 185118199, 185924037, 188571535, 189725204, 189250701, 191808988]
3805A91808988O82819J434676L13315J185868Q99400J72491J433796q01409R26544J065932
3795A99122420o74988o56491o23218n5978J02054k99648j041389j156772j054142p71285
3785A92890563N20845k191578o97540r2215o31474j732512O3799j642405k983575q41384
3775A82662524l11752k838202k429285j010826k207817p83154k953196j999184q00010
3766A67329098l260846j379904k182898k272585j299072k238357j800007k095169l043325
3757A47756935k687161k667144r44263j201703j474855k591342j345125k188046k996514
3748A29660782l77662k408116j840829j289272j547891k389161k449625j736448p10509
3739A14911269k350777j881069q56076r69062j556846r52378j870309j768012N0862q17803
$$ y = [191808988, 192491807, 193926483, 194239798, 195425666, 196325066, 196497557, 197931353, 197129944, 198056488, 199122420, 198447432, 197790941, 197167723, 197111745, 197213799, 196914151, 195872762, 194715990, 193661848, 192890563, 193411408, 191219830, 190522290, 190430075, 189798601, 188066089, 188129888, 186487483, 183503908, 182662524, 182350772, 179512570, 177083285, 176072459, 173864642, 173081488, 170128292, 168129108, 167329098, 164068252, 162688348, 160505450, 158232865, 156933793, 154695436, 152895429, 150800260, 147756935, 145069774, 142402630, 141458367, 140256664, 138781809, 136190467, 134845342, 132657296, 129660782, 129283120, 126875004, 125034175, 123744903, 122197012, 119807851, 117358226, 115621778, 114911269, 112560492, 110679423, 109823347, 108854285, 107297439, 106345061, 104474752, 102706740, 102757602, 101939799]
3729A01939799p20199j595554j45310r35608q19037j381397M05442n17580J3878j741790
3719I4502644m78146L489605l101421l67836j62108L98614J3865q6781J373900j430129
3709I4152207O92531J077703j558608K061810k5623J094702L29179M39903J564973J309114
3699A01137891L16779M99330J413320J00249O85669Q56007J01020J593560J426964K90248
3689A08421037j80996J987900Q21818J212652J903692n82459K144139m54522J500297
3680A16773558J041420J644106R4818J224255N77302K42458k72200K153248N75711n99038
3670A23455638P56324J143667N55857q6801J017052l77527l45613o39649L85398J7017
3660A25881363o08252P80914L55422l29217j183987l33037j548071j94107m76490p11257
$$ y = [101939799, 101219600, 99624046, 99478736, 98543128, 97724091, 96342694, 96748136, 96230556, 96244434, 94502644, 94024498, 97514103, 94412682, 94044846, 93882738, 94281352, 94295217, 94208436, 95582336, 94152207, 94844738, 95922441, 94363833, 96425643, 96400020, 97494722, 97823901, 98263804, 99828777, 101137891, 101454670, 101954000, 103367320, 103467569, 104153238, 105009245, 105110265, 106703825, 108130789, 108421037, 108240041, 110227941, 111049759, 112262411, 114166103, 113583644, 115727783, 115273261, 116773558, 117814978, 119459084, 119553902, 120778157, 121355459, 121597917, 121325717, 123478965, 124054676, 123455638, 124211962, 125355629, 125911486, 125824685, 126841737, 126464210, 126118597, 125478948, 125864346, 125881363, 125273111, 126054025, 126409447, 126080230, 124896243, 124563206, 123015135, 122821028, 122344538, 121633281]
3650A21633281p85259m27914j011108n85736j950613k49854j695300k93561j313541
3641A13320395k164069j253374j834498j450686j854175j138072j209773k115477r87535
3632I9312736j520579j094641k594522j813514l176187j040407q30475k472172k102140
3623H2668099k448735j422428k576402j722660l985513r97773j635044j284571l928044
3614F2666929q58647k190520j857531k325346n37151k259682k668690j711656k524617
3605D5733089j313096j620392p77509k742515k277059r05445j566482r84280j561917
3596C1984394r88768k642099J20798j268610p36526j874146j049589m84336n09456m00966
3586B2150696L91642n61956J23542l58627j08605j115235n78868Q48367m52586M93224
$$ y = [121633281, 120848022, 120420108, 119409000, 118823264, 116872651, 116622797, 114927497, 114633936, 113320395, 111156326, 109902952, 108068454, 106617768, 104763593, 103625521, 102415748, 100300271, 99312736, 97792157, 96697516, 94102994, 92289480, 89113293, 88072886, 87242411, 84770239, 82668099, 80219364, 78796936, 76220534, 74497874, 70512361, 69514588, 67879544, 66594973, 62666929, 61808282, 59617762, 57760231, 55434885, 54897734, 52638052, 49969362, 48257706, 45733089, 44419993, 42799601, 42022092, 39279577, 37002518, 36097073, 34530591, 33546311, 31984394, 30995626, 28353527, 28474325, 27205715, 26469189, 24595043, 23545454, 23061118, 22551662, 22150696, 22542338, 21980382, 22103924, 21745297, 21636692, 20521457, 19942589, 20790956, 20338370, 20831594]
3576B0831594N55784J628213N5684J115573K73073J135501n3336Q08266K686175N84206
3566B9620733K27875J442488K033237J891657R82398J879567R97285K717853K232300
3557D4025393J135922L091220L007962K207133O16039K490743K165989J600864K860084
3548F3201349L197569J629927J322829K267913M528820K328144K462394L299568J798019
3539H6036532K505244K803206L179592J945474L446978J647800L566010K216633K280319
3530A09627788K822484J961999K135025K327967J192204K465601K884905J253987K528058
3521A29200018L193276J564002R85834J927392R14486K946088J32351R96924J382548
3512A43242919J810305m48882J188156J157708K016998Q02157j59139M0728O08838R00975
$$ y = [20831594, 21387378, 23015591, 23071275, 24186848, 24459921, 25595422, 25542086, 26350352, 29036527, 29620733, 29848608, 31291096, 33324333, 35215990, 36198388, 38077955, 39075240, 41793093, 44025393, 45161315, 48252535, 51260497, 53467630, 54083669, 56574412, 58740401, 60341265, 63201349, 66398918, 68028845, 69351674, 71619587, 76148407, 78476551, 80938945, 84238513, 86036532, 88541776, 91344982, 94524574, 96470048, 99917026, 101564826, 105130836, 107347469, 109627788, 112450272, 114412271, 116547296, 118875263, 120067467, 122533068, 125417973, 126671960, 129200018, 132393294, 133957296, 134943130, 136870522, 137785008, 140731096, 140863447, 141860371, 143242919, 145053224, 144604342, 145792498, 146950206, 148967204, 149769361, 149610222, 149650950, 150259788, 151160763]
3502A51160763j05282O68246j574708J172128K08572j317527j387427P75876j323723
3493A48276918o24153m64062j089252j595586j460207k116557j233792j989243j681842
3484A36022224j430642k619891j664035k113691j598158k634543k484190k201597k366033
3475A16909444k061769k183225k788986k621014k744655k907607k738065l907373j792650
3466I3164100k892726l926495l203147m087632k413522l294335l785146l245615l206121
3457F3109361k188317l648251l267274l751963k277148l231140l379499k742980k493880
3448C6128909k087618l958578l346152j724213l888386k847042j681278k974306k898915
3439A0722421j417447k399376k220526k249530j751322l660400k710640r69911j587930
$$ y = [151160763, 151055481, 151723727, 150149019, 151321147, 151529719, 150212192, 148824765, 149600641, 148276918, 147652765, 147188703, 146099451, 144503865, 143043658, 140927101, 139693309, 137704066, 136022224, 134591582, 131971691, 130307656, 128193965, 126595807, 123961264, 121477074, 119275477, 116909444, 114847675, 112664450, 109875464, 107254450, 104509795, 101602188, 98864123, 94956750, 93164100, 90271374, 86344879, 83141732, 79054100, 76640578, 73346243, 69561097, 66315482, 63109361, 60921044, 57272793, 54005519, 50253556, 47976408, 44745268, 41365769, 38622789, 36128909, 34041291, 30082713, 26736561, 25012348, 21123962, 18276920, 16595642, 13621336, 10722421, 9304974, 6905598, 4685072, 2435542, 684220, -2976180, -5686820, -6656731, -8244661]
3430h244661q24052p28243k096974j027759j440431k338748l79616N29493j457022j17492
3420a8125505m43087r53152j067941n64307N72735M3960N18405J126453n16771L47834
3410a9061376N29134J31935J575964J454219M97273J712386n20550K715729J624937N79803
3400h760546J957960J258376L026737R09401J873269J096708K313843L153656K510728
3391I340132J612979K060713K634550K462335M964697K815034O11980K853579J452779
3382C0808778J859618J026439L922644M373793Q94327L658314L216296L422871K499382
3373E5682462K738886K149252K271376K012390L325326K246508K071694K769645K166820
3364G7434359J667972K257012L552435P55665J760463J963581K576503K846997Q01219
$$ y = [-8244661, -9068713, -9796956, -11893930, -12921689, -14362120, -16700868, -17080484, -16550991, -18008013, -18125505, -18568592, -19521744, -20589685, -21153992, -20581257, -20537297, -20018892, -18892439, -19409210, -19061376, -18532242, -18400307, -16824343, -15370124, -14872851, -13160465, -13681015, -10965286, -9340349, -8760546, -6802586, -5544210, -2517473, -1608072, 265197, 1361905, 3675748, 6829404, 9340132, 10953111, 13013824, 15648374, 18110709, 23075406, 25890440, 26502420, 29355999, 30808778, 32668396, 33694835, 37617479, 41991272, 42885599, 46543913, 49760209, 53183080, 55682462, 58421348, 60570600, 62841976, 64854366, 68179692, 70426200, 72497894, 75267539, 77434359, 79102331, 81359343, 84911778, 85667443, 87427906, 89391487, 91967990, 94814987, 95616206]
3355I5616206P29733O17360K646875L90762J699809J255203N47200P21801J379860J900846
3345A07505655n28886P18983J665610j126368M18939j045264O71460l47377q87307L85135
3335A07430580K7467J30984j524057j382764p72710j527160o87454k111746j126057
3326I8457083j516291j172762k145830j897314o94352j674822l331716j988887n11018
3317H3524091k754942l055858j340977l411030k104930l427829k077316l467427k001129
3308E9882653k353366l348230k679142j942634l465988l486000k765110l630315j988796
3299C4223072k719400k828578l748502l072556k713547l561564k428538l622286k720839
3290F807262j835241l186353l549770k252386j585057k328580l322385k616843j876449
$$ y = [95616206, 96345939, 96963299, 99610174, 100000936, 101700745, 102955948, 103503148, 104224949, 105604809, 107505655, 106976769, 107695752, 109361362, 108234994, 108653933, 107608669, 108280129, 107932752, 107045445, 107430580, 107458047, 107589031, 106064974, 104682210, 103909500, 102382340, 101694886, 99583140, 98457083, 96940792, 95768030, 93622200, 91724886, 91030534, 89355712, 86023996, 84035109, 83524091, 80769149, 77713291, 76372314, 72961284, 70856354, 67428525, 65351209, 61883782, 59882653, 57529287, 54181057, 51501915, 49559281, 46093293, 42607293, 39842183, 36211868, 34223072, 31503672, 28675094, 24926592, 21854036, 19140489, 15578925, 13150387, 9528101, 6807262, 4972021, 1785668, -1764102, -4016488, -5601545, -7930125, -11252510, -13869353, -15745802]
3281a5745802l495543k200183k484324k528513k609096k477370j882325j839966j991258
3272c7254380j549690j372637o99825j358171j348120j576840q85497j258931j711431
3263d9015522J58335j492264j041580L50246j063033n01504Q88018n9015l20194m62782
3253e2559295k59076L21923j1685O82470Q17362L55545P71239J105143K96927J168918
3243d7310529M9166J384177J748201Q88647Q74943M16316K194959K332979O66208K713256
3233c4041677P22964J842215K292065J601961J875644J108630K488242J395139K604801
3224a8110016J267332K981299O71607K556899J259240K429993M57174K036567J823432
3215b626473K637195K727461J612570J433020K281441K095300J151650J834414K458274
$$ y = [-15745802, -19241345, -21441528, -23925852, -26454365, -29063461, -31540831, -33423156, -35263122, -37254380, -38804070, -40176707, -40876532, -42234703, -43582823, -45159663, -46045160, -47304091, -49015522, -48857187, -50349451, -51391031, -51040785, -52103818, -52605322, -51717304, -51776319, -52096513, -52559295, -52818371, -52496448, -52508133, -51825663, -51008301, -50652756, -49881517, -48776374, -48479447, -47310529, -47261363, -45877186, -44128985, -43240338, -42365395, -41949079, -39754120, -37421141, -36754933, -34041677, -33318713, -31476498, -29184433, -27582472, -25706828, -24598198, -22109956, -20714817, -18110016, -16842684, -13861385, -13189778, -10632879, -9373639, -6943646, -6486472, -4449905, -2626473, 10722, 2738183, 4350753, 5783773, 8065214, 10160514, 11312164, 13146578, 15604852]
3206A5604852J092991J525904J202157J461940K080165M54942K261184p17826J463453
3197B6429762K296592N34120J148780L60204J688705P60519J048766J145859k66185
3188C5147122J685672p289k24905K21683n39946Q52638M86006K78695M84034j626420
3178C6757290j44361J98483P92488k112763Q83499o79527l81611j360176J027878j789344
3168C3191856M2570j269337Q6058j670119m34779j873157q98019m46970k96842j632390
3158B4798871j155304j496553m4255R2997j237661k779660o81637m68736k26886k100275
3148A4700901k26568r28607j250465l05871j199686N98167K00793o93999j113841p1258
3138I709566q45259r38442K75895M03942l32364K06057j74033M01616m55752P32955J52422
$$ y = [15604852, 16697843, 18223747, 19425904, 20887844, 22968009, 23422951, 25684135, 24966309, 26429762, 28726354, 29260474, 30409254, 30769458, 32458163, 33218682, 34267448, 35413307, 35147122, 36832794, 36825505, 36600600, 36822283, 36282337, 37134975, 37620981, 37899676, 38383710, 36757290, 36612929, 36811412, 37603900, 35491137, 36374636, 35695109, 35313498, 33953322, 34981200, 33191856, 33234426, 31965089, 32051147, 30381028, 29946249, 28073092, 27175073, 26728103, 26431261, 24798871, 23643567, 22147014, 22102759, 22195756, 20958095, 18178435, 17496798, 17028062, 16801176, 14700901, 14474333, 13545726, 12295261, 11989390, 10789704, 11387871, 11588664, 10894665, 9780824, 9709566, 8864307, 7925865, 8201760, 8605702, 8273338, 8479395, 8305362, 8706978, 8251226, 8984181, 9136603]
3127I136603J000135P24174J637235j40963M44493J277183J364414M91229J844110J289113
3117A9067726K175041Q1669K023440K101484L289386J443006K898227K415258K963023
3108C8458260K318203K712956K101277L530604K478303M296403K612591K491076K361190
3099F3360863M140920M722476L862324K967911M870783K609728K614542N818997M009992
3090I8978536L376615M921052M564711M128159L966730M190934M592430M873563L904637
3081A37497367M590571M047793M643806N745836L248109M490344N101277L974229M323835
3072A77663167M265949M478879L711264M087631M822085M400501L639444M074222N474953
3063B16618095L150331L049992L212994L624306L860844K971574K120732M221432K596368
$$ y = [9136603, 10136738, 10860912, 12498147, 12357184, 12801677, 14078860, 15443274, 15934503, 17778613, 19067726, 21242767, 21324436, 23347876, 25449360, 28738746, 30181752, 33079979, 35495237, 38458260, 40776463, 43489419, 45590696, 49121300, 51599603, 55896006, 58508597, 60999673, 63360863, 67501783, 72224259, 76086583, 79054494, 83925277, 86535005, 89149547, 94968544, 98978536, 102355151, 107276203, 111840914, 115969073, 119935803, 124126737, 128719167, 133592730, 137497367, 142087938, 146135731, 150779537, 156525373, 159773482, 164263826, 169365103, 173339332, 177663167, 181929116, 186407995, 190119259, 194206890, 199028975, 203429476, 207068920, 211143142, 216618095, 219768426, 222818418, 226031412, 229655718, 233516562, 236488136, 238608868, 242830300, 245426668]
3054B45426668K018865J956186K746960L245688K191408K922251J555695R72466K902961
3045B65939148J322644M32437K92573R03368J883613J78142L63248N46445m44853J336917
3035B72753682q66484q35264m5225j574502j295423K04383p82894o40433k318720j664518
3025B62934602k537249l241958j356480j921538k654813k175832k662855l914828m494758
3016B37974291k863168k575380m380456l280951m275910l961456m429317l736720m838675
3007B03632258m528713n071448m368257n290688m500081m065277n582042l951639o187375
2998A60086738n858197n721264m430455n549482n353527m461483o850291o600508m044162
2989A11217369m498762o123352n383427n924302n561131m823806n359397o254737m825644
$$ y = [245426668, 247445533, 249401719, 252148679, 255394367, 257585775, 260508026, 262063721, 263036187, 265939148, 267261792, 267694229, 267986802, 268890170, 270773783, 270951925, 271315173, 271861618, 271416765, 272753682, 271887198, 271051934, 271006709, 269432207, 268136784, 268341167, 267558273, 266917840, 264599120, 262934602, 260397353, 257155395, 255798915, 253877377, 251222564, 249046732, 246383877, 242469049, 237974291, 235111123, 232535743, 228155287, 224874336, 220598426, 216636970, 212207653, 208470933, 203632258, 199103545, 194032097, 189663840, 184373152, 179873071, 175807794, 170225752, 166274113, 160086738, 154228541, 148507277, 144076822, 138527340, 133173813, 128712330, 121862039, 115261531, 111217369, 106718607, 100595255, 95211828, 89287526, 83726395, 78902589, 73543192, 67288455, 62462811]
2980F2462811n113813n653029o011693m774374n780221m923582n610939l948330m364867
2971A6281963m913275m996800m756863m438789m237233m207668m759987l134091l353259
2962b2516002l866469l588918m043020k747788k397034k874180l298186k623259j933906
2953d9888762k633606j705210j584188k492128k367680j978390j170124m44974j441576
2944f5706638k774824N04464l07576p20720q39314m20751m87010J314052J466236K64150
2934f7707931m79145K6604J758824k35743J373181K227616K049062M99554J017745J708642
2924e7761591K397237J680751K380396J121232J218819K300004K734945J626886K094155
2915d0207166J728843L578762K020137L428979K447821K802986J686167L290660L648317
$$ y = [62462811, 57348998, 51695969, 45684276, 40909902, 35129681, 30206099, 24595160, 20646830, 16281963, 11368688, 6371888, 1615025, -2823764, -7060997, -11268665, -16028652, -19162743, -22516002, -26382471, -29971389, -34014409, -36762197, -39159231, -42033411, -45331597, -47954856, -49888762, -52522368, -54227578, -55811766, -58303894, -60671574, -62649964, -63820088, -64265062, -65706638, -68481462, -67976998, -68284574, -69005294, -69844608, -70265359, -70752369, -69438317, -67972081, -67707931, -68187076, -68160472, -66401648, -66637391, -65264210, -63036594, -60987532, -60487978, -59470233, -57761591, -55364354, -53683603, -51303207, -50181975, -48963156, -46663152, -43928207, -42301321, -40207166, -38478323, -34899561, -32879424, -29450445, -27002624, -24199638, -22513471, -19222811, -15574494]
2906a5574494K002486L459321J439717L377040L322857L613263K611868K898983L606838
2897A0757879K982381K426756R32986L690435K653948R42291L693645L131310P50904
2888C1962535K101959K630105K888754O64117J927797L041971K565899Q97128J993012
2879E0673277K235817O83499K206301R04052J459701N0009J729861J202664Q25710N58723
2869F2529614J928411O68173r1379O71807O95538k34917o41737R48981M82720m01914
2859F6555297q75472j23706o99668m21257j486598n0499j686062K29689O6977j208577
2849F0300124j161855j333319n80251k828579j590298o64574j345654j184580j954799
2840D7656215q00770r92031r40543k410214k368866k715747m68132j869563j884033
$$ y = [-15574494, -13572008, -10112687, -8672970, -5295930, -1973073, 1640190, 4252058, 7151041, 10757879, 13740260, 16167016, 17100002, 20790437, 23444385, 24386676, 28080321, 31211631, 31962535, 34064494, 36694599, 39583353, 40247470, 42175267, 45217238, 47783137, 48680265, 50673277, 52909094, 53592593, 55798894, 56702946, 58162647, 58212656, 59942517, 61145181, 61970891, 62529614, 64458025, 65126198, 65034819, 65706626, 66402164, 66167247, 65525510, 66474491, 66957211, 66555297, 65679825, 65556119, 64856451, 64435194, 62948596, 62898097, 61212035, 61441724, 61508701, 60300124, 59138269, 57804950, 57224699, 54396120, 52805822, 52141248, 50795594, 49611014, 47656215, 46855445, 45863414, 44922871, 42512657, 40143791, 37428044, 36959912, 35090349, 33206316]
2831C3206316j594981j201469j748255j927762j319616k108119k025691k218389j376313
2822A7685721j902735j534689j694720j671432j447000j972193o20041k079000M9782
2813D813693k517299q92415j857573j129847j849232r47167j521287q80722j208008
2804g989857j154986r74251r62112p17361j254606j888764m7170P23179j013020j10079
2794a5389027j425739r54088p71793N71292j307162J831807k443520K30892j147121r4429
2784b0898888M85046Q21042j034393K81760j158248N36894L04314o40018l95468k6546
2774b1724505L41110j039971J48762J366171q98509l30809J40454k05032j89384k34947
2764b2626660o97506j763200m06048L22870M81784k020246p93329q49262n00231o32388
$$ y = [33206316, 31611335, 30409866, 28661611, 26733849, 25414233, 23306114, 21280423, 19062034, 17685721, 15782986, 14248297, 12553577, 10882145, 9435145, 7462952, 6842911, 4763911, 4813693, 2296394, 1403979, -453594, -1583441, -3432673, -4379840, -5901127, -6781849, -7989857, -9144843, -10119094, -11081206, -11798567, -13053173, -14941937, -14989107, -14265928, -15278948, -15389027, -16814766, -17768854, -18540647, -17969355, -19276517, -17444710, -19888230, -19657338, -20804459, -20898888, -20413842, -19592800, -20627193, -20345433, -21503681, -20966787, -20662473, -21302491, -21697959, -21724505, -21383395, -22423366, -22274604, -20908433, -21806942, -22137751, -21997297, -22202329, -22391713, -22626660, -23324166, -25087366, -25493414, -25170544, -24688760, -26709006, -27502335, -28351597, -28851828, -29484216]
2754b9484216j163075j897213o00494j591387k846525k059467j179901j602701k161360
2745d4586339j386686k803192k317680m54550k489121l730539k583390l298354l085818
2736f6735669k758780l534866k546849l490668m038957l635269l342654m955196m071263
2727i9110171l931877m804332n480470n343407l296755o031365m246440n700501n943872
2718a43889190n120155n965418n384912o653652n742875n939801p033316o089553m752206
2709a96571078o395763o921453o407966o343801o533769p498035o723283p436979p085441
2700b57917568n783466r052317n745568o786748p881805n944464n726973q442895p955717
2691c21237521o293160p937560p564639p679681n614582n414378p106766o943196p270175
$$ y = [-29484216, -30647291, -32544504, -33144998, -34736385, -37582910, -39642377, -40822278, -42424979, -44586339, -45973025, -48776217, -51093897, -51548447, -54037568, -57768107, -60351497, -63649851, -66735669, -69494449, -73029315, -75576164, -79066832, -83105789, -86741058, -90083712, -95038908, -99110171, -103042048, -107846380, -113326850, -118670257, -121967012, -127998377, -132244817, -137945318, -143889190, -149009345, -154974763, -160359675, -167013327, -172756202, -178696003, -185729319, -191818872, -196571078, -202966841, -209888294, -216296260, -222640061, -229173830, -236671865, -243395148, -250832127, -257917568, -263701034, -272753351, -278498919, -285285667, -293167472, -299111936, -304838909, -313281804, -321237521, -327530681, -335468241, -343032880, -350712561, -356327143, -361741521, -368848287, -375791483, -383061658]
2682c83061658o126970o355830n561565o982168m656926o211829o452020n260700m924442
2673d35594108n736650o277251o690522m050777n234354l591002m310648m392317n297807
2664d81175436l089263k957401k848150l942339l086906l528213j881783k191067j594676
2655e06295234k657409n37378k605164n75245j144375m39080p16891L88094J76105L17416
2645e14089161m73228J518068J208878R31477K420339J746610J853451K321156K609157
2636d99953253K874025L692269K518704M220191L199299L733344M559554N694531M077517
2627d65383819N497700N322919M389232O031047O012731N999570O798148O609012O452289
2618d12271171P255660N844039O663599P132480O694739R107321O334866Q844643Q259793
$$ y = [-383061658, -389188628, -395544458, -401106023, -408088191, -412745117, -418956946, -425408966, -430669666, -435594108, -441330758, -447608009, -454298531, -458349308, -463583662, -467174664, -471485312, -475877629, -481175436, -484264699, -487222100, -490070250, -494012589, -497099495, -500627708, -502509491, -504700558, -506295234, -508952643, -509490021, -512095185, -512670430, -513814805, -514253885, -514970776, -514582682, -514406577, -514089161, -514562389, -513044321, -511835443, -510903966, -508483627, -506737017, -504883566, -502562410, -499953253, -497079228, -493386959, -490868255, -486648064, -483448765, -479715421, -475155867, -469461336, -465383819, -459886119, -454563200, -450173968, -444142921, -438130190, -432130620, -425332472, -418723460, -412271171, -405015511, -399171472, -392507873, -385375393, -378680654, -369573333, -363238467, -354393824, -346134031]
2609c46134031O601301J0285778P434130P410851R336133P893211R802269P879428P899001
2600b71591929Q863357R930930Q881641R094701Q335741R795463Q444173R563807Q971227
2591a89710889Q610451R837107Q974589P047885R518894Q805310Q509199P711921Q077970
2582a12617563Q564997Q998992Q817448Q118911P865433P996812P040801Q517766N985486
2573d0710917O440244Q569357N938098N945125P542243N205353O970465O464148N261541
2564A7625657O091098M713272M682864M905085M831132M734128M765923N565988L176409
2555F1091556L561117M256078M351908J011372M133801M657047J431619P60324K500104
2546H7754926K336645J952541J212779J799487K594355J732284J401597J503996L41771
$$ y = [-346134031, -339532730, -329246952, -321812822, -314401971, -305065838, -297172627, -287370358, -279490930, -271591929, -262728572, -252797642, -243916001, -234821300, -226485559, -216690096, -208245923, -198682116, -189710889, -181100438, -171263331, -162288742, -155240857, -145721963, -136916653, -128407454, -120695533, -112617563, -104052566, -95053574, -86236126, -78117215, -70251782, -62254970, -55214169, -46696403, -40710917, -34270673, -25701316, -19763218, -13818093, -6275850, -1070497, 5899968, 12364116, 17625657, 23716755, 28430027, 33112891, 38017976, 42849108, 47583236, 52349159, 57915147, 61091556, 64652673, 68908751, 73260659, 74272031, 78405832, 83062879, 84494498, 85254822, 87754926, 90091571, 92044112, 93256891, 95056378, 97650733, 99383017, 100784614, 102288610, 102630381]
2537A02630381K10567N72515M8945J293648K94864Q82621R405P55554q02945j449063
2527A04446492P68411k40925L31272j395472l86215n52077m54156m21289n02630l5439
2517A01557972l66756j263402j242785j049642j52243j738586j282139j542650J98706
2508I3118475r44053j139346q85182j175412j179826l89443k211362j120568k286912
2499H1786371k63769j300864o62039j614459j83603p05414j145340k142380k023784r04106
2489G0840613j096189j910635J121120k927971p07818k165988j040592n71209q53854
2480F0687477M31685j666431j536813p14245j244692o36470o22044n51207j112772l37527
2470E2696961O38774k125833o40276J143864j18244j250768M5783K34304L24573k44404
$$ y = [102630381, 102840948, 103413463, 103462408, 104756056, 105050920, 105933541, 105942946, 106698500, 105895555, 104446492, 105214903, 104973978, 105305250, 103909778, 103523563, 102971486, 102517330, 102096041, 101593411, 101557972, 101191216, 99927814, 98685029, 97635387, 97483144, 95744558, 94462419, 92919769, 93118475, 92174422, 91035076, 90149894, 88974482, 87794656, 87405213, 85193851, 84073283, 81786371, 81522602, 80221738, 79559699, 77945240, 77761637, 77056223, 75910883, 73768503, 71744719, 70840613, 69744424, 67833789, 68954909, 66026938, 65319120, 63153132, 62112540, 61541331, 60687477, 61119162, 59452731, 57915918, 57201673, 55956981, 55320511, 54698467, 54147260, 53034488, 52696961, 53335735, 51209902, 50569626, 51713490, 51595246, 50344478, 50390261, 50624565, 50949138, 50704734]
2460E0704734l45228n43608m87202l42889J223234j220721J01645J146740L7998M5963
2450E0320666M84033K21873m5019l45000O46349j00829J624601k3744j315140J227037
2440E2694827K28986r80580n83524L49808K32112l02325q09167M37213Q34491L3063q38198
2429E1296706m91130J06789j058450j529163p5173o48454r4009n67631k016998o55633
2419D4266854J74885q71386j935980p66868j598722k057180l79451j953045j632919
2410C3246188k198508j284215q46117k521971j587619j747191l037488j626191k86169
2401A8110719k514019k258855k763650k872231o57239k871248l582357o59319l962861
2392d031060q30674k208764k794725l151221j669393k160329j824351k992605l058605
$$ y = [50704734, 50359506, 49815898, 49328696, 48985807, 50209041, 48988320, 49089965, 50236705, 50274703, 50320666, 50804699, 51026572, 50981553, 50636553, 51282902, 51182073, 52806674, 52782930, 51467790, 52694827, 52923813, 51943233, 51359709, 51709517, 51941629, 51639304, 50830137, 51267350, 52101841, 52134904, 51296706, 50805576, 50912365, 49853915, 48324752, 48249579, 47601125, 47507116, 46939485, 44922487, 44266854, 44441739, 43570353, 41634373, 40867505, 39268783, 37211603, 36832152, 34879107, 33246188, 31047680, 29763465, 28917348, 26395377, 24807758, 23060567, 20023079, 18396888, 18110719, 15596700, 13337845, 10574195, 7701964, 7044725, 4173477, 591120, -68199, -4031060, -4861734, -7070498, -9865223, -13016444, -14685837, -16846166, -18670517, -21663122, -24721727]
2383b4721727l389304j203749k336475j779274j307729l288214j659588j376133l858883
2374d4921076j423229p45514r91054l071076j688786j599441r10092q44426r71756q44793
2364e8011243p02757j988299k33412p75680r69744N81428R54342o47756K74938L20517
2354f1197666K283384m33919J046125o76497J469495J156819J599934N16864L226913
2345e1008548J751879K687885K847464J950152K563084J953878L064380M638860L566496
2336b5984470L176677M435591K626301L707333N201298L711196N265688M654910M743184
2327A1537708M579358N553382N092599M751718O003174M652724O743541O154495N837497
2318F0906196M736893P207450N821642P855960N701934P218455O987244O427382P503222
$$ y = [-24721727, -28111031, -29314780, -31651255, -33430529, -34738258, -38026472, -39686060, -41062193, -44921076, -46344305, -47089819, -48080873, -51151949, -52840735, -54440176, -55350268, -56194694, -57166450, -58011243, -58714000, -60702299, -60935711, -61711391, -62681135, -62099707, -61145365, -61793121, -61518183, -61197666, -58914282, -59348201, -58302076, -58978573, -57509078, -56352259, -54752325, -54235461, -51008548, -49256669, -46568784, -43721320, -41771168, -39208084, -37254206, -34189826, -29550966, -25984470, -22807793, -18372202, -15745901, -12038568, -6837270, -3126074, 2139614, 6794524, 11537708, 16117066, 21670448, 26763047, 31514765, 37517939, 42170663, 48914204, 55068699, 60906196, 65643089, 72850539, 78672181, 86528141, 92230075, 99448530, 106435774, 112863156, 120366378]
2309A20366378O738064P346767O461408O413716Q080226O690775O928655Q393206O801273
2300A84220468P090470O019148O875463P494262O890546Q564658P237101O630899N426316
2291B46449331R161217O761783N198344P251546P542512O449227O104760O083809O778839
2282C07781368O758414N158118N816949O457152N003363N723710N950423M772109M405176
2273C57826782M394828L224220N087099M787633K834107L376868M154224L511772K656436
2264C91853969K890682K084748J495727J994480J656958J597829P62825Q77242N82980
2255D05797440k83197l71278N52961j150671r96001M929j982139l137178p40808m125438
2245C93568620k627463k947123l755243l736318m420787n230098l930743m831427n643837
$$ y = [120366378, 127104442, 134451209, 140912617, 147326333, 155406559, 162097334, 169025989, 177419195, 184220468, 191310938, 197330086, 204205549, 211699811, 218590357, 227155015, 234392116, 241023015, 246449331, 255610548, 262372331, 267570675, 274822221, 282364733, 288813960, 294918720, 301002529, 307781368, 314539782, 319697900, 325514849, 331972001, 336975364, 342699074, 348649497, 353421606, 357826782, 362221610, 365445830, 370532929, 375320562, 378154669, 381531537, 385685761, 389197533, 391853969, 394744651, 396829399, 398325126, 400319606, 401976564, 403574393, 404337218, 405214460, 405797440, 405514243, 405142965, 405695926, 404545255, 403549254, 403554183, 401572044, 398434866, 397694058, 393568620, 390941157, 387994034, 384238791, 380502473, 376081686, 370851588, 366920845, 362089418, 356445581]
2236C56445581n770149n971912n590064n869267n904710p510280o887084o600570p751115
2227B98590430p639260p217355q190038q091281j0057861p361840q465798q421969q375166
2218B24769862j0477505p701402q876346q615766r455938r086619r661374q288979q961445
2209A43644488r547710q852078q667178p561294q713607r687046q897536q256699q375615
2200F5085725q561319r704527p391685q202557p597105q257606q222017p359863o805700
2191g016654q073020p136670p054755o354460n689000o976382n734755o116872o872339
2182f7024907m401717o560171m052642n048478m791975m283540m304551l664199m144044
2173a08276224l421865l098053l911773k996732k616649j829981j067676j636661k773540
$$ y = [356445581, 350675432, 344703520, 339113456, 333244189, 327339479, 319829199, 312942115, 306341545, 298590430, 290951170, 283733815, 275543777, 267452496, 257394635, 250032795, 241566997, 233145028, 224769862, 214292357, 206590955, 197714609, 189098843, 179642905, 170556286, 160894912, 152605933, 143644488, 134096778, 125244700, 116577522, 109016228, 100302621, 90615575, 81718039, 73461340, 65085725, 56524406, 46819879, 39428194, 31225637, 23628532, 15370926, 7148909, -210954, -7016654, -15089674, -22226344, -29281099, -35635559, -41324559, -48300941, -54035696, -60152568, -67024907, -71426624, -77986795, -82039437, -87087915, -91879890, -96163430, -100467981, -104132180, -108276224, -111698089, -114796142, -118707915, -121704647, -124321296, -126151277, -127218953, -128855614, -131629154]
2164a31629154k355866K93426j786797j56635m70270m02501j840288J115093K45165
2155a36987827J834595M12145K51553J15987J284201J499511K758272J865139R05435
2146a26060989J800489K528306J716841J719671L766354M330318J932750K125999L276703
2137a02863558K837680M479484L495223L795818K725534L101726L954196M402157M285140
2128f9786600L603559M761428M401464M962023L718033L758503N283891L385415L580566
2119c2331718N401830M074973L610959L882942M311742L862477M154965L928712M335411
2110E232293N076574K938413L380588M619313M392470M760458L012510L824639L604585
2101D0841843M624760K648686L164409J858669M018451L731183L555661L337596J688339
$$ y = [-131629154, -133985020, -133691594, -135478391, -135635026, -136105296, -136507797, -138348085, -137232992, -136987827, -135153232, -134741087, -134489534, -134373547, -133089346, -131589835, -128831563, -126966424, -126060989, -124260500, -121732194, -120015353, -118295682, -114529328, -110199010, -108266260, -106140261, -102863558, -100025878, -95546394, -92051171, -88255353, -85529819, -82428093, -78473897, -74071740, -69786600, -66183041, -61421613, -57020149, -52058126, -48340093, -44581590, -39297699, -35912284, -32331718, -26929888, -22854915, -19243956, -15361014, -11049272, -7186795, -3031830, 896882, 5232293, 10308867, 13247280, 16627868, 21247181, 25639651, 30400109, 33412619, 37237258, 40841843, 45466603, 48115289, 51279698, 53138367, 57156818, 60888001, 64443662, 67781258, 69469597]
2092F9469597K905232L140307K708591K370478J645554L482384K572360K094626K416490
2083I2805619K378726J913969K328183K483362J228296J662739J219806K487595K897043
2074A11405338l80420K118855O37192K615402K195947J761313J640705K76781K408122
2065A24679235K88482L47323K930511O28798J980045K089545J832703R29012P86287
2056A36491941J520065L055281K044972L4247J592740J931312K024982J918459K150531
2047A52764530K030274J524890K160753K499056K198812J335024K535287K561325L252674
2038A72862625J897126J887354K225705L851608K770093J665817L196257M342359L204607
2029A97903551Q11954N232531L147240L391465M204240L058674K637765L687399L641730
$$ y = [69469597, 72374829, 75515136, 78223727, 80594205, 82239759, 85722143, 88294503, 90389129, 92805619, 95184345, 97098314, 99426497, 101909859, 103138155, 104800894, 106020700, 108508295, 111405338, 111024918, 113143773, 113780965, 116396367, 118592314, 120353627, 121994332, 122271113, 124679235, 124967717, 125315040, 128245551, 128874349, 130854394, 132943939, 134776642, 135705654, 136491941, 138012006, 141067287, 143112259, 143146506, 144739246, 146670558, 148695540, 150613999, 152764530, 154794804, 156319694, 158480447, 160979503, 163178315, 164513339, 167048626, 169609951, 172862625, 174759751, 176647105, 178872810, 182724418, 185494511, 187160328, 190356585, 194698944, 197903551, 198715505, 203948036, 207095276, 210486741, 214690981, 217749655, 220387420, 224074819, 227716549]
2020B27716549L233649L751412L830788N321423L573248L255561M666534L808735L701082
2011B62858981L232842M232055M084640L295860K985183M089879M004648K815834N177483
2002B96777405L871105K624947M245769K256776L478644M83478M704087K550556K773967
1993C23766734M687310N277970N7815M945249m15553N198617O42571K797360L891826
1984C50849899N92589K644612K969425O94617K437750K082530J038257J530805J080350
1975C65920834K182077J927200J506167J112620M76882K40860J165449J061859R85893
1966C76579841j137198R4467K8433L80650q4974q80307q80408j362215j226971j102217
1956C70409101j783544j231712j427080k150253j080600j909112l495740k305101l628759
$$ y = [227716549, 230950198, 234701610, 238532398, 243853821, 247427069, 250682630, 255349164, 259157899, 262858981, 266091823, 270323878, 274408518, 277704378, 280689561, 284779440, 288784088, 291599922, 296777405, 300648510, 303273457, 307519226, 309776002, 313254646, 313738124, 318442211, 320992767, 323766734, 328454044, 333732014, 333789829, 338735078, 338319525, 343518142, 344160713, 346958073, 350849899, 351442488, 354087100, 357056525, 357751142, 360188892, 362271422, 363309679, 364840484, 365920834, 368102911, 370030111, 371536278, 372648898, 373125780, 373366640, 374532089, 375593948, 376579841, 375442643, 375537110, 375565543, 375946193, 375861219, 374980912, 374100504, 372738289, 371511318, 370409101, 368625557, 367393845, 365966765, 363816512, 362735912, 360826800, 357331060, 355025959, 351397200]
1947C51397200k874664m390924m166162l379009m507727l931255l961685m264388m570147
1938C15351239n107400n049531n429872o673381n477918o034127o810785o469413o169796
1929B62129016o171430o725079p498923p106177p256482p225276o451789p821441p747389
1920A98125030q303379o369335p776485q419070o860746o263228p990744p366216p356086
1911A31419741q538442o986862q005631n856608q786840p205031p513213o475687p282427
1902F4769000o796886o122258o838930o822708o964125n530368p522265n334269m627878
1893H209313n852942n492395m079939n039779m546170n203849m043198l976726m252831
1884c4278516l373165l441069l032017l589485k382919k817160j840771p45186l054689
$$ y = [351397200, 348522536, 344131612, 339965450, 336586441, 332078714, 328147459, 324185774, 319921386, 315351239, 310243839, 305194308, 299764436, 293091055, 287613137, 281579010, 274768225, 268298812, 262129016, 255957586, 249232507, 241733584, 234627407, 227370925, 220145649, 213693860, 205872419, 198125030, 189821651, 183452316, 175675831, 167256761, 160396015, 154132787, 146142043, 138775827, 131419741, 122881299, 115894437, 107888806, 102032198, 93245358, 86040327, 78527114, 72051427, 64769000, 57972114, 51849856, 45010926, 38188218, 31224093, 25693725, 18171460, 12837191, 8209313, 2356371, -3136024, -7215963, -12255742, -16801912, -22005761, -26048959, -30025685, -34278516, -37651681, -41092750, -44124767, -47714252, -50097171, -52914331, -54755102, -55500288, -58554977]
1875e8554977j363003j75624o18483j656074n39027k13652p44054P57796m74377L269414
1865f0312061J093428J879928K070567J291385K372759K378984L187207K447885K698454
1856d0891464L163458L650415L749114L787563M729695M671646L022774M528748N651235
1847c936816N123043M594805N483431O320072M622973O307599O950005O138270O259059
1838D7862441N859053O034281O500756O849763P430564N809950P537871O349535P344823
1829A07579037P604544N583486Q047254P561896O310505O575576Q033519P937277O413435
1820A71646529O555722P965701O951325O974518N737256P240055O159368O579521O974544
1811B32784539O603634O309999N537140O962837N311702N282578N972300N156632N297163
$$ y = [-58554977, -59917980, -60093604, -60712087, -62368161, -62907188, -63120840, -63864894, -63107098, -63581475, -60312061, -59218633, -57338705, -55268138, -53976753, -51603994, -49225010, -46037803, -43589918, -40891464, -37728006, -34077591, -30328477, -26540914, -21811219, -17139573, -14116799, -9588051, -3936816, 1186227, 5781032, 11264463, 17584535, 22207508, 28515107, 35465112, 41603382, 47862441, 53721494, 59755775, 66256531, 73106294, 80536858, 86346808, 93884679, 100234214, 107579037, 115183581, 120767067, 128814321, 136376217, 142686722, 149262298, 157295817, 165233094, 171646529, 178202251, 186167952, 193119277, 200093795, 205831051, 213071106, 219230474, 225809995, 232784539, 239388173, 245698172, 251235312, 258198149, 263509851, 268792429, 274764729, 279921361, 285218524]
1802B85218524N311967N097679L658189M006356N433535M582463L556626L163861L376496
1793C23405696L331140K628382K004177K252108L617070J076240J947697J170538J811261
1784C43244309M93393J175443p32778O14843R0879K22590k50006j334267L84738j857090
1774C42052054j979683j298509k051795k382243k361247j485668k800113k578002k766918
1765C22347876m017943l698903l919477l751215m705703k655286l578488n333083m576165
1756B86111613n072765n474849l764016m501474n807102o241328l510812o467022o649679
1747B38622566n418766o174034n505314o574165o308775o605715n418107o842193o570787
1738A83204710n165828p065544o900048o504632o788779n579254o206191o942683o889759
$$ y = [285218524, 290530491, 295628170, 299286359, 303292715, 308726250, 313308713, 316865339, 320029200, 323405696, 326736836, 329365218, 331369395, 333621503, 337238573, 338314813, 340262510, 341433048, 343244309, 343737702, 344913145, 344180367, 344795210, 344886089, 345108679, 344858673, 343524406, 343909144, 342052054, 340072371, 338773862, 336722067, 334339824, 331978577, 330492909, 327692796, 325114794, 322347876, 318329933, 314631030, 310711553, 306960338, 302254635, 299599349, 296020861, 290687778, 286111613, 281038848, 275563999, 271799983, 267298509, 261491407, 255250079, 251739267, 245272245, 238622566, 233203800, 227029766, 221524452, 214950287, 208641512, 202035797, 196617690, 189775497, 183204710, 178038882, 170973338, 164073290, 157568658, 150779879, 145200625, 138994434, 132051751, 125161992]
1729A25161992n837053o949603o739314o088582o897699n940597n859560o731643n908963
1720F8208978n802805o969241o559644n445132n663143n725718n792142n545041n773536
1711A4932576o063875n600660m775115m695322n752605n119018m962126n151495l509038
1702c0696678n604283m843899m820832l494812m161653m702473l448376k872611n191470
1693f9837087l056430k933619l782530l576138l877899m373090l541308l492634j382379
1684i9853114k211483l883426k787556k058759j862020m013764j580856k661718l483418
1675a24396114k260991j798847k871349k900850j277367j386027k658945j643563k649309
1666a43843362k022189k602274k412366j004314k796228j363741k005707j691596l099291
$$ y = [125161992, 119324939, 112375336, 105636022, 99547440, 92649741, 86709144, 80849584, 74117941, 68208978, 62406173, 55436932, 48877288, 43432156, 37769013, 32043295, 26251153, 20706112, 14932576, 8868701, 3268041, -1507074, -6202396, -11955001, -17074019, -22036145, -27187640, -30696678, -36300961, -41144860, -45965692, -49460504, -53622157, -58324630, -61773006, -64645617, -69837087, -72893517, -75827136, -79609666, -83185804, -87063703, -91436793, -94978101, -98470735, -99853114, -102064597, -105948023, -108735579, -110794338, -112656358, -116670122, -118250978, -120912696, -124396114, -126657105, -128455952, -131327301, -134228151, -135505518, -136891545, -139550490, -141194053, -143843362, -145865551, -148467825, -150880191, -151884505, -154680733, -156044474, -158050181, -159741777, -162841068]
1657a62841068k162141j389832k485382j658482j804316k074953j543989k086328l830732
1648a81877223j274941j746163k462629j694906l336935k915809j591198r51047k620949
1639b00471800j873910k821399j250724l128848k730797k528861k658550l094091j617417
1630b22176397l123070j355407k362829k544658l341843k137718j713910j945637k474738
1621b43176207l449582j941859k180693l508734k978309j566914k892270j892452j117192
1612b64704212j758539k056879k997244k367411j084668k109868j770139j910165p86533
1603b81545658o28678j592831l38713j015990l40763k149588o00396r03321o29250O70128
1593b89075060j84946O61142j073628R60360j03089J125101J377804J901830O05466
$$ y = [-162841068, -165003209, -166393041, -168878423, -170536905, -172341221, -174416174, -175960163, -178046491, -181877223, -183152164, -184898327, -187360956, -189055862, -192392797, -195308606, -196899804, -197850851, -200471800, -202345710, -205167109, -206417833, -209546681, -212277478, -214806339, -217464889, -220558980, -222176397, -225299467, -226654874, -229017703, -231562361, -234904204, -237041922, -238755832, -240701469, -243176207, -246625789, -248567648, -250748341, -254257075, -257235384, -258802298, -261694568, -263587020, -264704212, -266462751, -268519630, -271516874, -273884285, -274968953, -277078821, -278848960, -280759125, -281545658, -282174336, -283767167, -284105880, -285121870, -285462633, -287612221, -288212617, -289115938, -289745188, -289075060, -289260006, -288598864, -289672492, -288712132, -288815221, -287690120, -286312316, -284410486, -283805020]
1584b83805020J102803J519080K318434K658902J223664K224338K807967L086559L101325
1575b63761948L295366L552681L343178M562844N375630L448243M984257N123783M905621
1566b25170345N403191O405495N503980N227715N961806O217315P522489O253750Q065127
1557a68609477O453268O429569P600874R385322Q487094Q633015P941680P133902R957625
1548i6587128Q666240R629216R224676Q147474J0208510Q078745R418619J0447827
1540b2765821J1189260R315570J0334364Q379724J0994051R740411J1767228R575095
1532E8529882R913249J0613660J0437332J0997649R725784R997819R977637J0345689
1524A40538701J0644546J0197949J0350728J1333682R405061R627529J0021961J0314858
$$ y = [-283805020, -282702217, -281183137, -278864703, -276205801, -274982137, -272757799, -269949832, -266863273, -263761948, -260466582, -256913901, -253570723, -249007879, -243632249, -240184006, -235199749, -230075966, -225170345, -219767154, -213361659, -207857679, -202629964, -196668158, -190450843, -182928354, -176674604, -168609477, -162156209, -155726640, -148125766, -138740444, -130253350, -121620335, -113678655, -106544753, -96587128, -87920888, -78291672, -69066996, -60919522, -50711012, -42632267, -33213648, -22765821, -11576561, -2260991, 8073373, 16453097, 27447148, 37187559, 48954787, 58529882, 68443131, 79056791, 89494123, 100491772, 110217556, 120215375, 130193012, 140538701, 151183247, 161381196, 171731924, 183065606, 192470667, 202098196, 212120157, 222435015]
1516B22435015R852478R122866R821707R895531P617992Q591883J0126684Q974815Q987996
1507C05426967Q608524P715948P415883Q013120Q311380O551674P554117O760510O994285
1498C73352408O535033N925893N578766O299642M002311N329635N567851M075472M844842
1489D21511853L845557L431864K850598M042149K592423K619814K136707K187617J740627
1480D46959209K171350Q28178J941600o29737N88663L37096o99291L88504j101385j319363
1470D49464824j842469k460932j625257j734973k090302l364517k968061l479187l719199
1461D26179927l683770n116711n157936n360595n253292m699951o747471n318112n812363
1452C79029726n901770o513535p237443p153734p340102p299015q327851q021168p898618
$$ y = [222435015, 232287493, 241410359, 251232066, 261127597, 268745589, 277337472, 287464156, 296438971, 305426967, 314035491, 321751439, 329167322, 337180442, 345491822, 352043496, 359597613, 366358123, 373352408, 379887441, 385813334, 391392100, 397691742, 401694053, 407023688, 412591539, 416667011, 421511853, 425357410, 428789274, 431639872, 435682021, 438274444, 440894258, 443030965, 445218582, 446959209, 449130559, 449958737, 451900337, 451270600, 451859263, 452196359, 451497068, 451885572, 450784187, 449464824, 447622355, 445161423, 443536166, 441801193, 439710891, 436346374, 433378313, 429899126, 426179927, 422496157, 417379446, 412221510, 406860915, 401607623, 396907672, 390160201, 384842089, 379029726, 373127956, 366614421, 359376978, 352223244, 344883142, 337584127, 329256276, 321235108, 313336490]
1443C13336490q225609q208473q004523r034867r251746r705828p030089j0026442q680056
1434B35168857p732604r905169r336278q810639r685744r562287q426601r614413p688727
1425A54406395q631252r714771p985776q352721q888707q261925q591993q516008q338969
1416G7124273p530571q814352p365302q124135o060911r347113o982960n845417o834770
1407A0218742p047114p273460n780101o418893n650387n447565o005022n531456m911921
1398d3847177n270429m607523n675093l731436m067952m001670l567532l742635l760826
1389h2272273l295738k687053k737323k648867j923969j001876k629982j409495j096462
1380a01703038j516992j049243o41087k084991J346938j849982J025496j297527P49058
$$ y = [313336490, 305110881, 296902408, 288897885, 279863018, 270611272, 260905444, 253875355, 243848913, 235168857, 227436253, 217531084, 208194806, 199384167, 189698423, 180136136, 171709535, 162095122, 154406395, 145775143, 136060372, 128074596, 119721875, 110833168, 102571243, 93979250, 85463242, 77124273, 69593702, 60779350, 53414048, 45289913, 39229002, 29881889, 22898929, 17053512, 10218742, 3171628, -4101832, -9881933, -16300826, -21951213, -27398778, -33403800, -38935256, -43847177, -49117606, -53725129, -59400222, -63131658, -67199610, -71201280, -74768812, -78511447, -82272273, -85568011, -88255064, -90992387, -93641254, -95565223, -96567099, -99197081, -100606576, -101703038, -103220030, -104269273, -104910360, -106995351, -105648413, -107498395, -106472899, -107770426, -107021368]
1371a07021368J088245L05906R31680J232120O59049J63101J010504K372551K090746
1362i7167466R59048K673692K229079J966441K443367J447385J829295L512218K138955
1353g7967986L285480K899321J959772K987083K009917K120936L546423L336073L470891
1344e2352090K326504K117530L968890L174897L748630K536467K631406K194141L345518
1335b6308107L920351K116400L105879M141194K535346K491357J817104K492609K235780
1326a452087L907774J974985L495282K592004J719117J494426K230452L337871J886964
1317B1186788K814607J495392O07702L866185J091233P77089K446510J398626P17099
1308C6401231J643687J705096M01681J487012J149021J771867q26948J958678J321834
$$ y = [-107021368, -105933123, -105627217, -104695537, -103463417, -102804368, -102641267, -101630763, -99258212, -97167466, -96208418, -93534726, -91305647, -89339206, -86895839, -85448454, -83619159, -80106941, -77967986, -74682506, -71783185, -69823413, -66836330, -64826413, -62705477, -59159054, -55822981, -52352090, -50025586, -47908056, -43939166, -40764269, -37015639, -34479172, -31847766, -29653625, -26308107, -22387756, -20271356, -17165477, -13024283, -10488937, -7997580, -6180476, -3687867, -1452087, 2455687, 4430672, 7925954, 10517958, 12237075, 13731501, 15961953, 19299824, 21186788, 24001395, 25496787, 26104489, 29970674, 31061907, 31838996, 34285506, 35684132, 36401231, 38044918, 39750014, 40151695, 41638707, 42787728, 44559595, 43732647, 45691325, 47013159]
1299D7013159o50549q1525J599692J195804J689306k780881J003699L66558j06110N41435
1289D9790588m67145p5085J369992J05149j061496m90638N20517k24637K26312N44611
1279E0238168m53621J6925k9200p68554n53182L15938J213880r98616r60913j28785K04581
1268D8096621R71437j10891p51680O62477n38223j43794R73233j814983R83083n82883
1258D7744397N48651R06112m14632L17820P65433J020364O07073n39048J815663q36518
1248E1935315l29992J843148P55000l40380J117702N31913J106341l5110J132765l09022
1238E7407680J94580J90888O26053J557911J727098p56849J114383m77719Q38432N02422
1228F2924879J015707L64617k10802Q1125J292467M39261m28811L33365q8890O32029
$$ y = [47013159, 46362610, 46281085, 47880777, 49076581, 50765887, 47985006, 48988705, 49355263, 49249153, 49790588, 49323443, 49248358, 50618350, 50723499, 49662003, 49171365, 49691882, 49467245, 49693557, 50238168, 49784547, 49801472, 49772272, 49003718, 48450536, 48766474, 49980354, 48981738, 48020825, 47892040, 48096621, 49068058, 48957167, 48205487, 48867964, 48329741, 48185947, 49159180, 47344197, 48327280, 47744397, 48293048, 49199160, 48784528, 49102348, 49867781, 50888145, 51495218, 50956170, 52771833, 51935315, 51605323, 53448471, 54203471, 53863091, 54980793, 55512706, 56619047, 56583937, 57716702, 57407680, 57602260, 57793148, 58419201, 59977112, 61704210, 60947361, 62061744, 61584025, 62422457, 62924879, 63940586, 64305203, 64094401, 64175526, 65467993, 65907254, 65478443, 65811808, 65722918, 66354947]
1218F6354947L95482o20220r77540L25102r88259k92019o30916l16504j131496m81440
1208F1637137k573995o29219p29972j245462j853538j220795j120131j901293k402140
1199D7960592k083152k727541l144581k649100k069355l141953l418473l569435m562271
1190B0594731k843783l474996n186610k168852n546795m116312l837038n562934o118863
1181a8261452m784699m842393n487369m461877o585609o430393n263947p026758o343866
1172f9488363o896096p000082n716350p095625p206273q242339o122154o840307q516836
1163a33124425p811064o976744q080161q506633p479153q158406r048421p763417q169262
1154b05117686q076909p622781q903243p269134r631212p223560q484231q717544q572620
$$ y = [66354947, 66750429, 66130209, 65152669, 65477771, 64489512, 64197493, 63566577, 63250073, 62118577, 61637137, 59063142, 58433923, 57703951, 56458489, 54604951, 53384156, 52264025, 50362732, 47960592, 45877440, 43149899, 40005318, 37356218, 35286863, 32144910, 28726437, 25157002, 20594731, 17750948, 14275952, 9089342, 6920490, 1373695, -2742617, -6579655, -12142589, -18261452, -23046151, -27888544, -33375913, -37837790, -44423399, -50853792, -56117739, -63144497, -69488363, -76384459, -83384541, -89100891, -96196516, -103402789, -111645128, -117767282, -124607589, -133124425, -140935489, -147912233, -155992394, -164499027, -171978180, -180136586, -189185007, -196948424, -205117686, -213194595, -220817376, -229720619, -236989753, -246620965, -253844525, -262328756, -271046300, -279618920]
1145b79618920p441200p635141p383786p875487q371594q625582p408551p373840o766982
1136c48501083p182416p712566o461149o003863p616489o193319o003709n358639n528946
1127d06562179o640931m193999n944468m775801m302447m489107l916413k478869m182357
1118d47486571k433519k854765k316872k651138m26171j074861j706249K36537J25669
1109d60587940R23904J37056J434085J236269J685619L037460K897974L361770L711082
1100d42162721M680409L057620O071920N028082N847914O858424O341815Q570106P677290
1091c88029141P869584R756458R866286J0090221Q947580R868681J1305467J1253227
1083c09071637J3098943J3267054J2756950J3535539J3434123J5262361J4304716J6331554
$$ y = [-279618920, -287060120, -294695261, -302079047, -309954534, -318326128, -326951710, -334360261, -341734101, -348501083, -355683499, -363396065, -369857214, -375861077, -383477566, -389670885, -395674594, -401033233, -406562179, -413203110, -417397109, -423341577, -428117378, -432419825, -436908932, -440825345, -443304214, -447486571, -449920090, -452774855, -455091727, -457742865, -458169036, -459243897, -460950146, -460713609, -460587940, -459664036, -459526980, -458092895, -456856626, -455171007, -452133547, -449235573, -445873803, -442162721, -437482312, -434424692, -428352772, -423324690, -417476776, -410618352, -404276537, -395706431, -388029141, -380159557, -370403099, -360536813, -350446592, -341499012, -331630331, -320324864, -309071637, -295972694, -282705640, -269948690, -256413151, -242979028, -227716667, -213411951, -197080397]
1075a97080397J4734962J6303584J5671515J8446494J6711254J8140975J9311894J8159945
1067e9599774J8534485K0300168K0429566K0309538J9845717K0946643K1942880K1499554
1059A04208777K2397760K2218035K2658712K3590268K3139892K3977421K4899265K5032047
1051B92122177K5635916K4890497K5149584K5478826K5286519K6582657K5247921K6890388
1043D97284485K7550161K6563972K8149693K6092213K7501191K8235926K7483971K8772840
1035G17634452K7948802K7101562L0211104K8137827K9250908K8326878K7397160K9882266
1027I45890959K8010545K9535967K6905265K8145039L0304764K7145087K6471713K7198642
1019A169607981K6428273K6879618K6863705K6222890K5964749K5892998K4023105
$$ y = [-197080397, -182345435, -166041851, -150370336, -131923842, -115212588, -97071613, -77759719, -59599774, -41065289, -20765121, -335555, 19973983, 39819700, 60766343, 82709223, 104208777, 126606537, 148824572, 171483284, 195073552, 218213444, 242190865, 267090130, 292122177, 317758093, 342648590, 367798174, 393277000, 418563519, 445146176, 470394097, 497284485, 524834646, 551398618, 579548311, 605640524, 633141715, 661377641, 688861612, 717634452, 745583254, 772684816, 802895920, 831033747, 860284655, 888611533, 916008693, 945890959, 973901504, 1003437471, 1030342736, 1058487775, 1088792539, 1115937626, 1142409339, 1169607981, 1196036254, 1222915872, 1249779577, 1276002467, 1301967216, 1327860214, 1351883319]
1012A351883319K4548781K4694237K2765444K3455891K3017375K2796297K1263197
1005A514424541K1230478K0282775K0387062J9726137J9005298J8507628J7657981
998A651221900J7817132J6842840J7114570J8343606J5587254J4775183J5848283J5334046
990A782884814J3262565J5325734J2800125J4795723J3792825J2558678J1867939J4102760
982A891391163J2082256J3185403J1222157J3033882J1061806J1837563J1412671J0777522
974A986004423J0878609R090526R983024J0799528R248647J0206217Q774511P161005
966B062146490Q841556Q572760Q530713O131613P664671N823705N517637O082307N529799
957B124841251L189031M508476M167937K761946M016848L94557P45551J671262Q11172
$$ y = [1351883319, 1376432100, 1401126337, 1423891781, 1447347672, 1470365047, 1493161344, 1514424541, 1535655019, 1555937794, 1576324856, 1596050993, 1615056291, 1633563919, 1651221900, 1669039032, 1685881872, 1702996442, 1721340048, 1736927302, 1751702485, 1767550768, 1782884814, 1796147379, 1811473113, 1824273238, 1839068961, 1852861786, 1865420464, 1877288403, 1891391163, 1903473419, 1916658822, 1927880979, 1940914861, 1951976667, 1963814230, 1975226901, 1986004423, 1996883032, 2005973558, 2015956582, 2026756110, 2036004757, 2046210974, 2054985485, 2062146490, 2070988046, 2079560806, 2088091519, 2094223132, 2101887803, 2107711508, 2113229145, 2119311452, 2124841251, 2128030282, 2132538758, 2136706695, 2139468641, 2143485489, 2143880046, 2144625597, 2146296859, 2147108031]
948B147108031j4593L90209j93477k105471n77760j141613k456001k463552k624025
939B135921748l192705j890535l047216m407843l178718l888533l374513l835128m500632
930B104605925m215596m496663l422918n115824m021997l604923m424269l753538n235296
921B066314901l866253n492970n511532l932016m249304l961526m742184m110469n457600
912B024991047l656232m743726m266120n440243m962504n365484m382409n239361m818341
903A982116627n658819l917040n956234n576326o109974o654380n411847o198424o605903
894A930027680o243896n403481q063597p711526p740696q777978q368901q789491r597214
885A859330900j0648386r438165r337703j2373750j1103891j2864007j2190151j3664975
$$ y = [2147108031, 2147093438, 2147483647, 2147290170, 2145184699, 2144606939, 2143465326, 2141009325, 2138545773, 2135921748, 2132729043, 2130838508, 2127791292, 2123383449, 2120204731, 2116316198, 2112941685, 2109106557, 2104605925, 2100390329, 2095893666, 2092470748, 2087354924, 2083332927, 2079728004, 2075303735, 2071550197, 2066314901, 2062448648, 2056955678, 2051444146, 2047512130, 2043262826, 2039301300, 2034559116, 2030448647, 2024991047, 2021334815, 2016591089, 2012324969, 2006884726, 2001922222, 1996556738, 1992174329, 1986934968, 1982116627, 1976457808, 1972540768, 1966584534, 1961008208, 1954898234, 1948243854, 1942832007, 1936633583, 1930027680, 1923783784, 1918380303, 1910316706, 1902605180, 1894864484, 1886086506, 1877717605, 1868928114, 1859330900, 1848682514, 1839244349, 1829906646, 1817532896, 1806429005, 1793564998, 1781374847, 1767709872]
877A767709872j3525234j4498113j5192823j5025765j7202024j5932218j6631065j8745110
869A640957520j8273911j9577351j9377008j9355700k0848330k1039073k1571529k2597328
861A478317290k3551154k2059491k4100359k3457750k5177245k3461136k5997792k4374771
853A286137592k5721715k6228018k1992554k8853582k5797517k5530864k6573186k5801896
845A079638260k6508239k5403621k6673965k6026707k7702379k6249170k6139009k5049704
837H69885466k6308666k7032231k4362622k5863242k5775401k5567221k5163274k5111091
829F64701718k5094844k5768167k4102960k4292341k2790394k3396584k3720038k4743304
821D70793086k2740251k3174191k2346185k1710019k2217295k1636553k1108274k1503672
$$ y = [1767709872, 1754184638, 1739686525, 1724493702, 1709467937, 1692265913, 1676333695, 1659702630, 1640957520, 1622683609, 1603106258, 1583729250, 1564373550, 1543525220, 1522486147, 1500914618, 1478317290, 1454766136, 1432706645, 1408606286, 1385148536, 1359971291, 1336510155, 1310512363, 1286137592, 1260415877, 1234187859, 1212195305, 1183341723, 1157544206, 1132013342, 1105440156, 1079638260, 1053130021, 1027726400, 1001052435, 975025728, 947323349, 921074179, 894935170, 869885466, 843576800, 816544569, 792181947, 766318705, 740543304, 714976083, 689812809, 664701718, 639606874, 613838707, 589735747, 565443406, 542653012, 519256428, 495536390, 470793086, 448052835, 424878644, 402532459, 380822440, 358605145, 336968592, 315860318, 294356646]
813B94356646j9361799k1298312k1025836j9118683j9264419j9115111j8603557j8302724
805A38266205j8030510j7324006j6671040j6982642j7343799j5328797j5997685j5180476
797E407250j4635064j5588491j5117636j2145393j3233381j2953482j1951933j0970736
789a01188866j1364937j2022647r786634r613587r292776r778964q180721q517431q316239
780a88062802p501066o682289o067734p447118n559029m983903m765829l989871m522386
771b39582027k952866l535552k200530l314571j862346j085861j331717j478672j03522
762b57447664q05349R39134K122836J382462M70260J556179N79091L160251K424334
753b45618466K583568L698104L074505L865502M979561K510145N454737N494468M408452
$$ y = [294356646, 274994847, 253696535, 232670699, 213552016, 194287597, 175172486, 156568929, 138266205, 120235695, 102911689, 86240649, 69258007, 51914208, 36585411, 20587726, 5407250, -9227814, -24816305, -39933941, -52079334, -65312715, -78266197, -90218130, -101188866, -112553803, -124576450, -134363084, -143976671, -153269447, -163048411, -171229132, -179746563, -188062802, -195563868, -202246157, -208313891, -215761009, -221320038, -226303941, -231069770, -235059641, -239582027, -242534893, -246070445, -248270975, -251585546, -253447892, -254533753, -255865470, -257344142, -257447664, -258253013, -257313879, -255191043, -253808581, -253338321, -251782142, -251203051, -248042800, -245618466, -243034898, -239336794, -236262289, -232396787, -227417226, -224907081, -219452344, -213957876, -209549424]
744b09549424M689705N755688N427151N665056O591270N225263P406518O656414O146447
735a55985912O110706O472504P769864O488483O849119P621265Q112596P014229P669750
726i1877396O651209Q722499O921492O603786P864352P625059Q611329O764703P976703
717b4136264P685780O861121Q519792O824883O972882N922154Q343897P487086N890355
708D0371686O877107P343646O614760O767025P633251N095202O732752M811942O080763
699I8328134O323554N617003O538668N461205M287009O469807M419193L555635O418805
690A47419013M689921M408494M021180L814866L858009M821172L150173L225288L861969
681A83270085K341586K860092L473613K682898L451935K733519J329179J736168L258882
$$ y = [-209549424, -204859719, -199104031, -193676880, -188011824, -181420554, -176195291, -168788773, -162132359, -155985912, -149875206, -143402702, -135632838, -129144355, -122295236, -114673971, -106561375, -99547146, -91877396, -85226187, -76503688, -69582196, -62978410, -55114058, -47488999, -38877670, -32112967, -24136264, -16450484, -9589363, -1069571, 5755312, 12728194, 18650348, 26994245, 34481331, 40371686, 47248793, 54592439, 61207199, 67974224, 75607475, 80702677, 87435429, 92247371, 98328134, 104651688, 110268691, 116807359, 122268564, 126555573, 133025380, 137444573, 141000208, 147419013, 152108934, 156517428, 160538608, 164353474, 168211483, 173032655, 176182828, 179408116, 183270085, 185611671, 188471763, 191945376, 194628274, 198080209, 200813728, 202142907, 203879075, 207137957]
672B07137957K175006J574986J572778P7575J793187K375339K568326J37109N09398
663B19921661J183327M93973J269314J149857j177792R19340O29525J381869J172979
654B26944053j193047o04830N19701j044623J21816J753705p78068m81401K11599J77475
644B25626380o44227q39794o46719J51281M5370N54400j380812j38630j087976J75317
634B21814590K52359n97148j402156p11097l49956J466718j582581m3671k07550Q4688
624B18724196o37107j569382k03994J56402J93655n34540n29868l06193j03484q43487
614B14346198L86898m75511l27030j71846k400426N22135k31928j535533K80426J11356
604B10504739N72024j351002Q84188p25525o82070n14027j029236o23834j181192J17603
$$ y = [207137957, 209312963, 210887949, 212460727, 212538302, 214331489, 216706828, 219275154, 219412263, 219921661, 221104988, 221598961, 222868275, 224018132, 222840340, 223759680, 224389205, 225771074, 226944053, 225751006, 225146176, 225665877, 224621254, 224743070, 226496775, 225718707, 225237306, 225448905, 225626380, 224982153, 224142359, 223495640, 223646921, 223692291, 224246691, 222865879, 222727249, 221639273, 221814590, 222066949, 221469801, 220067645, 219356548, 219006592, 220473310, 218890729, 218847058, 218639508, 218724196, 218087089, 216517707, 216313713, 216470115, 216663770, 216129230, 215599362, 215293169, 215189685, 214346198, 214733096, 214257585, 213930555, 213758709, 211358283, 211880418, 211648490, 210112957, 210393383, 210504739, 211076763, 209725761, 210609949, 209884424, 209202354, 208688327, 207659091, 207035257, 205854065, 205971668]
594B05971668n94645l09599j127286j21132k036006p67609k011841J130602k288248
585A97845904k146623j271814l77475k299666k077273j636157j363585k107681j704979
576A82860651l712626j064452j698013k312364l592034k386787l109645k425687l498347
567A59060696k335859m003916l958295l964274k826019l552880m331379m266844l128497
558A26692733m722369m704856n047664n466757l532643o265730n687545n795284n310646
549H0159239n146312m665761p061117o378596m969955o580651n833436n805160p227419
540B6490832n857169o684382p995128o825791p633584o090963o968992o661094q384469
531c6610740o252370p427150q091882o646259p107062q092336p167912p097265p511276
$$ y = [205971668, 205377023, 205067424, 203940138, 203819006, 201783000, 201015391, 199003550, 200134152, 197845904, 195699281, 194427467, 194049992, 191750326, 189673053, 188036896, 186673311, 184565630, 182860651, 179148025, 178083573, 176385560, 174073196, 170481162, 168094375, 164984730, 162559043, 159060696, 156724837, 152720921, 148762626, 144798352, 141972333, 138419453, 134088074, 129821230, 126692733, 121970364, 117265508, 112217844, 106751087, 103218444, 96952714, 91265169, 85469885, 80159239, 75012927, 70347166, 63286049, 56907453, 51937498, 45356847, 39523411, 33718251, 26490832, 20633663, 13949281, 5954153, -871638, -8505222, -14596185, -21565177, -28226271, -36610740, -42863110, -50290260, -58382142, -65028401, -72135463, -80227799, -87395711, -94492976, -102004252]
522a02004252p691348p093586o886182q545994q421961p157311p148960p709854p294568
513a69954016o519675p028734o244702p192812p226830n734590p900560n892547p209143
504b30903609n843711n558774p134498n410919n928571n058035o002481n619108n677557
495b83137263m454800m526903m598692n091510n140440l191518m115544l734494l564297
486c21555461l307532k798463k576330j397198k969013j533465k523097k44388j939972
477c40844919j375177j774225k38397p07690O44336p98225N10574J477099J016898O77960
467c41411766J807741P53640J151264K138664J769461L094680J844910K567330K630092
458c23653984M485152L344337L948417K946553L424323M843847N867335M843877M032746
$$ y = [-102004252, -109695600, -116789186, -123675368, -132221362, -140643323, -147800634, -154949594, -162659448, -169954016, -176473691, -183502425, -189747127, -196939939, -204166769, -209901359, -217801919, -223694466, -230903609, -236747320, -242306094, -249440592, -254851511, -260780082, -265838117, -271840598, -277459706, -283137263, -287592063, -292118966, -296717658, -301809168, -306949608, -310141126, -314256670, -317991164, -321555461, -324862993, -327661456, -330237786, -331634984, -334603997, -336137462, -338660559, -338904947, -340844919, -342220096, -343994321, -344232718, -344940408, -344296072, -345094297, -344583723, -343106624, -342089726, -341411766, -339604025, -338850385, -337699121, -335560457, -333790996, -330696316, -328851406, -326284076, -323653984, -319168832, -315824495, -311876078, -308929525, -305505202, -300661355, -294794020, -289950143, -285917397]
449b85917397M805202M443446N568507N674843N083452N961707O549868N539139N715039
440b36576194O873341O078281O079224O941974P141548O401407P024311P133435O321953
431a76580720O219562O801677O905916O586388P480186Q204344O582235P578374P415447
422a12806591O283724P032418O401482O498694P438254P002027O995675O804500O610480
413e1739337O248890N847117P029772O062469P006609N764253O595849O637635N079991
404D533248N358874O154838N257710N277141M793239M535511N314820N315472M261119
395E0801972M402465L682615L845086M924296M132942L954978L866023L534899K107625
386H5252901J883755L605049L244316J466237K817996K453017K216766K844996J326108
$$ y = [-285917397, -281112195, -276668749, -271100242, -265425399, -260341947, -254380240, -247830372, -242291233, -236576194, -229702853, -223624572, -217545348, -210603374, -203461826, -197060419, -190036108, -182902673, -176580720, -170361158, -163559481, -156653565, -150067177, -142586991, -134382647, -127800412, -120222038, -112806591, -106522867, -99490449, -93088967, -86590273, -79152019, -72149992, -65154317, -58349817, -51739337, -45490447, -39643330, -32613558, -26551089, -19544480, -13780227, -7184378, -546743, 4533248, 9892122, 16046960, 21304670, 26581811, 31375050, 35910561, 41225381, 46540853, 50801972, 55204437, 58887052, 62732138, 67656434, 71789376, 75744354, 79610377, 83145276, 85252901, 87136656, 90741705, 93986021, 95452258, 98270254, 100723271, 102940037, 105785033, 107111141]
377A07111141J113643J806036M82881R19429K480994O84289N6099R46216J416540J10384
367A17127652j61937K12926P03765j021072P74426o4857k12710j248925k10393k17358
357A15681517J64011n88689l39992j054453j582930j536886m83079l24982j590433n41010
347A07803074k13010k013003n71632j164469j656851j502676j569453r89314j056645
338I7066021r36230p84923n44584n68795j115790n76456o08539r49786k40499j606784
328H9133635j276860Q36574K30488j481418j58008J62944n02357n65250l4399M86884
318H6832233n34400Q5093N10033k16429J81562N98366J081938q2116J158036J302446
308I0916762O32207J548426Q73695J152184j03445J546123K037144J084182J664597
$$ y = [107111141, 108224784, 110030820, 110513701, 111433130, 113914124, 114598413, 114654512, 115600728, 117017268, 117127652, 116965715, 117178641, 117882406, 116861334, 117635760, 117570903, 117358193, 116109268, 115898875, 115681517, 115845528, 115256839, 114916847, 113862394, 112279464, 110742578, 110259499, 109934517, 108344084, 107803074, 107590064, 105577061, 105005429, 103840960, 102184109, 100681433, 99111980, 98122666, 97066021, 96129791, 95344868, 94800284, 94231489, 93115699, 92539243, 91930704, 90980918, 90740419, 89133635, 87856775, 88693349, 88923837, 87442419, 87284411, 87447355, 86944998, 86379748, 86345349, 86832233, 86297833, 86382926, 86892959, 86676530, 86858092, 87456458, 88538396, 88456280, 89614316, 90916762, 91548969, 93097395, 93971090, 95123274, 95019829, 96565952, 98603096, 99687278, 101351875]
299A01351875K067540K448163J921466J533728K165048l53905K931449K970783J496397
290A18532544K474887J175097K718195J504107K386844K798576J896268J997704K414426
281A37898648J954455K813654J395073K465610J448479J397227K324694J663711J753119
272A55114670K232212J541402J480204K289078Q27014K409487J405443J030142Q04203
263A69133855K070577M62625R34077J441717p9985J929864M9107k86492R63206K27804
253A76846355P4680N74601j719860R19335O6286n46238j024206o11416j273395m80909
243A72825233j913396q15466j494624j860851j628491k535586j939653j953508j572320
234A57111338m206419r60372l225845j696280l459063l772129l422153m310110j708208
$$ y = [101351875, 103419415, 105867578, 107789044, 109322772, 111487820, 111133915, 114065364, 117036147, 118532544, 121007431, 122182528, 124900723, 126404830, 128791674, 131590250, 133486518, 135484222, 137898648, 139853103, 142666757, 144061830, 146527440, 147975919, 149373146, 151697840, 153361551, 155114670, 157346882, 158888284, 160368488, 162657566, 163484580, 165894067, 167299510, 168329652, 169133855, 171204432, 171667057, 172601134, 174042851, 173962866, 175892730, 175941837, 175655345, 176618551, 176846355, 176921035, 177495636, 175775776, 176695111, 176761397, 176215159, 175190953, 174579537, 173306142, 172825233, 170911837, 170096371, 168601747, 166740896, 165112405, 162576819, 160637166, 158683658, 157111338, 152904919, 151944547, 148718702, 147022422, 143563359, 139791230, 136369077, 132058967, 130350759]
225A30350759l564918l948241m616278l846636n442480l347034l229582l101044n486396
216I3768150m881369l787305l566044n571270n205553n017212m758218l986404m640078
207E2354697o015242m752101o220123m440061m306471n297936n313461n647987n074080
198E287235l703717n827817m354909m715607o119059m682493m763833m913375n407090
189c9200665m435004m504589m393899l820040n300231l700595l087892l387433n596076
180g7426424l480408k829010m056816l435713l750988m642286j732644l125872k861871
171a07342032l054206j967937j826881j383009k473000k815948j633265k439686j65411
162a25101375j163507m25676r66704j877732j394638O01035m52297k01181r53412R34103
$$ y = [130350759, 126785841, 122837600, 118221322, 114374686, 108932206, 105585172, 102355590, 99254546, 93768150, 88886781, 85099476, 81533432, 75962162, 70756609, 65739397, 60981179, 56994775, 52354697, 46339455, 41587354, 35367231, 30927170, 26620699, 21322763, 16009302, 10361315, 5287235, 1583518, -4244299, -8599208, -13314815, -19433874, -24116367, -28880200, -33793575, -39200665, -43635669, -48140258, -52534157, -56354197, -61654428, -65355023, -68442915, -71830348, -77426424, -80906832, -83735842, -87792658, -91228371, -94979359, -99621645, -101354289, -104480161, -107342032, -110396238, -112364175, -114191056, -115574065, -118047065, -120863013, -122496278, -124935964, -125101375, -126264882, -126690558, -127657262, -129534994, -130929632, -130328597, -130780894, -130982075, -131935487, -131001384]
152a31001384k20387J730148P01640q5439Q01315J861650N88056J242907Q26925K386591
142a21167978J001662P93967K830220J919838K499818K309221K912595J552087L553431
133a01795139J702717K810074K997496L149853K372142K195835K512152M314363K310919
124g7429588L238252J966063L398961L669780L530162L194191K845226L446389L280777
115d8859787M259689K067133K986211K695982M641699K310989K146151L704014K529078
106b1518841L355486J810051L619527K337540L831994K086728J337910K692038K450334
97B002767K407331J957327L500132N36045R40828J413156K158995J229660Q01396J219780
87A8167417J530278M76909M56538O41643k40038Q92966n45352M31672p49384Q04610n89190
$$ y = [-131001384, -131221771, -129491623, -128789983, -128875422, -128074107, -126212457, -125624401, -124381494, -123554569, -121167978, -120166316, -119372349, -116542129, -114622291, -112122473, -109813252, -106900657, -105348570, -101795139, -100092422, -97282348, -94284852, -91134999, -88762857, -86567022, -84054870, -79740507, -77429588, -74191336, -72225273, -68826312, -65156532, -61626370, -58432179, -55586953, -52140564, -48859787, -44600098, -42532965, -39546754, -36850772, -32209073, -29898084, -27751933, -24047919, -21518841, -18163355, -16353304, -12733777, -10396237, -6564243, -4477515, -3139605, -447567, 2002767, 4410098, 6367425, 9867557, 10403602, 11344430, 12757586, 14916581, 16146241, 16947637, 18167417, 19697695, 20174604, 20631142, 21272785, 21032747, 21925713, 21380361, 21812033, 21062649, 21867259, 21278069]
76B1278069q85408O79927j613279m22985l94652j522201j414766p56124k158684j913263
66A0876634q32160k442303j826779j748524k186852k445966k106485k904594j755261
57g372290j742516l847902j690968l353636k609732k412194l164576m339152k413034
48c2946000k321826l596842l603133k681107l564749k820421l715462l986788k494080
39f1730408l489738k381403k916140l719348l818776l727198k125222l266880j275398
30h8450511l089833l433392k649283k750807l774846k381648k472674j230358l918336
21a14151688k512414l495613m77815j730545k854126j026059j148490j771030j994448
12a31162228j980053j305611j372877j062484m26163j282114o85974q52182m52775r651
$$ y = [21278069, 20392661, 21072588, 19459309, 19036324, 18641672, 17119471, 15704705, 14948581, 12789897, 10876634, 10044474, 7602171, 5775392, 4026868, 1840016, -605950, -2712435, -5617029, -7372290, -9114806, -12962708, -14653676, -18007312, -20617044, -23029238, -26193814, -30532966, -32946000, -35267826, -38864668, -42467801, -45148908, -48713657, -51534078, -55249540, -59236328, -61730408, -65220146, -67601549, -70517689, -74237037, -78055813, -81783011, -83908233, -87175113, -88450511, -91540344, -94973736, -97623019, -100373826, -104148672, -106530320, -109002994, -110233352, -114151688, -116664102, -120159715, -120637530, -122368075, -125222201, -126248260, -127396750, -129167780, -131162228, -133142281, -134447892, -135820769, -136883253, -137309416, -138591530, -139277504, -140129686, -140582461, -140592112]
2a40592112n66083n3666l85503J76570Q26704J72525N97371l11981O27473P40801J332118
-9a37435783P80269N66591J369829J614574P78630J671923R59754K221345O19180K173157
-19a24680531K239881K895163J045269J947302J896926J748742K828082K566342J141407
-28a06371417K447450K754241J583850K788984K518228K721849L224396O7873K355046
-37h5909500K956536K930260K051388J703187K068204K795053J289422K437712K474144
-46f5203594L131994J846225J862726P39375K166323J719769K548194J656471J718202
-55d7814315Q32524J244775k76795J720811K181942O79864K03534J640265Q71211M47009
-65c8269175J03035m18102M8890J554332j656129n60593L51115o3301j11068q62979
$$ y = [-140592112, -141158195, -141211861, -141597364, -141420794, -140594090, -140421565, -139824194, -140136175, -139508702, -138767901, -137435783, -136655514, -136088923, -134719094, -133104520, -132325890, -130653967, -129694213, -127472868, -126853688, -124680531, -122440650, -119545487, -118500218, -116552916, -114655990, -112907248, -110079166, -107512824, -106371417, -103923967, -101169726, -99585876, -96796892, -94278664, -91556815, -88332419, -88264546, -85909500, -82952964, -80022704, -77971316, -76268129, -74199925, -71404872, -70115450, -67677738, -65203594, -62071600, -60225375, -58362649, -57623274, -55456951, -53737182, -51188988, -49532517, -47814315, -46981791, -45737016, -46013811, -44293000, -42111058, -41431194, -41227660, -39587395, -38716184, -38269175, -38166140, -38584242, -38535352, -36981020, -38637149, -39197742, -38846627, -38909928, -39020996, -39883975]
-75c9883975j548156p54766R2409j521012p10268j078923j628735l374289l67143j355044
-85e2129902l177660j449034j568406j643895k260002k737962k462927k340487l488356
-94g3258631k611357k033392k936171l207763k014833k676772j704465k414933m859649
-103i7717966k584283k462037l423846l695089k004677l388259l241023m150188k498620
-112a25165988l077856k837910k103472m331159l164835l206706k338727k831070k705030
-121a51762753k523145k530245l292282k440324k439923k978074r35522k682977k136349
-130a73721594k865057k034103j321902j881293j512849j312968j692291j930205j067056
-139a89339318J04619k087595j604077M56118o48767o46151m91172n1873l40704K85509
$$ y = [-39883975, -41432131, -42186897, -42094488, -43615500, -44325768, -45404691, -47033426, -50407715, -50774858, -52129902, -55307562, -56756596, -58325002, -59968897, -62228899, -64966861, -67429788, -69770275, -73258631, -75869988, -77903380, -80839551, -84047314, -86062147, -88738919, -90443384, -92858317, -97717966, -100302249, -102764286, -106188132, -109883221, -111887898, -115276157, -118517180, -122667368, -125165988, -128243844, -131081754, -133185226, -137516385, -140681220, -143887926, -146226653, -149057723, -151762753, -154285898, -156816143, -160108425, -162548749, -164988672, -167966746, -168902268, -171585245, -173721594, -176586651, -178620754, -179942656, -181823949, -183336798, -184649766, -186342057, -188272262, -189339318, -189234699, -191322294, -192926371, -192470253, -193119020, -193765171, -194256343, -194308216, -194648920, -194363411]
-149a94363411J117928O2013R61443L45880N41895J297352R12283J097262J404095J171336
-159a85451924J468413K025539J160816J198322L601869J571760K454521L576220J551275
-168a66843189J938851M356728K604824J869813L347688K699002L614300L488089L273548
-177a39650346K610809M009254L357522L178254L970352L706966L904996K717823M119519
-186a08074851L521347M176582L075398K845318M274145N186685L751581L672431L729165
-195g3842199L665077L015827L608101M970092K285316M060454M449809K481675L019484
-204d2286364M385704K399560M123584K917659K107187L354262J535877L110301K566792
-213a5785438L175765K902916K012359J372614R41616J976031K725710J033779K381390
$$ y = [-194363411, -193245483, -193183470, -192222027, -191876147, -191334252, -190036900, -189124617, -188027355, -186623260, -185451924, -183983511, -181957972, -180797156, -179598834, -175996965, -174425205, -171970684, -168394464, -166843189, -164904338, -160547610, -157942786, -156072973, -152725285, -150026283, -146411983, -142923894, -139650346, -137039537, -133030283, -129672761, -126494507, -122524155, -118817189, -114912193, -112194370, -108074851, -104553504, -100376922, -97301524, -94456206, -90182061, -84995376, -81243795, -77571364, -73842199, -70177122, -67161295, -63553194, -58583102, -56297786, -52237332, -47787523, -45305848, -42286364, -37900660, -35501100, -31377516, -28459857, -26352670, -22998408, -21462531, -18352230, -15785438, -12609673, -9706757, -7694398, -6321784, -5380168, -3404137, -678427, 355352, 2736742]
-222B736742J134047K019161P94228L64537J254656J107546J180346n56962K85924N54896
-232A0875121L86776j958753M20419K39865n86402o65519j090028j078884K61601j109001
-242E695195q30341k489929j813792p26024l012381q62387k303571j748996j298357
-251i390583l709594j72889k546864m134604k646602j135053l256131l523798k167500
-260c2683618k449325k820776k902654k998810l461924l496548l091785l589144l407935
-269f0902519k303144m555240k533615k583499k683146l939775k221084m529031k165398
-278h8416451l192458j639484k996611l834810l987399k090585l519710k159044l310268
-287a15146820j881325k770186l554420k788903j297912k822409j992305k170886l298120
$$ y = [2736742, 3870789, 5889950, 6684178, 7048715, 8303371, 9410917, 10591263, 10034301, 10320225, 10875121, 11261897, 9303144, 9723563, 9963428, 9377026, 8711507, 7621479, 6542595, 6804196, 5695195, 4864854, 2374925, 561133, -164891, -3177272, -4039659, -6343230, -8092226, -9390583, -13100177, -13273066, -15819930, -19954534, -22601136, -23736189, -26992320, -30516118, -32683618, -35132943, -37953719, -40856373, -43855183, -47317107, -50813655, -53905440, -57494584, -60902519, -63205663, -67760903, -70294518, -72878017, -75561163, -79500938, -81722022, -86251053, -88416451, -91608909, -93248393, -96245004, -100079814, -104067213, -106157798, -109677508, -111836552, -115146820, -117028145, -119798331, -123352751, -126141654, -127439566, -130261975, -132254280, -134425166, -137723286]
-296a37723286n46046j705790j564932o10975j956278j731038j066387j423427o17844
-305a48946003j418330l73943p90792l3588k350040O00698j74222q7771R13798J91914
-315a52468279J06958p89242J380470L36987q826m96752J085103K511554R36351K08056
-325a47197620J649577M7012J529705K265293J896609J749543K075071K276887J260929
-334a32446994K013741J978457J798593L169501K048602J749001J396796K998647K491444
-343a12802212K297792K496658L255088J928969J493294J914318L980822J663767K648679
-352i1122825L034902K129809K041414K462092L184893K405609J984111K239198J989265
-361f9651532K871854L276453Q41184J833441K559554J436508K438700K304239J154790
$$ y = [-137723286, -138269332, -139975122, -141540054, -142151029, -144107307, -145838345, -146904732, -148328159, -148946003, -150364333, -150738276, -151529068, -151562656, -153912696, -153311998, -153486220, -153573991, -152660193, -152468279, -152361321, -153150563, -151770093, -151433106, -151441932, -151938684, -150853581, -148342027, -147405676, -147197620, -145548043, -145501031, -143971326, -141706033, -139809424, -138059881, -135984810, -133707923, -132446994, -130433253, -128454796, -126656203, -123486702, -121438100, -119689099, -118292303, -115293656, -112802212, -110504420, -108007762, -104752674, -102823705, -101330411, -99416093, -95435271, -93771504, -91122825, -88087923, -85958114, -83916700, -81454608, -78269715, -75864106, -73879995, -71640797, -69651532, -66779678, -63503225, -62662041, -60828600, -58269046, -56832538, -54393838, -52089599, -50934809]
-370e0934809J282238J601866J291428J331478J291970J847644O72049J663961J076528
-379c8875647Q04727J58932J178866J330443q46398J228956O35918j256102K3274r4425
-389c5711456J144796j333141R76164K029J64028m28018n78362j166296j017154N72090
-399c7375320j356663j265343j579703n84988j946690m66771p97506k296502p34422r85910
-409d9389818j638628j516214k197892k570313l48141l291315J4817k249550j287256
-418f4474310k015598p13033k642276k077422j659203j653306j353858j600187j914207
-427h0103400j439285j338217j657727k954204j802187k11466k321458j819136k283271
-436i5930351P2124k239633j477985o85081l42224j865174p83328n47984m44882j860635
$$ y = [-50934809, -49652571, -48050705, -46759277, -45427799, -44135829, -42288185, -41616136, -39952175, -38875647, -38070920, -37911988, -36733122, -35402679, -36249077, -35020121, -34384203, -35640305, -35617031, -35711456, -34566660, -35899801, -34923637, -34921608, -34757580, -35185598, -35763960, -36930256, -37947410, -37375320, -38731983, -39997326, -41577029, -42162017, -44108707, -44575478, -45372984, -47669486, -48403908, -49389818, -51028446, -52544660, -54742552, -57312865, -57661006, -60952321, -60937504, -63187054, -64474310, -66489908, -67202941, -69845217, -71922639, -73581842, -75235148, -76589006, -78189193, -80103400, -81542685, -82880902, -84538629, -87492833, -89295020, -89506486, -91827944, -93647080, -95930351, -95858227, -98097860, -99575845, -100260926, -100603150, -102468324, -103251652, -103799636, -104244518, -106105153]
-446a06105153N64294r11419j135915l1850j71241L72070j712395R21581N65541j42811
-456a07787298J011454L90707R21793k80452O75240Q77816J518225L61574L97773J362015
-466a00551153J447703J082573R96672J797499K957318J197400K574090J064864J740937
-475h5692097K387429J815719K165377J641533L332601K241867K023130L787280K778858
-484f3518303K829420K175254L324642J940457L547633K392155K837214L817020L338656
-493c7315852J922250K690126L643095K252508L900303L103505L038693K953534J976611
-502a1835227L058598L401855J661690M325142K966989R76256K946409R82170L471306
-511A1955188M129216K622337N12006L660304K372630K111478J351441J728388J860768
$$ y = [-106105153, -105540859, -106452278, -107588193, -107620043, -107791284, -107419214, -109131609, -108210028, -107644487, -107787298, -106775844, -106385137, -105463344, -105743796, -105068556, -104190740, -102672515, -102310941, -101913168, -100551153, -99103450, -98020877, -97024205, -95226706, -92269388, -91071988, -88497898, -87433034, -85692097, -83304668, -81488949, -79323572, -77682039, -74349438, -72107571, -70084441, -66297161, -63518303, -60688883, -58513629, -55188987, -53248530, -49700897, -47308742, -44471528, -40654508, -37315852, -35393602, -32703476, -29060381, -26807873, -22907570, -19804065, -16765372, -13811838, -11835227, -8776629, -5374774, -3713084, 612058, 3579047, 4555303, 7501712, 8483882, 11955188, 16084404, 18706741, 19218747, 22879051, 25251681, 27363159, 28714600, 30442988, 32303756]
-520C2303756J503974J206909J537507K438876J947054J005492M21522J051651P01200
-529D4117941P57285M99703R49829P49905R15232j205516P64958L12487r00465k33819
-539D6727540j60230p44131P92645k595406J3055j811613p70404j297313k033146k419031
-549C5701966j390695o67669j881074k925660j379824k735900j788083j924994k749733
-558A8258334k919048k944733k983341l315148j758938l146956m571451j770013l303997
-567h455291k970224m321555l189288l608688m504977k254274l141567l476219n183264
-576d1105347k795354k799948k928967l819861n022981l647920m341529k556060l885536
-585g2903503l442752k835532m569143l160075k018952l334425l495939l580510k556487
$$ y = [32303756, 33807730, 35014639, 36552146, 38991022, 40938076, 41943568, 42365090, 43416741, 44117941, 44875226, 45374929, 46324758, 47074663, 47989895, 46784379, 47549337, 47861824, 46961359, 46727540, 46567310, 45823179, 46615824, 44020418, 44033473, 42221860, 41451456, 40154143, 38120997, 35701966, 34311271, 33643602, 31762528, 28836868, 27457044, 24721144, 22933061, 21008067, 18258334, 15339286, 12394553, 9411212, 6096064, 4337126, 1190170, -3381281, -5151294, -8455291, -11425515, -15747070, -18936358, -22545046, -27050023, -29304297, -32445864, -35922083, -41105347, -43900701, -46700649, -49629616, -53449477, -58472458, -62120378, -66461907, -69017967, -72903503, -76346255, -79181787, -83750930, -86911005, -88929957, -92264382, -95760321, -99340831, -101897318]
-594a01897318l640733j584470l190661k716574l864049k057448l099825k209859j334436
-603a25595373k746410k100271k683915k082539k323814j151234M89263k818605j951749
-612a42964647k924169j24327l84869o29242j105442j065836K78006J14986j07244j326597
-622a50239381J113814L06000q0945K01142J372787N48586l26826R82982J938809R13845
-632a43269187J509881J199955J463575K040944q15905K770257J997234K945127J467881
-641a28690238K165566K768594K878941Q45186J915829K330573L514276K741382K959470
-650a06570421K436425L065846L489295K084630K933717M121886L469050J826241L837394
-659g9305937L533753J611637M563616K285343L995593M244700K761725L304219L717784
$$ y = [-101897318, -105538051, -107122521, -110313182, -113029756, -116893805, -118951253, -122051078, -124260937, -125595373, -128341783, -130442054, -133125969, -135208508, -137532322, -138683556, -138194293, -141012898, -142964647, -145888816, -146013143, -146398012, -147027254, -148132696, -149198532, -148920526, -148805540, -148912784, -150239381, -149125567, -148819567, -148900512, -148699370, -147326583, -146777997, -147104823, -146121841, -144183032, -143269187, -141759306, -140559351, -139095776, -137054832, -137870737, -135100480, -133103246, -130158119, -128690238, -126524672, -123756078, -120877137, -120031951, -118116122, -115785549, -112271273, -109529891, -106570421, -104133996, -101068150, -97578855, -95494225, -92560508, -88438622, -84969572, -83143331, -79305937, -75772184, -74160547, -69596931, -67311588, -63315995, -59071295, -56309570, -53005351, -49287567]
-668d9287567J956612L600782K496552L405114K991934M072438L224850K819265K881078
-677b1838942K286242L854638K296801K503947K623882K248635K548787K500574K888584
-686A913148L359617J577695J759156K321971K476687K062304K358730K051612K627812
-695B2508732J114891K132353L88008J718217O00962J746081N55166O34843J570258
-704C2969511J659982Q88255J178352k6223J84409j8267J902451Q91308n38425K300876
-714D1392229k50380j302472k035629P20599P83947O49243j168874l42676r17794n46147
-724C6982046J75605L53093n42624L11406k266567J2266q1718M97180j815715M8306q21483
-735C2851795j040060p43038O32257j762991j164238O4954k13612j679181N68789j493358
$$ y = [-49287567, -47330955, -43730173, -41233621, -37828507, -34836573, -30764135, -27539285, -24720020, -21838942, -19552700, -15698062, -13401261, -10897314, -8273432, -6024797, -3476010, -975436, 1913148, 5272765, 6850460, 8609616, 10931587, 13408274, 15470578, 17829308, 19880920, 22508732, 23623623, 25755976, 26143984, 27862201, 28463163, 30209244, 30764410, 31399253, 32969511, 34629493, 35517748, 36696100, 36669877, 36854286, 36836019, 38738470, 39629778, 39091353, 41392229, 41141849, 39839377, 37803748, 38524347, 39308294, 39957537, 38788663, 38445987, 37528193, 36982046, 37157651, 37510744, 36968120, 37279526, 35012959, 35025225, 34943507, 35440687, 33624972, 33673278, 32851795, 31811735, 31068697, 31700954, 29937963, 28773725, 28838679, 28625067, 26945886, 27514675, 26021317]
-745B6021317K19038o73901j72419j85231r59629n7806K63902l87075m9653k69600L7790
-756B3786733M54148m01483n28653l94700K37481K93763j8810O0807P16502J282959
-766B5488747J712242L9230J85424L45678J750898J544155N51301R39705P32817J462963
-776C4753160J871186R95540J060127J390974K367840J282206K876257J756820K665741
-785E1019851O85359K139783K060855K155274J351477L553696K108561L275230L038364
-794G1388450J004261K440502L359472K257419J331820L816938K413706J886619K773713
-803I2672900L123172K359403L051690K819708K474623K484505L557234L198835K799897
-812A18541967J621879J725350L680207L247761K296625K915257L109895J941096L259457
$$ y = [26021317, 26240355, 25566454, 25394035, 25208804, 24249175, 24191369, 24455271, 24068196, 24018543, 23748943, 23786733, 24240881, 23839398, 23310745, 22916045, 23153526, 23447289, 23428479, 23489286, 24205788, 25488747, 27200989, 27240219, 27425643, 27771321, 29522219, 31066374, 31617675, 32557380, 33290197, 34753160, 36624346, 37619886, 38680013, 40070987, 42438827, 43721033, 46597290, 48354110, 51019851, 51705210, 53844993, 55905848, 58061122, 59412599, 62966295, 65074856, 68350086, 71388450, 72392711, 74833213, 78192685, 80450104, 81781924, 85598862, 88012568, 89899187, 92672900, 95796072, 98155475, 101207165, 104026873, 106501496, 108986001, 112543235, 115742070, 118541967, 120163846, 121889196, 125569403, 128817164, 131113789, 134029046, 137138941, 139080037, 142339494]
-821A42339494K304172J790587K389446K375728Q45283K507843K724087P68626K423551
-830A60468817J018203K379500J951897J380510K319622J888172m5431J399890J306054
-839A74067234J075636P18636K135065j12050Q19354o07943O81860P43756l87504p4925
-849A79059119J361508o56687k8430j290779K157880j859062j047509m81583j086786
-858A76127671m60547q24136j066711o68217r35677k400357j342312k374677j674170
-867A64380867l01096k307050j518649j455979k054175k398593l283867k032546j613763
-876A47415149l076506r64301l598795k248739k709547j362223l976159k288080l144064
-885A24046735j641029k609174l302312k493859l393406k334968l561090k409639k074770
$$ y = [142339494, 144643666, 146434253, 148823699, 151199427, 152044710, 154552553, 157276640, 158045266, 160468817, 161487020, 163866520, 165818417, 167198927, 169518549, 171406721, 171361290, 172761180, 174067234, 175142870, 175861506, 177996571, 177884521, 178703875, 178095932, 178777792, 179521548, 179134044, 179059119, 180420627, 179763940, 179735510, 178444731, 180602611, 178743549, 177696040, 177214457, 176127671, 175667124, 174842988, 173776277, 173108060, 172172383, 169772026, 168429714, 166055037, 164380867, 164079771, 161772721, 160254072, 158798093, 156743918, 154345325, 151061458, 149028912, 147415149, 144338643, 143374342, 139775547, 137526808, 134817261, 133455038, 129478879, 127190799, 124046735, 122405706, 119796532, 116494220, 114000361, 110606955, 108271987, 104710897, 102301258, 100226488]
-894A00226488l439331k933048k309188l004016k386034k956074j765893k643207k513256
-903G6276441k588869k846690l016101j445683k312015k692601j780021j312333j500399
-912E6781729l771701j472269k062040k528248j094934j943924j73439k867569j012928
-921C9854677j507816j266015j244937j412105j346893q42137O3834j186650j11609
-930C1000349j084732n40657J072816j710626m76067j18931m03978n65991P23279K56883
-940B8152345J81779q43835P31559P17902n94936J693014J40300K337513k03174l13481
-950C1998986M49345Q43487K155850J165622Q25143Q75599O48024K244279P08822Q29801
-960D2744958L90277J630512M67830P94539O48770J672871J743906R51624N17153J848276
$$ y = [100226488, 96787157, 93854109, 91544921, 88540905, 86154871, 83198797, 81432904, 78789697, 76276441, 73687572, 70840882, 67824781, 66379098, 64067083, 61374482, 59594461, 58282128, 56781729, 53010028, 51537759, 49475719, 46947471, 45852537, 43908613, 43735174, 40867605, 39854677, 38346861, 37080846, 35835909, 34423804, 33076911, 32234774, 32298608, 31111958, 31000349, 29915617, 29374960, 30447776, 28737150, 28261083, 28142152, 27738174, 27172183, 27895462, 28152345, 28334124, 27490289, 28221848, 28939750, 28344814, 30037828, 30178128, 32515641, 32312467, 31998986, 32448331, 33291818, 35447668, 36613290, 37438433, 38314032, 38962056, 41206335, 41915157, 42744958, 43135235, 44765747, 45233577, 46028116, 46676886, 48349757, 50093663, 51045287, 51562440, 53410716]
-970E3410716J099932J605222J149408J251243O39100K178784K46884r9580J416327M31834
-980F3329870J700370J215874R92319q32454O83126K01464K9651Q21293p51616m18601
-990F6971296K408960j254284O81567k48400N82755j157746k44545j498561N05452p04776
-1000F6041718l83102j432272J090655k496542n76731j911402m27299j469433k193803
-1009E6241789j604263k031672j191783j680927k458971j037008k143243k862481k620861
-1018C8610580k171980k091428l321677k320883j946135m200642k929038j572448l249437
-1027A4806912k541583l357554l269539k844261k950502l157590l511283l663616m820804
-1036a5309820j993024k680851m112721m169922l303740k837993m770924l178334l753094
$$ y = [53410716, 54510648, 56115870, 57265278, 58516521, 59155621, 61334405, 61581289, 61481709, 62898036, 63329870, 65030240, 66246114, 67238433, 66405979, 67089105, 67290569, 67320220, 68141513, 67389897, 66971296, 69380256, 68125972, 68807539, 68559139, 69141894, 67984148, 67739603, 66241042, 66746494, 66041718, 65658616, 64226344, 65316999, 62820457, 62243726, 60332324, 59905025, 58435592, 56241789, 54637526, 52605854, 51414071, 49733144, 47274173, 46237165, 44093922, 41231441, 38610580, 36438600, 34347172, 31025495, 28704612, 26758477, 22557835, 19628797, 18056349, 14806912, 12265329, 8907775, 5638236, 2793975, -156527, -3314117, -6825400, -10489016, -15309820, -17302844, -19983695, -24096416, -28266338, -31570078, -34408071, -39178995, -42357329, -46110423]
-1045d6110423m263888j793887m779235l574142l542362l422128l753994l077704l271290
-1054g7589053m962132k514693l599399l489068k339002l198016l504783k714641l444312
-1063a07355099k398336k688340k081971l369447l484472l376925k611632j947939k688904
-1072a32003065k738548j786580k426858j397023l033415j245654j674922j231808j179311
-1081a48717184q92153j264100r41044j762464k178447n30649q31766o49459r33236m98262
-1091a59198764N44896q29052j77921N07384l66953p78595N46656L61410O98950J313998
-1101a57377991O02821N32241K32637J297078R01536J885662K43160J572207L17318
-1110a49793331J394164J584558J305588R42383K432555J548764J456682K396281Q96826
$$ y = [-46110423, -50374311, -52168198, -56947433, -60521575, -64063937, -67486065, -71240059, -74317763, -77589053, -82551185, -85065878, -88665277, -92154345, -94493347, -97691363, -101196146, -103910787, -107355099, -109753435, -112441775, -114523746, -117893193, -121377665, -124754590, -127366222, -129314161, -132003065, -134741613, -136528193, -138955051, -140352074, -143385489, -144631143, -146306065, -147537873, -148717184, -149609337, -150873437, -151814481, -153576945, -155755392, -156286041, -157117807, -157767266, -158700502, -159198764, -158653868, -159482920, -159660841, -159153457, -159520410, -160299005, -159752349, -159390939, -158691989, -157377991, -156775170, -156242929, -156010292, -154713214, -153811678, -151926016, -151682856, -150110649, -149793331, -148399167, -146814609, -145509021, -144566638, -142134083, -140585319, -139128637, -136732356, -135835530]
-1119a35835530K249579K332601K293178K505838J265483J330092K791541J845822J942563
-1128a17278833K821055J944959J221866L014695J776664L161893K538918K052049K433885
-1137i6312849J744001M02331L427154K199965L010614L407948q98123L437101q17597
-1146h0399455R92322M706342Q88922J1047394O30706Q4912J404595R2678K554704J347041
-1156e6649839J443294J713488K190828Q19780K57803K260389K242414J257939j17998
-1165d4581902J154528P89406L07901K280165J336480M60084J961830m28204O34736R61990
-1175c5122986J454978q15964P53337J061244O70912P3309K04541J309987j26255k03031
-1185c0739928p00436R31390O46464j442846P19545N95050l31333j75250M39478J103756
$$ y = [-135835530, -133585951, -131253350, -128960172, -126454334, -125188851, -123858759, -121067218, -119221396, -117278833, -114457778, -112512819, -111290953, -108276258, -106499594, -103337701, -100798783, -98746734, -96312849, -94568848, -94166517, -90739363, -88539398, -85528784, -82120836, -83018959, -79581858, -80399455, -79407133, -74700791, -73811869, -62764475, -62133769, -62048857, -60644262, -60551584, -57996880, -56649839, -55206545, -53493057, -51302229, -50482449, -50224646, -47964257, -45721843, -44463904, -44581902, -43427374, -42637968, -42330067, -40049902, -38713422, -38253338, -36291508, -36719712, -36084976, -35122986, -33668008, -34483972, -33730635, -32669391, -31998479, -31925170, -31720629, -30410642, -30536897, -30739928, -31440364, -30508974, -29862510, -31305356, -30585811, -29990761, -30322094, -30497344, -30057866, -28954110]
-1195b8954110k671875m8809Q51902o50446Q93168n67148O91010j079111J241389j647142
-1205c1941172k67779K42535n55211L00884m11483j58218j44041o43587P95830n22037
-1215c3304279J062693o24021k62651K08731J60780J0556J231530k13165N8620J34297
-1225c1536909J078896K67555l84024J763691K2307P89467j091315P16272M52291K071351
-1235b5850418J57910R79725J115810J091325K84126J442246J102568J437040J30611
-1244a8109057O63731J327662Q13490K126673K036441J932918J160291O35125K434958
-1253d977768J242271K300563J310226J105564J032035K032675J029982K109440J087443
-1262H272431K938662J630001J861075J244116K290600K087882J513634J625333N67514
$$ y = [-28954110, -31625985, -31674794, -30822892, -31473338, -30580170, -31147318, -30456308, -31535419, -30294030, -31941172, -32208951, -31966416, -32521627, -32220743, -32632226, -32790444, -32934485, -33578072, -32782242, -33304279, -32241586, -32865607, -33128258, -32919527, -32758747, -32748191, -31516661, -31729826, -31671206, -31536909, -30458013, -30190458, -30574482, -28810791, -28788484, -27999017, -29090332, -28374060, -27921769, -25850418, -25692508, -24712783, -23596973, -22505648, -22221522, -20779276, -19676708, -18239668, -18109057, -17445326, -16117664, -15304174, -13177501, -11141060, -9208142, -8047851, -7412726, -4977768, -3735497, -1434934, -124708, 980856, 2012891, 4045566, 5075548, 7184988, 8272431, 11211093, 12841094, 14702169, 15946285, 18236885, 20324767, 21838401, 23463734, 24031248]
-1271B4031248K315441K063351K262694J078082J486702K119019J367878Q79287J485213
-1280C9088915J460107J334307J003918K996440R06554J390461R16702N70767J951547
-1289E1619718J941110L98120J300630j88419J624280J801188L75758k70302J699422
-1298F0301505J522965J13320k18062J20737j008551J27911M39248p9494o92241o076
-1308F0621262Q24056k93283j932071l18850q83117n78372l77361j079478j443132j176814
-1318E3362840q53265o68291q53868j336783j231716k088828k011741j273962l084845
-1327C9959541j304201j651493k456248j973878j798628k030272l237135j630999k166287
-1336B1710400j401319j559327m514229j746443k649074m007360k616026k287642l073258
$$ y = [24031248, 26346689, 28410040, 30672734, 31750816, 33237518, 35356537, 36724415, 37603702, 39088915, 40549022, 41883329, 42887247, 45883687, 46790241, 48180702, 49097404, 49668171, 51619718, 53560828, 53958948, 55259578, 55071159, 56695439, 58496627, 58872385, 58602083, 60301505, 61824470, 61937790, 61719728, 61840465, 60831914, 60959825, 61399073, 61319579, 60627338, 60621262, 61445318, 61152035, 59219964, 58901114, 58017997, 57439625, 57062264, 55982786, 54539654, 53362840, 52509575, 51841284, 50987416, 49650633, 48418917, 46330089, 44318348, 43044386, 39959541, 38655340, 37003847, 34547599, 32573721, 30775093, 28744821, 25507686, 23876687, 21710400, 20309081, 18749754, 14235525, 12489082, 9840008, 5832648, 3216622, 928980, -2144278]
-1345b144278k785315k520880l640429l211534k594997m405769k045909l190283k601448
-1354b9140842l412370k002976l675893k866444m074363j041586m325639k448752k988406
-1363e5977271k771804l518303k124888k133136k706514l670479k062056k662250j422395
-1372g9049096m126960k580172k349118j646482k165584k375713k000239k362166p57465
-1381i9412995j783698k537478k866673j813245j000934k91959j377779j181787k441573
-1390a14708121j207659j873295o55235j16499p42516k42813j433473J75600l79333l79661
-1400a21563005q85813N73767p17132O66365o42075M43692N35723j0159O84410L92934
-1410a20521293L51944M11211K022506J319787P15712J415943L7426K00656J102107
$$ y = [-2144278, -4929593, -7450473, -11090902, -14302436, -16897433, -21303202, -23349111, -26539394, -29140842, -32553212, -34556188, -38232081, -41098525, -45172888, -46214474, -50540113, -52988865, -55977271, -58749075, -62267378, -64392266, -66525402, -69231916, -72902395, -74964451, -77626701, -79049096, -83176056, -85756228, -88105346, -89751828, -91917412, -94293125, -96293364, -98655530, -99412995, -101196693, -103734171, -106600844, -108414089, -109415023, -109706982, -111084761, -112266548, -114708121, -115915780, -117789075, -118444310, -118560809, -119303325, -119546138, -120979611, -120804011, -121183344, -121563005, -122448818, -121875051, -122592183, -121925818, -122567893, -122124201, -121588478, -121598637, -120914227, -120521293, -120169349, -119758138, -117735632, -116415845, -115700133, -114284190, -114246764, -114046108, -112944001]
-1419a12944001K829760O53440J452212J601843J624117Q65943J032733J658448K666939
-1428i8558566J391346K003776J954647K100337J622190J527276K213441J772821K448085
-1437h1524647J496812J936199K482913K411294K482746N82219K087184K007105K127562
-1446f3910613K881805J937447J631648J366730K026110K548619J320528P13475K206344
-1455d7277907J903588K735694J584965K399950J461868Q61928J296630L028278K856418
-1464b9148588J013465J216334N14722J472841J100199J51388J955565J374661J300968
-1473a9048445L83821J604996N246J096935R54837R51184N24028J01319O76023O96529
-1483a2053527J383162j72761Q41918M52099q85640O39292q7290n14062J010133q53588
$$ y = [-112944001, -110114241, -109460801, -108008589, -106406746, -104782629, -103916686, -102883953, -101225505, -98558566, -97167220, -95163444, -93208797, -91108460, -89486270, -87958994, -85745553, -83972732, -81524647, -80027835, -78091636, -75608723, -73197429, -70714683, -70132464, -68045280, -66038175, -63910613, -61028808, -59091361, -57459713, -56092983, -54066873, -51518254, -50197726, -49484251, -47277907, -45374319, -42638625, -41053660, -38653710, -37191842, -36329914, -35033284, -32005006, -29148588, -28135123, -26918789, -26404067, -24931226, -23831027, -23679639, -21724074, -20349413, -19048445, -18664624, -17059628, -17054382, -15957447, -15002610, -14051426, -13527398, -13426079, -12750056, -12053527, -10670365, -10843126, -10001208, -9549109, -10434749, -9795457, -9882747, -10396809, -9386676, -10240264]
-1493a0240264P00156J199043j746464J66510k32462r36835p42309m34047l89629R77332
-1503a1678969j750520R23882n26968o28574q10424j128982o88950O3918j000100L22034
-1513a6903653k234507r82056m53905j445352M39861j238109n72552p30553j515q79000
-1523b5001341j317717q70548q14608P32604k160338L657j443875J180208o25583q32106
-1533c1149647L73643j072158l39867j276848q75498j67288n93639p93478J684372j650955
-1543c5861363P27333j341666j97161N66516j3128J146835l12347r8447J174417q30662
-1553c5039673k44287J074956M06830o59943k54561J398889O53630J110125K57855q3290
-1563c1379469p6256J189309P77457O9028J29658J690555J777869R6219P53924J431777
$$ y = [-10240264, -9540108, -8341065, -10087529, -9921019, -10153481, -11090316, -11832625, -12266672, -12656301, -11678969, -13429489, -12505607, -13032575, -13661149, -14471573, -15600555, -16289505, -16225587, -17225687, -16903653, -19138160, -20120216, -20574121, -22019473, -21579612, -22817721, -23390273, -24120826, -24122341, -25001341, -26319058, -27189606, -28004214, -27271610, -29431948, -29428291, -30872166, -29691958, -30317541, -31149647, -30776004, -31848162, -32188029, -33464877, -34340375, -34507663, -35101302, -35894780, -34210408, -35861363, -35134030, -36475696, -36672857, -36106341, -36119469, -34972634, -35284981, -35383428, -34209011, -35039673, -35283960, -34209004, -33802174, -34462117, -34716678, -33317789, -32664159, -31554034, -31296179, -31379469, -31455725, -30266416, -29488959, -29419931, -29290273, -27599718, -25821849, -25725630, -24971706, -23539929]
-1573b3539929R42567J019840M28324R31054J745106M97914J200312R06158J085850
-1582a4782804J459348j55930J929156K208358k1684R79305J305243K436984K35837Q20704
-1592c585483L11861J094684M19340J177583J622088J047881O22358K61030J997585
-1601D968927J118383J910790r43909L88316K406520N76055R51641R04519m8628J185282
-1611A3417896L67734J46082Q18829J102317q08564P19264J578438j128498Q984J239491
-1621A7461973J48547q18745k72279k76559J19605q32693Q10026j075625J229936n95034
-1631A5899152k837088Q96301K01530J31400n25951m27831j667122j078601n56297j509830
-1641H525663n48601j058488L1480k709968r2740k40287k014624j445053n74420o3355
$$ y = [-23539929, -22597362, -21577522, -21149198, -20218144, -18473038, -17975124, -16774812, -15868654, -14782804, -13323456, -13479386, -11550230, -9341872, -9363556, -8384251, -7079008, -4642024, -4406187, -3585483, -3273622, -2178938, -1759598, -582015, 1040073, 2087954, 2710312, 2971342, 4968927, 6087310, 7998100, 7054191, 7442507, 9849027, 10425082, 11376723, 12281242, 12232614, 13417896, 13785630, 13931712, 14750541, 15852858, 15044294, 15763558, 17341996, 16213498, 16222482, 17461973, 17610520, 16791775, 16519496, 16242937, 16362542, 15529849, 16339875, 15264250, 16494186, 15899152, 13062064, 13958365, 14159895, 14291295, 13765344, 13337513, 11670391, 10591790, 10035493, 8525663, 7977062, 6918574, 6950054, 4240086, 4147346, 3907059, 1892435, 447382, -127038, -190393]
-1651a90393j498763j338064k721332m41212j245241j934383j985593j506802j122611
-1660a3984394j675297j124873J52333j362725k288349j297185j081920j974232j878435
-1669b6515077r03290r38536k991584p62005j797060j820832q21435j363048k111067
-1678d0023934j372230j443002j062372o21483j887563j906000j46039m15557n21724
-1687d9399904j395474q97341n77910k146435j909316p72530n98696k397346J011527
-1696e9083425r98549K63445n60660j109325k059447N6923J118215j056089M39853j671731
-1706f4660790P87458p31738l81736j006169k93701P91311q79673M84001k62955R55143
-1716f5198849Q57016j151759R25938J082163r62876K73213n9324P73533k19439J61484
$$ y = [-190393, -1689156, -3027220, -5748552, -6189764, -7435005, -9369388, -11354981, -12861783, -13984394, -15659691, -16784564, -16632231, -17994956, -20283305, -21580490, -22662410, -24636642, -26515077, -27418367, -28356903, -31348487, -32110492, -33907552, -35728384, -36549819, -37912867, -40023934, -41396164, -42839166, -43901538, -44523021, -46410584, -48316584, -48462623, -48878180, -49399904, -50795378, -51692719, -52270629, -54417064, -56326380, -57098910, -57697606, -60094952, -59083425, -60081974, -59818529, -60379189, -61488514, -63547961, -63491038, -62372823, -63428912, -62989059, -64660790, -63873332, -64605070, -64986806, -65992975, -66286676, -65495365, -66375038, -65891037, -66153992, -65198849, -64341833, -65493592, -64567654, -63485491, -64448367, -64175154, -64234478, -63460945, -63680384, -63518900]
-1726f3518900J514690J142791j053704R7162P92241K043607L37882j35623J024105
-1735e7755749J264231r00120O82556J620151J4765J344410O17331J8357L67439K168140
-1745e0558489M78994k07401l98187J406666P72876R36113J498940R2207K08395Q63323
-1755d4906563q4472R99248q7213J080010q6113J190219K33992p70732P46630Q2872q5178
-1766d1687300J903121o26667o01592P48169n35244O04060j265815J80642r18212r11406
-1776d3110244j22014m1538j400563m08529M4420q54656o51466K41308j058119n37189
-1786d7898590m65721j217546j617587l68010m04559n88971j425981k308648j361893
-1795e7657506j134743j975088n45301j146462j653028j512252j97310k933457j203033
$$ y = [-63518900, -62004210, -60861419, -61915123, -61817961, -61025720, -58982113, -58644231, -58779854, -57755749, -56491518, -57391638, -56709082, -55088931, -55074166, -53729756, -53112425, -53094068, -52726629, -50558489, -50079495, -50286896, -50685083, -49278417, -48505541, -47569428, -46070488, -45978281, -45769886, -44906563, -44991035, -43991787, -44079000, -42998990, -43085103, -41894884, -41660892, -42431624, -41684994, -41602122, -41687300, -39784179, -40410846, -41012438, -40264269, -40799513, -40195453, -41461268, -41280626, -42198838, -43110244, -43232258, -43273796, -44674359, -45082888, -45038468, -45893124, -46544590, -46303282, -47361401, -47898590, -48364311, -49581857, -51199444, -51567454, -51972013, -52560984, -53986965, -56295613, -57657506, -58792249, -60767337, -61312638, -62459100, -64112128, -65624380, -65821690, -68755147, -69958180]
-1804f9958180j290025r84813k859784j536155j373606j219544k496030q10779k949502
-1813h5478418j003821j378915k2036l068956k947232q63213j971969j896773j572030
-1822a00203363k129887j640193j821129j254142j875463k164930j380270k726380j781102
-1831a16976859j520292j106850j245170j094909j759005j639874j653288k317113m88018
-1840a29801378m79527j989564o49917j205863j696112n69654j300162p512k213904p22534
-1850a40636127l37596k454392O5318j60159j43136j189021j267889J53755M73243l60675
-1860a45856679k01307q14813r39739Q43594o73524O92097j244086J57510M29671O04984
-1870a47002292J65521P25027N45271J329095o49288J424659R48154M08217J642128J14811
$$ y = [-69958180, -71248205, -72233018, -75092802, -76628957, -78002563, -79222107, -81718137, -82528916, -85478418, -86482239, -87861154, -87883190, -90952146, -93899378, -94762591, -96734560, -98631333, -100203363, -102333250, -103973443, -105794572, -107048714, -108924177, -111089107, -112469377, -115195757, -116976859, -118497151, -119604001, -120849171, -121944080, -123703085, -125342959, -126996247, -129313360, -129801378, -130280905, -132270469, -132920386, -134126249, -135822361, -136392015, -137692177, -137699689, -139913593, -140636127, -140973723, -143428115, -143362797, -143522956, -143666092, -144855113, -146123002, -145969247, -145496004, -145856679, -146057986, -146872799, -147812538, -146968944, -147642468, -146950371, -148194457, -148036947, -147607276, -147002292, -146836771, -146111744, -145566473, -144237378, -144886666, -143462007, -142513853, -142105636, -140463508, -140348697]
-1880a40348697Q15360N62858J046512Q60334J673290O49818Q77132K038844J118703
-1889a30705846J52849L290005R36960J981501Q78288J044396K470609J66478J886514
-1898a17898246J675246J981466J226608J318852K142510K695401J608727R66832J803340
-1907a02479264O49940K191830K234561J144577J666484J995350J965700K213944R02409
-1916h7514469K150491J676081K646090K80231J221948K401285K220103J378141K359813
-1925g1180286Q91555J392897J590472O36305K322560J661727J273113J894490J214084
-1934e8303083K025908K10748J485367M11843K979949J135704M11886J091450J618345
-1943d6931883J47695P29957J229005J374087J600930n56645M75826J218437K33127
$$ y = [-140348697, -139533337, -138970479, -137923967, -137063633, -135390343, -134740525, -133863393, -131824549, -130705846, -130552997, -127262992, -126326032, -124344531, -123466243, -122421847, -119951238, -119784760, -117898246, -116223000, -114241534, -113014926, -111696074, -109553564, -106858163, -105249436, -104282604, -102479264, -101829324, -99637494, -97402933, -96258356, -94591872, -92596522, -90630822, -88416878, -87514469, -85363978, -83687897, -81041807, -80761576, -79539628, -77138343, -74918240, -73540099, -71180286, -70288731, -68895834, -67305362, -66669057, -64346497, -62684770, -61411657, -59517167, -58303083, -56277175, -56066427, -54581060, -54169217, -51189268, -50053564, -49641678, -48550228, -46931883, -46784188, -46054231, -44825226, -43451139, -41850209, -42406854, -41931028, -40712591, -40479464]
-1952d0479464J263724J396911j128194O7602K112286k7728k04157J307322m33545J309241
-1962c4816002J383644p85403j09057j90400O21898N63134n7343n94499N55346j83186
-1972c3611868R65665k89590k74096O88781q64289Q24208o23165K28609k66369j91641
-1982c3413755q32636l81680J104670K57937r85134m71483n88350O732j173728l11238
-1992c6788665k0502P21748r9813n02149J39280j3533l27265r99408p85791M80911J399625
-2003c6795562j712555J61326r04109N34780m32570n49349r03788j96652R97330j66129
-2013c9967278n47461m17839K58496Q19471j14456o85396l90082k30317j013595K47074
-2023d2041383M16221k73060J59874J587258j898202J329168j62995j002361O74901k72367
$$ y = [-40479464, -39215740, -37818829, -38947023, -38879421, -36767135, -36794863, -36999020, -35691698, -36125243, -34816002, -33432358, -34217761, -34326818, -34517218, -33895320, -33332186, -33389529, -33984028, -33428682, -33611868, -32646203, -32935793, -33209889, -32521108, -33385397, -32561189, -33184354, -32955745, -33222114, -33413755, -34246391, -34628071, -33523401, -33265464, -34250598, -34722081, -35310431, -35303699, -36477427, -36788665, -36809167, -36087419, -36187232, -36689381, -36550101, -36563634, -36890899, -37890307, -38676098, -38195187, -36795562, -38508117, -38346791, -39250900, -38716120, -39148690, -39698039, -40601827, -40798479, -39801149, -39967278, -40514739, -40932578, -40674082, -39854611, -39969067, -40654463, -41044545, -41274862, -42288457, -42041383, -41625162, -41898222, -41738348, -40151090, -42049292, -40720124, -40883119, -41885480, -41210579, -41482946]
-2033d1482946M68173o37116j04329J670139n05423j69115j95714N03532N23259p01733
-2043d0631273q0463O00103O54277n27925O66516j666437J093085j08579l3648j18467
-2053d0152811m9512O73374K31555N34708J21135k28437j13940L21890m23654J279507
-2063c7806185j109370p93281l52254K88089O6692K97843K97485j25989J24671j952824
-2073d1065123J05037q60112J860710q16592k42720j361667J80883O23156j304187l61966
-2083d3242581P31128k09319k436343O02241K41376l53218m05443j160293N47930r56928
-2093d6641450m25452j415425l28219p45759r96249r97888n32054p04929j130149J056446
-2103e2861128o65397j209024k159079j220572M39396j491178L67472j393157J48229
$$ y = [-41482946, -41014773, -41651889, -41756218, -40086079, -40591502, -40760617, -40956331, -40452799, -39929540, -40631273, -40711736, -40111633, -39457356, -39985281, -39318765, -40985202, -39892117, -40000696, -40034344, -40152811, -40202323, -39528949, -39297394, -38762686, -38641551, -38869988, -38983928, -38662038, -39085692, -37806185, -38915555, -39708836, -40061090, -39773001, -39706309, -39408466, -39110981, -39236970, -39112299, -41065123, -40960086, -41820198, -39959488, -40776080, -41018800, -42380467, -42199584, -41576428, -42880615, -43242581, -42511453, -42720772, -45157115, -44554874, -44313498, -44666716, -45072159, -46232452, -45684522, -46641450, -47066902, -48482327, -48810546, -49556305, -50552554, -51550442, -52082496, -52787425, -53917574, -52861128, -53526525, -54735549, -56894628, -58115200, -57675804, -59166982, -58799510, -60192667, -60044438]
-2112f0044438j876118q41967q28708r136j168656o14052j202358j130531n65742k148407
-2122g0430113n75647m26109N56370j356922p86816K79952j493381l91388R0226j682104
-2132g6215932m76265j045639r2570j305327r19432p98538m32824p24305Q5366l66944
-2142h2292410p97603Q67511J06572r29140q49840L96776p25661m98935J377426j596637
-2152h4941941M12675l75972o69477O51560l14827K71609M14324O83106K41700L68609
-2162h3258634Q77602K13823M14379R93028k71075K0050j109658P19613K365877Q70761
-2172g8164234j67685Q36772M53373J154998P93099J033378P68897J773389Q07902J06197
-2182g0603914J918079J806207Q23859M55294J301505J381908J842620J294459M98936
$$ y = [-60044438, -61920556, -62762523, -63591231, -63600367, -64769023, -65383075, -66585433, -67715964, -68281706, -70430113, -71005760, -71431869, -70875499, -72232421, -73019237, -72739285, -74232666, -74624054, -74533828, -76215932, -76692197, -77737836, -77830406, -79135733, -80055165, -80853703, -81286527, -82010832, -81925466, -82292410, -83090013, -82222502, -82115930, -83045070, -83894910, -83498134, -84223795, -84722730, -83345304, -84941941, -84529266, -84905238, -85574715, -84923155, -85237982, -84966373, -84552049, -83868943, -83627243, -83258634, -82381032, -82167209, -81752830, -80759802, -81030877, -81010827, -82120485, -81400872, -79034995, -78164234, -78331919, -77495147, -77041774, -75886776, -75093677, -74060299, -73291402, -71518013, -70710111, -70603914, -68685835, -66879628, -66055769, -65600475, -64298970, -62917062, -61074442, -59779983, -59281047]
-2191e9281047L062906P30247J037797K390101P10448K502158m8765Q39624L547213M31660
-2201d4077658N31101L229195R58011R84391J437278J614495K553303N15380J153145
-2210c1101359K307499J990566N29274J905388J847252J964079J446833O1437K361894
-2219a6687137J758957J322680P15062J369702Q11317J648160R90801K879598R55655
-2228d235205J187494J632734J300349J09538J189166O56143R5871K670520O07047J802868
-2238G016525P40104O04037R97877L03943M00886P55219J90821J895574P38351l57303
-2248A3286034J348231k32151j255662J742871O02516j85423J578517k50093R17056j37320
-2258A7414576j80418l89486P04577j66337p11352K46959p18620J285568j447227o40461
$$ y = [-59281047, -56218141, -55487894, -54450097, -52059996, -51349548, -48847390, -48896155, -48056531, -44509318, -44077658, -43546557, -40317362, -39359351, -38374960, -36937682, -35323187, -32769884, -32254504, -31101359, -28793860, -26803294, -26274020, -24368632, -22521380, -20557301, -19110468, -19049031, -16687137, -14928180, -13605500, -12890438, -11520736, -10709419, -9061259, -8070458, -5190860, -4235205, -3047711, -1414977, -114628, -5090, 1184076, 1840219, 1936090, 4606610, 5213657, 7016525, 7756629, 8360666, 9358543, 9662486, 10063372, 10818591, 11009412, 12904986, 13643337, 13286034, 14634265, 14402114, 13146452, 14889323, 15491839, 15306416, 16884933, 16634840, 17551896, 17414576, 17234158, 16844672, 17549249, 17382912, 16671560, 16918519, 16199899, 17485467, 16038240, 15397779]
-2268A5397779m29574n55623m06675O14800j638551r27218m43072n41770m55957k92416
-2278A0321723j431111k02504R20390k271667j85775j201885k369747J38899j646367
-2287B071956L36404r58988j547101k37643j981545r81974j698256p42851j623815m78587
-2297g842400l48175j143195j116469j668433j191039j587953j09762j605625o00104
-2306a7213155j531775o47600j940227o96253j548486p04286m89811j115461m16516
-2315b6303570k436247l12584j562946j841452j149248k81350q67952k017185q56786
-2324c7629320o49069l13433k712053R02474m02219j216339j334120j504189n62449
-2333d5420717j053519J9111j532765r97977r09587j194364J142888p41395j52128n36320
$$ y = [15397779, 14968205, 14412582, 14005907, 14620707, 12982156, 12054938, 11611866, 11070096, 10614139, 10321723, 8890612, 8688108, 9608498, 7336831, 7151056, 5949171, 3579424, 3718323, 2071956, 2408360, 1449372, -97729, -335372, -2316917, -3298891, -4997147, -5739998, -7363813, -7842400, -8190575, -9333770, -10450239, -12118672, -13309711, -14897664, -15007426, -16613051, -17213155, -18744930, -19392530, -21332757, -22029010, -23577496, -24281782, -24771593, -25887054, -26303570, -28739817, -29052401, -30615347, -32456799, -33606047, -33887397, -34755349, -36772534, -37629320, -38278389, -38591822, -41303875, -40401401, -40803620, -42019959, -43354079, -44858268, -45420717, -46474236, -46455125, -47987890, -48985867, -49895454, -51089818, -49946930, -50688325, -50840453, -51376773]
-2343e1376773j289126j268095p07156M11700j049378J7379j587018J251840j704012
-2352e7300639j358656k34462m94220P62375k81690k19333j741198j6289L66696n90706
-2362f1108122M4701n12771r27458P70838M49901l80324P8780j392130N74771J40587K8602
-2373f2232625N47891n44206K77092N31111J22782j96138o3085N90916r34127Q33954
-2383f1066435l97760M84901J74213J282803l15001N25651k84685l90195N55382N26864
-2393e8904262K39783R28854K73610l96184L33102K30943P00374K21187r88485J721364
-2403e5639714J522218r05448J129124p872Q18761n15657P87751j14822K119591j314275
-2413e2120343R35098K07949R30799J22067R89517j85208O96128Q38632k86185J230976
$$ y = [-51376773, -52665899, -53933994, -54641150, -54229450, -55278828, -55261449, -56848467, -55596627, -57300639, -58659295, -58893757, -59387977, -58625602, -58907292, -59126625, -60867823, -60884112, -60517416, -61108122, -61063421, -61576192, -62503650, -61732812, -61282911, -61663235, -61584455, -62976585, -62401814, -62261227, -62232625, -61684734, -62228940, -61951848, -61420737, -61297955, -61494093, -61557178, -60966262, -61900389, -61066435, -61464195, -60979294, -60805081, -59522278, -59837279, -59311628, -59596313, -59986508, -59431126, -58904262, -58664479, -57735625, -57462015, -57858199, -57525097, -57294154, -56593780, -56372593, -57361078, -55639714, -54117496, -55022944, -53893820, -53901692, -53082931, -53598588, -52810837, -52925659, -50806068, -52120343, -51185245, -50977296, -50046497, -49924430, -48934913, -49120121, -48423993, -47585361, -47871546, -46640570]
-2423d6640570L62987O66914R77012J197833Q79442L97867q52609K54198P28814J278223
-2433d0749889N3989J424724N14598n33028J88041J528055J105371O72790K61394J552116
-2443c3981839J046519j14975Q87015j86896N12392K036144k88239J045952r741J527187
-2453b7526481K73904K095916M97090j49074Q03800J144762R49526L06579J049330K84026
-2463b0270622Q22453J590991J592087L41081O10530l3744R09340J208020N54678K257801
-2473a0417385p40360J960751J016771P46384N81798P11099N77408J221955J863209
-2482b478370J058309J25853J527638N97408Q25374J221586L75161Q57275J023658K62866
-2492E396758J313387J362422P80506P26657P44581J342180l63970J001576L26884K393892
$$ y = [-46640570, -46277583, -45610669, -44633657, -43435824, -42556382, -42158515, -43011124, -42756926, -42028112, -40749889, -40695900, -39271176, -38756578, -39289606, -39101565, -37573510, -36468139, -35795349, -35533955, -33981839, -32935320, -33050295, -32163280, -32350176, -31837784, -29801640, -30089879, -29043927, -29053668, -27526481, -27252577, -25156661, -24659571, -24808645, -24004845, -22860083, -21910557, -21603978, -20554648, -20270622, -19448169, -17857178, -16265091, -15924010, -15313480, -15347224, -14437884, -13229864, -12675186, -10417385, -11157745, -9196994, -8180223, -7433839, -6852041, -6140942, -5563534, -4341579, -2478370, -1420061, -1294208, 233430, 830838, 1656212, 2877798, 3252959, 4110234, 5133892, 5396758, 6710145, 8072567, 8853073, 9579730, 10324311, 11666491, 11302521, 12304097, 12630981, 15024873]
-2502A5024873p36185J443885J367042J68878J100880J613835n53661p02818J762214
-2511B0488943J079586R142K58941J111554K88504L79365J525180K40093n07789R26251
-2521B5799770O58174M41708L78748o47628J947261l31244R4165J282412R4765M7246
-2531B9765377N02786r77567m26333M95051N23257J60421n8084k1066n2872O81644l60003
-2542C0232611n77878n81224L67014k63185J96028r55709L46639P11517j307436K22894
-2552B8391271q85003m10743P75198j123872m16607J1972q94934r74767L5021n5639k79265
-2563B4172632k32317j478165J378214k231662p52001m44095q96395j103011m64970p5430
-2573A7872800q69703o64433k06689n45322o07280q74742j449207n50127n680j869790
$$ y = [15024873, 14288688, 15732573, 17099615, 17268493, 18369373, 19983208, 19429547, 18726729, 20488943, 21568529, 21577671, 21836612, 22948166, 23236670, 23616035, 25141215, 25381308, 24873519, 25799770, 26457944, 26899652, 27278400, 26630772, 28578033, 28246789, 28340954, 29623366, 29718131, 29765377, 30268163, 29290596, 28864263, 29359314, 29882571, 30042992, 29984908, 29963842, 29910970, 30592614, 30232611, 29654733, 29073509, 29440523, 29177338, 29373366, 28417657, 28764296, 29475813, 28168377, 28391271, 27506268, 27095525, 27870723, 26746851, 26330244, 26342216, 25447282, 24472515, 24507536, 24451897, 24172632, 23940315, 22462150, 23840364, 21608702, 20856701, 20412606, 19516211, 18413200, 17948230, 17872800, 17003097, 16338664, 16131975, 15586653, 14979373, 14104631, 12655424, 12105297, 12099617, 10229827]
-2583A0229827o74412q72807j6790j53449P94343k291560j960397L35740N3113o87237
-2593D756371r27433j993047r48310q33479j629835j68239k515087J462011J221724
-2602a575324j326445j7792Q46244m625079J18454j308963P9771j435164j52068j84192
-2612i580558o78310j31217J077262j64292k415191N4602o92653o20993j258109M65976
-2622a3943483N5392k145875J417114p79703j6637j691550K03561P41432k88355l88622
-2632a6836726j550043o02545Q12747L7453k28822O45383j081163k06219M88861J86818
-2642a8334256j178652J192209q386J677106q35891j030473J283720l508K22929k20731
-2652a7235933J183914l55068P75514j90040l31593R67460R29469P19674Q38855L96638
$$ y = [10229827, 9555415, 8682608, 8665818, 8512369, 9306712, 7015152, 5054755, 5390495, 5443608, 4756371, 3828938, 1835891, 887581, 54102, -1575733, -1743972, -4259059, -2797048, -1575324, -2901769, -2919561, -2073317, -6698396, -6579942, -7888905, -7809134, -9244298, -9396366, -9580558, -10258868, -10390085, -9312823, -9477115, -11892306, -11837704, -12530357, -13151350, -14409459, -13943483, -13888091, -16033966, -14616852, -15396555, -15413192, -17104742, -16901181, -16159749, -16448104, -16836726, -18386769, -18989314, -18176567, -18139114, -18367936, -17722553, -18803716, -19009935, -18521074, -18334256, -19512908, -18320699, -18329085, -16651979, -17487870, -18518343, -17234623, -17238131, -17015202, -17235933, -16052019, -16407087, -15631573, -15821613, -16153206, -15185746, -14256277, -13536603, -12697748, -12301110]
-2662a2301110P49087k73011J23686P12495k97582Q85359N85413Q51995K68030N89054
-2672h106584K29990M95481J012120O42141L75703O13373R09975O60923N73593R53487
-2682a639798Q89236J481798r99449J082286l61285J349999K25361Q22227R62234J195621
-2692E008230J087240p41887J253219K342576k17625P43285Q05579M62184J44218M98288
-2702A1385307J416534j18733R55951J309774K34510J187611O56452p1854K195848j67940
-2712A8983460j89210M97320J140070J300733q44442R28851P12856Q45498J179062l82949
-2722B4171249m9185J881560o19809O90400P72199P19141J68094n17353
$$ y = [-12301110, -11552023, -11825034, -11701348, -10988853, -11286435, -10401076, -9815663, -8963668, -8695638, -8106584, -7876594, -7381113, -6368993, -5726852, -5351149, -4737776, -3827801, -3166878, -2593285, -1639798, -750562, 731236, -268213, 814073, 452788, 1802787, 2028148, 2850375, 3812609, 5008230, 6095470, 5353583, 6606802, 8949378, 8731753, 9475038, 10280617, 10742801, 10887019, 11385307, 12801841, 12683108, 13639059, 14948833, 15183343, 16370954, 17027406, 16955552, 19151400, 18983460, 18794250, 19291570, 20431640, 21732373, 20887931, 21816782, 22529638, 23375136, 24554198, 24171249, 24122064, 26003624, 25383815, 26074215, 26846414, 27565555, 27733649, 27216296]
-2730B7216296  $$ checkpoint
##PAGE= N=2
##DATA TABLE=(X++(I..I)), XYDATA
13653B2562873p06582Q10317k175517j283346m03374m77311k32199j671013m39661j269401
13643A4714786q96077j120812j257420J192070k389044J46996q23283j393013j15715
13634H058488p89871O72673k205845j461658j54938q58825l88107j125880o85223j124575
13624f3761r53537o00799j424201m48322j365902j211798j60791l93089m55141m24835
13614g502176j270867q79970r34578K00975j961008j64826n31483k03746r37992j262181
13604a5447852o97032j098476o35170j122354K41717j066374j89102l15290o66509n37385
13594b1533827j083588K03253J30105j211659L18616r72826o3579m93623k34739R72227
13584b3969640j476940n31912j336603J5392R71077p10029K02941r8065j280513Q99471
$$ y = [22562873, 21856291, 22666608, 20491091, 19207745, 18804371, 18327060, 18094861, 16423848, 15984187, 14714786, 13818709, 12697897, 11440477, 12632547, 10243503, 10390499, 9567216, 8174203, 8058488, 7268617, 7941290, 5735445, 4273787, 4118849, 3260024, 2871917, 1746037, 1060814, -63761, -1017298, -1618097, -3042298, -3490620, -4856522, -6068320, -6229111, -6622200, -7077341, -7502176, -8773043, -9653013, -10587591, -10386616, -12347624, -12512450, -13043933, -13247679, -14185671, -15447852, -16144884, -17243360, -17878530, -19000884, -18759167, -19825541, -20014643, -20329933, -20996442, -21533827, -22617415, -22414162, -22284057, -23495716, -23177100, -24149926, -24213505, -24707128, -24941867, -23969640, -25446580, -25978492, -27315095, -27299703, -26328626, -27038655, -26835714, -26933779, -28214292, -27314821]
13574b7314821K31856M7098k64716N093p89900Q6945J296061k90118R6981m53933Q01583
13563b6547871j205416J125523K72388l94525K39418J100664L38224n05659N11087J956980
13553b3109187j88531l2263L19437J479494N31938P49912m9490R75536L26692Q4977
13543a8911485J871162J451726m82795N79188N41713O87481l47163K996430M65390J310359
13533i837994J387149J221799j1310J009599J500168J318830J498260m72742J179260
13524a206981J911967R60538J199430J468034J338376J537532Q16246J330019j581031
13515G774130K248484K934086q01144K295279K051369M77095J242716P96000K98797
13506A9316812K563888Q63204J090639J474723K054509P97029K010459Q94474J947784
$$ y = [-27314821, -27082965, -27035867, -27300583, -27295490, -28085390, -27998445, -26702384, -26992502, -26895521, -27349454, -26547871, -27753287, -26627764, -26355376, -26749901, -26510483, -25409819, -25071595, -25577254, -25066167, -23109187, -23297718, -23329981, -23010544, -21531050, -20999112, -20249200, -20298690, -19323154, -18996462, -18911485, -17040323, -15588597, -16071392, -15492204, -14950491, -14263010, -14610173, -11613743, -11148353, -9837994, -8450845, -7229046, -7240356, -6230757, -4730589, -3411759, -1913499, -2386241, -1206981, 704986, 1665524, 2864954, 4332988, 5671364, 7208896, 8025142, 9355161, 7774130, 10022614, 12956700, 12155556, 14450835, 16502204, 16979299, 18222015, 19018015, 19316812, 21880700, 22743904, 23834543, 25309266, 27363775, 28160804, 30171263, 31065737, 33013521]
13497C3013521J516668Q39449R34048R84617R05858J796805L43157K118371J354823
13488D3807317J227632j57848J132578K733552J61156M61730Q80595K038147J592361
13479E3877220N65136K49141L45435J243551J370590O54907J395562J149191M71069n73512
13469F0748290K270353k83517N66108J374200L00118R54079R64918J45510J03776n72368
13459F6571467J481863M69288j98918K51615M63598k90673k94768k83168j53096J105167
13449F9122375l83651N77855L38981m96809l02786p90205k23854j73046o537j37091m53437
13438F7071795q26310j073302K32887j83888j42602j105171j405603m02701N85732r79573
13428F1771264o53769k60169j540594j083513j172819j450581o9079j746278J14604p41614
$$ y = [33013521, 34530189, 35369638, 36303686, 37288303, 38194161, 39990966, 40334123, 42452494, 43807317, 45034949, 44877101, 46009679, 48743231, 48904387, 49366117, 50246712, 52284859, 53877220, 54442356, 54691497, 55036932, 56280483, 57651073, 58305980, 59701542, 60850733, 61321802, 60748290, 63018643, 62735126, 63301234, 64675434, 64975552, 65929631, 66894549, 67040059, 67143835, 66571467, 68053330, 68522618, 68323700, 68575315, 69038913, 68748240, 68453472, 68170304, 68017208, 69122375, 68738724, 69316579, 69655560, 69158751, 68855965, 68065760, 67841906, 67668860, 67662323, 67525232, 67071795, 66245485, 65172183, 65405070, 65221182, 65078580, 63973409, 62567806, 62165105, 62750837, 61771264, 61117495, 60857326, 59316732, 58233219, 57060400, 55609819, 55540740, 53794462, 53909066, 53167452]
13418E3167452q13805j701331q14252l75881k023334K8006j256530J2910k644027j159814
13408D2419394j775459j267120j834305j69975q22577j363740j69079k493567j017174
13399C1506398k033528j090686j377444r47638j087523j885828j178490j782790j194044
13390A8928427j419894j677376j428999o06479k096735p44250j120083j501238j936866
13381F396507j229306r83165k073851j530140j015970j690816j98847k867155l93627
13372e586370j831788j010950j482524k115458j230847j024204j635191j666739o09400
13363a8193471k150870j455689p87460j609485j165240k333917q06284K0031k287992
13354c0770377m64544q99446j778551j180323j292660n48678o10386j539091k382178
$$ y = [53167452, 52353647, 50652316, 49838064, 49462183, 47438849, 47466855, 46210325, 46223235, 43579208, 42419394, 40643935, 39376815, 37542510, 37372535, 36549958, 35186218, 35017139, 32523572, 31506398, 29472870, 28382184, 27004740, 26057102, 24969579, 23083751, 21905261, 20122471, 18928427, 17508533, 15831157, 14402158, 13795679, 11698944, 10954694, 9834611, 8333373, 6396507, 5167201, 4184036, 2110185, 580045, -435925, -2126741, -2325588, -5192743, -5586370, -7418158, -8429108, -9911632, -12027090, -13257937, -14282141, -15917332, -17584071, -18193471, -20344341, -21800030, -22587490, -24196975, -25362215, -27696132, -28502416, -28482385, -30770377, -31234921, -32134367, -33912918, -35093241, -36385901, -36934579, -37544965, -39084056, -41466234]
$$ [...]
-2730B8484052  $$ checkpoint
##END NTUPLES=
##END=
