##TITLE= S#397047
##JCAMP-DX= 5.00 $$ JEOL NMR v1.10
##DATA TYPE= NMR SPECTRUM
##DATA CLASS= NTUPLES
##NUM DIM= 1
##ORIGIN= DELTA_NMR
##OWNER= NMR
##SPECTROMETER/DATA SYSTEM= DELTA_NMR
##.OBSERVE FREQUENCY= 3.00529655924288E+02
##.OBSERVE NUCLEUS= ^1H
##.DELAY= (2.195E+02,2.195E+02)
##.ACQUISITION MODE= SIMULTANEOUS
##.FIELD= 7.0586013
##.FILTER WIDTH= 1.81675738660864
##.ACQUISITION TIME= 3.6339712
##.SPINNING RATE= 14
##.OBSERVE 90= 9.2
$$ ------------------------
$$ JEOL SPECIFIC PARAMETERS
##$FILENAME= C:\NMR/vanceoxidation-7.jdf
##$TITLE= S#397047
##$AUTHOR= NMR
##$CREATION=  1-FEB-2018 10:55:02
##$REVISION=  1-FEB-2018 11:02:15
##$CONTENT= PROTON NMR EXPERIMENT
##$INSTRUMENT= DELTA_NMR
##$SITE= Center College ECP+ 300
##$NODENAME= nmr2
##$DIMENSIONS= 1
##$STORAGE= FLOAT
##$X_FORMAT= COMPLEX
##$X_CURR_POINTS= 16384
##$X_START= 12.50103 $$ppm
##$X_STOP= -2.50012 $$ppm
##$X_TITLE= 1H                             
##$X_ZERO_POINT= 0.33329
##$X_FREQ_FLIP= FALSE
##$X_POINTS= 16384
##$X_PRESCANS= 0
##$X_DOMAIN= 1H
##$X_OFFSET= 5 $$ppm
##$X_FREQ= 300.52966 $$MHz
##$X_SWEEP= 4.50857 $$kHz
##$X_RESOLUTION= 0.27518 $$Hz
##$SOLVENT= CHLOROFORM-D
##$TEMP_GET= 20.5 $$dC
##$ACQ_DELAY= 0.2195 $$ms
##$DIGITAL_FILTER= FALSE
##$FILTER_FACTOR= 1
##$FILTER_WIDTH= 2.254 $$kHz
##$FILTER_MODE= BUTTERWORTH
##$TRANSITION_RATIO= 0.9
##$ORDERS
##$FACTORS
##$LOCK_STRENGTH= 248
##$LOCK_LEVEL= 200
##$LOCK_GAIN= 26
##$LOCK_OSC_OFFSET= 25.6519 $$kHz
##$LOCK_PHASE= 187 $$deg
##$LOCK_OSC_STATE= 2H OSC ON
##$X_ANGLE= 45 $$deg
##$X90= 9.2 $$us
##$X90_HI= 10 $$us
##$X90_LO= 50 $$us
##$X_90_WIDTH= 9.2 $$us
##$X_PULSE= 4.6 $$us
##$RELAXATION_DELAY= 4 $$s
##$SCANS= 2
##$PROBE_ID= 1412
##$ITERATIONS= 1
##$FIELD_STRENGTH= 7.0586 $$T
##$TEMP_SET= 25 $$dC
##$SPIN_SET= 15 $$Hz
##$SPIN_GET= 14 $$Hz
##$HE_LEVEL= 75 $$%
##$N2_LEVEL= 83 $$%
##$CHANGER_SAMPLE= 0
##$ADC_CARD= 16/1MHz/20
##$EXPERIMENT= single_pulse.exp
##$OBS_NOISE= WAUGH
##$IRR_NOISE= WALTZ
##$TRI_NOISE= WALTZ
##$QUA_NOISE= WAUGH
##$OBS_PWIDTH= 1 $$us
##$IRR_PWIDTH= 50 $$us
##$TRI_PWIDTH= 1 $$us
##$QUA_PWIDTH= 1 $$us
##$RECVR_GAIN= 4
##$IRR90= 9.2 $$us
##$TRI90= 10 $$us
##$QUA90= 10 $$us
##$IRR90_HI= 10 $$us
##$QUA90_HI= 10 $$us
##$IRR90_LO= 50 $$us
##$TRI90_LO= 10 $$us
##$QUA90_LO= 10 $$us
##$MOD_RETURN= 1
##$TOTAL_SCANS= 2
##$X_ACQ_DURATION= 3.63397 $$s
##$DELAY_OF_START= 1 $$s
##$ACTUAL_START_TIME= 886330481
##$CLIPPED= FALSE
##$DC_BALANCED= FALSE
##$TRI90_HI= 10 $$us
##$SPIN_LOCK_90= 100 $$us
##$SPIN_LOCK_ATTN= 24.4 $$dB
##$DEUT_GRAD_SHIM_90= 213 $$us
##$DEUT_GRAD_SHIM_ATTN= 9 $$dB
##$IRR_CODE= 146
##$LOCK_STATE= LOCK ON
##$AUTOLOCK_LEVEL= 200
##$SAWTOOTH_RANGE= 4
##$LOCK_STATUS= IDLE
##$LOCK_SETTLE_POINT= 4096
##$LOCK_ACHIEVE_POINT= 0
##$SPIN_ACTION= SPIN ON
##$SPIN_STATE= SPIN ON
##$SPIN_STATUS= SPIN ON
##$SPIN_GAS_SOURCE= AIR
##$TEMP_ACTION= TEMP OFF
##$TEMP_STATE= TEMP OFF
##$TEMP_STATUS= TEMP OFF
##$TEMP_COMP= 0
##$TEMP_DELAY= 0 $$s
##$TEMP_LIMIT_HI= 150 $$dC
##$TEMP_LIMIT_LO= -100 $$dC
##$TEMP_MELTING= -63 $$dC
$$ [...]
##$VT_PID_STD_WB_H_TD= 5
##$VT_PID_STD_WB_H_CBL= 10
##$VT_PID_STD_WB_H_CBH= 0
##$VT_PID_STD_WB_H_HC= 2.4
##$VT_PID_STD_WB_H_HL= 70
##$VT_PID_STD_WB_M_PB= 1.5
##$VT_PID_STD_WB_M_TI= 30
##$VT_PID_STD_WB_M_TD= 5
##$VT_PID_STD_WB_M_CBL= 9.9
##$VT_PID_STD_WB_M_CBH= 2.3
##$VT_PID_STD_WB_M_HC= 2.5
##$VT_PID_STD_WB_M_HL= 70
##$VT_PID_STD_WB_L_PB= 1.3
##$VT_PID_STD_WB_L_TI= 29
##$VT_PID_STD_WB_L_TD= 5
##$VT_PID_STD_WB_L_CBL= 20
##$VT_PID_STD_WB_L_CBH= 20
##$VT_PID_STD_WB_L_HC= 0.6
##$VT_PID_STD_WB_L_HL= 100
##$VT_PID_LONG_0_H_PB= 1.5
##$VT_PID_LONG_0_H_TI= 30
##$VT_PID_LONG_0_H_TD= 5
##$VT_PID_LONG_0_H_CBL= 9.9
##$VT_PID_LONG_0_H_CBH= 2.3
##$VT_PID_LONG_0_H_HC= 2.5
##$VT_PID_LONG_0_H_HL= 70
##$VT_PID_LONG_0_M_PB= 1.5
##$VT_PID_LONG_0_M_TI= 30
##$VT_PID_LONG_0_M_TD= 5
##$VT_PID_LONG_0_M_CBL= 9.9
##$VT_PID_LONG_0_M_CBH= 2.3
##$VT_PID_LONG_0_M_HC= 2.5
##$VT_PID_LONG_0_M_HL= 70
##$VT_PID_LONG_40_H_PB= 1.5
##$VT_PID_LONG_40_H_TI= 30
##$VT_PID_LONG_40_H_TD= 5
##$VT_PID_LONG_40_H_CBL= 9.9
##$VT_PID_LONG_40_H_CBH= 2.3
##$VT_PID_LONG_40_H_HC= 2.5
##$VT_PID_LONG_40_H_HL= 70
##$VT_PID_LONG_40_M_PB= 1.5
##$VT_PID_LONG_40_M_TI= 30
##$VT_PID_LONG_40_M_TD= 5
##$VT_PID_LONG_40_M_CBL= 9.9
##$VT_PID_LONG_40_M_CBH= 2.3
##$VT_PID_LONG_40_M_HC= 2.5
##$VT_PID_LONG_40_M_HL= 70
##$SAMPLE_ACTION= LOADED
##$SAMPLE_STATE= LOAD
##$SAMPLE_STATUS= LOADED
##$AUTOSHIM_MODE= AUTOSHIM OFF
##$AUTOSHIM_DELAY= 3600 $$s
##$AUTOSHIM_TRACK= AUTOSHIM OFF
##$SHIM_MAX_RECALL= MAX FOUND
##$SHIM_NAMES= SHIM_Z0
##$SHIM_Z0= 9167
##$SHIM_Z1= 5211
##$SHIM_Z2= 22
##$SHIM_Z3= -2829
##$SHIM_Z4= -240
##$SHIM_Z5= 46
##$SHIM_Z6= -33
##$SHIM_X= -14
##$SHIM_XZ= 16
##$SHIM_XZ2= 0
##$SHIM_XZ3= 0
##$SHIM_X2= -7
##$SHIM_X2Z= -40
##$SHIM_X3= 0
##$SHIM_Y= 1608
##$SHIM_YZ= 13
##$SHIM_YZ2= 10
##$SHIM_YZ3= 0
##$SHIM_Y2= -11
##$SHIM_Y2Z= -20
##$SHIM_Y3= 0
##$NUM_SCANS= 1
##$END_TIME= 886330502
##$LOCAL_TIME= 886330501.0
##$PROBE_ATN= 0
##$PROBE_TUNE= 0
##$PROBE_MATCH= 2077
##$PROBE_COARSE= NONE
##$LF_TUNE_DIAL= 0
##$LF_MATCH_DIAL= 0
##$HF_TUNE_DIAL= 0
##$HF_MATCH_DIAL= 0
##$PASS_RIPPLE= 0.01 $$dB
##$STOP_RIPPLE= 60 $$dB
##$PROBE_RECOVERY= 0 $$us
##$AF_DELAY_RATIO= 0
##$VERSION= 4.3.3
##$X_ACQ_TIME= 3.63397 $$s
##$DEAD_TIME= 0 $$us
##$DELAY= 0 $$us
##$PHASE_PRESET= 3 $$us
##$UNBLANK_TIME= 2 $$us
##$INITIAL_WAIT= 1 $$s
##$NORMALIZED= TRUE
$$ END OF JEOL SPECIFIC PARAMETERS
$$ -------------------------------
##NTUPLES= NMR SPECTRUM
##VAR NAME= FREQUENCY,    SPECTRUM/REAL, SPECTRUM/IMAG, PAGE NUMBER
##SYMBOL=   X,            R,             I,             N
##VAR TYPE= INDEPENDENT,  DEPENDENT,     DEPENDENT,     PAGE
##VAR FORM= AFFN,         ASDF,          ASDF,          AFFN
##VAR DIM=  16384, 16384, 16384, 2
##UNITS= PPM,     ARBITRARY UNITS, ARBITRARY UNITS, 
##FIRST=  1.2501033903057E+01, 4.53725852836881E+01, -3.19612496103578, 1
##LAST=  -2.50011824950436, 4.51217533836614E+01, 6.03469656038555, 2
##FACTOR=  9.1565355261926E-04, 4.72314808240903E-04, 4.72314808240903E-04, 1
##PAGE= N=1
##DATA TABLE=(X++(R..R)), XYDATA
$$ [...]
$$ plain form
9375 131431228 123103774 118975721 112831176 108064978 103127869 97155914 92479711 86026518 82094898
9366 82094898 77533863 72043781 64485307 59332090 55504254 50889858 46416520 42175549 37874545
9357 37874545 34490701 29508429 24580810 18833299 15214899 10543776 8125112 3932931 804242
9348 804242 -2715449 -4955391 -9576421 -13151350 -16156699 -19596553 -20931199 -24194036 -28405101
9339 -28405101 -31060527 -32757882 -35382015 -36962571 -39135983 -41764165 -43864353 -44859957 -47859317
9330 -47859317 -50239284 -50369299 -51774712 -52053276 -54380604 -57646134 -58220012 -57243883 -58858719
9321 -58858719 -60007984 -61032736 -62540774 -64071548 -63947166 -64848162 -65768424 -65699069 -65893455 -65678494
9311 -65678494 -67778445 -68218102 -68645550 -69769804 -69450590 -69820693 -69256972 -69608163 -70146101 -71140945
$$ packed form
9375A31431228q327454m128053o144545m766198m937109n971955m676203o453193l931620
9366H2094898m561035n490082p558474n153217l827836m614396m473338m240971m301004
9357C7874545l383844m982272m927619n747511l618400m671123k418664m192181l128689
9348H04242l519691k239942m621030l574929l005349l439854j334646l262837m211065
9339b8405101k655426j697355k624133j580556k173412k628182k100188r95604k999360
9330d7859317k379967j30015j405413k78564k327328l265530n73878R76129j614836
9321e8858719j149265j024752j508038j530774J24382r00996r20262O9355j94386K14961
9311f5678494k099951m39657m27448j124254L19214l70103N63721l51191n37938r94844
$$ plain form
9301 -71140945 -70450565 -70603265 -70708567 -71655422 -70969937 -71856206 -73126402 -71792442 -72120677 -74058830
9291 -74058830 -74669814 -73199920 -74343946 -75007245 -74897999 -74640482 -73057479 -74144565 -73266654 -74935487
9281 -74935487 -75034670 -74987950 -76744356 -76203154 -76045894 -75064797 -76373072 -76161579 -75893461 -76008953
9271 -76008953 -77518689 -77491864 -77302738 -78516835 -79054290 -78213498 -78292237 -78679717 -78129491 -79502326
9261 -79502326 -80763223 -80282500 -79518671 -80920741 -78886394 -78999336 -80404228 -79583109 -79453901 -79933228
9251 -79933228 -79122959 -79120648 -79958877 -80098402 -78350362 -76367520 -75630197 -76226092 -77202092 -76075287
9241 -76075287 -74559980 -74923809 -73850982 -73025525 -73203041 -70810472 -68583807 -69200996 -67102520 -66105839
9231 -66105839 -63554540 -64475822 -60047477 -57757387 -56839693 -55395682 -53728118 -49738467 -47726248
$$ packed form
9301g1140945O90380j52700j05302r46855O85485q86269j270196J333960l28235j938153
9291g4058830o10984J469894j144026o63299J09246K57517J583003j087086Q77911j668833
9281g4935487r9183M6720j756406N41202J57260R81097j308275K11493K68118j15492
9271g6008953j509736K6825J89126j214097n37455Q40792p8739l87480N50226j372835
9261g9502326j260897M80723P63829j402070K034347j12942j404892Q21119J29208m79327
9251g9933228Q10269K311q38229j39525J748040J982842P37323n95895r76000J126805
9241g6075287J515307l63829J072827Q25457j77516K392569K226665o17189K098476R96681
9231f6105839K551299r21282M428345K290090R17694J444011J667564L989651K012219
$$ plain form
9222 -47726248 -44443812 -42044665 -38776216 -36109480 -34774707 -32039315 -28218710 -25989561 -22041972
9213 -22041972 -19901931 -16808049 -13061603 -8998144 -6470587 -1069249 356045 4188965 8614271
9204 8614271 11838758 18645242 24188520 25818689 29766644 33843856 37916969 41382854 46364990
9195 46364990 52139683 56814375 62915702 68170652 72820356 78878821 81255829 86135345 90075423
9186 90075423 96133133 98284723 103147075 109459068 113337386 118942224 124736819 127878143 132988691
9177 132988691 138553908 141615959 147281912 151668956 155691490 161731911 165168462 169852726 174858641
9168 174858641 178493590 181387855 183743470 188328880 192973921 195450006 202389375 202846125 206299531
9159 206299531 210388655 212738052 214962778 217373568 220816001 223565019 225548687 227346627 227886999
$$ packed form
9222d7726248L282436K399147L268449K666736J334773K735392L820605K229149L947589
9213b2041972K140041L093882L746446M063459K527557N401338J425294L832920M425306
9204H614271L224487O806484N543278J630169L947955M077212M073113L465885M982136
9195D6364990N774693M674692O101327N254950M649704O058465K377008M879516L940078
9186I0075423O057710K151590M862352O311993L878318N604838N794595L141324N110548
9177A32988691N565217L062051N665953M387044M022534O040421L436551M684264N005915
9168A74858641L634949K894265K355615M585410M645041K476085O939369M56750L453406
9159B06299531M089124K349397K224726K410790L442433K749018J983668J797940N40372
$$ plain form
9150 227886999 229900769 232139426 232787482 235736676 237844661 236140677 235942070 237713005 237139688
9141 237139688 239621359 239862337 238328809 237132691 238032030 238599816 236709021 234880812 233596066
9132 233596066 232312787 228695072 227382634 226669146 225677446 221414016 219303410 216938791 213286441
9123 213286441 210938071 208262175 202244243 199036547 196538075 192141439 188672542 185559444 181725376
9114 181725376 176606225 171985838 167504287 161858840 157200995 153326687 147962496 143634096 137718756
9105 137718756 133013376 126760317 121254750 115731530 111141224 105369946 97595353 92488703 87872931
9096 87872931 81462707 76631558 69885823 64432145 59326874 53349654 48084434 42521156 38003899
9087 38003899 31103442 25508522 20691697 13688850 9467175 4862555 -1026691 -7137765 -12466444
$$ packed form
9150B27886999K013770K238657O48056K949194K107985j703984j98607J770935n73317
9141B37139688K481671K40978j533528j196118Q99339N67786j890795j828209j284746
9132B33596066j283279l617715j312438p13488r91700m263430k110606k364619l652350
9123B13286441k348370k675896o017932l207696k498472m396636l468897l113098l834068
9114A81725376n119151m620387m481551n645447m657845l874308n364191m328400n915340
9105A37718756m705380o253059n505567n523220m590306n771278p774593n106650m615772
9096H7872931o410224m831149o745735n453678n105271n977220n265220n563278m517257
9087C8003899o900457n594920m816825p002847m221675m604620n889246o111074n328679
$$ plain form
9078 -12466444 -16154167 -19569537 -26160888 -29809128 -34147210 -38465912 -43174670 -46885015 -51195113
9069 -51195113 -55825880 -57395178 -62834129 -65802624 -70280210 -72687718 -76580990 -78644156 -81616978
9060 -81616978 -83752164 -85279407 -88351491 -90251666 -92559331 -93167884 -96272627 -97623845 -97181350
9051 -97181350 -97995627 -98798766 -98174020 -100468261 -100138139 -101322911 -99646936 -98255287 -98825556 -98067097
9041 -98067097 -98081346 -96633267 -95212176 -93414501 -91277020 -90972181 -88390958 -86365833 -84524586
9032 -84524586 -83417263 -79965786 -78039730 -76479017 -73260941 -69621531 -67529218 -64205926 -59900858
9023 -59900858 -57070286 -53402674 -49619747 -47017924 -42611996 -38705883 -34626833 -31103893 -25566555
9014 -25566555 -22455540 -19201248 -15212441 -10539486 -6689177 -2196851 -405571 6809202 10756831
$$ packed form
9078a2466444l687723l415370o591351l648240m338082m318702m708758l710345m310098
9069e1195113m630767j569298n438951k968495m477586k407508l893272k063166k972822
9060h1616978k135186j527243l072084j900175k307665o08553l104743j351218M42495
9051i7181350q14277q03139O24746k294241L30122j184772J675975J391649n70269P58459
9041i8067097j4249J448079J421091J797675K137481L04839K581223K025125J841247
9032h4524586J107323L451477J926056J560713L218076L639410K092313L323292M305068
9023e9900858K830572L667612L782927K601823M405928L906113M079050L522940N537338
9014b5566555L111015L254292L988807M672955L850309M492326J791280P214773L947629
$$ plain form
9005 10756831 13839278 19503854 23599260 28959731 31416789 33906687 38994797 42206741 47113216
8996 47113216 52204638 56412332 58661829 62025620 65744639 70772446 72988732 77388598 82892163
8987 82892163 86327702 87116376 90469118 95116522 98795013 100509977 103899451 106718920 109307986
8978 109307986 110564797 112892842 116085056 119293421 121488649 122502303 123698045 125078422 129182307
8969 129182307 129405865 130130393 130145128 132228751 132419096 133479867 135829504 135583103 136135985 138295329
8959 138295329 138550463 138282640 138885586 137694923 138428449 138323392 137614557 136841348 137316551 137443110
8949 137443110 136332831 135840936 135316726 134040167 131691514 130412196 129456537 129794428 127426331
8940 127426331 126681946 125310888 124527505 122912400 120090616 117294258 117949693 114834312 114730188
$$ packed form
9005A0756831L082447N664576M095406N360471K457058K489898N088110L211944M906475
8996D7113216N091422M207694K249497L363791L719019N027807K216286M399866N503565
8987H2892163L435539P88674L352742M647404L678491J714964L389474K819469K589066
8978A09307986J256811K328045L192214L208365K195228J013654J195742J380377M103885
8969A29182307K23558P24528J4735K083623J90345J060771K349637k46401N52882K159344
8959A38295329K55134k67823O02946j190663P33526j05057p08835p73209M75203J26559
8949A37443110j110279m91895n24210j276559k348653j279318r55659L37891k368097
8940A27426331p44385j371058p83383j615105k821784k796358O55435l115381j04124
$$ plain form
8931 114730188 112959240 114289404 109211161 103505481 104019183 103547093 102516408 101657715 99410687
8922 99410687 95164588 92626370 92838915 89329113 88176683 85607555 86934689 84855493 82007092
8913 82007092 79666799 78342482 77762156 75656165 72065387 70609215 70145260 69386596 68056591
8904 68056591 67333747 66695339 64002936 63817007 60520297 59444423 59586234 58862527 58113255 55983099
8894 55983099 55828228 55311486 53316990 52307396 51575719 51956015 49918908 50763215 49959928 49582602
8884 49582602 49580103 49058228 48838137 49270130 48089393 46919544 47379113 47249251 45303578 46541563
8874 46541563 46156746 44413681 46001175 44797385 45517238 44785190 43494834 44863469 45163939 44181764
8864 44181764 43671266 43923500 43896772 43088333 42402834 43593178 43626289 43998847 42558083 41949131
$$ packed form
8931A14730188j770948J330164n078243n705680N13702m72090j030685q58693k247028
8922I9410687m246099k538218K12545l509802j152430k569128J327134k079196k848401
8913H2007092k340293j324317n80326k105991l590778j456172m63955p58664j330005
8904F8056591p22844o38408k692403j85929l296710j075874J41811p23707p49272k130156
8894E5983099j54871n16742j994496j009594p31677L80296k037107Q44307q03287l77326
8884D9582602k499n21875k20091M31993j180737j169849M59569j29862j945673J237985
8874D6541563l84817j743065J587494j203790P19853p32048j290356J368635L00470r82175
8864D4181764n10498K52234k6728q08439o85499J190344L3111L72558j440764o08952
$$ plain form
8854 41949131 41449709 39366962 37982574 38400236 36256713 36107109 35349041 34915103 33075574 32690047
8844 32690047 33061513 30367259 29436185 28081299 27534991 26576079 24597538 22533500 21190113
8835 21190113 20104650 17739365 15080276 15497777 12019210 10638371 7266035 5951189 3175967
8826 3175967 1287283 -264106 -3198702 -7144885 -8013707 -10682329 -13784773 -16520350 -19657747
8817 -19657747 -23002064 -25604269 -27161647 -29875285 -31943393 -36248388 -38916093 -40052630 -43256898
8808 -43256898 -48768418 -51013025 -52774948 -57439889 -60067422 -63634610 -65057956 -68511030 -72112716
8799 -72112716 -75640053 -76924588 -81861067 -84310451 -85622455 -88551510 -92981512 -95396913 -97589832
8790 -97589832 -100977257 -102132107 -104248029 -106408687 -110387206 -112113364 -115422348 -116522239 -119492053
$$ packed form
8854D1949131m99422k082747j384388M17662k143523j49604p58068m33938j839529l85527
8844C2690047L71466k694254r31074j354886n46308r58912j978541k064038j343387
8835B1190113j085463k365285k659089M17501l478567j380839l372336j314846k775222
8826C175967j888684j551389k934596l946183q68822k668622l102444k735577l137397
8817a9657747l344317k602205j557378k713638k068108m304995k667705j136537l204268
8808d3256898n511520k244607j761923m664941k627533l567188j423346l453074l601686
8799g2112716l527337j284535m936479k449384j312004k929055m430002k415401k192919
8790i7589832l387425j154850k115922k160658l978519j726158l308984j099891k969814
$$ plain form
8781 -119492053 -120872689 -121016937 -123023726 -123985263 -125948394 -128617398 -129152048 -130979091 -131741836
8772 -131741836 -130615228 -131315400 -132225598 -132606768 -133510283 -131462421 -131766963 -131011930 -130364066 -130882201
8762 -130882201 -129593221 -128771435 -126787488 -125929807 -123503469 -122092111 -120123818 -117844595 -115126150
8753 -115126150 -112774211 -110741039 -109869338 -106487489 -103599458 -99034932 -95317453 -91916443 -88305250
8744 -88305250 -84476573 -79360703 -75896774 -71369606 -67281158 -60811634 -56201270 -52042836 -46794614
8735 -46794614 -43228038 -37363089 -32151141 -25881414 -19404363 -14716807 -9062059 -2023419 2773697
8726 2773697 8692645 15288548 21739650 29014847 35629434 40726696 46211248 53912791 61248921
8717 61248921 68118990 75431405 81412668 87554495 94643933 101356558 106688558 113500780 120988591
$$ packed form
8781a19492053j380636j44248k006789r61537j963131k669004n34650j827043p62745
8772a31741836J126608p00172r10198l81170r03515K047862l04542P55033O47864n18135
8762a30882201J288980Q21786J983947Q57681K426338J411358J968293K279223K718445
8753a15126150K351939K033172Q71701L381849K888031M564526L717479L401010L611193
8744h8305250L828677N115870L463929M527168M088448O469524M610364M158434N248222
8735d6794614L566576N864949N211948O269727O477051M687556N654748P038640M797116
8726B773697N918948O595903O451102P275197O614587N097262N484552P701543P336130
8717F1248921O870069P312415N981263O141827P089438O712625N332000O812222P487811
$$ plain form
8708 120988591 128445936 134556731 140058953 147629535 153725608 162152414 166479043 171785226 178928233
8699 178928233 184775878 189864554 194945158 201489635 207354121 212751432 216914071 223343110 230099173
8690 230099173 234526344 239726381 244989605 248681651 253510460 257900002 261519208 264935496 269219514
8681 269219514 273338564 277828835 281110071 284022759 287301163 289633362 292620654 295598588 298083548
8672 298083548 298101142 302497683 303234904 305738849 307666363 308389118 307650290 307792414 309060337 310154006
8662 310154006 311275387 312340496 309991256 310274586 311849054 308274786 308683941 307195566 306378748
8653 306378748 305730469 302422261 301645251 300697227 299110659 299097501 295935566 293284906 289474149
8644 289474149 287926068 284783798 283196151 280373528 277891275 275132169 270445155 267869380 264652908
$$ packed form
8708A20988591P457345O110795N502222P570582O096073Q426806M326629N306183P143007
8699A78928233N847645N088676N080604O544477N864486N397311M162639O429039O756063
8690B30099173M427171N200037N263224L692046M828809M389542L619206L416288M284018
8681B69219514M119050M490271L281236K912688L278404K332199K987292K977934K484960
8672B98083548J7594M396541P37221K503945J927514P22755p38828J42124J267923J093669
8662C10154006J121381J065109k349240K83330J574468l574268M09155j488375q16818
8653C06378748o48279l308208p77010r48024j586568j3158l161935k650660l810757
8644B89474149j548081l142270j587647k822623k482253k759106m687014k575775l216472
$$ plain form
8635 264652908 260589511 257076176 253451185 251095144 245500114 244502343 240936359 237215316 232926622
8626 232926622 229768198 226800993 221302704 217173404 213070527 210404438 206560816 203184802 199831738
8617 199831738 195350392 191342227 189356678 183823554 181450838 178733021 174900900 170517138 166292369
8608 166292369 163886525 160867049 158155149 154764698 152029842 148831435 145129410 142564144 139207373
8599 139207373 138165591 136467597 134226185 131636149 128156755 127478582 125878963 123759044 120764237
8590 120764237 119519211 117029759 117416226 115707573 114965422 114296533 113412223 113473459 112677418 110825967
8580 110825967 110988108 110408819 110225145 111049335 110908133 112030368 111006939 110783911 111504760 111844528
8570 111844528 111875546 112722614 113510304 115133411 117131345 116224869 116645653 116990770 118765399 118789903
$$ packed form
8635B64652908m063397l513335l624991k356041n595030r97771l565984l721043m288694
8626B32926622l158424k967205n498289m129300m102877k666089l843622l376014l353064
8617A99831738m481346m008165j985549n533124k372716k717817l832121m383762m224769
8608A66292369k405844l019476k711900l390451k734856l198407l702025k565266l356771
8599A39207373j041782j697994k241412k590036l479394o78173j599619k119919k994807
8590A20764237j245026k489452L86467j708653p42151o68889q84310O1236p96041j851451
8580A10825967J62141n79289j83674Q24190j41202J122235j023429k23028P20849L39768
8570A11844528L1018Q47068P87690J623107J997934r06476M20784L45117J774629K4504
$$ plain form
8560 118789903 122023767 122783720 124563135 124457247 126684573 129176010 129959613 131904906 133152636
8551 133152636 134461213 136496057 136595610 140103569 141228950 141244610 144855288 145581941 148305352
8542 148305352 152474781 150047715 152619652 154724271 156581634 157445156 158543606 159366928 160352329
8533 160352329 162887722 165474699 165360236 166959737 169089186 169925498 170620294 172332129 171948573
8524 171948573 172732786 174686500 174426266 176106264 177205888 177616201 177687327 178005751 177356275 175862815
8514 175862815 177415187 178443757 178220250 176861844 179095024 177044491 177697061 177840323 179682041
8505 179682041 177686378 175550101 175802839 175646101 175641067 173575815 173331857 174094781 172589707 172296393
8495 172296393 171319324 170556150 168351008 167707949 168162873 165443076 164472270 165095826 162599299 160984915
$$ packed form
8560A18789903L233864P59953J779415j05888K227326K491437P83603J945293J247730
8551A33152636J308577K034844R9553L507959J125381J5660L610678P26653K723411
8542A48305352M169429k427066K571937K104619J857363Q63522J098450Q23322R85401
8533A60352329K535393K586977j14463J599501K129449Q36312O94796J711835l83556
8524A71948573P84213J953714k60234J679998J099624M10313P1126L18424o49476j493460
8514A75862815J552372J028570k23507j358406K233180k050533O52570J43262J841718
8505A79682041j995663k136277K52738j56738n034k065252k43958P62924j505074k93314
8495A72296393r77069p63174k205142o43059M54924k719797r70806O23556k496527j614384
$$ plain form
8485 160984915 160294062 156917586 157766184 158628466 156493084 154627606 154164105 153513761 150954961 151362314
8475 151362314 149043046 148908646 146867970 146269206 145792870 144972093 144936568 142809850 141604857 141521747
8465 141521747 138784131 138872500 136869813 138026196 138120978 138006981 137250394 137318306 134855626 134328673
8455 134328673 134989499 134252142 134107090 132968512 135130590 133304159 134826947 135180906 134701046 134904939
8445 134904939 134476223 136729410 136834050 136267211 136289559 137654730 138263859 138409881 138680100 139477371
8435 139477371 141438706 141714307 142660941 144589575 145983792 147319239 148362453 150012889 148762225
8426 148762225 149376351 150697400 151982427 152344013 153110426 156454181 157263342 156919456 159694936 160282451
8416 160282451 161160696 162128929 162111252 163423693 165630067 165731925 164793497 168284443 169029187 168514225
$$ packed form
8485A60984915o90853l376476Q48598Q62282k135382j865478m63501o50344k558800M07353
8475A51362314k319268j34400k040676n98764m76336q20777l5525k126718j204993q3110
8465A41521747k737616Q8369k002687J156383R4782j13997p56587O7912k462680n26953
8455A34328673O60826p37357j45052j138578K162078j826431J522788L53959m79860K03893
8445A34904939m28716K253187J04640n66839K2348J365171O09129J46022K70219P97271
8435A39477371J961335K75601R46634J928634J394217J335447J043214J650436j250664
8426A48762225O14126J321049J285027L61586P66413L343755Q09161l43886K775480N87515
8416A60282451Q78245R68233j7677J312441K206374J01858r38428L490946P44744n14962
$$ plain form
8406 168514225 167708299 168899769 169422574 171058670 170836804 171028802 169848858 171299242 173589893
8397 173589893 172273870 172480471 172302103 172705548 168073194 166789784 166518868 165070024 164024984
8388 164024984 164204776 161784221 161354236 159639041 157179824 155350689 154331377 151487228 148367716
8379 148367716 144966676 142296187 139900402 136969078 133015093 129816612 126377341 123779178 118698681
8370 118698681 114520286 112015726 107017901 101581035 97212360 94242469 90146226 85088951 79202582
8361 79202582 73719701 65896953 60800251 54744195 48742991 42658329 36823172 32373391 25558025
8352 25558025 20161779 12996041 5854250 -899326 -6195446 -13025551 -20151571 -29361791 -34972290
8343 -34972290 -42724409 -49793648 -57630844 -66159771 -73345784 -79432007 -87425279 -94806885 -101178724
$$ packed form
8406A68514225q05926J191470N22805J636096k21866J91998j179944J450384K290651
8397A73589893j316023K06601j78368M03445m632354j283410k70916j448844j045040
8388A64024984J79792k420555m29985j715195k459217j829135j019312k844149l119512
8379A48367716l401040k670489k395785k931324l953985l198481l439271k598163n080497
8370A18698681m178395k504560m997825n436866m368675k969891m096243n057275n886369
8361G9202582n482881p822748n096702o056056o001204o084662n835157m449781o815366
8352B5558025n396246p165738p141791o753576n296120o830105p126020r210220n610499
8343c4972290p752119p069239p837196q528927p186013o086223p993272p381606o371839
$$ plain form
8334 -101178724 -109529863 -118113155 -123374019 -132306717 -140408712 -146668922 -155161198 -163397436 -169585863
8325 -169585863 -175080993 -182694320 -189939329 -196749255 -205463680 -212571835 -218414927 -225247792 -232408295
8316 -232408295 -239446895 -245787944 -250392374 -256310201 -261764954 -268937893 -274744970 -281798896 -286849552
8307 -286849552 -291957859 -297186342 -301101701 -305213244 -311621060 -315757584 -318776734 -323571220 -328451465
8298 -328451465 -331466266 -336255686 -340470272 -341877237 -345674086 -347372848 -348834156 -351944825 -353608851
8289 -353608851 -354592376 -356337657 -359255197 -361721002 -362163143 -362155421 -364084830 -365317154 -363860701 -364422686
8279 -364422686 -365474235 -365673206 -364194717 -363520622 -362932311 -363353087 -360487779 -359545196 -359576454 -358660440
8269 -358660440 -353826310 -351497742 -348535852 -345920640 -344818180 -343167972 -340977338 -335987585 -333441689
$$ packed form
8334a01178724q351139q583292n260864q932698q101995o260210q492276q236238o188427
8325a69585863n495130p613327p245009o809926q714425p108155n843092o832865p160503
8316b32408295p038600o341049m604430n917827n454753p172939n807077p053926n050656
8307b86849552n108307n228483l915359m111543o407816m136524l019150m794486m880245
8298c28451465l014801m789420m214586j406965l796849j698762j461308l110669j664026
8289c53608851r83525j745281k917540k465805m42141P722j929409j232324J456453n61985
8279c64422686j051549j98971J478489O74095N88311m20776K865308R42583l1258R16014
8269c58660440M834130K328568K961890K615212J102460J650208K190634M989753K545896
$$ plain form
8260 -333441689 -330228791 -325759845 -322590220 -318203619 -315112971 -311948701 -306212240 -301504708 -299342732
8251 -299342732 -293693618 -289471217 -285763509 -281797810 -275043939 -271606469 -265812525 -260015307 -257588888
8242 -257588888 -252339303 -247356631 -242911073 -238622464 -233116590 -226931564 -221288197 -218466886 -214899695
8233 -214899695 -208306400 -202664830 -199617802 -194279324 -189031155 -185592268 -181449530 -176576902 -170601645
8224 -170601645 -164907179 -159466508 -158686066 -148984565 -148283310 -142929138 -136601822 -132788085 -129136490
8215 -129136490 -124903042 -120954496 -119046672 -114156940 -109805625 -106282628 -103031807 -98994107 -95807202
8206 -95807202 -93253534 -88943878 -84359322 -82293809 -79185406 -77003444 -74376916 -72268366 -69007061
8197 -69007061 -66501835 -64513427 -62979848 -62392862 -57481195 -54736342 -53936110 -52316996 -50071552
$$ packed form
8260c33441689L212898M468946L169625M386601L090648L164270N736461M707532K161976
8251b99342732N649114M222401L707708L965699O753871L437470N793944N797218K426419
8242b57588888N249585M982672M445558M288609N505874O185026N643367K821311L567191
8233b14899695O593295N641570L047028N338478N248169L438887M142738M872628N975257
8224a70601645N694466N440671P80442R701501P01255N354172O327316L813737L651595
8215a29136490M233448L948546J907824M889732M351315L522997L250821M037700L186905
8206i5807202K553668M309656M584556K065513L108403K181962K626528K108550L261305
8197f9007061K505226J988408J533579N86986M911667K744853Q00232J619114K245444
$$ plain form
8188 -50071552 -48190337 -46894222 -45348463 -43290331 -41432997 -40327216 -38073821 -37493946 -36176207
8179 -36176207 -36441871 -33927663 -32532620 -30688541 -30259521 -30026237 -29190887 -27129479 -25413878
8170 -25413878 -23098181 -23439392 -22118503 -22270764 -20955618 -19912640 -18252309 -17103338 -16063189
8161 -16063189 -16672288 -15236434 -11847889 -10094878 -11213372 -11961224 -9368352 -8010878 -7859113
8152 -7859113 -5291985 -2929146 -2378461 -1770098 540204 1808846 2504378 2825267 4635801 6797363
8142 6797363 9061492 9970326 12728854 13762897 15956983 18194001 21308922 23456627 25187398
8133 25187398 28132387 29248089 31411376 33886536 35956527 38410366 39207446 42906626 45597614
8124 45597614 48945734 51361884 54760522 58531409 60700782 64023559 64858980 66556922 72021489
$$ packed form
8188e0071552J881215J296115J545759K058132J857334J105781K253395N79875J317739
8179c6176207k65664K514208J395043J844079M29020K33284Q35350K061408J715601
8170b5413878K315697l41211J320889j52261J315146J042978J660331J148971J040149
8161a6063189o09099J435854L388545J753011j118494p47852K592872J357474J51765
8152g859113K567128K362839N50685O08363K310302J268642O95532L20889J810534K161562
8142F797363K264129R08834K758528J034043K194086K237018L114921K147705J730771
8133B5187398K944989J115702K163287K475160K069991K453839P97080L699180K690988
8124D5597614L348120K416150L398638L770887K169373L322777Q35421J697942N464567
$$ plain form
8115 72021489 74187886 74939515 78551467 81064045 82765381 87313716 90021156 93366543 95858078
8106 95858078 98445476 100862600 102819938 108099662 111424511 113999006 116573688 119116796 121780231
8097 121780231 123917934 127281432 129713654 132741465 134073350 138412674 139788185 140443247 141340864
8088 141340864 145313371 146287875 148951718 150999293 153022039 152536367 154512406 155869592 157996456
8079 157996456 160484579 161112466 161234899 161104701 161900185 163248067 164639820 163328939 163961210 164886374
8069 164886374 163752885 163136453 162555877 164040445 162454516 162224942 162484670 161488747 158950180
8060 158950180 156980529 157842127 157129780 155388323 154564720 152472883 149951237 148350450 146937079
8051 146937079 144779318 142393948 139632960 137365417 133468317 132067863 131193672 127318063 123859860
$$ packed form
8115G2021489K166397P51629L611952K512578J701336M548335K707440L345387K491535
8106I5858078K587398K417124J957338N279724L324849K574495K574682K543108K663435
8097A21780231K137703L363498K432222L027811J331885M339324J375511O55062Q97617
8088A41340864L972507R74504K663843K047575K022746m85672J976039J357186K126864
8079A57996456K488123O27887J22433j30198P95484J347882J391753j310881O32271R25164
8069A64886374j133489o16432n80576J484568j585929k29574K59728r95923k538567
8060A58950180j969651Q61598p12347j741457q23603k091837k521646j600787j413371
8051A46937079k157761k385370k760988k267543l897100j400454q74191l875609l458203
$$ plain form
8042 123859860 121643540 120047083 116176654 111736562 107710728 104143830 101913418 100342608 96798142
8033 96798142 93495934 89450165 86616589 82152406 78109267 74862343 71910536 68565616 64559085
8024 64559085 63111899 59038538 53095216 50122446 46053818 43653813 38933906 36419482 34084567
8015 34084567 29695729 26416430 23759757 20461151 19294714 15224309 12377472 9225880 5344035
8006 5344035 3456834 306490 -1083365 -4019218 -5030951 -6841966 -11312096 -11653032 -13972481
7997 -13972481 -15781606 -16810809 -18572590 -20621195 -22275315 -23129440 -24195924 -24819129 -26288115
7988 -26288115 -27066115 -27157648 -27297752 -28016072 -27753854 -26624487 -26236718 -27218937 -26504142 -25702624
7978 -25702624 -23606995 -24383619 -22988476 -21927771 -21328210 -20036703 -17930704 -16828969 -14217718
$$ packed form
8042A23859860k216320j596457l870429m440092m025834l566898k230412j570810l544466
8033I6798142l302208m045769k833576m464183m043139l246924k951807l344920m006531
8024F4559085j447186m073361n943322k972770m068628k400005m719907k514424k334915
8015C4084567m388838l279299k656673l298606j166437m070405k846837l151592l881845
8006E344035j887201l150344j389855k935853j011733j811015m470130l40936k319449
7997a3972481j809125j029203j761781k048605j654120q54125j066484o23205j468986
7988b6288115p78000r1533j40104p18320K62218J129367L87769r82219P14795Q01518
7978b5702624K095629p76624J395143J060705N99561J291507K105999J101735K611251
$$ plain form
7969 -14217718 -12244123 -10396471 -7236345 -5171973 -3832487 -204740 1299079 2061098 5934199
7960 5934199 10210096 11096849 13862339 15673253 19558201 21175266 24692769 27942756 30508954
7951 30508954 33672865 38095806 41372974 44988628 48927852 51360923 53186329 57795343 59428629
7942 59428629 63132092 65312928 69475927 73627909 75082336 77457033 81090801 82739200 85079670
7933 85079670 90779241 91984312 95424012 98718282 101359618 103669920 106355899 107726959 110735053
7924 110735053 112326567 115076738 116059514 118032032 118457159 119225202 122485424 122209348 124489727
7915 124489727 125132543 125640555 126340971 127000274 126390481 126772631 128535592 128112990 126971085 128235420
7905 128235420 126915257 126457562 127102094 125424642 124016918 122811285 121409562 119565128 118243803
$$ packed form
7969a4217718J973595J847652L160126K064372J339486L627747J503819P62019L873101
7960E934199M275897Q86753K765490J810914L884948J617065L517503L249987K566198
7951C0508954L163911M422941L277168L615654L939224K433071J825406M609014J633286
7942E9428629L703463K180836M162999M151982J454427K374697L633768J648399K340470
7933H5079670N699571J205071L439700L294270K641336K310302K685979J371060L008094
7924A10735053J591514K750171R82776J972518M25127P68043L260222k76076K280379
7915A24489727O42816N08012P00416O59303o09793L82150J762961m22602j141905J264335
7905A28235420j320163m57695O44532j677452j407724j205633j401723j844434j321325
$$ plain form
7896 118243803 116780974 116267542 113946176 110271719 110078528 107698940 105053255 103998316 101632815
7887 101632815 98257544 96726918 92650997 90735691 88135273 83871524 81670110 79178592 75887847
7878 75887847 74547003 70803744 67885445 61875047 60414237 57274042 55694581 52390923 47473753
7869 47473753 45002328 43804683 39041904 35359283 30963325 27913351 23391321 22108146 19287419
7860 19287419 17320643 11468152 9997631 7391181 3737636 424728 -1465698 -3731122 -6958031
7851 -6958031 -9271290 -12234683 -15480163 -17034733 -17926589 -20250654 -22060447 -23487385 -25415053
7842 -25415053 -27126509 -27676529 -28536514 -30279785 -31500264 -32555925 -34746939 -35071231 -35921085 -35316585
7832 -35316585 -35178320 -34681762 -34833286 -34765305 -35113123 -34355654 -33638383 -34182011 -32612342 -31368952
$$ packed form
7896A18243803j462829n13432k321366l674457j93191k379588k645685j054939k365501
7887A01632815l375271j530626m075921j915306k600418m263749k201414k491518l290745
7878G5887847j340844l743259k918299o010398j460810l140195j579461l303658m917170
7869D7473753k471425j197645m762779l682621m395958l049974m522030j283175k820727
7860A9287419j966776n852491j470521k606450l653545l312908j890426k265424l226909
7851f958031k313259k963393l245480j554570q91856k324065j809793j426938j927668
7842b5415053j711456n50020q59985j743271j220479j055661k191014l24292q49854O04500
7832c5316585J38265M96558j51524O7981l47818P57469P17271n43628J569669J243390
$$ plain form
7822 -31368952 -29454095 -28194453 -26444455 -25760744 -24107018 -22551511 -19241344 -19357115 -17177788
7813 -17177788 -14566850 -12407211 -9705362 -5811777 -4991721 -402240 1102261 5088015 6313512
7804 6313512 10438373 14517865 17371725 21119004 24723275 26896739 29278481 34822205 39110634
7795 39110634 41452855 44988227 48382959 53454580 55644995 59265264 63115839 68667800 72160260
7786 72160260 75595818 79046549 85083135 88441121 92265094 96885714 100165045 103642557 108249537
7777 108249537 110926134 114113957 119093881 121196274 126837038 130155003 134355718 135878654 140866137
7768 140866137 143195292 146724336 151063762 152829774 155408711 158530945 160508219 162878780 166724780
7759 166724780 171066857 172537415 173500858 176088333 177683960 180902319 181852877 184591255 185501869
$$ packed form
7822c1368952J914857J259642J749998O83711J653726J555507L310167j15771K179327
7813a7177788K610938K159639K701849L893585Q20056M589481J504501L985754J225497
7804F313512M124861M079492K853860L747279L604271K173464K381742N543724M288429
7795C9110634K342221L535372L394732N071621K190415L620269L850575N551961L492460
7786G2160260L435558L450731O036586L357986L823973M620620L279331L477512M606980
7777A08249537K676597L187823M979924K102393N640764L317965M200715J522936M987483
7768A40866137K329155L529044M339426J766012K578937L122234J977274K370561L846000
7759A66724780M342077J470558R63443K587475J595627L218359R50558K738378R10614
$$ plain form
7750 185501869 187274070 188958712 189630566 192221238 192800114 194879147 195478996 195075313 197311423
7741 197311423 200228960 199828764 200313705 199745311 199851681 201059399 199567841 201446324 200844840 200952226
7731 200952226 200323978 201286085 199601014 199287295 200093457 200899283 198341352 197579340 198916346 197584785
7721 197584785 196796219 196715588 194459629 193819662 193669392 193061458 191202453 190804610 190359014 188483831
7711 188483831 187183011 188601069 186919756 184809489 184194751 183210410 180904889 179829018 179136902
7702 179136902 180647469 180880839 178887222 177191622 176988722 177434727 175810757 175182019 175173815 175585008
7692 175585008 175655144 173307155 174085730 174986436 172912038 174182475 172977526 172619313 172249798 173302622
7682 173302622 173787390 173976605 175245951 175009042 175430679 173589904 173686479 175634504 176867481 178395860
$$ packed form
7750A85501869J772201J684642O71854K590672N78876K079033N99849m03683K236110
7741A97311423K917537m00196M84941n68394J06370J207718j491558J878483o01484J07386
7731B00952226o28248R62107j685071l13719Q06162Q05826k557931p62012J337006j331561
7721A97584785p88566q0631k255959o39967j50270o07934j859005l97843m45596j875183
7711A88483831j300820J418058j681313k110267o14738r84341k305521j075871o92116
7702A79136902J510567K33370j993617j695600k02900M46005j623970o28738q204M11193
7692A75585008P0136k347989P78575R00706k074398J270437j204949l58213l69515J052824
7682A73302622M84768J89215J269346k36909M21637j840775R6575J948025J232977J528379
$$ plain form
7672 178395860 178520515 179078204 181499754 182385632 183233433 183870190 185505453 185372024 186583762 188109216
7662 188109216 191176191 190944436 192412580 194026972 195324655 196247486 197582489 199080065 200739262
7653 200739262 204022938 204514164 206254615 209083533 210209857 212136611 212643597 214026772 216262397
7644 216262397 217112347 217814600 219756340 220774410 221194023 223050195 225515894 226580389 226279640
7635 226279640 228226754 230641619 231943694 233358558 234474952 234166886 234051614 235612213 235436690
7626 235436690 236091711 236441723 235919674 236290827 235125421 234950430 235944326 237412086 235657171 234963583
7616 234963583 235049624 232288928 231984186 231263948 231171383 227890949 226183873 226173125 223190096 220399359
7606 220399359 218348321 217497681 215432673 212520436 210564134 207969368 205369061 202884092 199794967
$$ packed form
7672A78395860J24655N57689K421550Q85878Q47801O36757J635263j33429J211738J525454
7662A88109216L066975k31755J468144J614392J297683R22831J335003J497576J659197
7653B00739262L283676M91226J740451K828918J126324J926754N06986J383175K235625
7644B16262397Q49950P02253J941740J018070M19613J856172K465699J064495l00749
7635B26279640J947114K414865J302075J414864J116394l08066j15272J560599j75523
7626B35436690O55021L50012n22049L71153j165406j74991R93896J467760j754915o93588
7616B34963583Q6041k760696l04742p20238r2565l280434j707076j0748k983029k790737
7606B20399359k051038q50640k065008k912237j956302k594766k600307k484969l089125
$$ plain form
7597 199794967 199141097 194048939 188821879 187378540 182783444 179830683 176929755 172829704 170208851
7588 170208851 164946777 160156349 156180571 152683855 147539791 142978058 138272227 132771798 128787587
7579 128787587 123890291 121660783 118024891 111208368 106194817 101379792 96238331 91109173 85104150
7570 85104150 79409712 75515041 71453834 66752316 60848324 56232356 51262592 47025164 41654024
7561 41654024 36601138 33239548 30142441 23136174 18296916 13954803 9299269 4749080 1144741
7552 1144741 -2738292 -8048341 -11563576 -17476312 -23739951 -25863771 -27261060 -31110740 -35618228
7543 -35618228 -37525851 -38533748 -45926117 -48419619 -48497038 -53176463 -55672231 -58580623 -59693161
7534 -59693161 -60032239 -61078694 -65345504 -64127686 -66165788 -67865071 -66867074 -67790274 -69044131
$$ packed form
7597A99794967o53870n092158n227060j443339m595096k952761k900928m100051k620853
7588A70208851n262074m790428l975778l496716n144064m561733m705831n500429l984211
7579A28787587m897296k229508l635892o816523n013551m815025n141461n129158o005023
7570H5104150n694438l894671m061207m701518n903992m615968m969764m237428n371140
7561D1654024n052886l361590l097107p006267m839258m342113m655534m550189l604339
7552A144741l883033n310049l515235n912736o263639k123820j397289l849680m507488
7543c5618228j907623j007897p392369k493502p7419m679425k495768k908392j112538
7534e9693161l39078j046455m266810J217818k038102j699283R97997r23200j253857
$$ plain form
7525 -69044131 -69765544 -69570110 -70183252 -69913027 -69174682 -69539650 -68250626 -68072227 -66268040 -65191337
7515 -65191337 -64919815 -62023774 -62562597 -59685694 -56140474 -54750597 -52685503 -53444224 -50178352
7506 -50178352 -46701277 -42478866 -40319335 -37438682 -33974306 -30712628 -27301072 -23931164 -19993621
7497 -19993621 -16122233 -13423038 -9934886 -5320839 -2526857 2871875 6062771 12235839 16732783
7488 16732783 19557084 24500414 30075603 34174919 38826988 42970358 49070539 52203606 56884522
7479 56884522 61787725 65606408 70773584 76412487 81121980 83779697 89197605 93462912 99142898
7470 99142898 103578975 106055104 112324513 116145095 121318397 124796073 130527366 134199677 137159904
7461 137159904 140348501 144783321 149868573 152701013 157226483 160626850 164453433 167218575 170849271
$$ packed form
7525f9044131p21413J95434o13142K70225P38345l64968J289024J78399J804187J076703
7515f5191337K71522K896041n38823K876903L545220J389877K065094p58721L265872
7506e0178352L477075M222411K159531K880653L464376L261678L411556L369908L937543
7497a9993621L871388K699195L488152M614047K793982N398732L190896O173068M496944
7488A6732783K824301M943330N575189M099316M652069M143370O100181L133067M680916
7479E6884522M903203L818683N167176N638903M709493K657717N417908M265307N679986
7470I9142898M436077K476129O269409L820582N173302L477676N731293L672311K960227
7461A37159904L188597M434820N085252K832440M525470L400367L826583K765142L630696
$$ plain form
7452 170849271 175526653 176235667 179225050 181441638 184597893 187103077 190216494 193278456 194646723
7443 194646723 196210806 200156108 202146980 204077962 205754547 207107670 207288328 208431775 210322820
7434 210322820 211278377 213038168 215157742 216722765 217341938 217017198 217977116 217604789 218360770 217900907
7424 217900907 219246405 219040652 218970417 219509263 218870592 218842108 220407647 218430585 217491189 218335408
7414 218335408 219122729 219207593 216723969 215623467 215781718 215206342 213392653 211256456 211474581 211340578
7404 211340578 211279942 210822996 210053155 210738349 210347349 206514225 208474257 206886777 204368298 205327107
7394 205327107 203784824 203504371 204147484 203642731 201657106 202519807 201998103 200190265 199767547 200695647
7384 200695647 198986146 197629019 198205996 198616474 198888318 198911139 198319333 197137443 198590031 199911930
$$ packed form
7452A70849271M677382P09014K989383K216588L156255K505184L113417L061962J368267
7443A94646723J564083L945302J990872J930982J676585J353123J80658J143447J891045
7434B10322820R55557J759791K119574J565023O19173l24740R59918l72327P55981m59863
7424B17900907J345498k05753p0235N38846o38671k8484J565539j977062r39396Q44219
7414B18335408P87321Q4864k483624j100502J58251n75376j813689k136197K18125j34003
7404B11340578o0636m56946p69841O85194l91000l833124J960032j587480k518479R58809
7394B05327107j542283k80453O43113n04753j985625Q62701n21704j807838m22718R28100
7384B00695647j709501j357127N76977M10478K71844K2821n91806j181890J452588J321899
$$ plain form
7374 199911930 200260806 199028710 200263251 201219206 201328370 202054597 203248936 202786714 203391259 205017105
7364 205017105 205448948 206613322 206149827 210443272 210647621 210519158 211295234 213005535 212519186 215301608
7354 215301608 215885384 217012072 219803679 221668862 222646005 224162610 224559379 226619644 225892439
7345 225892439 228498864 230153438 231526287 233358311 236588615 236991090 237757848 240453816 242246418
7336 242246418 243270490 243572069 243567185 245659299 245897038 249043526 249555127 251280541 251735486 251802175
7326 251802175 254160883 253224936 254627860 255275787 256008055 256660580 257002724 256393254 257288515 256309844
7316 256309844 256191337 255532703 256541232 255095543 253999138 254826421 254044033 251415398 250068898
7307 250068898 249581843 248458827 246498096 245265196 244132765 240494357 239977938 239976187 237096973
$$ packed form
7374A99911930L48876j232096J234541R55955J09164P26227J194339m62222O04545J625846
7364B05017105M31843J164374m63495M293445K04349j28463P76076J710301m86349K782422
7354B15301608N83776J126688K791607J865183R77143J516605L96769K060265p27205
7345B25892439K606425J654574J372849J832024L230304M02475P66758K695968J792602
7336B42246418J024072L01579m884K092114K37739L146488N11601J725414M54945O6689
7326B51802175K358708r35947J402924O47927P32268O52525L42144o09470Q95261r78671
7316B56309844j18507o58634J008529j445689j096405Q27283p82388k628635j346500
7307B50068898m87055j123016j960731j232900j132431l638408n16419j751k879214
$$ plain form
7298 237096973 233179992 232651818 229621797 225789594 224347214 220534347 216566798 213415079 210535121
7289 210535121 206729082 204057312 200513454 195850683 192727659 188352421 184836173 180273428 175026307
7280 175026307 170289393 166185264 162526691 157730382 153808299 148251149 142967372 137809719 132458895
7271 132458895 128119027 123401952 116990601 112295209 106725338 103145298 97991536 91498819 85023975
7262 85023975 80889876 76221301 69686829 64292564 57593528 53099105 47454069 42210863 36471154
7253 36471154 31712895 28087252 22118360 15236872 10591047 4315022 596325 -3553618 -8611522
7244 -8611522 -13388923 -17305746 -21694271 -25987823 -32277081 -36080499 -40000103 -44148808 -46505037
7235 -46505037 -50177170 -54828269 -58196574 -62152629 -64948784 -69280109 -70195640 -72849953 -75392832
$$ packed form
7298B37096973l916981n28174l030021l832203j442380l812867l967549l151719k879958
7289B10535121l806039k671770l543858m662771l123024m375238l516248m562745n247121
7280A75026307m736914m104129l658573m796309l922083n557150n283777n157653n350824
7271A32458895m339868m717075o411351m695392n569871l580040n153762o492717o474844
7262H5023975m134099m668575o534472n394265o699036m494423n645036n243206n739709
7253C6471154m758259l625643n968892o881488m645825o276025l718697m149943n057904
7244h611522m777401l916823m388525m293552o289258l803418l919604m148705k356229
7235d6505037l672133m651099l368305l956055k796155m331325r15531k654313k542879
$$ plain form
7226 -75392832 -77856564 -80712993 -84693251 -86273557 -88549822 -89173598 -91706855 -93521937 -95050863
7217 -95050863 -95720360 -95461345 -98222856 -99122338 -99306398 -99256373 -100871076 -99179947 -99880829 -100199438
7207 -100199438 -99676528 -99082495 -98665734 -97506890 -95713157 -94332307 -92623866 -93245157 -91895641
7198 -91895641 -91303053 -88112789 -86962027 -84927751 -82080674 -80953558 -78604613 -77127446 -73367555
7189 -73367555 -71862682 -70027915 -66475850 -63688633 -59501064 -57264588 -55816635 -53527916 -51367793
7180 -51367793 -46906272 -42793641 -41609956 -35647594 -34840051 -31445782 -28288207 -24266548 -20651229
7171 -20651229 -16961231 -13189000 -9759668 -7873781 -4229184 -530292 2006447 5019881 8547355
7162 8547355 9897088 13962693 16583906 18835264 22117363 25252432 27849791 30709526 34138620
$$ packed form
7226g5392832k463732k856429l980258j580306k276265o23776k533257j815082j528926
7217i5050863o69497K59015k761511q99482j84060N0025j614703J691129p00882l18609
7207a00199438N22910N94033M16761J158844J793733J380850J708441o21291J349516
7198i1895641N92588L190264J150762K034276K847077J127116K348945J477167L759891
7189g3367555J504873J834767L552065K787217M187569K236476J447953K288719K160123
7180e1367793M461521M112631J183685N962362Q07543L394269L157575M021659L615319
7171b0651229L689998L772231L429332J885887L644597L698892K536739L013434L527474
7162H547355J349733M065605K621213K251358L282099L135069K597359K859735L429094
$$ plain form
7153 34138620 35009079 36774608 40556067 42976867 43816946 45484252 49024657 51601180 52080187
7144 52080187 54254367 56381329 58175402 59170661 61894576 62904072 63320812 64947354 66025214
7135 66025214 67047072 67713623 69291910 69274079 69560874 70619588 70887266 71158743 71630686 69751342
7125 69751342 71973281 72380552 71907292 72398533 73472060 73299425 72799823 73155787 72512611 71777135
7115 71777135 70488821 69963158 69626725 69737700 69981224 68789765 67191715 66359662 66076932 65546152
7105 65546152 65137896 64711117 63451106 63911052 63021397 61678446 60722332 60053723 59527244 59523840
7095 59523840 57822228 58801202 58117064 57565063 57216634 55638925 56070954 56865618 56866998 54951998
7085 54951998 55140430 55162326 56168789 56284661 57122708 57047281 55982210 57189213 59003361 60102365
$$ packed form
7153C4138620Q70459J765529L781459K420800Q40079J667306L540405K576523M79007
7144E2080187K174180K126962J794073R95259K723915J009496M16740J626542J077860
7135F6025214J021858O66551J578287j7831K86795J058714K67678K71477M71943j879344
7125F9751342K221939M07271m73260M91241J073527j72635m99602L55964o43176p35476
7115G1777135j288314n25663l36433J10975K43524j191459j598050q32053k82730n30780
7105F5546152m08256m26779j260011M59946q89655j342951r56114o68609n26479l404
7095E9523840j701612R78974o84138n52001l48429j577709M32029P94664J380j915000
7085E4951998J88432K1896J006463J15872Q38047p5427j065071J207003J814148J099004
$$ plain form
7075 60102365 59821559 58932300 60774278 63791746 65269200 65256830 66007345 66833465 68385588 70353602
7065 70353602 72171500 73531698 75600026 76874518 78150263 80849165 82407802 83677732 87181260
7056 87181260 89942378 90966838 93935089 98887148 99204965 103152231 104986292 108336636 109999637
7047 109999637 111938360 115684611 118917522 121751920 125510877 128081520 132648401 132457180 136290061
7038 136290061 139868697 143335503 145948937 151104903 153730979 157590810 160327650 162331617 165187154
7029 165187154 168277661 170567256 174117784 176102955 179217645 184673831 185851335 187805534 191778351
7020 191778351 194777160 197789745 199477752 202668210 204650274 207027249 209397914 210649365 212703950
7011 212703950 215972965 216219551 217728867 220294523 220542341 223091143 223471745 224770946 225747503
$$ packed form
7075F0102365k80806q89259J841978L017468J477454j2370P50515Q26120J552123J968014
7065G0353602J817898J360198K068328J274492J275745K698902J558637J269930L503528
7056H7181260K761118J024460K968251M952059L17817L947266J834061L350344J663001
7047A09999637J938723L746251L232911K834398L758957K570643M566881j91221L832881
7038A36290061L578636L466806K613434N155966K626076L859831K736840K003967K855537
7029A65187154L090507K289595L550528J985171L114690N456186J177504J954199L972817
7020A91778351K998809L012585J688007L190458J982064K376975K370665J251451K054585
7011B12703950L269015K46586J509316K565656K47818K548802L80602J299201R76557
$$ plain form
7002 225747503 224969708 226076208 226478254 227187390 227475429 227968977 227475855 227792079 227836439 226363891
6992 226363891 227654733 226558489 226793242 226523646 225020452 223220465 221081017 219641266 218898568
6983 218898568 215974179 215458689 213745139 210722052 208336424 206680658 204169410 200942021 200189791
6974 200189791 196463405 194204651 190929942 187338405 184865155 180532046 178419428 173932999 171334683
6965 171334683 167399425 164742219 160298227 156917512 152978760 148844617 144320352 140696538 138833841
6956 138833841 135524800 131083060 125600268 120681757 116837446 115421853 110399046 107039700 101417762
6947 101417762 97741179 94394952 90325178 87514617 83291882 80480700 76967406 72352952 67976262
6938 67976262 65094018 63908940 59599684 57339359 54369609 51654175 49377655 45937075 43482338
$$ packed form
7002B25747503p77795J106500M02046P09136K88039M93548m93122L16224M4360j472548
6992B26363891J290842j096244K34753k69596j503194j799987k139448j439751p42698
6983B18898568k924389n15490j713550l023087k385628j655766k511248l227389p52230
6974B00189791l726386k258754l274709l591537k473250m333109k112618m486429k598316
6965A71334683l935258k657206m443992l380715l938752m134143m524265l623814j862697
6956A38833841l309041m441740n482792m918511l844311j415593n022807l359346n621938
6947A01417762l676583l346227m069774k810561m222735k811182l513294m614454m376690
6938F7976262k882244j185078m309256k260325k969750k715434k276520l440580k454737
$$ plain form
6929 43482338 39617892 37881780 34424480 32605595 32018115 30398853 27844176 27675687 23451183
6920 23451183 23274770 21771702 21164130 19857891 21289092 19154011 18306679 18462297 18603083 17114328
6910 17114328 16553648 16032870 18105181 19382236 20171977 20693175 22557269 22085104 23761164 25063876
6900 25063876 25040409 28241138 28995671 31062515 33958197 37474868 38772983 41595011 42627117
6891 42627117 46179187 48468045 49734214 54809082 57520972 58649285 64083131 66849811 70264154
6882 70264154 73623332 76816489 81152160 83594656 87258723 89685211 93915263 98346298 102775774
6873 102775774 106077456 108864820 111174525 115057935 119912090 123974211 127054110 131686916 135877959
6864 135877959 140134668 143339225 146592928 149890413 155278332 159407925 162398460 166438698 168482608
$$ packed form
6929D3482338l864446j736112l457300j818885n87480j619262k554677j68489m224504
6920B3451183j76413j503068o07572j306239J431201k135081q47332J55618J40786j488755
6910A7114328n60680n20778K072311J277055P89741N21198J864094m72165J676060J302712
6900B5063876k3467L200729P54533K066844K895682L516671J298115K822028J032106
6891D2627117L552070K288858J266169N074868K711890J128313N433846K766680L414343
6882G0264154L359178L193157M335671K442496L664067K426488M230052M431035M429476
6873A02775774L301682K787364K309705L883410M854155M062121L079899M632806M191043
6864A35877959M256709L204557L253703L297485N387919M129593K990535M040238K043910
$$ plain form
6855 168482608 172245881 175051204 178250934 182217077 185367911 185688639 191313699 193370449 195867771
6846 195867771 197787861 200036558 203479092 206764749 208978055 211736374 211951623 213827773 214881178
6837 214881178 217763413 217341415 220228083 219928255 222745789 223799561 224755548 225339004 226697400
6828 226697400 228656008 228902457 231683661 231814324 229716212 229773466 228228930 230217277 230485254
6819 230485254 229042213 228347388 228025457 226882924 224865187 225543719 224294533 223694113 223354796
6810 223354796 221026945 219746007 219293101 217444875 213781981 213694102 213471992 210059334 209729100 208782654
6800 208782654 206658341 204010547 201910718 199642208 196913069 196336277 193906884 190418468 190167148
6791 190167148 188666203 185557741 183649266 181969494 180911503 178364045 174986109 173414603 171189178
$$ packed form
6855A68482608L763273K805323L199730L966143L150834L20728N625060K056750K497322
6846A95867771J920090K248697L442534L285657K213306K758319K15249J876150J053405
6837B14881178K882235m21998K886668k99828K817534J053772R55987N83456J358396
6828B26697400J958608K46449K781204J30663k098112N7254j544536J988347K67977
6819B30485254j443041o94825l21931j142533k017737O78532j249186o00420l39317
6810B23354796k327851j280938m52906j848226l662894q7879k22110l412658l30234r46446
6800B08782654k124313k647794k099829k268510k729139n76792k429393l488416k51320
6791A90167148j500945l108462j908475j679772j057991k547458l377936j571506k225425
$$ plain form
6782 171189178 170212144 167931867 166091908 164237303 162088015 159131194 157510735 155911649 153591852
6773 153591852 152864411 151268376 147371060 146853872 145010826 143551453 142340790 142160460 141053611
6764 141053611 138245497 136824500 135802045 133801315 132407601 132777589 132583246 131375852 130820182
6755 130820182 130104885 128113709 127714902 127117503 126506641 126936286 126531664 126347057 124557869 125599944
6745 125599944 125905290 124838404 125835259 123326826 123813597 125009025 123864460 123947010 124488156 124081208
6735 124081208 125139874 124989245 125076191 125577625 123914981 123906034 124473660 125907335 125776731 124520323
6725 124520323 124652885 125163786 123576528 124015512 124921835 125448835 125414101 123561222 124689144 122831457
6715 122831457 123398753 123690186 123633472 122971220 121236728 120063747 118706782 119455073 118429821 119070218
$$ packed form
6782A71189178r77034k280277j839959j854605k149288k956821j620459j599086k319797
6773A53591852p27441j596035l897316n17188j843046j459373j210663j80330j106849
6764A41053611k808114j420997j022455k000730j393714L69988j94343j207394n55670
6755A30820182p15297j991176l98807n97399o10862M29645m04622j84607j789188J042075
6745A25599944L05346j066886R96855k508433M86771J195428j144565Q2550N41146m06948
6735A24081208J058666j50629Q6946N01434j662644q947N67626J433675j30604j256408
6725A24520323J32562N10901j587258M38984R06323N27000l4734j852879J127922j857687
6715A22831457N67296K91433n6714o62252j734492j172981j356965P48291j025252O40397
$$ plain form
6705 119070218 117362648 116081402 113087988 111573618 110434017 109892319 108442084 107758707 105871845
6696 105871845 104281602 99857828 98086065 95689673 95054510 93074657 90307206 86668103 84578520
6687 84578520 82466511 79875271 75136844 72490726 68084150 64937648 61820173 58834749 56342572
6678 56342572 51888981 49204946 44796767 41720561 35837949 31509630 28004760 24052468 18819530
6669 18819530 15023323 11041622 7461300 2267599 -3244145 -7850286 -11514421 -15423015 -20502994
6660 -20502994 -24316779 -28726168 -34359038 -38570881 -44721934 -49399793 -54669122 -56845490 -63323365
6651 -63323365 -68737976 -71874849 -76060438 -82052204 -84983040 -89912121 -95414393 -99154752 -102303199
6642 -102303199 -106211277 -110797661 -114926316 -120084151 -123327061 -127587555 -130719560 -134001602 -137218044
$$ packed form
6705A19070218j707570j281246k993414j514370j139601n41698j450235o83377j886862
6696A05871845j590243m423774j771763k396392o35163j979853k767451l639103k089583
6687H4578520k112009k591240m738427k646118m406576l146502l117475k985424k492177
6678E6342572m453591k684035m408179l076206n882612m328319l504870l952292n232938
6669A8819530l796207l981701l580322n193701n511744m606141l664135l908594n079979
6660b0502994l813785m409389n632870m211843o151053m677859n269329k176368o477875
6651f3323365n414611l136873m185589n991766k930836m929081n502272l740359l148447
6642a02303199l908078m586384m128655n157835l242910m260494l132005l282042l216442
$$ plain form
6633 -137218044 -140404391 -144051007 -146688146 -149369640 -151935354 -155761932 -158276005 -160869142 -162433536
6624 -162433536 -163255834 -165690066 -169030926 -170194796 -171160499 -171711115 -173624606 -172055078 -174098777
6615 -174098777 -175990262 -175315812 -176200027 -176772972 -176325963 -175213345 -177123873 -175808386 -174501701
6606 -174501701 -174381088 -172257417 -172328073 -170907525 -169238591 -165908305 -163558919 -161684029 -160059026
6597 -160059026 -157744895 -154012978 -151165764 -148550820 -145264289 -143223037 -140744367 -136176318 -132252008
6588 -132252008 -128593859 -125331233 -120577706 -118080932 -112771908 -108646708 -104030944 -98454927 -93419978
6579 -93419978 -90110668 -84862426 -80034837 -75662428 -70164829 -64415648 -60671765 -54782147 -50033431
6570 -50033431 -45786061 -39226396 -34393038 -29085113 -24963448 -19004260 -12631580 -7798172 -4081429
$$ packed form
6633a37218044l186347l646616k637139k681494k565714l826578k514073k593137j564394
6624a62433536q22298k434232l340860j163870r65703n50616j913491J569528k043699
6615a74098777j891485O74450q84215n72945M47009J112618j910528J315487J306685
6606a74501701J20613K123671p0656J420548J668934L330286K349386J874890J625003
6597a60059026K314131L731917K847214K614944L286531K041252K478670M568049L924310
6588a32252008L658149L262626M753527K496774N309024M125200M615764N576017N034949
6579i3419978L309310N248242M827589M372409N497599N749181L743883N889618M748716
6570e0033431M247370O559665M833358N307925M121665N959188O372680M833408L716743
$$ plain form
6561 -4081429 1652183 7686178 12775161 17565601 20778951 26526947 33422661 36629646 42493381
6552 42493381 47424558 53093192 55817886 59919547 64911818 70179230 73643493 77192683 82429691
6543 82429691 85950559 88248598 91296415 97327052 99727948 102342859 105157116 107478503 108734856
6534 108734856 110335409 112023197 116422425 120312769 120554103 124003059 126290733 126452339 127503716
6525 127503716 129839199 131944087 131995967 132796329 131437637 132040676 132943204 132919673 133945681 133163812
6515 133163812 132554121 131361937 132390286 131264048 129302872 128628650 127447033 126448906 125740871
6506 125740871 125264050 121857346 120592484 119456471 117827436 115472899 114068044 110453991 107677416
6497 107677416 106850818 104361228 102223462 98162398 95776384 93521806 92049163 88586859 84825431
$$ packed form
6561d081429N733612O033995N088983M790440L213350N747996O895714L206985N863735
6552D2493381M931177N668634K724694M101661M992271N267412L464263L549190N237008
6543H2429691L520868K298039L047817O030637K400896K614911K814257K321387J256353
6534A08734856J600553J687788M399228L890344K41334L448956K287674J61606J051377
6525A27503716K335483K104888N1880Q00362j358692O03039R02528k3531J026008p81869
6515A33163812o09691j192184J028349j126238j961176o74222j181617r98127p08035
6506A25740871m76821l406704j264862j136013j629035k354537j404855l614053k776575
6497A07677416q26598k489590k137766m061064k386014k254578j472643l462304l761428
$$ plain form
6488 84825431 81494025 77665357 75992585 70744075 69209055 65007051 63603795 58633968 56611491
6479 56611491 53060104 48170463 44110435 42458805 38597616 37386397 33449224 30135286 27605358
6470 27605358 23886526 23198346 19836706 16099360 13183703 10104195 7399765 3614909 2569300
6461 2569300 123463 -2349522 -6121382 -6217791 -7635492 -11426389 -13606161 -15443536 -18373398
6452 -18373398 -20113941 -22561493 -23466367 -25852207 -26441074 -28343381 -29040933 -31182277 -32711426
6443 -32711426 -33094582 -34060875 -35091274 -36086302 -35445098 -38056555 -37841979 -39358102 -39594960 -39879851
6433 -39879851 -38839867 -41224987 -42464442 -41719623 -39732337 -41054628 -40091948 -39996528 -41995252 -42651758
6423 -42651758 -40991292 -41612131 -41146411 -41289772 -42432678 -41074897 -39238142 -39511781 -40098798 -39370543
$$ packed form
6488H4825431l331406l828668j672772n248510j535020m202004j403256m969827k022477
6479E6611491l551387m889641m060028j651630l861189j211219l937173l313938k529928
6470B7605358l718832o88180l361640l737346k915657l079508k704430l784856j045609
6461B569300k445837k472985l771860r6409j417701l790897k179772j837375k929862
6452a8373398j740543k447552r04874k385840n88867j902307o97552k141344j529149
6443c2711426l83156r66293j030399r95028O41204k611457K14576j516123k36858k84891
6433c9879851J039984k385120j239455P44819J987286j322291R62680R5420j998724o56506
6423d2651758J660466o20839M65720j43361j142906J357781J836755k73639n87017P28255
$$ plain form
6413 -39370543 -39466568 -39163428 -40099408 -39509817 -37382103 -37262387 -36027353 -36796720 -36174054 -35546425
6403 -35546425 -34230737 -35249439 -34141507 -34955927 -34609014 -34972788 -34824560 -34357046 -33820513 -34163751
6393 -34163751 -34826340 -34547571 -35529338 -35032833 -35571723 -35379165 -35344997 -35311676 -35451836 -35813429 -36301332
6382 -36301332 -37551175 -38612519 -39349905 -39616743 -40013873 -41856703 -43010493 -43614208 -46402364 -46126498
6372 -46126498 -46377325 -48596234 -51555758 -49458165 -52935695 -52923319 -56324278 -55638738 -56446546 -58137838
6362 -58137838 -59657405 -62585233 -64954487 -66810064 -66726480 -69498419 -71733238 -72898022 -75967008
6353 -75967008 -76483011 -78606811 -78878344 -80670722 -82073628 -84534309 -86464972 -88510055 -88994890
6344 -88994890 -90950116 -93377747 -94872290 -96932212 -98216853 -98660871 -99870057 -101086177 -102120437
$$ packed form
6413c9370543r6025L03140r35980N89591K127714J19716J235034p69367O22666O27629
6403c5546425J315688j018702J107932q14420L46913l63774J48228M67514N36533l43238
6393c4163751o62589K78769r81767M96505n38890J92558L4168L3321j40160l61593m87903
6382c6301332j249843j061344p37386k66838l97130j842830j153790o03715k788156K75866
6372d6126498k50827k218909k959524K097593l477530J2376l400959O85540q07808j691292
6362e8137838j519567k927828k369254j855577Q3584k771939k234819j164784l068986
6353g5967008n16003k123800k71533j792378j402906k460681j930663k045083m84835
6344h8994890j955226k427631j494543k059922j284641m44018j209186j216120j034260
$$ plain form
6335 -102120437 -103503706 -104607922 -104842945 -106170046 -107279478 -108487450 -109555097 -109464931 -112107724
6326 -112107724 -111876215 -112051190 -111522579 -110266061 -109250202 -111225106 -110756958 -111436425 -111066537 -108714724
6316 -108714724 -109686084 -108256131 -108437580 -108184294 -106721102 -104604784 -104777660 -100657952 -100293935 -99399683
6306 -99399683 -96787151 -94783948 -93284194 -90050265 -89178743 -86491617 -85486740 -82580527 -78268818
6297 -78268818 -74864205 -71582927 -69526417 -67352571 -66239885 -60897769 -58285169 -54295742 -50509783
6288 -50509783 -45524941 -41133257 -36354103 -34700663 -31794025 -26709738 -21771017 -19143593 -14980229
6279 -14980229 -9352063 -5528025 -1960461 1994752 5878541 9164831 14577180 18502435 25276645
6270 25276645 28449417 31970401 37074380 40626947 45612505 49445576 53915538 58093994 59915989
$$ packed form
6335a02120437j383269j104216k35023j327101j109432j207972j067647R0166k642793
6326a12107724K31509j74975N28611J256518J015859j974904M68148o79467L69888K351813
6316a08714724r71360J429953j81449K53286J463192K116318j72876M119708L64017Q94252
6306i9399683K612532K003203J499754L233929Q71522K687126J004877K906213M311709
6297g8268818L404613L281278K056510K173846J112686N342116K612600L989427L785959
6288e0509783M984842M391684M779154J653440K906638N084287M938721K627424M163364
6279a4980229N628166L824038L567564L955213L883789L286290N412349L925255O774210
6270B5276645L172772L520984N103979L552567M985558L833071M469962M178456J821995
$$ plain form
6261 59915989 63622382 67541205 72817930 76808767 78176019 82796941 87341930 90560227 92654452
6252 92654452 95893590 99903236 102715554 105689996 108281942 109759346 112266864 116330218 119585723
6243 119585723 120242457 120335477 123773865 126024727 125658026 128458742 128943257 131361027 132326490 131798577
6233 131798577 132383790 133037628 132681263 131830261 131915136 131742199 132085647 131691334 130644570 128879707
6223 128879707 127957646 128359585 125419918 121347460 120630690 120003449 117821535 114113110 112110137
6214 112110137 109769502 105767579 103359680 100302952 98771095 96193659 91969031 88273602 85199663
6205 85199663 79845619 76387580 72567740 67916985 64371788 59626760 56270074 50751467 45212477
6196 45212477 41520863 37990171 33514000 27206179 22058928 17755287 12743025 8669236 3414266
$$ packed form
6261E9915989L706393L918823N276725L990837J367252M620922M544989L218297K094225
6252I2654452L239138M009646K812318K974442K591946J477404K507518M063354L255505
6243A19585723O56734R3020L438388K250862l66701K800716M84515K417770R65463n27913
6233A31798577N85213O53838l56365q51002Q4875j72937L43448l94313j046764j764863
6223A28879707r22061M01939k939667m072458p16770o27241k181914l708425k002973
6214A12110137k340635m001923k407899l056728j531857k577436m224628l695429l073939
6205H5199663n354044l458039l819840m650755l545197m745028l356686n518607n538990
6196D5212477l691614l530692m476171o307821n147251m303641n012262m073789n254970
$$ plain form
6187 3414266 -2574384 -7592304 -12898857 -18396176 -23317399 -30056521 -34588674 -38946095 -42907433
6178 -42907433 -48125814 -52710578 -57158992 -63055407 -68769476 -72096468 -78314169 -83271194 -84992681
6169 -84992681 -90760460 -93312456 -97015595 -101055080 -105882221 -109206567 -112120035 -117295019 -120954100
6160 -120954100 -124284499 -127666541 -129125245 -133213882 -136319197 -138669776 -140913329 -142044325 -142891301
6151 -142891301 -147662391 -149809166 -151229044 -152223172 -154538126 -154985624 -154691644 -156187308 -157718493
6142 -157718493 -156151678 -157185054 -158540127 -160048300 -158169675 -158058296 -156668233 -155862757 -156291394
6133 -156291394 -153528750 -153726380 -153539984 -152821170 -151070506 -148442172 -146907074 -146624635 -143301833
6124 -143301833 -140583272 -138518117 -136144515 -132957035 -130910627 -127176368 -124563663 -124106456 -122278882
$$ packed form
6187C414266n988650n017920n306553n497319m921223o739122m532153m357421l961338
6178d2907433n218381m584764m448414n896415n714069l326992o217701m957025j721487
6169h4992681n767779k551996l703139m039485m827141l324346k913468n174984l659081
6160a20954100l330399l382042j458704m088637l105315k350579k243553j130996q46976
6151a42891301m771090k146775j419878r94128k314954m47498K93980j495664j531185
6142a57718493J566815j033376j355073j508173J878625J11379J390063Q05476m28637
6133a56291394K762644j97630J86396P18814J750664K628334J535098K82439L322802
6124a43301833K718561K065155K373602L187480K046408L734259K612705M57207J827574
$$ plain form
6115 -122278882 -116181702 -112606844 -110352114 -105966025 -102193722 -98328454 -96085541 -94072089 -89074100
6106 -89074100 -84051017 -79830064 -76802708 -73684645 -69754437 -65469102 -61363822 -57833775 -54268264
6097 -54268264 -50369537 -45155953 -42305994 -38096139 -35808003 -30367649 -26647865 -22258144 -19961204
6088 -19961204 -15647955 -10433201 -7518834 -3374030 -2265986 1657987 6538104 7776239 12020397
6079 12020397 13963962 17908482 20458808 24328153 26646290 29117378 31742350 34380097 37576247
6070 37576247 40624140 42326309 44779073 46244470 48398275 51010195 52956927 55170020 57043159
6061 57043159 57662529 60965951 62165842 62091509 63475659 63823186 64299620 66165751 66009623 67464616
6051 67464616 67039822 68554847 68083777 69585618 69256892 70158013 70349236 69467746 68127921 69165967
$$ packed form
6115a22278882O097180L574858K254730M386089L772303L865268K242913K013452M997989
6106h9074100N023083M220953L027356L118063L930208M285335M105280L530047L565511
6097e4268264L898727N213584K849959M209855K288136N440354L719784M389721K296940
6088a9961204M313249N214754K914367M144804J108044L923973M880117J238135M244158
6079A2020397J943565L944520K550326L869345K318137K471088K624972K637747L196150
6070C7576247L047893J702169K452764J465397K153805K611920J946732K213093J873139
6061E7043159O19370L303422J199891p4333J384150L47527M76434J866131j56128J454993
6051F7464616m24794J515025m71070J501841l28726R01121J91223q81490j339825J038046
$$ plain form
6041 69165967 71233671 68929054 68702623 68632968 68232597 66218809 66597013 65610815 65097653 65080602
6031 65080602 64614012 63333874 61757827 60031076 60503121 59902511 60267089 59340278 58300101 58455859
6021 58455859 57029105 55172791 54640659 54274110 54389951 52891061 50803437 50037262 49282817 50149135
6011 50149135 48756341 49684803 47820466 44907353 44454115 44336423 43155768 44596469 44810455
6002 44810455 42445306 41742447 40813580 42423383 42768212 41184025 39497584 39715743 42435754 42860063
5992 42860063 40708211 38761391 39359812 39757241 39625329 39010296 40767879 40857208 42076437 40012268
5982 40012268 41898041 44129566 43340442 42896060 43030797 42885701 42680581 45092411 44164615 45727499
5972 45727499 46908458 46274323 46454890 46836449 47590491 49165381 48358360 48250694 50437916 48621998
$$ packed form
6041F9165967K067704k304617k26431o9655m00371k013788L78204r86198n13162j7051
6031F5080602m66590j280138j576047j726751M72045o00610L64578r26811j040177J55758
6021E8455859j426754j856314n32132l66549J15841j498890k087624p66175p54445Q66318
6011E0149135j392794R28462j864337k913113m53238j17692j180655J440701K13986
6002D4810455k365149p02859r28867J609803L44829j584187j686441K18159K720011M24309
5992D2860063k151852j946820N98421L97429j31912o15033J757583Q9329J219229k064169
5982D0012268J885773K231525p89124m44382J34737j45096k05120K411830r27796J562884
5972D5727499J180959o34135J80567L81559P54042J574890q07021j07666K187222j815918
$$ plain form
5962 48621998 50610019 51213079 53342323 52991927 53801773 53418443 54642274 54383860 53821101 54729131
5952 54729131 53929978 51965272 51450933 55149308 54668581 50926711 52192637 52356154 53014117 52890114
5942 52890114 50782509 50769006 50785667 49114121 48270684 47010913 46832024 46391484 43895096 41598793
5932 41598793 43510902 40280373 39649529 39044147 36325709 33305583 32361915 29936832 28583161
5923 28583161 28325081 24403542 22480694 19611323 17061835 16146821 12695904 9098969 8521211
5914 8521211 5920143 2725322 -38010 -3207631 -7609126 -9591552 -11523327 -16911773 -19162237
5905 -19162237 -21217718 -25379329 -27984085 -30329464 -34102910 -37820490 -40495579 -42894454 -45603612
5896 -45603612 -50419397 -53523393 -57305534 -60176771 -64589619 -66826049 -68215152 -69361606 -75344248
$$ packed form
5962D8621998J988021O03060K129244l50396Q09846l83330J223831k58414n62759R08030
5952E4729131p99153j964706n14339L698375m80727l741870J265926J63517O57963j24003
5942E2890114k107605j3503J6661j671546q43437j259771j78889m40540k496388k296303
5932D1598793J912109l230529o30844o05382k718438l020126r43668k425083j353671
5923B8583161k58080l921539j922848k869371k549488r15014l450917l596935n77758
5914H521211k601068l194821k763332l169621m401495j982426j931775n388446k250464
5905a9162237k055481m161611k604756k345379l773446l717580k675089k398875k709158
5896d5603612m815785l103996l782141k871237m412848k236430j389103j146454n982642
$$ plain form
5887 -75344248 -78002572 -79613075 -82406693 -86650025 -90123907 -92157760 -94446489 -97814691 -99689612
5878 -99689612 -100599928 -102437429 -104679403 -106068416 -108478410 -109505210 -110044694 -111778508 -113400800
5869 -113400800 -114976817 -114976677 -115511146 -117016764 -116592113 -116786679 -117732282 -119061858 -118089771 -117744342
5859 -117744342 -118171500 -116854112 -115771659 -112664287 -113355498 -111252668 -110910765 -109069305 -106025130
5850 -106025130 -104120282 -102343256 -99297187 -96338708 -93242006 -90608428 -87946304 -84646086 -80440293
5841 -80440293 -78378905 -73312279 -69560469 -65607941 -60875253 -55893138 -51530224 -47360130 -42401741
5832 -42401741 -36292153 -31065405 -25671846 -21701019 -15445768 -9817750 -3276804 3582573 8346479
5823 8346479 15103571 20879016 27954264 34194746 38698190 45931133 52462565 59106875 67066746
$$ packed form
5887g5344248k658324j610503k793618m243332l473882k033853k288729l368202j874921
5878i9689612r10316j837501k241974j389013k409994j026800n39484j733814j622292
5869a13400800j576017J40n34469j505618M24651j94566r45603j329576R72087L45429
5859a17744342m27158J317388J082453L107372o91211K102830L41903J841460L044175
5850a06025130J904848J777026L046069K958479L096702K633578K662124L300218M205793
5841h0440293K061388N066626L751810L952528M732688M982115M362914M170094M958389
5832d2401741O109588N226748N393559L970827O255251N628018O540946O859377M763906
5823H346479O757092N775445P075248O240482M503444P232943O531432O644310P959871
$$ plain form
5814 67066746 72202799 79179153 86171274 93286253 99316569 107817686 114778755 120077448 126983861
5805 126983861 132476016 141258248 146629730 154151359 157724756 164542691 171229655 177778151 182988649
5796 182988649 189569396 194758857 201303400 207809778 213539843 217784225 223291138 228944674 234668939
5787 234668939 241241969 244011671 249277634 252549168 257497821 262478149 265132134 266576062 271128310
5778 271128310 275406771 277678514 280190520 284712599 286661505 288871922 290268871 292629547 294314670
5769 294314670 293637057 293610075 294767728 295383272 293585262 294645295 295779852 293805460 294006741
5760 294006741 291183352 290122317 289163413 287100597 284758384 282740980 278870372 276278199 272007592
5751 272007592 268239979 264014295 262504580 258195507 253257098 250561117 245829269 239568530 233495630
$$ packed form
5814F7066746N136053O976354O992121P114979O030316Q501117O961069N298693O906413
5805A26983861N492155Q782232N371482P521629L573397O817935O686964O548496N210498
5796A82988649O580747N189461O544543O506378N730065M244382N506913N653536N724265
5787B34668939O573030K769702N265963L271534M948653M980328K653985J443928M552248
5778B71128310M278461K271743K512006M522079J948906K210417J396949K360676J685123
5769B94314670o77613k6982J157653O15544j798010J060033J134557j974392K01281
5760B94006741k823389j061035r58904k062816k342213k017404l870608k592173m270607
5751B72007592l767613m225684j509715m309073m938409k695981m731848o260739o072900
$$ plain form
5742 233495630 228799338 223258166 216267319 210883526 205655339 197226032 192228252 185252819 176971395
5733 176971395 171617346 164696493 157612061 149643187 141010548 133332480 126080756 117024109 109061568
5724 109061568 101363883 93640081 85741110 76235641 67634609 59739190 51568746 42911745 34528979
5715 34528979 24425134 17057905 8193337 -427484 -8604708 -17981689 -26849428 -36120618 -44291029
5706 -44291029 -52448924 -62548149 -71721032 -79237766 -88388902 -95205430 -105022164 -111365859 -119938996
5697 -119938996 -128584059 -136311299 -143193741 -150773281 -157152201 -165752496 -172509794 -179502488 -186975592
5688 -186975592 -193617204 -200055091 -207374397 -213680163 -220033000 -225679400 -231065554 -235651670 -241827661
5679 -241827661 -250684973 -254366643 -258977821 -263069332 -267911629 -272063187 -275165205 -282482068 -286041985
$$ packed form
5742B33495630m696292n541172o990847n383793n228187q429307m997780o975433q281424
5733A76971395n354049o920853p084432p968874q632639p678068p251724r056647p962541
5724A09061568p697685p723802p898971r505469q601032p895419q170444q657001q382766
5715C4528979j0103845p367229q864568q620821q177224r376981q867739r271190q170411
5706d4291029q157895j0099225r172883p516734r151136o816528r816734o343695q573137
5697a19938996q645063p727240o882442p579540o378920q600295o757298o992694p473104
5688a86975592o641612o437887p319306o305766o352837n646400n386154m586116o175991
5679b41827661q857312l681670m611178m091511m842297m151558l102018p316863l559917
$$ plain form
5670 -286041985 -287786273 -291070202 -294484935 -298575268 -300220235 -304603265 -306240921 -308576103 -311196669
5661 -311196669 -312944148 -315203759 -316182622 -318866394 -321533136 -320792323 -320247604 -321548807 -321809518
5652 -321809518 -321454084 -321442373 -319744158 -319523476 -319247353 -318274505 -316730068 -314561380 -315765872 -314390196
5642 -314390196 -312402758 -307860340 -306665921 -304475481 -300158156 -297981453 -294105052 -290676493 -287814495
5633 -287814495 -284532728 -280224510 -275916906 -272085344 -267061096 -261737260 -258153797 -252770423 -248605877
5624 -248605877 -242394346 -236877409 -232560388 -226487228 -220110946 -212544431 -204853896 -198174380 -189977361
5615 -189977361 -184472160 -179132105 -172953197 -163573237 -156346291 -147843477 -139986546 -131682742 -123117927
5606 -123117927 -114288515 -105234438 -97079820 -87994989 -78850387 -69038327 -58881451 -49199627
$$ packed form
5670b86041985j744288l283929l414733m090333j644967m383030j637656k335182k620566
5661c11196669j747479k259611r78863k683772k666742P40813N44719j301203k60711
5652c21809518L55434J1711J698215K20682K76123R72848J544437K168688j204492J375676
5642c14390196J987438M542418J194419K190440M317325K176703L876401L428559K861998
5633b87814495L281767M308218M307604L831562N024248N323836L583463N383374M164546
5624b48605877O211531N516937M317021O073160O376282P566515P690535O679516Q197019
5615a89977361N505201N340055O178908R379960P226946Q502814P856931Q303804Q564815
5606a23117927Q829412R054077Q154618R084831R144602R812060J0156876R681824
$$ plain form
5598 -49199627 -37522169 -27145496 -18266222 -7161155 5468790 15836452 26626009 37113650
5590 37113650 49079422 62861853 74338674 88057678 100332814 111143692 124699578 137238810
5582 137238810 150581519 165131274 178801844 191278739 205359186 219492905 234167335 249414549
5574 249414549 263257223 279571358 293616666 312123848 328751682 344572826 359328939 375707469
5566 375707469 393855032 410782264 427138356 443936110 461665388 478620006 497535598 515733580
5558 515733580 533227933 550834234 570333207 589572899 608454910 628195348 647343524 665854025
5550 665854025 687044459 706872904 726272198 746244842 765919248 786102047 805988678 829329783
5542 829329783 846675602 867056751 887401733 909316621 931053915 952263663 971972046 994961641
$$ packed form
5598d9199627J1677458J0376673Q879274J1105067J2629945J0367662J0789557J0487641
5590C7113650J1965772J3782431J1476821J3719004J2275136J0810878J3555886J2539232
5582A37238810J3342709J4549755J3670570J2476895J4080447J4133719J4674430J5247214
5574B49414549J3842674J6314135J4045308J8507182J6627834J5821144J4756113J6378530
5566C75707469J8147563J6927232J6356092J6797754J7729278J6954618J8915592J8197982
5558E15733580J7494353J7606301J9498973J9239692J8882011J9740438J9148176J8510501
5550F65854025K1190434J9828445J9399294J9972644J9674406K0182799J9886631K3341105
5542H29329783J7345819K0381149K0344982K1914888K1737294K1209748J9708383K2989595
$$ plain form
5534 994961641 1016430579 1037694702 1060426801 1081158903 1103423529 1124789027 1148227229 1169506990
5526 1169506990 1189247996 1211378034 1232915412 1255688601 1276775729 1297976463 1318696219
5519 1318696219 1340598681 1361638507 1383860969 1404380541 1426382944 1447154191 1467665982
5512 1467665982 1489113306 1508821729 1529132011 1548777211 1568252530 1588312271 1610241086
5505 1610241086 1628341469 1646326298 1664390830 1684839527 1703244096 1719148663 1737885653
5498 1737885653 1756750707 1773224955 1790823103 1808456980 1823717251 1840323938 1855501303
5491 1855501303 1871446247 1887161604 1902001975 1916846312 1930368836 1941483741 1957108999 1966740643
5483 1966740643 1980461568 1991069099 2003944267 2014756908 2023272358 2035623650 2043884971 2052111146
$$ packed form
5534I94961641K1468938K1264123K2732099K0732102K2264626K1365498K3438202K1279761
5526A169506990J9741006K2130038K1537378K2773189K1087128K1200734K0719756
5519A318696219K1902462K1039826K2222462K0519572K2002403K0771247K0511791
5512A467665982K1447324J9708423K0310282J9645200J9475319K0059741K1928815
5505A610241086J8100383J7984829J8064532K0448697J8404569J5904567J8736990
5498A737885653J8865054J6474248J7598148J7633877J5260271J6606687J5177365
5491A855501303J5944944J5715357J4840371J4844337J3522524J1114905J5625258R631644
5483A966740643J3720925J0607531J2875168J0812641Q515450J2351292Q261321Q226175
$$ plain form
5475 2052111146 2059858585 2069639390 2077786944 2083592879 2089961172 2092958127 2100380585 2107210530 2111575689
5466 2111575689 2115224882 2117503260 2114665266 2117580167 2129895332 2147483647 2143556049 2134527951
5458 2134527951 2134222091 2136463538 2135922117 2131544734 2129770933 2127747504 2122235120 2118646563 2114100232
5449 2114100232 2111419841 2106064110 2099218257 2091923915 2086787790 2079930884 2071910359 2061931673 2054400464
5440 2054400464 2044976974 2033359348 2023481875 2014492116 2004181155 1991304926 1980502490 1969173474
5432 1969173474 1957069969 1942306050 1930036418 1916683137 1903970818 1889050259 1872251412
5425 1872251412 1857628447 1844303434 1826834501 1808762350 1794325541 1778028797 1761426223
5418 1761426223 1747244994 1726980030 1710181470 1690995958 1673197622 1655467898 1635245334
$$ packed form
5475B052111146P747439R780805Q147554N805935O368293K996955P422458O829945M365159
5466B111575689L649193K278378k837994K914901J2315165J7588315l927598r028098
5458B134527951l05860K241447n41421m377383j773801k023429n512384l588557m546331
5449B114100232k680391n355731o845853p294342n136125o856906q020525r978686p531209
5440B054400464r423490j1617626r877473q989759j0310961j2876229j0802436j1329016
5432A969173474j2103505j4763919j2269632j3353281j2712319j4920559j6798847
5425A872251412j4622965j3325013j7468933j8072151j4436809j6296744j6602574
5418A761426223j4181229k0264964j6798560j9185512j7798336j7729724k0222564
$$ plain form
5411 1635245334 1617920356 1599223125 1577558167 1559222095 1541880058 1520660361 1500309803
5404 1500309803 1480609769 1460992335 1439463502 1419066596 1400818668 1380274198 1358005683
5397 1358005683 1338515383 1317666101 1297007157 1276407858 1257339295 1235352749 1213417868
5390 1213417868 1192061610 1171998045 1151176793 1130487460 1108960604 1089252654 1066058053
5383 1066058053 1046798143 1027998073 1007537646 985924767 966410755 947679031 924587518
5376 924587518 905869974 886894766 866364118 847223450 827946091 807460492 787272606 768672807
5368 768672807 748759318 728543468 711239839 692942855 675008132 658816750 640046045 621814936
5360 621814936 603627258 585028884 566643677 550762436 534289590 517351103 499822209 484131793
$$ packed form
5411A635245334j7324978j8697231k1664958j8336072j7342037k1219697k0350558
5404A500309803j9700034j9617434k1528833k0396906j8247928k0544470k2268515
5397A358005683j9490300k0849282k0658944k0599299j9068563k1986546k1934881
5390A213417868k1356258k0063565k0821252k0689333k1526856j9707950k3194601
5383A066058053j9259910j8800070k0460427k1612879j9514012j8731724k3091513
5376I24587518j8717544j8975208k0530648j9140668j9277359k0485599k0187886j8599799
5368G68672807j9913489k0215850j7303629j8296984j7934723j6191382j8770705j8231109
5360F21814936j8187678j8598374j8385207j5881241j6472846j6938487j7528894j5690416
$$ plain form
5352 484131793 467202379 451141911 436515906 419248588 402949533 386567048 371653188 358840331
5344 358840331 344529234 328508447 314735398 298881109 284037844 271482641 257471010 243349768
5336 243349768 230993345 217810040 204614212 191671367 178819484 166609251 154229861 140665390
5328 140665390 130736499 119462852 107001614 94090928 83265704 72534006 61756323 52981248
5320 52981248 40939775 30986933 21636151 10520827 2156646 -8181145 -17553239 -26884539
5312 -26884539 -36868295 -44292428 -53432523 -63991000 -72476119 -79400489 -86460891 -94974990 -102988954
5303 -102988954 -109623292 -117619916 -124339205 -129884256 -137626911 -144413429 -152362993 -159020405 -163911359
5294 -163911359 -170999060 -175620791 -180384560 -186838818 -189096352 -194344821 -201254719 -206456417 -210164081
$$ packed form
5352D84131793j6929414j6060468j4626005j7267318j6299055j6382485j4913860j2812857
5344C58840331j4311097j6020787j3773049j5854289j4843265j2555203j4011631j4121242
5336B43349768j2356423j3183305j3195828j2942845j2851883j2210233j2379390j3564471
5328A40665390r928891j1273647j2461238j2910686j0825224j0731698j0777683q775075
5320E2981248j2041473r952842r350782j1115324q364181j0337791r372094r331300
5312b6884539r983756p424133r140095j0558477q485119o924370p060402q514099q013964
5303a02988954o634338p996624o719289n545051p742655o786518p949564o657412m890954
5294a63911359p087701m621731m763769o454258k257534n248469o909898n201698l707664
$$ plain form
5285 -210164081 -213537566 -218724177 -222039601 -225722451 -228645502 -232182299 -234378496 -238972682 -241953510
5276 -241953510 -244344100 -244926259 -246744388 -248940538 -251234516 -253756589 -253994345 -255036619 -256598214
5267 -256598214 -255898702 -257496252 -256554287 -258148126 -257534537 -257084505 -255442080 -254116203 -253014687
5258 -253014687 -251497998 -250621997 -248241934 -247089393 -244576154 -242392892 -240129219 -237675913 -232360249
5249 -232360249 -229538793 -228016072 -223333185 -220677224 -216122397 -213873079 -206066442 -201424487 -196748847
5240 -196748847 -191635736 -187557899 -182061354 -176733328 -170176050 -164992261 -158639103 -151192624 -146201671
5231 -146201671 -138709226 -132278315 -127360578 -120708529 -112588751 -105330417 -98232295 -91631341 -82462012
5222 -82462012 -75355804 -67820983 -59996473 -52564224 -43574969 -35056607 -26817611 -18677728 -10422324
$$ packed form
5285b10164081l373485n186611l315424l682850k923051l536797k196197m594186k980828
5276b41953510k390590n82159j818129k196150k293978k522073k37756j042274j561595
5267b56598214O99512j597550R41965j593839O13589M50032J642425J325877J101516
5258b53014687J516689Q76001K380063J152541K513239K183262K263673K453306N315664
5249b32360249K821456J522721M682887K655961M554827K249318P806637M641955M675640
5240a96748847N113111M077837N496545N328026O557278N183789O353158P446479M990953
5231a46201671P492445O430911M917737O652049Q119778P258334P098122O600954R169329
5222h2462012P106208P534821P824510P432249Q989255Q518362Q238996Q139883Q255404
$$ plain form
5213 -10422324 -2790119 5788444 12525618 21639298 31378185 40408236 47290022 55138788 63115413
5204 63115413 72884322 81798319 90652089 98050728 107188136 116088027 123216393 130748470 139710266
5195 139710266 144980229 152415669 160662928 169252942 176593948 183808262 190726054 199483550 206256197
5186 206256197 214010937 219337831 224881624 232136040 238309140 242914962 248845326 255348554 260845690
5177 260845690 265572591 271807539 275096668 279985919 285194415 288576279 293128029 296529215 300394176
5168 300394176 303530672 306253585 308676021 312111890 314682436 316099201 317854982 319660934 320100386
5159 320100386 322180476 322659979 323456638 325237038 324531118 323835595 321830049 322417976 322195040 321079437
5149 321079437 318692222 318963757 316868350 314452981 313326655 309477859 306664699 303608128 300649094
$$ packed form
5213a0422324P632205Q578563O737174R113680R738887R030051O881786P848766P976625
5204F3115413R768909Q913997Q853770P398639R137408Q899891P128366P532077Q961796
5195A39710266N269963P435440Q247259Q590014P341006P214314O917792Q757496O772647
5186B06256197P754740N326894N543793P254416O173100M605822N930364O503228N497136
5177B60845690M726901O234948L289129M889251N208496L381864M551750L401186L864961
5168C00394176L136496K722913K422436L435869K570546J416765J755781J805952M39452
5159C20100386K080090M79503P96659J780400p05920o95523k005546N87927k22936j115603
5149C21079437k387215K71535k095407k415369j126326l848796k813160l056571k959034
$$ plain form
5140 300649094 297645567 294192464 289120357 286201580 281078616 277482821 273129270 269687367 264812001
5131 264812001 260729109 254770659 250217254 244394800 238335694 233211337 225919371 221173760 214413503
5122 214413503 208385202 202774523 197745523 191061684 183540266 177771895 170820617 163126674 157100676
5113 157100676 149751709 145578342 138574988 130142269 125075315 118715748 112290596 105092653 98641944
5104 98641944 90503017 84674895 78560822 71441246 65386314 59188855 54713764 45886016 41394646
5095 41394646 35702791 30506839 24883645 18065817 11106084 6879340 739656 -2774513 -6382607
5086 -6382607 -13508220 -17786998 -22207816 -26461286 -31614236 -36354625 -39150423 -42418804 -46394198
5077 -46394198 -48171159 -52076647 -56363315 -60014819 -63164092 -65046245 -68406006 -70194813 -72409031
$$ packed form
5140C00649094l003527l453103n072107k918777n122964l595795m353551l441903m875366
5131B64812001m082892n958450m553405n822454o059106n124357p291966m745611o760257
5122B14413503o028301n610679n029000o683839p521418n768371o951278p693943o025998
5113A57100676p348967m173367p003354q432719n066954o359567o425152p197943o450709
5104I8641944q138927n828122o114073p119576o054932o197459m475091q827748m491370
5095D1394646n691855n195952n623194o817828o959733m226744o139684l514169l608094
5086f382607p125613m278778m420818m253470n152950m740389k795798l268381l975394
5077d6394198j776961l905488m286668l651504l149273j882153l359761j788807k214218
$$ plain form
5068 -72409031 -72864558 -73985889 -76108754 -77072401 -78932891 -80951440 -80853163 -82496748 -83161296 -82148983
5058 -82148983 -82472254 -82220391 -82035596 -83418095 -82739089 -81817788 -81170120 -78945710 -78625495 -76575652
5048 -76575652 -74657374 -74771443 -74009987 -72210153 -68842014 -68645518 -67984175 -65220607 -61870343
5039 -61870343 -60210368 -57134122 -54839237 -52728980 -49777302 -47530124 -44002783 -41220562 -39907388
5030 -39907388 -37552180 -34152810 -29922449 -26654383 -20781029 -21273394 -18063498 -16652448 -13840302
5021 -13840302 -10736288 -7421923 -5332258 -1674233 2493617 5363143 8142175 9638902 13077319
5012 13077319 15490277 18890416 20720256 23980851 26561699 29513021 31686373 34387727 35711154
5003 35711154 40059489 41347471 44327730 45628443 48871443 50407560 52765100 54824544 56800103
$$ packed form
5068g2409031m55527j121331k122865r63647j860490k018549R8277j643585o64548J012313
5058h2148983l23271K51863J84795j382499O79006R21301O47668K224410L20215K049843
5048g6575652J918278j14069P61456J799834L368139J96496O61343K763568L350264
5039f1870343J659975L076246K294885K110257K951678K247178L527341K782221J313174
5030c9907388K355208L399370M230361L268066N873354m92365L209896J411050K812146
5021a3840302L104014L314365K089665L658025M167850K869526K779032J496727L438417
5012A3077319K412958L400139J829840L260595K580848K951322K173352K701354J323427
5003C5711154M348335J287982K980259J300713L243000J536117K357540K059444J975559
$$ plain form
4994 56800103 56057472 59389294 59739916 62809557 62953650 64095558 65532500 67574671 68496853 69145798
4984 69145798 70496541 69616220 70806555 71050042 72044667 74335403 74429759 73799726 72949253 72453240
4974 72453240 74136209 73467534 73860240 74868228 75673711 74860955 73629966 73951032 72421694 74196015
4964 74196015 73887684 73718346 73066664 72488413 71285754 72044811 71424848 71786257 70008652 70154212
4954 70154212 69678680 70205914 69948238 67991994 67713157 66991106 66920399 66854277 66641627 66743323
4944 66743323 65716851 65193510 63524858 63825132 63665620 63972841 63104233 64638794 63505591 65010807
4934 65010807 64604806 63882797 63305187 62513397 63221777 62533809 62754062 63460503 64339799 65659465
4924 65659465 63898723 65640583 65466038 66452161 65996403 66348417 65729151 67678213 68973533 69031473
$$ packed form
4994E6800103p42631L331822L50622L069641J44093J141908J436942K042171R22182O48945
4984F9145798J350743q80321J190335K43487R94625K290736R4356o30033q50473m96013
4974G2453240J682969o68675L92706J007988Q05483q12756j230989L21066j529338J774321
4964G4196015l08331j69338o51682n78251j202659P59057o19963L61409j777605J45560
4954G0154212m75532N27234k57676j956244k78837p22051p0707o6122k12650J01696
4944F6743323j026472n23341j668652L00274j59512L07221q68608J534561j133203J505216
4934F5010807m06001p22009n77610p91790P08380o87968K20253P06441Q79296J319666
4924F5659465j760742J741860j74545R86123m55758L52014o19266J949062J295320N7940
$$ plain form
4914 69031473 69106093 69159783 71180824 70068405 71817032 73574020 73703052 74984547 76230542 78362428
4904 78362428 77712231 79657987 81555546 81149577 81436706 82637264 84751624 84941052 84475937 84312539
4894 84312539 86204948 89492087 90039353 90108409 92178777 91778833 91523832 93684037 93358468 94232992
4884 94232992 93050356 95105029 95407753 94480336 95260095 96792059 97040737 96279330 96428786 96913673
4874 96913673 96575673 94282560 94707249 94437362 93479972 94299050 93839137 93429533 91548268 89679557
4864 89679557 89530551 87392685 87144875 85810994 84165335 83018899 81489080 79369136 76927920
4855 76927920 72779860 72304890 70832222 67889112 65838207 63906906 60527493 57730747 56481130
4846 56481130 53135464 50078858 47479947 44271593 39315433 38154780 34274413 32237520 28781056
$$ packed form
4914F9031473P4620N3690K021041j112419J748627J756988J29032J281495J245995K131886
4904G8362428o50197J945756J897559m05969K87129J200558K114360J89428m65115j63398
4894H4312539J892409L287139N47266O9056K070368l99944k55001K160205l25569Q74524
4884I4232992j182636K054673L02724r27417P79759J531964K48678p61407J49456M84887
4874I6913673l38000k293113M24689k69887r57390Q19078m59913m09604j881265j868711
4864H9679557j49006k137866k47810j333881j645659j146436j529819k119944k441216
4855G6927920m148060m74970j472668k943110k050905j931301l379413k796746j249617
4846E6481130l345666l056606k598911l208354m956160j160653l880367k036893l456464
$$ plain form
4837 28781056 23956774 21092908 16027260 13794232 7167053 5462439 2570328 -3232173 -6332087
4828 -6332087 -10553977 -15672849 -17691872 -21472078 -24239929 -28536435 -33352365 -37673179 -42543828
4819 -42543828 -47243241 -49922233 -55202752 -57914175 -62788868 -66699551 -70224517 -74542553 -77294647
4810 -77294647 -81134446 -83848835 -93339808 -93206988 -96324341 -99307947 -100566427 -105450398 -108845428
4801 -108845428 -111372552 -114115964 -116198949 -119131956 -121655938 -123517230 -126310441 -128472261 -131687542
4792 -131687542 -133278939 -133385948 -135904692 -137324932 -138081504 -139054978 -140181302 -139804779 -141111200
4783 -141111200 -142303670 -141745986 -141838480 -140953897 -141733798 -143050567 -141740439 -140663150 -140795239 -138337235
4773 -138337235 -137161423 -135556353 -134533825 -132376798 -129550824 -125361460 -124220321 -122410034 -119404166
$$ packed form
4837B8781056m824282k863866n065648k233028o627179j704614k892111n802501l099914
4828f332087m221890n118872k019023l780206k767851m296506m815930m320814m870649
4819d2543828m699413k678992n280519k711423m874693l910683l524966m318036k752094
4810g7294647l839799k714389r490973J32820l117353k983606j258480m883971l395030
4801a08845428k527124k743412k082985k933007k523982j861292k793211k161820l215281
4792a31687542j591397j07009k518744j420240p56572r73474j126324L76523j306421
4783a41111200j192470N57684r2494Q84583p79901j316769J310128J077289j32089K458004
4773a38337235J175812J605070J022528K157027K825974M189364J141139J810287L005868
$$ plain form
4764 -119404166 -118586542 -115810198 -112506749 -108945732 -104325826 -102907631 -99469788 -96887675 -92723425
4755 -92723425 -89801968 -85547967 -81243650 -75754006 -71310764 -68706248 -64992352 -60398217 -54681976
4746 -54681976 -50723118 -45701315 -40214065 -35236864 -31937748 -27003229 -20452232 -16380351 -10760442
4737 -10760442 -5971339 -1619122 4070412 10614683 13620070 19007046 23030882 27979927 33722168
4728 33722168 38434516 42828816 47598033 52486732 57225694 62047583 66923128 72584965 75293449
4719 75293449 78911153 83402873 87389211 92306179 95286933 99290178 103641833 107501101 111480300
4710 111480300 114226474 116611372 119972058 122456459 125907169 128118849 130604161 131818841 135098352
4701 135098352 135738144 139736398 140698456 141141528 141381007 142945732 144185616 144817490 144940112 143732812
$$ packed form
4764a19404166Q17624K776344L303449L561017M619906J418195L437843K582113M164250
4755i2723425K921457M254001M304317N489644M443242K604516L713896M594135N716241
4746e4681976L958858N021803N487250M977201L299116M934519O550997M071881N619909
4737a0760442M789103M352217N689534O544271L005387N386976M023836M949045N742241
4728C3722168M712348M394300M769217M888699M738962M821889M875545N661837K708484
4719G5293449L617704M491720L986338M916968K980754M003245M351655L859268L979199
4710A11480300K746174K384898L360686K484401L450710K211680K485312J214680L279511
4701A35098352O39792L998254R62058M43072K39479J564725J239884O31874J22622j207300
$$ plain form
4691 143732812 145596781 145982707 147336259 146185226 144997183 145237861 142794901 143174746 142084101
4682 142084101 140332869 140569167 139475384 137038715 136641019 133589807 131308519 128347028 125476133
4673 125476133 123354741 121427516 117483238 115068773 113602923 110094990 105463394 102533655 100072776
4664 100072776 94883441 92266014 89230416 84847706 79425993 75323994 71776248 68954753 64539226
4655 64539226 61513425 57135535 52935282 48476103 43061727 39845051 35589605 31415362 27752207
4646 27752207 23621719 19708417 15051824 10828083 6692904 3950194 -2187858 -6556090 -9931442
4637 -9931442 -14628719 -16665641 -19748723 -23533863 -27979337 -33358172 -38032211 -40613634 -43044529
4628 -43044529 -46174999 -48892942 -52553185 -54475317 -57477923 -60345195 -62866661 -66312587 -69441631
$$ packed form
4691A43732812J863969L85926J353552j151033j188043K40678k442960L79845j090645
4682A42084101j751232K36298j093783k436669l97696l051212k281288k961491k870895
4673A25476133k121392j927225l944278k414465j465850l507933m631596k929739k460879
4664A00072776n189335k617427l035598m382710n421713m101999l547746k821495m415527
4655F4539226l025801m377890m200253m459179n414376l216676m255446m174243l663155
4646B7752207m130488l913302m656593m223741m135179k742710o138052m368232l375352
4637i931442m697277k036922l083082l785140m445474n378835m674039k581423k430895
4628d3044529l130470k717943l660243j922132l002606k867272k521466l445926l129044
$$ plain form
4619 -69441631 -71295692 -74147753 -76834251 -79247494 -80103478 -80010725 -82973744 -85725161 -88136453
4610 -88136453 -88568279 -91379487 -90115326 -91325597 -92080841 -93984809 -94798548 -94133578 -96353144 -96309579
4600 -96309579 -96185421 -96500313 -95818842 -94431390 -95756548 -94930479 -94825963 -94834415 -94480765 -95017611
4590 -95017611 -93093115 -92043540 -90948667 -90964689 -88872970 -88855936 -87955321 -86944548 -84295642 -83198146
4580 -83198146 -82756022 -81336868 -80430109 -79513541 -76283105 -74809812 -73997514 -74187905 -71054120 -68778413
4570 -68778413 -67840386 -66612299 -65369533 -63863786 -61593779 -60769401 -58665484 -56972004 -53834789
4561 -53834789 -52753237 -53107697 -52131852 -49594750 -47359011 -46278614 -44951315 -44160730 -42043205
4552 -42043205 -40090262 -40142495 -38954788 -38177274 -36824460 -36096176 -35588066 -35379216 -32862474 -32525008
$$ packed form
4619f9441631j854061k852061k686498k413243q55984R2753k963019k751417k411292
4610h8136453m31826k811208J264161j210271p55244j903968q13739O64970k219566M3565
4600i6309579J24158l14892O81471J387452j325158Q26069J04516q452L53650n36846
4590i5017611J924496J049575J094873j6022K091719J7034R00615J010773K648906J097496
4580h3198146M42124J419154R06759R16568L230436J473293Q12298j90391L133785K275707
4570f8778413R38027J228087J242766J505747K270007Q24378K103917J693480L137215
4561e3834789J081552l54460R75845K537102K235739J080397J327299P90585K117525
4552d2043205J952943n2233J187707P77514J352814P28284N08110K08850K516742L37466
$$ plain form
4542 -32525008 -30980725 -32314876 -31445128 -31413777 -31715317 -30285303 -29132841 -28719661 -29517108 -29562671
4532 -29562671 -28642399 -28641676 -28929520 -27547983 -28375669 -27893858 -29078689 -29729099 -29779679 -29342001 -29956424
4521 -29956424 -30315707 -29743874 -30814254 -31315987 -31887924 -32669714 -34292667 -33032191 -35014606 -36296544
4511 -36296544 -35041373 -33582488 -34523574 -34482492 -35783647 -35730399 -36835033 -37516941 -37630212 -37983491
4501 -37983491 -37391426 -37600051 -37320686 -37595049 -39165253 -39951276 -39592175 -40602566 -40438702 -39485443
4491 -39485443 -39431374 -38156622 -38059719 -38761121 -38030790 -38230956 -37752365 -36595772 -35825795 -34172990
4481 -34172990 -33082955 -33194418 -33305645 -31420920 -29803741 -28991585 -26307229 -25081337 -22681528
4472 -22681528 -19816205 -17756975 -18958280 -17704625 -14637604 -13320862 -11214124 -8772159 -6191561
$$ packed form
4542c2525008J544283j334151Q69748L1351l01540J430014J152462M13180p97447m5563
4532b9562671R20272P23k87844J381537q27686M81811j184831o50410n0580M37678o14423
4521b9956424l59283N71833j070380n01733n71937p81790j622953J260476j982415j281938
4511c6296544J255171J458885r41086M1082j301155N3248j104634o81908j13271l53279
4501c7983491N92065k08625K79365k74363j570204p86023L59101j010391J63864R53259
4491c9485443N4069J274752R6903p01402P30331k00166M78591J156593P69977J652805
4481c4172990J090035j11463j11227J884725J617179Q12156K684356J225892K399809
4472b2681528K865323K059230j201305J253655L067021J316742K106738K441965K580598
$$ plain form
4463 -6191561 -3698162 -1675575 1251280 3418309 7117609 10302745 11500841 14628345 18925251
4454 18925251 19754017 22401709 26404078 29856038 33142096 34752281 38653720 41913489 45603300
4445 45603300 47735745 50748228 54608838 57855460 61989273 65819838 68037200 72157644 73686260
4436 73686260 77314118 82960216 85068044 88311211 91784450 92809372 97241346 98969988 102798496
4427 102798496 104941352 108399001 110158481 111369849 113302996 116864949 119439785 123714411 125023698
4418 125023698 128371790 129501129 130668464 133267849 135596566 137248338 138229605 139547366 139940293
4409 139940293 139952877 142727399 142428251 145388701 144199481 144729193 144497226 144073596 145123593 144310172
4399 144310172 142525578 143125007 141548989 140379893 138661743 137716187 136910999 133223795 131357951
$$ packed form
4463f191561K493399K022587K926855K167029L699300L185136J198096L127504M296906
4454A8925251Q28766K647692M002369L451960L286058J610185L901439L259769L689811
4445D5603300K132445L012483L860610L246622M133813L830565K217362M120444J528616
4436G3686260L627858N646098K107828L243167L473239J024922M431974J728642L828508
4427A02798496K142856L457649J759480J211368J933147L561953K574836M274626J309287
4418A25023698L348092J129339J167335K599385K328717J651772R81267J317761L92927
4409A39940293J2584K774522k99148K960450j189220N29712k31967m23630J049997q13421
4399A44310172j784594N99429j576018j169096j718150r45556q05188l687204j865844
$$ plain form
4390 131357951 130998839 129842805 129428350 125121375 122980451 119807547 119272353 115677629 112718307
4381 112718307 110032631 106092761 102142295 98546542 95321535 90594397 87044777 84105365 79866169
4372 79866169 75904798 68933156 64898590 60181510 56033800 52657954 47859053 41312037 36614650
4363 36614650 32916700 27105284 23148396 17864647 12126634 7621600 2343269 -3822032 -9363257
4354 -9363257 -15275583 -18851313 -26030231 -30473795 -35643716 -39696299 -44177826 -50275221 -53443495
4345 -53443495 -59554811 -64318065 -69658589 -73703915 -78697806 -84008673 -89167293 -90916933 -97054018
4336 -97054018 -100550345 -105393492 -109399755 -112593018 -118671639 -123175491 -125105575 -126752343 -132810193
4327 -132810193 -135161212 -137752415 -142148276 -143381018 -146619333 -149717787 -151474767 -154696863 -154438452
$$ packed form
4390A31357951l59112j156034m14455m306975k140924l172904n35194l594724k959322
4381A12718307k685676l939870l950466l595753l225007m727138l549620k939412m239196
4372G9866169l961371o971642m034566m717080m147710l375846m798901o547016m697387
4363C6614650l697950n811416l956888n283749n738013m505034n278331o165301n541225
4354i363257n912326l575730p178918m443564n169921m052583m481527o097395l168274
4345e3443495o111316m763254n340524m045326m993891n310867n158620j749640o137085
4336i7054018l496327m843147m006263l193263o078621m503852j930084j646768o057850
4327a32810193k351019k591203m395861j232742l238315l098454j756980l222096K58411
$$ plain form
4318 -154438452 -156615546 -158480673 -161194337 -163164984 -163677969 -164905992 -164345442 -165092215 -164451045
4309 -164451045 -166155114 -167902342 -166391428 -166315394 -165402638 -166122491 -165194988 -164598220 -163974216 -162179260
4299 -162179260 -161078206 -160037847 -159678964 -157384544 -152639453 -152685807 -151756412 -148704483 -145632778
4290 -145632778 -142468942 -142286406 -138252572 -135882734 -133015194 -129329977 -124714661 -120286054 -117133328
4281 -117133328 -113410304 -110102608 -107877768 -103262842 -100899579 -96452049 -91135495 -87250966 -82744163
4272 -82744163 -77960917 -72773021 -70959319 -65842166 -60644343 -56377669 -51690691 -47868118 -43901531
4263 -43901531 -38989852 -35268775 -31521003 -26023606 -21072980 -17621524 -11153754 -8063467 -3088957
4254 -3088957 -716358 4564648 9649693 12417034 15778500 22108832 27270629 30169755 34952221
$$ packed form
4318a54438452k177094j865127k713664j970647n12985j228023N60550p46773O41170
4309a64451045j704069j747228J510914P6034R12756p19853R27503N96768O24004J794956
4299a62179260J101054J040359L58883K294420M745091m6354R29395L051929L071705
4290a45632778L163836J82536M033834K369838K867540L685217M615316M428607L152726
4281a17133328L723024L307696K224840M614926K363263M447530N316554L884529M506803
4272h2744163M783246N187896J813702N117153N197823M266674M686978L822573L966587
4263d3901531M911679L721077L747772N497397M950626L451456O467770L090287M974510
4254c088957K372599N281006N085045K767341L361466O330332N161797K899126M782466
$$ plain form
4245 34952221 36906174 39524889 43181117 47232287 50523306 54094619 57282048 60248226 62147830
4236 62147830 67076906 69040966 73955621 76924946 77677122 79722226 81697710 85417822 87186786
4227 87186786 89740663 90432340 91997980 94979509 95990736 98468857 100408864 102391658 104173949
4218 104173949 105191729 106194131 106353120 108196972 108033096 109098665 110616256 111880626 112302254
4209 112302254 111261664 112409495 113551108 114438592 114107450 113630696 116089685 115409474 114959810 115906153
4199 115906153 115922108 115945626 116620138 115907995 116234942 114679177 115766991 114735492 115728064 115244167
4189 115244167 113883356 114380063 114089411 115934792 117801928 116910574 116330396 116305794 114872155 115859741
4179 115859741 116359497 117176069 118606967 117070400 118772057 119661405 119530542 120497071 120237831 120530685
$$ packed form
4245C4952221J953953K618715L656228M051170L291019L571313L187429K966178J899604
4236F2147830M929076J964060M914655K969325P52176K045104J975484L720112J768964
4227H7186786K553877O91677J565640K981529J011227K478121J940007J982794J782291
4218A04173949J017780J002402J58989J843852j63876J065569J517591J264370M21628
4209A12302254j040590J147831J141613Q87484l31142m76754K458989o80211m49664R46343
4199A15906153J5955K3518O74512p12143L26947j555765J087814j031499R92572m83897
4189A15244167j360811M96707k90652J845381J867136q91354n80178k4602j433639R87586
4179A15859741M99756Q16572J430898j536567J701657Q89348j30863R66529k59240K92854
$$ plain form
4169 120530685 122301988 122372535 121297449 122999642 124039854 124470974 124811157 127943632 129878332
4160 129878332 130991939 129683139 132915087 133939933 133901684 136511612 139274387 141099758 142050340
4151 142050340 142971016 144787977 145804571 148936403 150343032 152129783 154195637 155826138 158012761
4142 158012761 161584382 161515605 164269346 165692124 169457359 170770396 174057839 176511602 178198412
4133 178198412 179955291 182331525 183460827 185716457 187489246 189412779 193882247 195697578 197114269
4124 197114269 197954104 201316785 202172340 205838756 208368159 209528900 211597702 214031708 214564755
4115 214564755 215794191 217794061 219768954 222033305 223364055 224079255 225633572 227030051 229342168
4106 229342168 228729521 228954368 229142321 229796389 230818907 231566107 233314587 233016830 233496519 233866925
$$ packed form
4169A20530685J771303P0547j075086J702193J040212M31120L40183L132475J934700
4160A29878332J113607j308800L231948J024846l8249K609928K762775J825371R50582
4151A42050340R20676J816961J016594L131832J406629J786751K065854J630501K186623
4142A58012761L571621o8777K753741J422778L765235J313037L287443K453763J686810
4133A78198412J756879K376234J129302K255630J772789J923533M469468J815331J416691
4124A97114269Q39835L362681Q55555L666416K529403J160741K068802K434006N33047
4115B14564755J229436J999870J974893K264351J330750P15200J554317J396479K312117
4106B29342168o12647K24847J87953O54068J022518P47200J748480k97757M79689L70406
$$ plain form
4096 233866925 232361991 231892392 231676645 230624348 231903189 230580380 229996042 227919789 227907442 226975529
4086 226975529 225097887 223560616 222830060 220013201 220027768 215732242 214855973 212669947 211556219
4077 211556219 208985907 206667362 206523178 202575901 198144065 194435619 192348802 191294806 187088837
4068 187088837 184771476 181398581 178023708 174307639 172573106 169011995 163262051 160618523 156234361
4059 156234361 153715442 151059688 147312172 142540429 139432689 134691948 132542444 127216275 123231435
4050 123231435 119001547 115565662 110478522 107854339 104437968 101484984 97373285 93194299 90484320
4041 90484320 86042804 83676497 80486551 75268357 72028155 68680772 66353416 63122877 59346574
4032 59346574 56152521 54429367 51851060 50185718 46882342 44489863 42014857 40216924 38238373
$$ packed form
4096B33866925j504934m69599k15747j052297J278841j322809n84338k076253j2347r31913
4086B26975529j877642j537271p30556k816859J4567m295526q76269k186026j113728
4077B11556219k570312k318545j44184l947277m431836l708446k086817j053996m205969
4068A87088837k317361l372895l374873l716069j734533l561111n749944k643528m384162
4059A56234361k518919k655754l747516m771743l107740m740741k149504n326169l984840
4050A23231435m229888l435885n087140k624183l416371k952984m111699m178986k709979
4041I0484320m441516k366307l189946n218194l240202l347383k327356l230539l776303
4032E9346574l194053j723154k578307j665342l303376k392479k475006j797933j978551
$$ plain form
4023 38238373 36230838 33820088 32865327 34793927 33905413 31685795 29298431 27955063 25923782
4014 25923782 24690536 23523784 23144833 24526499 25096012 23672382 22835655 23162239 23965276 24787309
4004 24787309 25228076 27726017 28600461 29296343 31517322 32931772 33872665 35780815 38784420
3995 38784420 40623846 40325107 42282557 45290372 48786591 51708490 54553427 56365286 61097661
3986 61097661 62996364 65436494 69300480 72592029 75214611 76994248 81851748 83892905 87994645
3977 87994645 93137333 96838057 99996682 103811960 108353405 110809940 115167402 117593726 123176836
3968 123176836 126287395 132314777 136646647 139970490 144066574 147160622 151701235 155417516 159871911
3959 159871911 163874887 167998534 171305844 175420955 176452187 180029908 183942207 188317322 190868934
$$ packed form
4023C8238373k007535k410750r54761J928600q88514k219618k387364j343368k031281
4014B5923782j233246j166752l78951J381666N69513j423630q36727L26584Q03037Q22033
4004B4787309M40767K497941Q74444O95882K220979J414450R40893J908150L003605
3995C8784420J839426k98739J957450L007815L496219K921899K844937J811859M732375
3986F1097661J898703K440130L863986L291549K622582J779637M857500K041157M101740
3977H7994645N142688L700724L158625L815278M541445K456535M357462K426324N583110
3968A23176836L110559O027382M331870L323843M096084L094048M540613L716281M454395
3959A59871911M002976M123647L307310M115111J031232L577721L912299M375115K551612
$$ plain form
3950 190868934 193732297 197894277 199284298 202238420 204224707 208407304 210283117 213268568 216636913
3941 216636913 218154030 219343187 221951839 223009978 225934859 230121778 229893971 231231369 232818402
3932 232818402 233316384 234975478 234999460 234704625 236863413 236524727 237864367 237714622 236999996 236942232
3922 236942232 236230471 237640775 236484362 234972962 235263200 233733707 232727208 230471414 229644829
3913 229644829 227440802 227866954 225958079 225611487 223769836 222766570 219885404 217647315 215177304
3904 215177304 212453202 209714902 206449553 204560300 203240624 199983986 197048565 194901149 192976126
3895 192976126 189872145 186994037 183755182 178912141 178137143 174666061 171270341 168213614 165533289
3886 165533289 161883311 158227668 155372214 152782869 149785854 147347731 144138624 140450872 138312588
$$ packed form
3950A90868934K863363M161980J390021K954122J986287M182597J875813K985451L368345
3941B16636913J517117J189157K608652J058139K924881M186919k27807J337398J587033
3932B32818402M97982J659094K3982k94835K158788l38686J339640j49745p14626n7764
3922B36942232p11761J410304j156413j511400K90238j529493j006499k255794q26585
3913B29644829k204027M26152j908875l46592j841651j003266k881166k238089k470011
3904B15177304k724102k738300l265349j889253j319676l256638k935421k147416j925023
3895A92976126l103981k878108l238855m843041p74998l471082l395720l056727k680325
3886A65533289l649978l655643k855454k589345k997015k438123l209107l687752k138284
$$ plain form
3877 138312588 134811333 131634364 128539451 126594890 123802584 121068793 117615728 114763022 113436693
3868 113436693 110031355 107592235 105900598 103736073 101069097 97769208 96648626 94417026 93015084
3859 93015084 91964000 89683117 87176738 85919594 84906203 82444394 81135908 80697645 78703946
3850 78703946 77662195 77685531 76432092 75549429 74751381 73965747 72632498 73424570 74058922 72233418
3840 72233418 71847169 70616545 71354873 71986612 71909514 72244542 71122368 69661092 70832967 72107217
3830 72107217 73448502 72960712 72827470 74212112 73600661 74742764 74709297 76292450 75751353 76092812
3820 76092812 77045007 76499462 79729566 80393172 80543201 81448089 80892140 82142802 82331497 81983158
3810 81983158 82435136 84492059 83567617 83211561 85609552 85131002 85118291 86376049 85701997 85852161
$$ packed form
3877A38312588l501255l176969l094913j944561k792306k733791l453065k852706j326329
3868A13436693l405338k439120j691637k164525k666976l299889j120582k231600j401942
3859I3015084j051084k280883k506379j257144j013391k461809j308486m38263j993699
3850G8703946j041751K3336j253439q82663p98048p85634j333249P92072O34352j825504
3840G2233418l86249j230624P38328O31739p7098L35028j122174j461276J171875J274250
3830G2107217J341285m87790j33242J384642o11451J142103l3467J583153n41097L41459
3820G6092812R52195n45545L230104O63606J50029R04888n55949J250662J88695l48339
3810H1983158M51978K056923r24442l56056K397991m78550j2711J257758o74052J50164
$$ plain form
3800 85852161 86384864 86841029 86307066 86818828 88114354 87509166 87142082 85034523 85391449 84335547
3790 84335547 83526797 83353423 82780709 80665717 80602476 78290604 77084328 76434309 75460006 71936100
3780 71936100 70484679 69034784 68904449 66680663 64488361 63390186 60141049 56981925 57437670
3771 57437670 53277437 49649838 50347340 48614935 45457662 41174071 38014840 34952257 31401361
3762 31401361 29715654 26444552 25078393 20668488 18401674 15001308 11509949 7756137 4917910
3753 4917910 -269183 -2754016 -5455663 -9459325 -12386339 -17017654 -19635597 -23723443 -25664169
3744 -25664169 -28259948 -32645632 -36287020 -39539681 -42573428 -44925745 -47538723 -51127889 -55038758
3735 -55038758 -56594362 -61722350 -63059276 -66524305 -69358518 -72228025 -74739788 -75871783 -77774545
$$ packed form
3800H5852161N32703M56165n33963N11762J295526o05188l67084k107559L56926j055902
3790H4335547q08750j73374n72714k114992o3241k311872j206276o50019r74303l523906
3780G1936100j451421j449895j30335k223786k192302j098175l249137l159124M55745
3771E7437670m160233l627599O97502j732405l157273m283591l159231l062583l550896
3762C1401361j685707l271102j366159m409905k266814l400366l491359l753812k838227
3753D917910n187093k484833k701647m003662k927014m631315k617943m087846j940726
3744b5664169k595779m385684l641388l252661l033747k352317k612978l589166l910869
3735e5038758j555604n127988j336926l465029k834213k869507k511763j131995j902762
$$ plain form
3726 -77774545 -79603141 -81186190 -84466732 -87748466 -87926626 -90701633 -91344907 -93571371 -91668090
3717 -91668090 -93573610 -95009746 -97177446 -98470021 -99360186 -98504236 -97411983 -98033935 -99453457
3708 -99453457 -99249831 -97824674 -97775909 -97583174 -97150241 -93851935 -91853140 -91170243 -90225911 -89713398
3698 -89713398 -87214903 -86797450 -83252634 -82192154 -79293488 -78115208 -74963167 -72974344 -69066713
3689 -69066713 -66698151 -61247877 -59747594 -54866128 -50493067 -46816847 -43241399 -39754485 -36110412
3680 -36110412 -29986981 -26548230 -22524235 -17123616 -13020628 -7213021 -3111703 -268805 6148989
3671 6148989 10252574 16969746 20644362 25346524 30664617 36946590 41871621 46885104 52638869
3662 52638869 57854590 62587889 68459761 74737685 79286701 84491678 90273705 96450410 102027893
$$ packed form
3726g7774545j828596j583049l280542l281734j78160k775007o43274k226464J903281
3717i1668090j905520j436136k167700j292575q90165Q55950J092253o21952j419522
3708i9453457K03626J425157M8765J92735M32933L298306J998795O82897R44332N12513
3698h9713398K498495M17453L544816J060480K898666J178280L152041J988823L907631
3689f9066713K368562N450274J500283M881466M373061L676220L575448L486914L644073
3680c6110412O123431L438751M023995N400619M102988N807607M101318K842898O417794
3671F148989M103585O717172L674616M702162N318093O281973M925031N013483N753765
3662E2638869N215721M733299N871872O277924M549016N204977N782027O176705N577483
$$ plain form
3653 102027893 106695265 111206387 116160103 121574963 126759751 132267479 137058217 139978423 144199025
3644 144199025 151394282 156981727 160152562 163965384 169051538 173628034 178146804 181564954 185412291
3635 185412291 188513959 193082709 195958901 202407109 205690730 207955026 211081603 213945691 217595619
3626 217595619 219804676 222895192 225664258 229633729 230482903 234338460 235255538 236897052 239944581
3617 239944581 242214209 242489977 243482644 245162512 247151484 246084254 248019917 251080788 251379596
3608 251379596 251091600 254519537 253897153 254406463 252782911 254558344 253423005 252894094 253032410
3599 253032410 254264011 254157055 252150886 253872503 253455180 251357423 251113505 250069519 248108823
3590 248108823 246258347 246110704 246363414 245208500 243954431 241525865 241201304 240701538 239329353
$$ packed form
3653A02027893M667372M511122M953716N414860N184788N507728M790738K920206M220602
3644A44199025P195257N587445L170835L812822N086154M576496M518770L418150L847337
3635A85412291L101668M568750K876192O448208L283621K264296L126577K864088L649928
3626B17595619K209057L090516K769066L969471Q49174L855557R17078J641514L047529
3617B39944581K269628K75768R92667J679868J988972j067230J935663L060871K98808
3608B51379596k87996L427937o22384N09310j623552J775433j135339n28911J38316
3599B53032410J231601j06956k006169J721617m17323k097757k43918j043986j960696
3590B48108823j850476j47643K52710j154914j254069k428566l24561m99766j372185
$$ plain form
3581 239329353 237458647 237800927 235400460 235574090 234437310 232582415 231519610 230877171 229354649
3572 229354649 226871636 223965494 226321686 224450088 223837100 220979645 220243542 217883922 219179190
3563 219179190 217556538 216197686 215008285 214134139 212934966 212016257 211987718 211577846 210261850 209597926
3553 209597926 208568364 210230802 209220099 208035415 207984901 208293211 207224453 208800529 208512105
3544 208512105 207992917 207285949 209175256 210401568 209253130 208714164 209880797 211464034 210742385
3535 210742385 209870381 211314479 212554306 212664540 213841208 214408778 215155602 216661755 218559661
3526 218559661 217449181 219400358 219300028 218999385 220715383 222389720 224640630 224633231 225675561 225727162
3516 225727162 226250078 225663653 227293927 228570263 228436962 229494148 229528939 230084822 232729608 233301248
$$ packed form
3581B39329353j870706L42280k400467J73630j136780j854895j062805o42439j522522
3572B29354649k483013k906142K356192j871598o12988k857455p36103k359620J295268
3563B19179190j622652j358852j189401q74146j199173r18709k8539m09872j315996o63924
3553B09597926j029562J662438j010703j184684n0514L08310j068758J576076k88424
3544B08512105n19188p06968J889307J226312j148438n38966J166633J583237p21649
3535B10742385q72004J444098J239827J10234J176668N67570P46824J506153J897906
3526B18559661j110480J951177j00330l00643J715998J674337K250910p399J042330N1601
3516B25727162N22916n86425J630274J276336j33301J057186L4791N55883K644786N71640
$$ plain form
3506 233301248 232751294 233063770 232342411 234621493 234143318 235154640 236342857 237227239 236933462 237067615
3496 237067615 234231631 233588836 233863768 233084811 232867693 233239724 232499688 231567611 231672651 229257122
3486 229257122 228821608 227798051 225566030 223653107 220893032 220713499 219110750 218551571 215472367
3477 215472367 212368092 211192282 208039417 204864604 203343571 199644125 198123913 196101073 191604467
3468 191604467 187034780 184090716 180905409 177002041 175170786 170559944 166021962 163927092 160208650
3459 160208650 156957417 151628369 147952775 143035668 137942225 133507236 129895229 122936236 119625199
3450 119625199 114650986 112378674 106039449 101835689 97302091 92826897 88189006 83466805 77282648
3441 77282648 72594767 68717338 65330011 60785958 55515888 51088946 44951515 40433404 36218841
$$ packed form
3506B33301248n49954L12476p21359K279082m78175J011322J188217Q84382k93777J34153
3496B37067615k835984o42795K74932p78957k17118L72031p40036r32077J05040k415529
3486B29257122m35514j023557k232021j912923k760075j79533j602749n59179l079204
3477B15472367l104275j175810l152865l174813j521033l699446j520212k022840m496606
3468A91604467m569687k944064l185307l903368j831255m610842m537982k094870l718442
3459A60208650l251233n329048l675594m917107n093443m434989l612007o958993l311037
3450A19625199m974213k272312o339225m203760m533598m475194m637891m722201o184157
3441G7282648m687881l877429l387327m544053n270070m426942o137431m518111m214563
$$ plain form
3432 36218841 31327747 26770085 22826607 18545598 14679908 9530544 5217468 -13394 -2886756
3423 -2886756 -6946519 -12599903 -14261278 -17553830 -22158744 -24925034 -26954792 -29906401 -31907833
3414 -31907833 -35508734 -39445125 -42073237 -44285016 -47892191 -48079605 -49306502 -51653553 -52848618
3405 -52848618 -54858417 -56253582 -56120348 -57226699 -58142554 -57489432 -60018531 -60983000 -61039559 -61790778
3395 -61790778 -61670036 -62165941 -61634536 -57800475 -59473516 -58918734 -56582282 -55288636 -52456414
3386 -52456414 -50222314 -48956744 -47469769 -46421583 -42569863 -37184797 -36827357 -35105717 -33213434
3377 -33213434 -28460680 -24558237 -21060206 -19947134 -14921135 -9764585 -6083870 -3495315 597926
3368 597926 6032574 8552267 12812925 20194801 23465288 28657879 31350935 35704711 41666666
$$ packed form
3432C6218841m891094m557662l943478m281009l865690n149364m313076n230862k873362
3423b886756m059763n653384j661375l292552m604914k766290k029758k951609k001432
3414c1907833l600901l936391k628112k211779l607175j87414j226897k347051j195065
3405e2848618k009799j395165J33234j106351r15855O53122k529099r64469n6559p51219
3395f1790778J20742m95905N31405L834061j673041N54782K336452J293646K832222
3386e2456414K234100J265570J486975J048186L851720N385066L57440J721640J892283
3377c3213434M752754L902443L498031J113072N025999N156550L680715K588555M093241
3368E97926N434648K519693M260658P381876L270487N192591K693056M353776N961955
$$ plain form
3359 41666666 46581052 51685705 55067393 59583302 63755867 69398696 74343305 78644151 85489750
3350 85489750 88942301 95143711 99681018 103754888 108223262 113017556 118292511 123645339 128977174
3341 128977174 133891595 136115022 141303821 146013196 152083370 158407038 159369771 163434379 169449909
3332 169449909 173338221 177658034 179753495 183766840 186617236 191883941 195069296 198096237 201004902
3323 201004902 203959171 205492975 208671721 211471397 214682205 217336712 218322723 221087680 223401953
3314 223401953 225818942 227117809 229864401 231748626 234454393 236120734 236099738 235758569 236614596
3305 236614596 238341066 239575387 239898827 239795465 239475672 243015967 241445324 242960559 242604414
3296 242604414 242302437 241499232 241571811 240835254 240794628 238573633 237924997 237275481 237643240 237529238
$$ packed form
3359D1666666M914386N104653L381688M515909M172565N642829M944609M300846O845599
3350H5489750L452551O201410M537307M073870M468374M794294N274955N352828N331835
3341A28977174M914421K223427N188799M709375O070174O323668R62733M064608O015530
3332A69449909L888312M319813K095461M013345K850396N266705L185355L026941K908665
3323B01004902K954269J533804L178746K799676L210808K654507R86011K764957K314273
3314B23401953K416989J298867K746592J884225K705767J666341k0996l41169Q56027
3305B36614596J726470J234321L23440j03362l19793L540295j570643J515235l56145
3296B42604414l01977q03205P2579p36557m0626k220995o48636o49516L67759j14002
$$ plain form
3286 237529238 235261113 234150896 235083597 233795619 233461088 229986436 229363990 227896786 226169262
3277 226169262 224063399 223904222 222853464 222579103 221214596 219678211 218725090 216950586 215600475
3268 215600475 216067306 214075883 211394511 209821395 207472957 206686965 203949179 202936560 200873812
3259 200873812 201659019 202199755 201185624 200797262 199129364 195023030 195570183 194630533 191197236 190936741
3249 190936741 192420802 189811723 189029488 189675360 189609126 187967826 188722488 188478079 189086652 188375354
3239 188375354 188096504 188601047 187774335 188518019 188121360 187323671 188895430 190081108 190369608 189474032
3229 189474032 191057149 191081461 192755405 194131462 193957606 191665499 194507323 194902784 196525951
3220 196525951 197857330 199860198 201787582 200705391 203170288 203539400 204449168 204401330 206389794
$$ packed form
3286B37529238k268125j110217R32701j287978l34531l474652o22446j467204j727524
3277B26169262k105863j59177j050758k74361j364507j536385r53121j774504j350111
3268B15600475M66831j991423k681372j573116k348438p85992k737786j012619k062748
3259B00873812P85207N40736j014131l88362j667898m106334N47153r39650l433297k60495
3249A90936741J484061k609079p82235O45872o6234j641300P54662k44409O08573p11298
3239A88375354k78850N04543q26712P43684l96659p97689J571759J185678K88500q95576
3229A89474032J583117K4312J673944J376057j73856k292107K841824L95461J623167
3220A96525951J331379K002868J927384j082191K464897L69112R09768m7838J988464
$$ plain form
3211 206389794 208153656 207767303 209053899 211447667 211226629 211720924 211324861 214425429 215521503
3202 215521503 217336926 218605332 217731741 217745540 218894497 218909646 220594115 220474389 219140590 222116429
3192 222116429 222352466 222560380 221838731 221971909 223578881 224864085 224099492 225267392 224017905
3183 224017905 222955045 223323480 221734468 220971450 219915268 218744798 218591931 217657222 217814151
3174 217814151 215703984 214824754 213873051 213166696 210595087 207677717 205648457 203801185 202110787
3165 202110787 201485190 197396807 195538070 193567873 192796276 187917475 185221650 183320182 179254410
3156 179254410 174698621 173376392 171310691 167450964 165281453 160866032 158115280 153643990 150998297
3147 150998297 146883763 144792176 139862607 135051607 133788303 129675590 124816227 120720484 117722416
$$ packed form
3211B06389794J763862l86353J286596K393768k21038M94295l96063L100568J096074
3202B15521503J815423J268406q73591J3799J148957J5149J684469j19726j333799K975839
3192B22116429K36037K07914p21649J33178J606972J285204p64593J167900j249487
3183B24017905j062860L68435j589012p63018j056182j170470j52867r34709J56929
3174B17814151k110167q79230r51703p06355k571609k917370k029260j847272j690398
3165B02110787o25597m088383j858737j970197p71597m878801k695825j901468m065772
3156A79254410m555789j322229k065701l859727k169511m415421k750752m471290k645693
3147A50998297m114534k091587m929569m811000j263304m112713m859363m095743k998068
$$ plain form
3138 117722416 113834299 107405464 103976361 102562552 97928852 93652724 89600246 84561116 80676173
3129 80676173 77761690 74486477 69761093 65434342 61328476 57036885 54765738 51041539 46526819
3120 46526819 42638830 39619466 37225468 34183969 31775397 27266442 23369816 22232553 20646759
3111 20646759 16267772 13245235 11164431 7722858 5808091 4879204 1931146 -301723 -211488
3102 -211488 -1684953 -4817429 -7129228 -5559922 -9027963 -9894587 -11481526 -10594593 -12781106 -12546857
3092 -12546857 -14526671 -14159389 -14377377 -14526140 -14236065 -12437880 -12615294 -13000794 -12662145 -11390145
3082 -11390145 -9829265 -8274384 -6092356 -4863971 -4159200 -3872501 -436253 649272 2364564
3073 2364564 4475028 5495450 8094879 10169311 12196533 14870747 18223691 21886562 24178899
$$ packed form
3138A17722416l888117o428835l429103j413809m633700m276128m052478n039130l884943
3129H0676173k914483l275213m725384m326751m105866m291591k271147l724199m514720
3120D6526819l887989l019364k393998l041499k408572m508955l896626j137263j585794
3111B0646759m378987l022537k080804l441573j914767r28887k948058k232869R0235
3102b11488j473465l132476k311799J569306l468041q66624j586939Q86933k186513K34249
3092a2546857j979814L67282k17988j48763K90075J798185j77414l85500L38649J272000
3082a1390145J560880J554881K182028J228385P04771K86699L436248J085525J715292
3073B364564K110464J020422K599429K074432K027222K674214L352944L662871K292337
$$ plain form
3064 24178899 26758658 28432664 30612889 34629746 37106325 41175909 43307852 46788125 49227121
3055 49227121 52700187 55832496 57677826 61215149 63230858 66501189 70356269 73940575 77133770
3046 77133770 79236782 82177113 85613052 88799099 91257243 95176296 100182071 100203934 101783875
3037 101783875 105321479 107171475 110416482 113059129 116435610 118596351 119459236 122490883 125218176
3028 125218176 126897493 129093208 128721048 130287307 131396089 132694129 134226195 135244440 137473597
3019 137473597 138501380 137146149 137436144 138550532 139096196 138650994 138013046 140453138 138314751
3010 138314751 139147592 139892895 138694325 137769322 135849440 134616754 134069739 133541183 132669892 129302096
3000 129302096 128836109 127753397 125034253 123386140 121695440 120257624 116623784 114034698 112411585
$$ packed form
3064B4178899K579759J674006K180225M016857K476579M069584K131943L480273K438996
3055D9227121L473066L132309J845330L537323K015709L270331L855080L584306L193195
3046G7133770K103012K940331L435939L186047K458144L919053N005775K1863J579941
3037A01783875L537604J849996L245007K642647L376481K160741Q62885L031647K727293
3028A25218176J679317K195715l72160J566259J108782J298040J532066J018245K229157
3019A37473597J027783j355231K89995J114388N45664m45202o37948K440092k138387
3010A38314751Q32841P45303j198570r25003j919882j232686n47015n28556q71291l367796
3000A29302096m65987j082712k719144j648113j690700j437816l633840k589086j623113
$$ plain form
2991 112411585 110704919 107028810 105791479 102950420 100343967 96774674 94010862 91795004 88626317
2982 88626317 85494021 82992636 80309665 77608179 73090580 70424774 67106643 62932172 62909966
2973 62909966 58624516 55988231 52653716 49038576 46168968 43332636 40239030 36495794 33783178
2964 33783178 31421944 30187927 28527703 25600367 21783290 18588646 16187243 15328349 11802187
2955 11802187 10286115 8725165 5949864 7123494 4145401 -79974 -1172397 -2035454 -3078733
2946 -3078733 -3615834 -6044373 -6242389 -6969137 -7634850 -8040742 -9321821 -8155924 -8267506 -9572508
2936 -9572508 -9883878 -8950801 -8442243 -8007779 -7556639 -7467291 -8257108 -6349338 -3080254 -2241467
2926 -2241467 -1369731 -663689 1294071 2896176 4943344 7269650 9437880 10800061 12196673
$$ packed form
2991A12411585j706666l676109j237331k841059k606453l569293k763812k215858l168687
2982H8626317l132296k501385k682971k701486m517599k665806l318131m174471k2206
2973F2909966m285450k636285l334515l615140k869608k836332l093606l743236k712616
2964C3783178k361234j234017j660224k927336l817077l194644k401403q58894l526162
2955A1802187j516072j560950k775301J173630k978093m225375j092423q63057j043279
2946c078733n37101k428539j98016p26748o65713m05892j281079J165897j11582j305002
2936i572508l11370R33077N08558M34464M51140Q9348p89817J907770L269084Q38787
2926b241467Q71736P06042J957760J602105K047168K326306K168230J362181J396612
$$ plain form
2917 12196673 16726637 17250634 19719999 23003881 25618200 28189242 31848653 34558447 37755838
2908 37755838 40211130 43605778 47957252 50491437 53852131 57110606 62463290 66510128 69694917
2899 69694917 71983981 75289131 79491129 82039186 85498760 89393341 92247665 97481199 99338940
2890 99338940 103480266 107768416 111957284 114702559 119021597 120794905 126257047 130489363 132010199
2881 132010199 134207056 137401972 139288652 141971351 146550935 149694625 152711726 155821696 158091033
2872 158091033 160442424 162199386 165535588 168637107 170459722 170802832 171661586 175317657 176071363
2863 176071363 178694116 180485109 182165538 182562271 182880669 184732509 185010478 186982450 186625939
2854 186625939 186146583 185814904 188133462 187151463 186343051 188546038 187487912 187446785 186619814 186686436
$$ packed form
2917A2196673M529964N23997K469365L283882K614319K571042L659411K709794L197391
2908C7755838K455292L394648M351474K534185L360694L258475N352684M046838L184789
2899F9694917K289064L305150M201998K548057L459574L894581K854324N233534J857741
2890I9338940M141326M288150M188868K745275M319038J773308N462142M232316J520836
2881A32010199K196857L194916J886680K682699M579584L143690L017101L109970K269337
2872A58091033K351391J756962L336202L101519J822615L43110Q58754L656071P53706
2863A76071363K622753J790993J680429L96733L18398J851840K77969J971972l56511
2854A86625939m79356l31679K318558r81999q08412K202987j058126m1127q26971O6622
$$ plain form
2844 186686436 185269899 184427495 183998698 182448231 180732722 180867737 180281736 179071033 176308333
2835 176308333 174909022 173287378 172250974 170735424 168668225 166723685 165151062 162725524 160204272
2826 160204272 156880309 154536486 152393320 148644439 147161951 144875769 142273207 140082681 136832611
2817 136832611 135343156 131432912 126676256 125548294 122556054 120816998 117916734 114926931 112467069
2808 112467069 109674372 106923370 103411607 101961897 100555751 96187578 94502153 90834084 90014401
2799 90014401 86852504 84732000 81599531 79599923 77162022 73724280 70535995 69433606 66149709
2790 66149709 65880166 63710444 61247687 60011409 56401469 53743223 53714803 53442795 49303012
2781 49303012 48015558 49005496 46899112 43194763 42622388 41375673 38366598 37590947 36997560
$$ packed form
2844A86686436j416537q42404m28797j550467j715509J35015n86001j210703k762700
2835A76308333j399311j621644j036404j515550k067199j944540j572623k425538k521252
2826A60204272l323963k343823k143166l748881j482488k286182k602562k190526l250070
2817A36832611j489455l910244m756656j127962k992240j739056k900264k989803k459862
2808A12467069k792697k751002l511763j449710j406146m368173j685425l668069q19683
2799I0014401l161897k120504l132469j999608k437901l437742l188285j102389l283897
2790F6149709k69543k169722k462757j236278l609940k658246k8420k72008m139783
2781D9303012j287454R89938k106384l704349n72375j246715l009075p75651n93387
$$ plain form
2772 36997560 35215005 34921947 32412722 31119438 29746800 28768534 28283194 27485746 27175835 26642518
2762 26642518 25813713 24977470 22870559 21507538 20323595 20537722 18703444 18258683 18374579 16433987
2752 16433987 15502223 14831207 13117485 11579586 12928529 11986447 10873223 9166392 6729738
2743 6729738 5796692 6598569 4393607 3510567 2054699 217298 -2262228 -3148764 -4436951 -5749790
2733 -5749790 -5428231 -8523624 -12260906 -13814603 -15429777 -18277854 -20420670 -22753328 -24910290
2724 -24910290 -27317720 -31371936 -34308324 -34817437 -38549501 -42075798 -43191145 -46667549 -50315879
2715 -50315879 -54124884 -57840603 -62211931 -64054591 -68015926 -71407893 -76580070 -80512305 -83925916
2706 -83925916 -89180860 -91139075 -95383155 -100804808 -105394385 -107180041 -112844200 -119126817 -123580507
$$ packed form
2772C6997560j782555k93058k509225j293284j372638r78266m85340p97448l09911n33317
2762B6642518q28805q36243k106911j363021j183943K14127j834278m44761J15896j940592
2752A6433987r31764o71016j713722j537899J348943r42082j113224j706831k436654
2743F729738r33046Q01877k204962q83040j455868j837401k479526q86536j288187j312839
2733e749790L21559l095393l737282j553697j615174k848077k142816k332658k156962
2724b4910290k407430m054216k936388n09113l732064l526297j115347l476404l648330
2715e0315879l809005l715719m371328j842660l961335l391967n172177l932235l413611
2706h3925916n254944j958215m244080n421653m589577j785656n664159o282617m453690
$$ plain form
2697 -123580507 -128308410 -132362829 -136368375 -141906022 -146905305 -152347140 -156713463 -164371887 -171042833
2688 -171042833 -175645496 -176767374 -184392873 -188040305 -193800393 -198847982 -204028022 -209458656 -214305383
2679 -214305383 -219620803 -224279125 -231433166 -234703300 -239862691 -244655734 -249201234 -255175911 -258758075
2670 -258758075 -262822381 -267395976 -271733082 -276857902 -281059863 -284568824 -290125213 -292855813 -296772692
2661 -296772692 -301477114 -303920954 -307198621 -310510273 -312905680 -317718343 -319727351 -322506955 -325411568
2652 -325411568 -327420555 -328856463 -329994918 -331682281 -333849325 -336833034 -337230439 -338873539 -338650588
2643 -338650588 -339945600 -340281067 -340447150 -340329778 -339121138 -339581672 -337613865 -338063470 -338738660 -335982469
2633 -335982469 -334997566 -332254600 -329351316 -328738310 -324770752 -323564998 -322206321 -317734874 -315277826
$$ packed form
2697a23580507m727903m054419m005546n537647m999283n441835m366323p658424o670946
2688a71042833m602663j121878p625499l647432n760088n047589n180040n430634m846727
2679b14305383n315420m658322p154041l270134n159391m793043m545500n974677l582164
2670b58758075m064306m573595m337106n124820m201961l508961n556389k730600l916879
2661b96772692m704422k443840l277667l311652k395407m812663k009008k779604k904613
2652c25411568k008987j435908j138455j687363k167044k983709l97405j643100K22951
2643c38650588j295012l35467j66083J17372J208640m60534J967807m49605o75190K756191
2633c35982469R84903K742966K903284O13006L967558J205754J358677M471447K457048
$$ plain form
2624 -315277826 -311681229 -306855702 -303876058 -299687789 -295906073 -290736455 -287802008 -282555576 -277505169
2615 -277505169 -272302624 -268437921 -262299203 -257406775 -250702316 -243206788 -236322747 -230285861 -224429852
2606 -224429852 -218909838 -211440804 -205082612 -198524657 -190331695 -182960483 -176919564 -170694900 -163369130
2597 -163369130 -155640728 -149452944 -140143010 -132669079 -124678021 -117434638 -109335274 -101215220 -93128267
2588 -93128267 -85377699 -77285219 -70162588 -62106088 -55038914 -45959517 -38203826 -30299758 -22416183
2579 -22416183 -14617969 -5593810 1066952 9231417 16204207 22972818 28963633 37203650 44523321
2570 44523321 50487382 56291123 64155175 72680306 78651365 85264934 90633918 96199144 100762963
2561 100762963 108222843 112708902 119078132 124367890 129434588 134275389 139368667 144484245 147672498
$$ packed form
2624c15277826L596597M825527K979644M188269L781716N169618K934447N246432N050407
2615b77505169N202545L864703O138718M892428O704459P495528O884041O036886N856009
2606b24429852N520014P469034O358192O557955Q192962P371212O040919O224664P325770
2597a63369130P728402O187784R309934P473931P991058P243383Q099364Q120054Q086953
2588i3128267P750568Q092480P122631Q056500P067174R079397P755691P904068P883575
2579b2416183P798214R024159O660762Q164465O972790O768611N990815Q240017P319671
2570D4523321N964061N803741P864052Q525131N971059O613569N368984N565226M563819
2561A00762963P459880M486059O369230N289758N066698M840801N093278N115578L188253
$$ plain form
2552 147672498 151734617 156628445 162982254 166045160 168874467 173546189 176026801 180938146 182709409
2543 182709409 185265699 188498312 192055118 192820723 196693221 199689742 200660627 203923712 204342055
2534 204342055 207050914 208182696 210027941 209881851 211324719 212260653 215733619 216546704 216051724
2525 216051724 217521462 218242846 218779190 218544753 219218881 220089550 219990518 221016661 219416968 220312869
2515 220312869 220481398 217543901 218253411 218331248 217519754 215739321 215924492 215801939 215174907 213777753
2505 213777753 212003409 212512117 211501012 209560300 208806137 208230801 207585332 206731966 203954390
2496 203954390 202467644 201814549 201145286 200371737 198869078 196397568 194614196 194321345 194243513 191526639
2486 191526639 190082456 189184854 187844936 187883172 185846295 185034578 184644901 183729373 182985163 182369851
$$ packed form
2552A47672498M062119M893828O353809L062906K829307M671722K480612M911345J771263
2543A82709409K556290L232613L556806P65605L872498K996521R70885L263085M18343
2534B04342055K708859J131782J845245j46090J442868R35934L472966Q13085m94980
2525B16051724J469738P21384N36344k34437O74128Q70669r9032J026143j599693Q95901
2515B20312869J68529k937497P09510P7837q11494j780433J85171j22553o27032j397154
2505B13777753j774344N08708j011105j940712p54163n75336o45469q53366k777576
2496B03954390j486746o53095o69263p73549j502659k471510j783372k92851p7832k716874
2486A91526639j444183q97602j339918L8236k036877q11717l89677r15528p44210o15312
$$ plain form
2476 182369851 179828816 179134163 178720989 178146047 177192457 177012995 176406020 174706119 176040380 174663535
2466 174663535 174567593 174066722 175294789 174638669 174100520 175282570 175023501 174518139 175335019 176219332
2456 176219332 176491957 176129747 178030053 179172104 179753337 179485364 180601402 179812391 180975431
2447 180975431 182443660 182569728 183571361 184010987 184462796 187402899 187836148 187456198 189319946
2438 189319946 187847252 189501702 190309531 190145837 192444319 192728862 194225165 194648132 195024176 194959893
2428 194959893 197077458 199938625 199844286 200354659 201390677 201991151 202463531 204067079 204763846 204378211
2418 204378211 204711277 205844578 204551520 205554390 206231643 206778622 205865195 204047695 205566168
2409 205566168 205211115 205168577 204956563 204965611 204398617 204108582 204182425 204988922 203155625 203009200 202032868
$$ packed form
2476A82369851k541035o94653m13174n74942r53590j79462o06975j699901J334261j376845
2466A74663535r5942n00871J228067o56120n38149J182050k59069n05362Q16880Q84313
2456A76219332K72625l62210J900306J142051N81233k67973J116038p89011J163040
2447A80975431J468229J26068J001633M39626M51809K940103M33249l79950J863748
2438A89319946j472694J654450Q07829j63694K298482K84543J496303M22967L76044o4283
2428A94959893K117565K861167r4339N10373J036018O00474M72380J603548O96767l85635
2418B04378211L33066J133301j293058J002870O77253N46979r13427j817500J518473
2409B05566168l55053m2538k12014R048n66994k90035P3843Q06497j833297j46425r76332
$$ plain form
2398 202032868 201037273 198737003 197261454 197607346 194727599 195003216 194695023 193249542 191867817
2389 191867817 190534704 187856226 187673213 187783120 185786123 184377977 181601882 180828594 178416407
2380 178416407 176929977 176428289 175312823 173437404 171803180 171390523 170643393 168152904 166941920
2371 166941920 164499245 162923964 160468916 160001276 158435337 155272686 153967309 152991740 152166675
2362 152166675 152156410 149403188 149713973 149166853 148236802 147547218 146992834 145115415 143264039 145234972
2352 145234972 144483409 144892115 142783842 142199847 143136391 143075897 143325335 142397074 142810860 141730713
2342 141730713 144068419 145466278 145069013 146580641 147963996 149329569 150564580 150223624 153349313
2333 153349313 155672764 156933337 158282910 158151182 161235898 163763755 166267393 169323260 172150681
$$ packed form
2398B02032868r95595k300270j475549L45892k879747K75617l08193j445481j381725
2389A91867817j333113k678478j83013J09907j996997j408146k776095p73288k412187
2380A78416407j486430n01688j115466j875419j634224m12657p47130k490489j210984
2371A66941920k442675j575281k455048m67640j565939l162651j305377r75569q25065
2362A52166675j0265k753222L10785n47120r30051o89584n54384j877419j851376J970933
2352A45234972p51563M08706k108273n83995R36544o0494K49438r28261M13786j080147
2342A41730713K337706J397859l97265J511628J383355J365573J235011l40956L125689
2333A53349313K323451J260573J349573j31728L084716K527857K503638L055867K827421
$$ plain form
2324 172150681 173919203 177058976 178771822 182513218 185396080 188927261 192267512 194137035 199963825
2315 199963825 204067233 206332139 209833463 214907646 218071946 222919597 226372287 230765243 235029941
2306 235029941 239652818 244432330 248647739 253555189 259204506 262278643 267469277 272343744 276972117
2297 276972117 280204684 284318046 290907256 294975251 301371103 305333231 309860726 315000596 320353264
2288 320353264 324126819 327055379 332621964 336539882 340992582 346057245 350787406 354784680 358331706
2279 358331706 363056189 365406356 370540239 375530560 377722015 380158898 383881276 387113658 390935790
2270 390935790 393013925 395094708 398666166 403512292 404172555 405580336 407278076 410136677 411226625
2261 411226625 411551818 413033484 412548844 412564175 413578215 414124942 414244918 415311846 412949141 414813948
$$ packed form
2324A72150681J768522L139773J712846L741396K882862L531181L340251J869523N826790
2315A99963825M103408K264906L501324N074183L164300M847651L452690M392956M264698
2306B35029941M622877M779512M215409M907450N649317L074137N190634M874467M628373
2297B76972117L232567M113362O589210M067995O395852L962128M527495N139870N352668
2288C20353264L773555K928560N566585L917918M452700N064663M730161L997274L547026
2279C58331706M724483K350167N133883M990321K191455K436883L722378L232382L822132
2270C90935790K078135K080783L571458M846126O60263J407781J697740K858601J089948
2261D11226625L25193J481666m84640J5331J014040N46727J19976J066928k362705J864807
$$ plain form
2251 414813948 412819629 411414958 410970444 409695778 406221620 404798999 402850421 401564756 397936961
2242 397936961 393550750 390106253 388160458 383840062 379223774 373894827 370213251 366106566 360590195
2233 360590195 357032325 351375116 345994079 340203528 334159256 329157818 322535270 316863365 310236021
2224 310236021 303450210 295622935 288529987 282346591 275622507 270355471 262803652 255459181 247867953
2215 247867953 241431970 234888668 227841599 220831809 211724887 204039316 196775300 189171106 181617292
2206 181617292 173497909 166164577 160020602 152870257 146901144 138774136 130779032 124123866 117891759
2197 117891759 110136118 104062473 97502592 90226005 83159075 75367988 70405138 63715624 58311565
2188 58311565 52251463 45552283 39651817 33741191 30147001 25929609 20739111 16068789 11146629
$$ packed form
2251D14813948j994319j404671m44514j274666l474158j422621j948578j285665l627795
2242C97936961m386211l444497j945795m320396m616288n328947l681576m106685n516371
2233C60590195l557870n657209n381037n790551o044272n001438o622548n671905o627344
2224C10236021o785811p827275p092948o183396o724084n267036p551819p344471p591228
2215B47867953o435983o543302p047069p009790r106922p685571p264016p604194p553814
2206A81617292q119383p333332o143975p150345n969113q127008p995104o655166o232107
2197A17891759p755641o073645o559881p276587p066930p791087m962850o689514n404059
2188E8311565o060102o699180n900466n910626l594190m217392n190498m670322m922160
$$ plain form
2179 11146629 6727582 1553614 -3309620 -6066754 -12200280 -14393533 -15737032 -20781830 -25157141
2170 -25157141 -26803955 -29080832 -30481028 -34907061 -39323244 -41458220 -41421213 -42929712 -46629070
2161 -46629070 -46658741 -46957360 -48981329 -49181146 -50248791 -49789245 -51158436 -51196057 -50490597 -52266919
2151 -52266919 -49474353 -49718526 -47771312 -45981643 -46465802 -45295909 -44238674 -42883291 -42387509
2142 -42387509 -41329900 -38390829 -35803314 -36122697 -33416214 -30100750 -27072665 -24365037 -21381869
2133 -21381869 -20311412 -17280783 -13978795 -10659666 -6291001 -3180733 -2211049 825803 4274964
2124 4274964 7470539 11894805 16107418 18655213 20895810 25421041 28105557 31095359 35204476
2115 35204476 37516150 40331389 44166590 48500297 50611272 53416630 55501107 57576000 61949306
$$ packed form
2179A1146629m419047n173968m863234k757134o133526k193253j343499n044798m375311
2170b5157141j646814k276877j400196m426033m416183k134976L7007j508499l699358
2161d6629070k9671k98619k023969j99817j067645M59546j369191l7621P05460j776322
2151e2266919K792566k44173J947214J789669m84159J169893J057235J355383M95782
2142d2387509J057609K939071K587515l19383K706483L315464L028085K707628K983168
2133b1381869J070457L030629L301988L319129M368665L110268R69684L036852L449161
2124D274964L195575M424266M212613K547795K240597M525231K684516K989802M109117
2115C5204476K311674K815239L835201M333707K110975K805358K084477K074893M373306
$$ plain form
2106 61949306 65356899 68355377 71334736 75443822 77656128 81521666 84080960 86926796 89534292
2097 89534292 91577482 93156487 95705293 97735830 99079004 100599359 102389693 106235318 109549425
2088 109549425 110466710 111614881 113730997 115438129 117133041 118979632 121153400 122424898 123925374
2079 123925374 124812572 125308236 126656059 128107636 128575654 129669942 130251864 129770946 130774361
2070 130774361 132553000 133850164 133140388 132807714 134120353 134647784 135959273 135920074 137911871 137444357
2060 137444357 138819495 138389478 136820845 138258898 137891769 138468041 140118294 140466527 139893322
2051 139893322 140929711 140915734 140188340 142413809 141677370 142031153 144242954 143306164 141836357 145062703
2041 145062703 143666010 144784356 146009358 147137085 147774152 147967297 150504836 149131375 149513245
$$ packed form
2106F1949306L407593K998478K979359M109086K212306L865538K559294K845836K607496
2097H9534292K043190J579005K548806K030537J343174J520355J790334L845625L314107
2088A09549425R17285J148171K116116J707132J694912J846591K173768J271498J500476
2079A23925374Q87198M95664J347823J451577M68018J094288N81922m80918J003415
2070A30774361J778639J297164p09776l32674J312639N27431J311489l9199J991797m67514
2060A37444357J375138m30017j568633J438053l67129N76272J650253L48233n73205
2051A39893322J036389j3977p27394K225469p36439L53783K211801r36790j469807L226346
2041A45062703j396693J118346J225002J127727O37067J93145K537539j373461L81870
$$ plain form
2032 149513245 149836936 150966263 153117009 154033867 155114793 155524923 158283944 156746735 160641840
2023 160641840 160241397 162551570 162822444 164711605 167046878 168111974 169326750 170909818 172055101
2014 172055101 172816403 176322192 175820231 179842903 181845074 181613348 181305307 182816137 186437796
2005 186437796 188009540 191940158 192399176 193251510 193829454 195945385 198094892 199893389 202000639
1996 202000639 199500846 198186013 202056147 205823601 204461517 208644745 207918213 209649000 210826998
1987 210826998 211434303 213031876 215997672 216094705 216598249 218413104 218085780 220288362 219784565 221604369
1977 221604369 220760481 222465163 224278576 225125782 226712321 225715026 226942141 226787116 227875935
1968 227875935 227441959 227694889 228241436 229989480 227870912 228466919 227415703 227832184 227626531 227316799
$$ packed form
2032A49513245L23691J129327K150746R16858J080926M10130K759021j537209L895105
2023A60641840m00443K310173K70874J889161K335273J065096J214776J583068J145283
2014A72055101P61302L505789n01961M022672K002171k31726l08041J510830L621659
2005A86437796J571744L930618M59018Q52334N77944K115931K149507J798497K107250
1996B02000639k499793j314833L870134L767454j362084M183228p26532J730787J177998
1987B10826998O07305J597573K965796R7033N03544J814855l27324K202582n03797J819804
1977B21604369q43888J704682J813413Q47206J586539r97295J227115j55025J088819
1968B27875935m33976K52930N46547J748044k118568N96007j051216M16481k05653l09732
$$ plain form
1958 227316799 227529514 225810549 224985626 222878159 223381323 223585653 219926868 219021919 215703936
1949 215703936 213869250 212011342 211318761 208494478 204718271 204415891 201533696 199154434 195341996
1940 195341996 194137251 190799329 186132413 181852167 178801679 175575688 170634456 166885212 164069804
1931 164069804 161063358 154030120 150582481 147804288 142654308 137983835 133889848 128149008 124206332
1922 124206332 118764140 114681797 110060593 105252259 101427336 96084738 92353301 87264832 82099655
1913 82099655 76420483 71116533 66887552 63433192 58805438 54171398 49110419 45723960 40490608
1904 40490608 38215626 33104369 29334204 25057724 20838458 15898165 12416003 9591424 5214791
1895 5214791 2335681 -479883 -3461420 -6314989 -9664887 -11567818 -14663314 -16428372 -17719025
$$ packed form
1958B27316799K12715j718965q24923k107467N03164K04330l658785r04949l317983
1949B15703936j834686j857908o92581k824283l776207l02380k882195k379262l812438
1940A95341996j204745l337922m666916m280246l050488l225991m941232l749244k815408
1931A64069804l006446p033238l447639k778193n149980m670473m093987n740840l942676
1922A24206332n442192m082343m621204m808334l824923n342598l731437n088469n165177
1913H2099655n679172n303950m228981l454360m627754m634040n060979l386459n233352
1904D0490608k274982n111257l770165m276480m219266m940293l482162k824579m376633
1895E214791k879110k815564k981537k853569l349898j902931l095496j765058j290653
$$ plain form
1886 -17719025 -21111011 -23792101 -24725905 -25155652 -27567847 -27636248 -28011302 -30364133 -29509102 -31168395
1876 -31168395 -30047473 -30809414 -30820258 -30883561 -30173858 -29501026 -28195665 -27018661 -27537757 -26088654
1866 -26088654 -22780598 -21423195 -20045998 -16782132 -15513760 -13017395 -9279116 -6905651 -4301740
1857 -4301740 1215062 4045210 7739898 10812611 13804921 18220843 21913311 25679660 31249326
1848 31249326 37903440 41386361 44664086 50117856 55426387 60388462 65598628 71556453 76888301
1839 76888301 82329060 87104792 90980594 97156985 104409209 109153606 115348517 120730572 126392562
1830 126392562 131287789 138423652 144929545 151195479 156477050 161704645 168128927 176034675 181807468
1821 181807468 187620586 192873163 198102862 204104369 211703873 215215369 219991575 226731686 232222538
$$ packed form
1886a7719025l391986k681090r33804m29747k412195o8401l75054k352831Q55031j659293
1876c1168395J120922p61941j0844o3303P09703O72832J305361J177004n19096J449103
1866b6088654L308056J357403J377197L263866J268372K496365L738279K373465K603911
1857d301740N516802K830148L694688L072713K992310M415922L692468L766349N569666
1848C1249326O654114L482921L277725N453770N308531M962075N210166N957825N331848
1839G6888301N440759M775732L875802O176391P252224M744397O194911N382055N661990
1830A26392562M895227P135863O505893O265934N281571N227595O424282P905748N772793
1821A81807468N813118N252577N229699O001507P599504L511496M776206O740111N490852
$$ plain form
1812 232222538 237147490 242238854 246699255 252179983 256834441 261299325 265284189 271294327 275978099
1803 275978099 280363669 284962010 287346319 290938650 293542014 297567369 300230157 302122902 307182575
1794 307182575 307458493 311233663 313317866 315105088 316067818 320319496 319158483 320972553 322810053
1785 322810053 322689828 324434687 324251844 324196238 322516905 324412269 323668449 323408865 321482742 320555025
1775 320555025 319077489 319110148 316203790 315218531 312722196 310982014 310857808 308017913 304405030
1766 304405030 301962912 298872411 296356797 293990911 292276702 289064920 283471836 280025639 276818731
1757 276818731 271174215 268359025 264323157 260778728 256140144 250386776 246589746 241099195 236877189
1748 236877189 232965484 227379217 221351644 217022568 212079492 208263371 204489858 197935062 193373598
$$ packed form
1812B32222538M924952N091364M460401N480728M654458M464884L984864O010138M683772
1803B75978099M385570M598341K384309L592331K603364M025355K662788J892745N059673
1794C07182575K75918L775170K084203J787222R62730M251678j161013J814070J837500
1785C22810053j20225J744859j82843n5606j679333J895364p43820k59584j926123r27717
1775C20555025j477536L2659k906358r85259k496335j740182j24206k839895l612883
1766C04405030k442118l090501k515614k365886j714209l211782n593084l446197l206908
1757B76818731n644516k815190m035868l544429m638584n753368l797030n490551m222006
1748B36877189l911705n586267o027573m329076m943076l816121l773513o554796m561464
$$ plain form
1739 193373598 185505679 182329924 177628653 169958451 166313693 161295493 154576283 149991649 145684581
1730 145684581 139188297 135086099 129898816 124456004 119019258 114183949 110018438 104714927 100347019
1721 100347019 96089600 91254272 86972477 80743523 76432466 70632065 65872919 61015532 57704421
1712 57704421 53592693 50091222 46226699 42401903 37752922 34767115 30802208 26540336 23375355
1703 23375355 20228797 17279481 11398427 11377789 7993121 5019644 3274429 645745 -1491040
1694 -1491040 -4661422 -7907144 -8782376 -10583002 -13871831 -14837369 -16158929 -19282488 -20683228
1685 -20683228 -20843806 -23319742 -24924247 -26299451 -28649989 -29743193 -29212532 -30333283 -31596852
1676 -31596852 -30595204 -32667628 -35863162 -34382634 -36231453 -34840827 -36093894 -36893511 -36554546
$$ packed form
1739A93373598p867919l175755m701271p670202l644758n018200o719210m584634m307068
1730A45684581o496284m102198n187283n442812n436746m835309m165511n303511m367908
1721A00347019m257419m835328m281795o228954m311057n800401m759146m857387l311111
1712E7704421m111728l501471l864523l824796m648981k985807l964907m261872l164981
1703B3375355l146558k949316n881054k0638l384668k973477j745215k628684k136785
1694a491040l170382l245722q75232j800626l288829r65538j321560l123559j400740
1685b0683228j60578k475936j604505j375204k350538j093204N30661j120751j263569
1676c1596852J001648k072424l195534J480528j848819J390626j253067p99617L38965
$$ plain form
1667 -36554546 -37805294 -38452835 -40203482 -39472310 -39798269 -38741103 -39396597 -39020328 -40197397 -39212202
1657 -39212202 -38442732 -38624714 -39715243 -40116466 -40503854 -39320843 -40737955 -39967360 -40636855 -40434616
1647 -40434616 -39584028 -37700465 -39462472 -39039549 -39364874 -39211351 -39840671 -39703961 -41533188 -41142578
1637 -41142578 -38995965 -39343076 -38310710 -39538591 -40879973 -38753155 -38690602 -38378439 -39123040 -38782656
1627 -38782656 -38459314 -38275223 -38393368 -38515666 -38173539 -39980944 -38526380 -37219541 -38389432 -37087638
1617 -37087638 -36716045 -37715930 -37266591 -37627271 -38139473 -37750186 -35595514 -36226766 -35693737 -34083964
1607 -34083964 -34905378 -34030709 -32675859 -31840870 -30744460 -31001445 -29872914 -28233980 -26255779 -26365114
1597 -26365114 -24803933 -22590846 -20551907 -21648826 -20316145 -17216285 -14492925 -13083015 -10579462
$$ packed form
1667c6554546j250748o47541j750647P31172l25959J057166o55494L76269j177069R85195
1657c9212202P69470j81982j090529m01223l87388J183011j417112P70595o69495K02239
1647d0434616Q50588J883563j762007M22923l25325J53523o29320J36710j829227L90610
1637d1142578K146613l47111J032366j227881j341382K126818O2553L12163p44601L40384
1627c8782656L23342J84091j18145j22298L42127j807405J454564J306839j169891J301794
1617c7087638L71593r99885M49339l60680n12202L89287K154672o31252N33029J609773
1607c4083964q21414Q74669J354850Q34989J096410k56985J128531J638934J978201j09335
1597b6365114J561181K213087K038939j096919J332681L099860K723360J409910K503553
$$ plain form
1588 -10579462 -7718663 -6910903 -4519000 -500448 -377013 2573590 6010298 8223255 11954660
1579 11954660 15390481 19062655 22910341 25631042 29788993 32712008 38638531 42438322 47169266
1570 47169266 51619561 54149721 59031278 63668431 68560962 73590311 79157207 85129971 89215402
1561 89215402 94716251 100394060 105055578 111376862 116156092 123115452 129027410 135867211 141853144
1552 141853144 147403041 153035400 158751150 165721940 172279493 179629333 186089545 193151347 200003266
$$ packed form
1588a0579462K860799Q07760K391903M018552J23435K950603L436708K212957L731405
1579A1954660L435821L672174L847686K720701M157951K923015N926523L799791M730944
1570D7169266M450295K530160M881557M637153M892531N029349N566896N972764M085431
1561H9215402N500849N677809M661518O321284M779230O959360N911958O839801N985933
1552A41853144N549897N632359N715750O970790O557553P349840O460212P061802O851919
$$ [...]
-2730B7051560  $$ checkpoint
##END NTUPLES=
##END=
