##TITLE= S#354534
##JCAMP-DX= 5.00 $$ JEOL NMR v1.10
##DATA TYPE= NMR SPECTRUM
##DATA CLASS= NTUPLES
##NUM DIM= 1
##ORIGIN= DELTA_NMR
##OWNER= NMR
##SPECTROMETER/DATA SYSTEM= DELTA_NMR
##.OBSERVE FREQUENCY= 7.5568234259928E+01
##.OBSERVE NUCLEUS= ^13C
##.DELAY= (5.14E+01,5.14E+01)
##.ACQUISITION MODE= SIMULTANEOUS
##.FIELD= 7.0586013
##.FILTER WIDTH= 8.6618213122048E-01
##.ACQUISITION TIME= 1.7334272
##.SPINNING RATE= 16
##.OBSERVE 90= 9.5
$$ ------------------------
$$ JEOL SPECIFIC PARAMETERS
##$FILENAME= C:\NMR/borneol-5.jdf
##$TITLE= S#354534
##$AUTHOR= NMR
##$CREATION=  1-FEB-2018 09:48:41
##$REVISION=  1-FEB-2018 09:55:56
##$CONTENT= CARBON NMR EXPERIMENTn
##$INSTRUMENT= DELTA_NMR
##$SITE= Center College ECP+ 300
##$NODENAME= nmr2
##$DIMENSIONS= 1
##$STORAGE= FLOAT
##$X_FORMAT= COMPLEX
##$X_CURR_POINTS= 32768
##$X_START= 225.07631 $$ppm
##$X_STOP= -25.06868 $$ppm
##$X_TITLE= 13C                            
##$X_ZERO_POINT= 0.39976
##$X_FREQ_FLIP= FALSE
##$X_POINTS= 32768
##$X_PRESCANS= 4
##$X_DOMAIN= 13C
##$X_OFFSET= 100 $$ppm
##$X_FREQ= 75.56823 $$MHz
##$X_SWEEP= 18.90359 $$kHz
##$X_RESOLUTION= 0.57689 $$Hz
##$SOLVENT= CHLOROFORM-D
##$TEMP_GET= 21.9 $$dC
##$ACQ_DELAY= 51.4 $$us
##$DIGITAL_FILTER= FALSE
##$FILTER_FACTOR= 1
##$FILTER_WIDTH= 9.446 $$kHz
##$FILTER_MODE= BUTTERWORTH
##$TRANSITION_RATIO= 0.9
##$ORDERS
##$FACTORS
##$LOCK_STRENGTH= 89
##$LOCK_LEVEL= 200
##$LOCK_GAIN= 26
##$LOCK_OSC_OFFSET= 25.6519 $$kHz
##$LOCK_PHASE= 187 $$deg
##$LOCK_OSC_STATE= 2H OSC ON
##$X_ANGLE= 30 $$deg
##$X90= 9.5 $$us
##$X90_HI= 9 $$us
##$X90_LO= 35 $$us
##$X_90_WIDTH= 9.5 $$us
##$X_PULSE= 3.16667 $$us
##$RELAXATION_DELAY= 1 $$s
##$SCANS= 100
##$PROBE_ID= 1412
##$ITERATIONS= 1
##$FIELD_STRENGTH= 7.0586 $$T
##$TEMP_SET= 25 $$dC
##$SPIN_SET= 15 $$Hz
##$SPIN_GET= 16 $$Hz
##$HE_LEVEL= 75 $$%
##$N2_LEVEL= 84 $$%
##$CHANGER_SAMPLE= 0
##$ADC_CARD= 16/1MHz/20
##$EXPERIMENT= single_pulse_dec
##$OBS_NOISE= WAUGH
##$IRR_NOISE= WALTZ
##$TRI_NOISE= WALTZ
##$QUA_NOISE= WAUGH
##$OBS_PWIDTH= 1 $$us
##$IRR_PWIDTH= 50 $$us
##$TRI_PWIDTH= 1 $$us
##$QUA_PWIDTH= 1 $$us
##$IRR_DOMAIN= 1H
##$IRR_FREQ= 300.52966 $$MHz
##$RECVR_GAIN= 15
##$IRR90= 9.2 $$us
##$TRI90= 10 $$us
##$QUA90= 10 $$us
##$IRR90_HI= 10 $$us
##$QUA90_HI= 10 $$us
##$IRR90_LO= 50 $$us
##$TRI90_LO= 10 $$us
##$QUA90_LO= 10 $$us
##$IRR_OFFSET= 5 $$ppm
##$MOD_RETURN= 1
##$TOTAL_SCANS= 100
##$X_ACQ_DURATION= 1.73343 $$s
##$DELAY_OF_START= 1 $$s
##$ACTUAL_START_TIME= 886326230
##$CLIPPED= FALSE
##$DC_BALANCED= FALSE
##$TRI90_HI= 10 $$us
##$SPIN_LOCK_90= 100 $$us
##$SPIN_LOCK_ATTN= 24.4 $$dB
##$DEUT_GRAD_SHIM_90= 213 $$us
##$DEUT_GRAD_SHIM_ATTN= 9 $$dB
##$IRR_CODE= 146
##$LOCK_STATE= LOCK OFF
##$AUTOLOCK_LEVEL= 200
##$SAWTOOTH_RANGE= 4
##$LOCK_STATUS= OFF
##$LOCK_SETTLE_POINT= 4096
##$LOCK_ACHIEVE_POINT= 0
##$SPIN_ACTION= SPIN ON
##$SPIN_STATE= SPIN ON
##$SPIN_STATUS= SPIN ON
##$SPIN_GAS_SOURCE= AIR
##$TEMP_ACTION= TEMP OFF
##$TEMP_STATE= TEMP OFF
##$TEMP_STATUS= TEMP OFF
##$TEMP_COMP= 0
##$TEMP_DELAY= 0 $$s
$$ [...]
##$VT_PID_STD_WB_H_CBL= 10
##$VT_PID_STD_WB_H_CBH= 0
##$VT_PID_STD_WB_H_HC= 2.4
##$VT_PID_STD_WB_H_HL= 70
##$VT_PID_STD_WB_M_PB= 1.5
##$VT_PID_STD_WB_M_TI= 30
##$VT_PID_STD_WB_M_TD= 5
##$VT_PID_STD_WB_M_CBL= 9.9
##$VT_PID_STD_WB_M_CBH= 2.3
##$VT_PID_STD_WB_M_HC= 2.5
##$VT_PID_STD_WB_M_HL= 70
##$VT_PID_STD_WB_L_PB= 1.3
##$VT_PID_STD_WB_L_TI= 29
##$VT_PID_STD_WB_L_TD= 5
##$VT_PID_STD_WB_L_CBL= 20
##$VT_PID_STD_WB_L_CBH= 20
##$VT_PID_STD_WB_L_HC= 0.6
##$VT_PID_STD_WB_L_HL= 100
##$VT_PID_LONG_0_H_PB= 1.5
##$VT_PID_LONG_0_H_TI= 30
##$VT_PID_LONG_0_H_TD= 5
##$VT_PID_LONG_0_H_CBL= 9.9
##$VT_PID_LONG_0_H_CBH= 2.3
##$VT_PID_LONG_0_H_HC= 2.5
##$VT_PID_LONG_0_H_HL= 70
##$VT_PID_LONG_0_M_PB= 1.5
##$VT_PID_LONG_0_M_TI= 30
##$VT_PID_LONG_0_M_TD= 5
##$VT_PID_LONG_0_M_CBL= 9.9
##$VT_PID_LONG_0_M_CBH= 2.3
##$VT_PID_LONG_0_M_HC= 2.5
##$VT_PID_LONG_0_M_HL= 70
##$VT_PID_LONG_40_H_PB= 1.5
##$VT_PID_LONG_40_H_TI= 30
##$VT_PID_LONG_40_H_TD= 5
##$VT_PID_LONG_40_H_CBL= 9.9
##$VT_PID_LONG_40_H_CBH= 2.3
##$VT_PID_LONG_40_H_HC= 2.5
##$VT_PID_LONG_40_H_HL= 70
##$VT_PID_LONG_40_M_PB= 1.5
##$VT_PID_LONG_40_M_TI= 30
##$VT_PID_LONG_40_M_TD= 5
##$VT_PID_LONG_40_M_CBL= 9.9
##$VT_PID_LONG_40_M_CBH= 2.3
##$VT_PID_LONG_40_M_HC= 2.5
##$VT_PID_LONG_40_M_HL= 70
##$SAMPLE_ACTION= LOADED
##$SAMPLE_STATE= LOAD
##$SAMPLE_STATUS= LOADED
##$AUTOSHIM_MODE= AUTOSHIM OFF
##$AUTOSHIM_DELAY= 3600 $$s
##$AUTOSHIM_TRACK= AUTOSHIM OFF
##$SHIM_MAX_RECALL= IDLE
##$SHIM_NAMES= SHIM_Z0
##$SHIM_Z0= 9174
##$SHIM_Z1= 5009
##$SHIM_Z2= -48
##$SHIM_Z3= -2829
##$SHIM_Z4= -240
##$SHIM_Z5= 46
##$SHIM_Z6= -33
##$SHIM_X= -14
##$SHIM_XZ= 16
##$SHIM_XZ2= 0
##$SHIM_XZ3= 0
##$SHIM_X2= -7
##$SHIM_X2Z= -40
##$SHIM_X3= 0
##$SHIM_Y= 1608
##$SHIM_YZ= 13
##$SHIM_YZ2= 10
##$SHIM_YZ3= 0
##$SHIM_Y2= -11
##$SHIM_Y2Z= -20
##$SHIM_Y3= 0
##$NUM_SCANS= 1
##$END_TIME= 886326520
##$LOCAL_TIME= 886326520
##$PROBE_ATN= 0
##$PROBE_TUNE= 3853
##$PROBE_MATCH= 5069
##$PROBE_COARSE= NONE
##$LF_TUNE_DIAL= 0
##$LF_MATCH_DIAL= 0
##$HF_TUNE_DIAL= 0
##$HF_MATCH_DIAL= 0
##$PASS_RIPPLE= 0.01 $$dB
##$STOP_RIPPLE= 60 $$dB
##$PROBE_RECOVERY= 0 $$us
##$AF_DELAY_RATIO= 0
##$VERSION= 4.3.3
##$X_ACQ_TIME= 1.73343 $$s
##$DEAD_TIME= 0 $$us
##$DELAY= 0 $$us
##$PHASE_PRESET= 3 $$us
##$UNBLANK_TIME= 2 $$us
##$INITIAL_WAIT= 1 $$s
##$NORMALIZED= TRUE
$$ END OF JEOL SPECIFIC PARAMETERS
$$ -------------------------------
##NTUPLES= NMR SPECTRUM
##VAR NAME= FREQUENCY,    SPECTRUM/REAL, SPECTRUM/IMAG, PAGE NUMBER
##SYMBOL=   X,            R,             I,             N
##VAR TYPE= INDEPENDENT,  DEPENDENT,     DEPENDENT,     PAGE
##VAR FORM= AFFN,         ASDF,          ASDF,          AFFN
##VAR DIM=  32768, 32768, 32768, 2
##UNITS= PPM,     ARBITRARY UNITS, ARBITRARY UNITS, 
##FIRST=  2.25076309295504E+02, 1.97698139463432E+01, 5.28503383765915, 1
##LAST=  -2.50686752434227E+01, 3.90636570297478E+01, -2.73750155251229E+01, 2
##FACTOR=  7.63405208102439E-03, 7.36024689026568E-04, 7.36024689026568E-04, 1
##PAGE= N=1
##DATA TABLE=(X++(R..R)), XYDATA
$$ [...]
5981A18296919j83665292K8120387J0627990n8174643J47471086j87887010J39862810
$$ 118296919 -65368373 -37247986 -26619996 -84794639 62676447 -125210563 14652247
5974A4652247K608439M6600501l9361293L5244360m1494247J25758950k51524833L3669980
$$ 14652247 17260686 63861187 24499894 59744254 18250007 144008957 -107515876 -73845896
5966g3845896o5964118N3302289J43544425j40327354J43777145q0138984O9008806
$$ -73845896 -139810014 -86507725 57036700 -83290654 60486491 -19652493 49356313
5959D9356313j61142809J77334341q0525724N7588561j32186029J561700J4631115
$$ 49356313 -111786496 65547845 -14977879 42610682 -89575347 -88013647 -73382532
5952g3382532K27048863Q284303j60797531m3965696O7366381k0011733N509783o090910
$$ -73382532 153666331 161950634 1153103 -42812593 24553788 4542055 10051838 3960928
5944C960928l1808020J3103654j5523327o8481326K8554690M8614823m7861498J34431909
$$ 3960928 -27847092 -14743438 -30266765 -98748091 -70193401 -21578578 -69440076 64991833
5936F4991833o6510020o0608406P404433J41718888j23011781o5285019N0386266O4194722
$$ 64991833 -1518187 -62126593 -54722160 86996728 -36015053 -101300072 -50913806 13280916
5928A3280916j00333791n0115415J33253402l5185851J36539888m49235382K98463793
$$ 13280916 -87052875 -137168290 -3914888 -39100739 97439149 -351796233 -53332440
5921e3332440J6284763K17180860n0612363m1774165L0598251j19284476R4805335
$$ -53332440 -37047677 180133183 129520820 87746655 118344906 -939570 93865765
5914I3865765J2255618l9982457Q5998019k2173409m8155679m6335232L0473338P4693772
$$ 93865765 106121383 66138926 152136945 129963536 81807857 35472625 65945963 140639735
5906A40639735P59012955o3103275l26086331k61088368j88321452J05403499K3066862
$$ 140639735 899652690 836549415 510463084 249374716 61053264 166456763 189523625
5899A89523625l9159113J7250869J13347236j32423805j27569141J27720107m1771665
$$ 189523625 150364512 167615381 280962617 148538812 20969671 148689778 106918113
5892A06918113q352708K01735038q9566885j97759095j81089698N6808351J5513344
$$ 106918113 98565405 300300443 210733558 12974463 -168115235 -111306884 -95793540
5885i5793540J57566363P7140181j60572692k9339072Q1243636p0103075M4222608M953031
$$ -95793540 61772823 138913004 -21659688 -50998760 30244876 -39858199 4364409 9317440
5877I317440K3125080R1304030j88372415J58419098k2251458L200555L8147064n6270078
$$ 9317440 32442520 123746550 -64625865 93793233 71541775 74742330 112889394 56619316
5869E6619316r684535R7968130p7486225l3192059k0874537K1045850N5690074L9166218
$$ 56619316 46934781 144902911 67416686 34224627 13350090 34395940 90086014 129252232
5861A29252232n7171567k18917372K93498316r4412773n258585m8008436l5097174
$$ 129252232 72080665 -146836707 146661609 52248836 46990251 -1018185 -36115359
5854c6115359o9621610J74990812j89428333M6234612J02688359m3814684q4187239
$$ -36115359 -105736969 69253843 -120174490 -73939878 28748481 -15066203 -99253442
5847i9253442M9252228O531866l7069006J2645728J33143350P1424083j96049733l058019
$$ -99253442 -50001214 -43469348 -80538354 -67892626 65250724 136674807 -59374926 -62432945
5839f2432945K0037323o4450607J88932654n2808009r6308347J09162610N0463222
$$ -62432945 -42395622 -106846229 82086425 29278416 -67029931 42132679 92595901
5832I2595901j19955293J05859047j18901160J08455639J06432358N7933842j62724744
$$ 92595901 -27359392 78499655 -40401505 68054134 174486492 232420334 69695590
5825F9695590j20614991J40321775j71204114O7757005K7221427j03098558l7777757
$$ 69695590 -50919401 89402374 -81801740 -14044735 13176692 -89921866 -127699623
5818a27699623K98759309q8242053r2903918q6340950Q8127011p1276679J24442468
$$ -127699623 171059686 82817633 -10086285 -96427235 -8300224 -79576903 44865565
5811D4865565M1272003J0162871l3809018j52841528J85014498k3092477p0301413
$$ 44865565 86137568 96300439 62491421 -90350107 94664391 71571914 1270501
5804A270501l4653437O5193395N944608J7914730j30087651O4925151J02859250r5270295
$$ 1270501 -33382936 31810459 37755067 55669797 -74417854 -9492703 93366547 -1903748
5796a903748J75446637p7068356j62423224J63412092k26476734P7616563l023376
$$ -1903748 173542889 96474533 -65948691 97463401 -129013333 -51396770 -54420146
5789e4420146R2987568L9317056o2592140P8990047o5332598J517709m5425905o0153930
$$ -54420146 38567422 77884478 15292338 94282385 28949787 30467496 -14958409 -75112339
5781g5112339J14859858p3687240k0130832j27070172J52011997n4713091N3540493
$$ -75112339 39747519 -33939721 -54070553 -181140725 -29128728 -83841819 -30301326
5774c0301326K9973139p9676j1531968M0153506o2373885j24075687P3722168p280907
$$ -30301326 -328187 -407863 -11939831 28213675 -34160210 -158235897 -84513729 -91794636
5766i1794636J90133422p1021732k1013746N721929j12089137K737725K346856J47458070
$$ -91794636 98338786 27317054 6303308 12025237 -100063900 -97326175 -94979319 52478751
5758E2478751j72650094K41255297j18568169N7953526J9393340r0697749Q594887
$$ 52478751 -120171343 121083954 2515785 60469311 79862651 -10835098 -2240211
5751b240211P3828048m254767o4423537J11810868k05296298O3238791n6460326L0007672
$$ -2240211 71587837 67333070 2909533 114720401 -90575897 -27337106 -83797432 -53789760
5743e3789760k4679798K27426131M6042102r2352018m2746516j37870330J60992723
$$ -53789760 -78469558 148956573 194998675 102646657 59900141 -77970189 83022534
5736H3022534k4259969j71588567J64186281q6254427q9927062P9257425O1059322m967873
$$ 83022534 58762565 -112826002 51360279 -34894148 -124821210 -45563785 15495537 10527664
5728A0527664J24262891n4639031r3810278J13064566j63215405p5325505J13703404
$$ 10527664 134790555 80151524 -13658754 99405812 -63809593 -139135098 -25431694
5721b5431694J29012384j79690429Q4464382m8406881O6289868j11481506J44295376
$$ -25431694 103580690 -76109739 8354643 -40052238 26237630 -85243876 59051500
5714E9051500l6349402L4743864m3886010q5892428m483026R2934340m8930739P0505653
$$ 59051500 22702098 57445962 13559952 -72332476 -76815502 16118838 -32811901 37693752
5706C7693752j8456118j08281754J57108851J3523078j83325996J47104094M1676681
$$ 37693752 19237634 -89044120 68064731 81587809 -101738187 45365907 87042588
5699H7042588k23637238K0485707L3999900J39274149P1939897j69040468M9528978
$$ 87042588 -136594650 -116108943 -82109043 57165106 129105003 -39935465 9593513
5692I593513n1949153l8184865K18861530m6392575j64346856L4724061L5161102L0468645
$$ 9593513 -42355640 -80540505 138321025 91928450 -72418406 -37694345 -2533243 27935402
5684B7935402j39998933P6797955l9530298K15671733r8710021m6458296p4346693
$$ 27935402 -112063531 -35265576 -74795874 140875859 42165838 -4292458 -78639151
5677g8639151j01343759J45014078J70967660j05210619K4972199j09744406j13570800
$$ -78639151 -179982910 -34968832 135998828 30788209 55760408 -53983998 -167554798
5670a67554798J31633569K2485504m7690675L5675438m1785859o5107585j9009888
$$ -167554798 -35921229 -13435725 -61126400 -25450962 -67236821 -132344406 -151354294
5663a51354294J88134396K104202N5869484j28853679N2201725J21941754j67619595
$$ -151354294 36780102 38884304 94753788 -34099891 18101834 140043588 -27576007
5656b7576007L1155123n1449493j2632170m6894912k7315015Q5858484q854578J72707732
$$ -27576007 3579116 -47870377 -60502547 -107397459 -134712474 -48853990 -57708568 114999164
5648A14999164m0110780M2901346Q796371p6455259r7934815R3778985r1842499K7853532
$$ 114999164 74888384 117789730 126586101 50130842 -47803973 45975012 -45867487 -18013955
5640a8013955K6597288q8690631K0791866N0254215r2636450K08568805r6422245R9337667
$$ -18013955 8583333 -80107298 -59315432 -9061217 -101697667 106871138 10448893 109786560
5632A09786560k03738181m224586J77834027j00327255o768903J9789083N2683117
$$ 109786560 -93951621 -98176207 79657820 -20669435 -27438338 -7649255 45033862
5625D5033862p7807945j43294894J11328020J52934290n2674665l8043922j1962696
$$ 45033862 -32774083 -176068977 -64740957 88193333 35518668 -2525254 -14487950
5618a4487950Q7274157q7502331p0589594J26301976L4887410j78852029N2062037R250323
$$ -14487950 72786207 -14716124 -85305718 40996258 75883668 -102968361 -50906324 -41656001
5610d1656001o787761K4237491m1215028R5328677Q577191j9116789r5263650J43377598
$$ -41656001 -48443762 -24206271 -65421299 29907378 38484569 19367780 -75895870 67481728
5602F7481728p5708790m7969360j14016294J85272239l5024172N245858j3540944L8292809
$$ 67481728 -8227062 -56196422 -170212716 15059523 -19964649 -14718791 -28259735 10033074
5594A0033074l1175302k2357840K8792515J1035080J1201971j75375515J69465911
$$ 10033074 -21142228 -43500068 -14707553 -3672473 7529498 -167846017 1619894
5587A619894k3732193p2140128k0426849J46918814R5575511j91046437J79342411
$$ 1619894 -22112299 -94252427 -114679276 32239538 127815049 -63231388 116111023
5580A16111023l2724374r6479554J22095997j60222297M5356172J50718194j98032307
$$ 116111023 83386649 -13092905 109003092 -51219205 -5863033 144855161 -53177146
5573e3177146M6429668L7536729l5014999J09100818J6451433j22427789k3452661
$$ -53177146 -6747478 30789251 -4225748 104875070 121326503 -1101286 -24553947
5566b4553947n2918145l7176164J56348480l1743230k5161522j46594057P2063148
$$ -24553947 -77472092 -114648256 41700224 9956994 -15204528 -161798585 -89735437
5559h9735437L5112505m4043869J09500562l5626345m1591173P310761j1426938J6248112
$$ -89735437 -54622932 -98666801 10833761 -24792584 -66383757 -59072996 -70499934 -54251822
5551e4251822n9986393J10610083J09045056r4197802P9824454r8556418n3757766
$$ -54251822 -114238215 -3628132 105416924 11219122 91043576 -7512842 -61270608
5544f1270608R9329755o8047039k369350J4782449Q3334045j2430575q5819121J23172568
$$ -61270608 38059147 -29987892 -32357242 -17574793 65759252 53328677 -32490444 90682124
5536I0682124q3886006Q9885808L4235925j05659427k3340463m7472170M970135Q5281743
$$ 90682124 6796118 96681926 130917851 25258424 1917961 -45554209 -40584074 44697669
5528D4697669p1829351O833636l2241662K5775444N411908j4088328q6208992k5570784
$$ 44697669 -27131682 -20298046 -52539708 -26764264 -21352356 -35440684 -121649676 -147220460
5520a47220460K50806682L5918377j25654479p9691117R1982303J27410783j84848475
$$ -147220460 103586222 139504599 13850120 -65840997 26141306 153552089 -31296386
5513c1296386J0317785K7300839j07639454K14512001j14242857l2608483j7548384
$$ -31296386 -20978601 6322238 -101317216 113194785 -1048072 -33656555 -51204939
5506e1204939J59319645P9165311j18104570O6813583j83970176K5769553J42838345
$$ -51204939 108114706 187280017 69175447 135989030 -47981146 -22211593 120626752
5499A20626752j26172815j07850663J54939436r2922460M5289815K03683194k34059805
$$ 120626752 -5546063 -113396726 41542710 -51379750 -6089935 197593259 -36466546
5492c6466546R5424635n8272950K1342700j2324962n0013060q0442896L248171J11164262
$$ -36466546 58958089 685139 22027839 9702877 -40310183 -120753079 -117504908 -6340646
5484f340646n4228654j54766290J78481815N6178106J3495000J17591180k32991858
$$ -6340646 -60569300 -215335590 -36853775 19324331 32819331 150410511 -82581347
5477h2581347J30214848j65510832J83988427r5966769m8000307R7211677J19511763
$$ -82581347 47633501 -117877331 66111096 -29855673 -77855980 19355697 138867460
5470A38867460j46313788l936262l7937182j168160O2040584l2573231M9491472j05623953
$$ 138867460 -7446328 -11382590 -49319772 -50487932 11552652 -21020579 28470893 -77153060
5462g7153060O4840755J24031246j10538521k3512429j40060830K16736462j41270684
$$ -77153060 -12312305 111718941 1180420 -22332009 -162392839 54343623 -86927061
5455h6927061Q5324284p1447373j8986803M5007997p3377975R2801122K4155049O32213
$$ -86927061 -1602777 -73050150 -92036953 -47028956 -120406931 -27605809 -3450760 -2818547
5447b818547J5167182n7668074K0679455o761585n2468519j3585543J96502492k05189347
$$ -2818547 12348635 -45319439 -24639984 -31401569 -83870088 -97455631 99046861 -106142486
5439a06142486J06416027J6158142n3186059P8543492J17360434j67839112J11262668
$$ -106142486 273541 16431683 -36754376 41789116 159149550 -8689562 102573106
5432A02573106j15804188M4599274N7981263o1896090N5447666q6261997O663477l0426917
$$ 102573106 -13231082 31368192 89349455 27453365 82901031 -3360966 3302511 -27124406
5424b7124406n8615071R7694239N1850826l5234687j35584970J42888386j39978541
$$ -27124406 -85739477 11954762 63805588 28570901 -107014069 35874317 -104104224
5417a04104224J05984726j958901Q3149574j02617978K217177o727015r2163498J91537352
$$ -104104224 1880502 -78399 83071175 -19546803 -17329626 -24056641 -116220139 75317213
5409G5317213K3501556m4618509Q5750577j96448119J4915162M9233961O5649487
$$ 75317213 98818769 54200260 139950837 -56497282 -41582120 7651841 73301328
5402G3301328J09090123o3201971j60203427N4431693R6273336j46421838j1476969
$$ 73301328 182391451 119189480 -41013947 13417746 109691082 -36730756 -48207725
5395d8207725R7597161j4559291m8299982K2735137n5076316Q466418J89206508q8908212
$$ -48207725 49389436 34830145 -13469837 9265300 -45811016 -37344598 151861910 62953698
5387F2953698N7078290j47897405l3066974N294301M7918566n9255649l6540199N6521418
$$ 62953698 120031988 -27865417 -60932391 -55638090 -7719524 -66975173 -103515372 -46993954
5379d6993954Q704726j7884141P9240607n6009498q513537J13569099M1356410k09398438
$$ -46993954 -38289228 -56173369 23067238 -32942260 -41455797 72113302 113469712 -95928726
5371i5928726J31712147j37413108L279816m9346977J51035552M8706106j63022170
$$ -95928726 35783421 -101629687 -98349871 -147696848 3338704 52044810 -110977360
5364a10977360l9866073J51570235J563611N7360809j32383438N6926462J49627466
$$ -110977360 -150843433 726802 2290413 59651222 -72732216 -15805754 133821712
5357A33821712j85400531J02442104l5672556j46760726J09221961j4358896M9583231
$$ 133821712 -51578819 50863285 15190729 -131569997 -22348036 -36706932 12876299
5350A2876299j25980025k8547865L49281548k20379610N0710660n8026571L9180685
$$ 12876299 -113103726 -141651591 207629957 -12749653 37961007 -20065564 19115121
5343A9115121q8157168J96441985j39971683j13484173M3871202Q1107220M6191564
$$ 19115121 -69042047 127399938 -12571745 -126055918 -82184716 -1077496 45114068
5336D5114068r9247114L1255182l57727Q7359091p1742916j8011829o2072598j8183830
$$ 45114068 -54133046 -22877864 -23235591 64123500 -7619416 -25631245 -87703843 -105887673
5328a05887673k2396189J10364125K37279406l30910820M3317404J86679193k54920321
$$ -105887673 -128283862 -17919737 219359669 -111551151 -68233747 118445446 -136474875
5321a36474875Q8550405Q9246086J33799740j58783684j704399o2016288J9022492
$$ -136474875 -47924470 41321616 175121356 16337672 14633273 -47383015 -28360523
5314b8360523J4226793J15800948O7919459q3419997p5628534n2695557K7988747
$$ -28360523 -14133730 101667218 169586677 86166680 10538146 -42157411 -14168664
5307a4168664j11733476K03990248R5194032p0242874k0318440q4010653L3229336
$$ -14168664 -125902140 78088108 173282140 103039266 82720826 -1289827 31939509
5300C1939509J09794497m1219445r2899790J68886034j32954378k9507832j08688705
$$ 31939509 141734006 100514561 7614771 176500805 43546427 14038595 -94650110
5293i4650110J83845734p6553549K18796686r7596399o7791913l0090513l8280983
$$ -94650110 89195624 12642075 231438761 133842362 66050449 35959936 -2321047
5286b321047r0669243M0299232J33225983j84623175J94473007j25629183j12866237
$$ -2321047 -92990290 -52691058 80534925 -104088250 90384757 -35244426 -148110663
5279a48110663J68102077Q3415926j21393378L1079455o8724138o8948618K3728356
$$ -148110663 19991414 103407340 -17986038 13093417 -55630721 -124579339 -100850983
5272a00850983J33569614j76418672J89682872q6161194n8043121J22233731j5806221
$$ -100850983 32718631 -143700041 45982831 -40178363 -98221484 24012247 8206026
5265H206026j27542940O3045552J4972261l88354N2723780J5575803j69996475K2804614
$$ 8206026 -119336914 -56291362 -41319101 -41707455 11016325 26592128 -143404347 -120599733
5257a20599733m0011032K425550K10301928q5761039J7865425R812410j9258106Q4427222
$$ -120599733 -160610765 -158185215 52116713 -33644326 -15778901 -5966491 -25224597 59202625
5249E9202625r130784J3807144j02507421J10271382j41945519J36190684j20610171
$$ 59202625 50071841 63878985 -38628436 71642946 -70302573 65888111 -54722060
5242e4722060k7970068q2814594K79700901j39739939K7648421m429328J91003268
$$ -54722060 -82692128 -165506722 114194179 -25545760 2102661 -2326667 188676601
5235A88676601q8872125o8544961p5214616N2271586N4997091l5672888j08090660
$$ 188676601 99804476 31259515 -43955101 8316485 63313576 27640688 -80449972
5228h0449972L1474335R2123024p9174812O5846342j9630443O7089986L0580577m7200668
$$ -80449972 -48975637 43147387 -36027425 29818917 10188474 77278460 107859037 60658369
5220F0658369p7874470O1659011j93085212N406906K96619224j29062862L3240390
$$ 60658369 -17216101 44442910 -148642302 -143235396 153383828 24320966 57561356
5213E7561356j85128574J55545632j94492501M1212501J7801173N0752901R5755870
$$ 57561356 -127567218 27978414 -166514087 -125301586 -107500413 -56747512 39008358
5206C9008358j8131052n4692901l9267189J56117171j10519042J58936515j76769494
$$ 39008358 20877306 -33815595 -73082784 83034387 -27484655 131451860 -45317634
5199d5317634M6500905j52943532P7573186k1435971r62036Q0697703J1735909J05655357
$$ -45317634 1183271 -151760261 -74187075 -95623046 -96585082 -15887379 -4151470 101503887
5191A01503887q6577386J1347085L4202189l2088376J4470957r9512047L263777P3217214
$$ 101503887 14926501 26273586 60475775 28387399 42858356 -56653691 -53389914 19827300
5183A9827300j53167410Q5853001Q339736k3420597O7784907Q3869217m3768620O7554238
$$ 19827300 -133340110 -47487109 -39147373 -62567970 5216937 89086154 45317534 112871772
5175A12871772j26191429N8390262J0319493m3034892K092705R5107731l7493027N5799318
$$ 112871772 -13319657 45070605 55390098 12355206 14447911 109555642 72062615 127861933
5167A27861933j07257883N8761327k02155185J65278960q9612918J15032757m6155277
$$ 127861933 20604050 79365377 -122789808 42489152 -47123766 67908991 21753714
5160B1753714K2610847o4533337l2298818M4119379j81649753K21246709o7180731
$$ 21753714 44364561 -20168776 -52467594 -8348215 -189997968 31248741 -35931990
5153c5931990Q7784444O462578q7589774Q581796k4860699k0334355J82837008m637972
$$ -35931990 51852454 58315032 -29274742 -20692946 -45553645 -65888000 116949008 112311036
5145A12311036q0785363M9323876j28425863J84684311j65734431K5426323K05447526
$$ 112311036 31525673 80849549 -47576314 137107997 -28626434 -3200111 202247415
5138B02247415l20357018J80411058n9440096k855929l6094188n8931167J66159043
$$ 202247415 -118109603 62301455 2861359 5430 -36088758 -95019925 71139118
5131G1139118q1753842j9228641r1062203m259362J27294983L5207655j13288573
$$ 71139118 -10614724 -29843365 -120905568 -125164930 2130053 37337708 -75950865
5124g5950865J00048751L9337560j40651785K17032843m7945052j27530766n2484917
$$ -75950865 24097886 63435446 -77216339 139816504 91871452 -35659314 -88144231
5117h8144231P8316922l0091613M2544998k02514500K22753569K02594368J86216833
$$ -88144231 -9827309 -39918922 2626076 -199888424 22865145 225459513 411676346
5110D11676346j18810018j62145920K0164898p85163q6867535J42523195k09845009
$$ 411676346 292866328 130720408 150885306 150100143 63232608 205755803 -4089206
5103d089206O2313501M4543328M1924843K956436J15799687k4626799K69193338N04691134
$$ -4089206 58224295 102767623 144692466 147648902 263448589 238821790 508015128 1012706262
5095A012706262m31822651o43149926K1793932j70399206Q1035903L2251117q946896
$$ 1012706262 580883611 -62266315 -40472383 -210871589 -129835686 -97584569 -106531465
5088a06531465p348890N2107402M6197789P9219979K3840959j5773984l7822512J40727128
$$ -106531465 -113880355 -61772953 -15575164 63644815 87485774 71711790 33889278 174616406
5080A74616406m12299347j72697866J10043016Q0048221M2599646K17316687r8499891
$$ 174616406 -237682941 -410380807 -300337791 -220289570 -177689924 39626763 -58873128
5073e8873128n7770120N8677670n8215449J09061884o4218005p659647n347571P1494587
$$ -58873128 -116643248 -57965578 -116181027 -7119143 -71337148 -78996795 -84344366 -12849779
5065a2849779k04700837J74922206k3592587N2517008j05803583Q9962319J209613
$$ -12849779 -217550616 -42628410 -66220997 -13703989 -119507572 -29545253 -28335640
5058b8335640r4217358J17005546p1175895K5999201L8519342o5508203L5721587N9313830
$$ -28335640 -122552998 -5547452 -76723347 -50724146 -12204804 -77713007 -41991420 17322410
5050A7322410p4157539J42200686l8743212k04812689J11495648L9357485J1697800
$$ 17322410 -56835129 85365557 46622345 -158190344 -46694696 -7337211 4360589
5043D360589J0357086o3764612J58527119j73684887m6408352J09273767K8777106
$$ 4360589 14717675 -49046937 109480182 -64204705 -110613057 -1339290 27437816
5036B7437816L9656144j02337046N1047028j160215l2568920n4901456L4703882J00840659
$$ 27437816 67093960 -35243086 15803942 14643727 -17925193 -72826649 -38122767 62717892
5028F2717892L2444108p5094011k7879578l7950551J11276187q7293400L8996348q5541434
$$ 62717892 95162000 20067989 -7811589 -45762140 65514047 -21779353 17216995 -68324439
5020f8324439K55512634j95517281r0795233J42172094j64226776J24142383j37026210
$$ -68324439 187188195 -8329086 -99124319 43047775 -121179001 2963382 -134062828
5013a34062828K29941818j42311747P8857579J1007079k4957199o1188671p0519624
$$ -134062828 95878990 -46432757 32424822 43431901 18474702 -42713969 -113233593
5006a13233593J31058859K8463610p3398291m1969814J12257325K0787535L6210158
$$ -113233593 17825266 46288876 -27109415 -69079229 43178096 63965631 100175789
4999A00175789j05863035k1150271K36079840j68906705n130253p243421o2377407
$$ 100175789 -5687246 -26837517 209242323 40335618 35205365 27961944 -34415463
4992c4415463K4791675q2475794J93742056j76646566J25153094n617506q386174N5843392
$$ -34415463 -9623788 -92099582 101642474 -75004092 50149002 44531496 36145322 91988714
4984I1988714j57414039P5751588P4859245r4888838Q1849167K7690257j25854114O120485
$$ 91988714 -65425325 10326263 85185508 -9703330 72145837 99836094 -26018020 -19897535
4976a9897535n8103925O7929847m2269049J34765596m4403781j16127772J72332437
$$ -19897535 -78001460 -10071613 -52340662 82424934 38021153 -78106619 94225818
4969I4225818j3846196j11877643K12859284k11537531l4330097J14243593j92880086
$$ 94225818 80379622 -31498021 181361263 -30176268 -64506365 49737228 -143142858
4962a43142858L4922091L52572K4928613N5430804N5125746j3391403M7810670p2788822
$$ -143142858 -108220767 -107868195 -82939582 -27508778 27616968 14225565 62036235 -10752587
4954a0752587L7321271j32012609O7729177q8027603m7943053K18317988j31509580
$$ -10752587 26568684 -105443925 -37714748 -125742351 -173685404 44632584 -86876996
4947h6876996n639025Q3647737J14378188q9043782K1010860R527881m5880238K6531152
$$ -86876996 -92516021 -8868284 105509904 16466122 37476982 47004863 1124625 27655777
4939B7655777j32905644K0117197R6960303n0925235J6602986P6415941P650392p6556129
$$ 27655777 -105249867 -85132670 11827633 -39097602 -22494616 53921325 61571717 -14984412
4931a4984412N3852681o7969782M2958107P3280384l8448957l7752818J23742229
$$ -14984412 38868269 -29101513 13856594 87136978 48688021 10935203 134677432
4924A34677432j57044680j0064392L2465969J73595430r5717689o59654j89986595
$$ 134677432 -22367248 -32431640 34329 173629759 77912070 77252416 -112734179
4917a12734179P3838736l0724387O276583J21111738J3034251p0465196k3717659N7500591
$$ -112734179 -38895443 -69619830 -63343247 57768491 70802742 337546 -23380113 34120478
4909C4120478P2231239k51999023J89571613j3289964j4024783J5669091j23707710
$$ 34120478 106351717 -145647306 43924307 30634343 16609560 32278651 -91429059
4902i1429059N9218247R7848541k2857372p5079478O8469786n1894665K8762214J286578
$$ -91429059 -32210812 65637729 42780357 -32299121 36170665 -15724000 13038214 14324792
4894A4324792J00869821L7446387j86702383Q0567654j52770648K85238330k47785637
$$ 14324792 115194613 152641000 -34061383 46506271 -106264377 178973953 -68811684
4887f8811684J09772694n8398086l674216Q9853464l9144850J20490732j36626900
$$ -68811684 40961010 -17437076 -21111292 68742172 29597322 150088054 13461154
4880A3461154Q1394438p8650224P2280936q3864566J6606164o0299983J89534317
$$ 13461154 94855592 16205368 88486304 4621738 21227902 -39072081 150462236
4873A50462236j46887869J8462774M8347004j52359195R7783882J34770379p3591577
$$ 150462236 3574367 22037141 70384145 -81975050 15808832 150579211 76987634
4866G6987634o9675755l0639963J34730632j95630561L2984914j1288465J33309426
$$ 76987634 7311879 -23328084 111402548 -84228013 -51243099 -62531564 70777862
4859G0777862m6774077K0992081m8739830r2231829j2562965M6255786M4070032o0248529
$$ 70777862 24003785 44995866 -3743964 -95975793 -108538758 -62282972 -18212940 -78461469
4851g8461469l6934938m2249793J56379396m8226814M5620608L2173387p4091239
$$ -78461469 -115396407 -157646200 -1266804 -49493618 -3873010 28300377 -45790862
4844d5790862J34153692j52561503J11644067r5983627o5087569O0270677J19063348
$$ -45790862 88362830 -64198673 47445394 -48538233 -113625802 -53355125 65708223
4837F5708223p2830574J07411379j45720805K00818494j74046175L8715705j7293193
$$ 65708223 -7122351 100289028 -45431777 155386717 -18659458 20056247 2763054
4830B763054J09421224j68260825J19347368k29844506K33489670p6568643m3397703
$$ 2763054 112184278 -56076547 63270821 -166573685 66915985 -9652658 -53050361
4823e3050361J32213541j60113170M0687228Q0829892k1841254j04510338l6923559
$$ -53050361 79163180 -80949990 -40262762 40567130 18725876 -85784462 -122708021
4816a22708021J50470714j09421951J39993889J1386908j57983888L777844J88230910
$$ -122708021 27762693 -81659258 58334631 69721539 -88262349 -84484505 103746405
4809A03746405q3679155J8682962O2827311j77102180L0343170R3490819q1848486
$$ 103746405 20067250 38750212 101577523 -75524657 -45181487 48309332 -33539154
4802c3539154q7400703J10662243l5675678J06761127n0840851k7011105j51276611
$$ -33539154 -120939857 -10277614 -45953292 60807835 9966984 -17044121 -168320732
4795a68320732K43711143j8520344j93983784J48878571p3479167p8903616J58957744
$$ -168320732 75390411 56870067 -137113717 11764854 -61714313 -140617929 18339815
4788A8339815p9456587j20142715J05008985R2641099o2626265j0312685n1822742
$$ 18339815 -61116772 -181259487 -76250502 16390597 -46235668 -56548353 -108371095
4781a08371095o3808522K11848943r9554322n9742643J41968928J0855301r0212686
$$ -108371095 -172179617 39669326 -59884996 -119627639 22341289 33196590 -57016096
4774e7016096j2919227J59095685o9365322M0063529Q8043524k09912371K04445552
$$ -57016096 -69935323 89160362 19795040 59858569 147902093 -62010278 142435274
4767A42435274o3371138j07208994M4284716J24761952r1504283O2754891m621721
$$ 142435274 79064136 -28144858 16139858 140901810 49397527 112152418 107530697
4760A07530697r1019575K6296883K8210926N9425383L1882273o8411200r1288859j7726438
$$ 107530697 16511122 42808005 71018931 130444314 162326587 93915387 2626528 -15099910
4752a5099910q060551n6948424J08239009Q3313413j01271346k1663520J3937737M802856
$$ -15099910 -23160461 -80108885 28130124 111443537 10172191 -11491329 2446408 7249264
4744G249264J1061031L5926536L4410988O1871076k53593892J7552136Q8982979j00452499
$$ 7249264 18310295 54236831 88647819 150518895 -103074997 -85522861 3460118 -96992381
4736i6992381N4884232J62593793j7838046j28832227p394679n9463009J65911788
$$ -96992381 -42108149 120485644 102647598 -26184629 -33579308 -93042317 72869471
4729G2869471j06439451k7327165O7716635j00902360r1954602Q1353633o7455518
$$ 72869471 -33569980 -60897145 6819490 -94082870 -186037472 -104683839 -172139357
4722a72139357J46394904l5191171M099427J25234077k74140644J62734670k50660
$$ -172139357 -25744453 -60935624 -56836197 68397880 -205742764 -43008094 -43258754
4715d3258754j28429391J61015092o6563955Q877334J30885878n0693267N7926593
$$ -43258754 -171688145 -10673053 -77237008 -68359674 62526204 11832937 69759530
4708F9759530j06690426o7291208J19626930Q8453029j71023457P0382653P9073662
$$ 69759530 -36930896 -104222104 15404826 103857855 -67165602 3217051 82290713
4701H2290713K8252356p4001279K0664033m8685107P7154339J5263074j78574334
$$ 82290713 110543069 36541790 57205823 8520716 85675055 100938129 -77636205
4694g7636205J13458769m2284489M0138220M6842884o2645092L0992432o2376128
$$ -77636205 35822564 -6461925 33676295 80519179 17874087 48866519 -13509609
4687a3509609L09973332j65257507j15314256J1796362j21766201P6734397J2240783
$$ -13509609 296463723 131206216 15891960 27688322 -94077879 -17343482 -5102699
4680e102699o6189303J26239203j2017732R1919748P7449897j48496835P3093937J032432
$$ -5102699 -71292002 54947201 42929469 134849217 212299114 63802279 136896216 137928648
4672A37928648k1290645o9624715j75884252M0903994J76822921N1364017Q3915232
$$ 137928648 116638003 47013288 -128870964 -87966970 88855951 140219968 224135200
4665B24135200j39746182L1373340J53875115k27002479m9319973J36462467j38332079
$$ 224135200 84389018 115762358 269637473 42634994 -6684979 129777488 -8554591
4658h554591q9058221J33535021n7815214n9992594J35061334m3732918K27092142
$$ -8554591 -97612812 35922209 -21893005 -81885599 53175735 9442817 236534959
4651B36534959k25533202J96181274l14137641J39595334k1959924M0056681m9142322
$$ 236534959 11001757 207183031 -106954610 32640724 10680800 50737481 1595159
4644A595159N014661m4716720N9561164l8848287J80599752j94483167M2134558J2514144
$$ 1595159 6609820 -38106900 21454264 -17394023 163205729 -31277438 10857120 23371264
4636B3371264n5112649O2804777L1120966M8458475K449632n2991377j29344764J62919021
$$ 23371264 -31741385 31063392 62184358 110642833 113092465 60101088 -69243676 93675345
4628I3675345n7825097j10749823R9650341J5730638L5861469q2726248l7189775
$$ 93675345 35850248 -74899575 24750766 40481404 76342873 -6383375 -43573150
4621d3573150J38532463q6033908J69287017k05807113P5646396o5151081L1013875
$$ -43573150 94959313 8925405 178212422 -27594691 48051705 -17099376 13914499
4614A3914499K8558499Q8013760k15510144j9261944J43961676L8713165n075019
$$ 13914499 42472998 130486758 -85023386 -104285330 39676346 78389511 73314492
4607G3314492j08797428J13474311j01422229M8848502k1837106P610123m8921521
$$ 73314492 -35482936 77991375 -23430854 25417648 3580542 11190665 -37730856
4600c7730856J31699553r5363617M1192616j06012221r343791Q9889576r0074372P4510227
$$ -37730856 93968697 -1394920 39797696 -66214525 -75558316 14331260 -75743112 -1232885
4592a232885Q4578469j11838531j05582988R2230802M0929402m597928l1147463N2997904
$$ -1232885 83345584 -28492947 -134075935 -41845133 -915731 -5513659 -36661122 16336782
4584A6336782j12866102p6209110J76499115k7566133k8250358m9453307R7400583
$$ 16336782 -96529320 -172738430 3760685 -23805448 -52055806 -101509113 -4108530
4577d108530L8024560r1710973J44332021m1884834l9686401n2985703J40914598q4137385
$$ -4108530 33916030 -57794943 86537078 44652244 4965843 -48019860 92894738 8757353
4569H757353o7350534K6070704k9367422j03904183J52220669r9546997J96184346
$$ 8757353 -58593181 -32522477 -61889899 -165794082 -13573413 -113120410 83063936
4562H3063936o1341503j13506004J28941225j95669238N4923631J89060103p4816299
$$ 83063936 21722433 -91783571 37157654 -158511584 -103587953 85472150 10655851
4555A0655851Q3874248k12586828J47949863j3229701J4683095J9154590J66568396
$$ 10655851 94530099 -118056729 29893134 16663433 31346528 50501118 217069514
4548B17069514j63729736n7282511j07375654K46898822j38108462J07101655j03619531
$$ 217069514 53339778 -3942733 -111318387 135580435 -2528027 104573628 954097
4541I54097J8776976n4698217M1289334J19655558j10049433N8830220L2540391o6991376
$$ 954097 19731073 -34967144 6322190 125977748 15928315 74758535 107298926 40307550
4533D0307550P914490p9979948j7230382O0703932r942425O8382853L004775j17078026
$$ 40307550 48222040 -31757908 -48988290 11715642 1773217 70156070 73160845 -43917181
4525d3917181J32269153k7782988l9472806P054191o7457022o1801418J67886706
$$ -43917181 88351972 60568984 21096178 28150369 -39306653 -101108071 66778635
4518F6778635j29251475J91581022p3544739j26717338J97847231l529551j60146555
$$ 66778635 -62472840 129108182 55563443 -71153895 126693336 123163785 -36982770
4511c6982770K2681649K6547283n6156220K1991262q9520996M1110586P4219631o0124436
$$ -36982770 -14301121 12246162 -43910058 -21918796 -111439792 -70329206 3890425 -56234011
4503e6234011P0999305l7440946N9473722n6807986j12664726J98035831j50978071
$$ -56234011 14765294 -22675652 36798070 -20009916 -132674642 65361189 -85616882
4496h5616882q9516253J42232002p0399826O0600085n8694174K38382116k5378916
$$ -85616882 -175133135 -32901133 -103300959 -42700874 -101395048 136987068 111608152
4489A11608152j57505467K67524401k18737797J55055997k26664176Q4736385l1634564
$$ 111608152 -45897315 221627086 2889289 157945286 -68718890 16017495 -15617069
4482a5617069P2564930j38996273m7791339J69105885l7785026K7833833P9898192l605738
$$ -15617069 56947861 -82048412 -129839751 39266134 1481108 29314941 109213133 105607395
4474A05607395l6960620O1997763j00610607j04431856j0459804K1992975P6469013
$$ 105607395 68646775 130644538 30033931 -74397925 -84857729 -62864754 13604259
4467A3604259j15562534J35657562j51244607L7159647M3445540O596357K85050201
$$ 13604259 -101958275 33699287 -117545320 -80385673 -36940133 -30343776 254706425
4460B54706425j26404347R3188723p3531226j91135347O5782366m137237N6044793
$$ 254706425 128302078 221490801 147959575 -43175772 22606594 18469357 74514150
4453G4514150J23914351k18455223m2488666J14464561Q1247420j93312078L82075858
$$ 74514150 198428501 -20026722 -62515388 51949173 133196593 -60115485 321960373
4446C21960373J83812388j93073645j53947878j29156763m9485759J02740940k7194427
$$ 321960373 505772761 312699116 158751238 29594475 -19891284 82849656 55655229
4439E5655229J8341278n4343768n1832882j13565397Q6274483Q2668474j75792664
$$ 55655229 73996507 19652739 -32180143 -145745540 -59471057 23197417 -152595247
4432a52595247K69068571p2847452o3580752j93158152k8935682K05713216k0644200
$$ -152595247 116473324 43625872 -19954880 -213113032 -242048714 -36335498 -56979698
4425e6979698m2938621J1565753o3539210Q773865j43359041L05099204j740197k13882881
$$ -56979698 -99918319 -88352566 -151891776 -143117911 -286476952 18622252 16882055 -197000826
4417a97000826O7650975K27474978q1213367j6421442Q8982649j96692762J37066824
$$ -197000826 -129349851 98125127 16911760 490318 89472967 -107219795 29847029
4410B9847029m4913948o8889568P3300796k6468862j12072139J33331460r7051037
$$ 29847029 -15066919 -83956487 -10655691 -37124553 -149196692 -15865232 -112916269
4403a12916269M7337347Q5308501L0774945N1224571j53941829p2465000J04070322
$$ -112916269 -65578922 19729579 50504524 101729095 -52212734 -124677734 -20607412
4396b0607412o0598201n4190468P5020350J5456734K674632J18281391O7588166l1915634
$$ -20607412 -81205613 -135396081 -60375731 -44918997 -42244365 76037026 143625192 111709558
4388A11709558p1627363K8102467l6273915p0287111J11708536P792276r1768649
$$ 111709558 40082195 68184662 31910747 -38376364 73332172 81124448 -10644201
4381a0644201J25162082j84601292N4522494r5119430J71590138J5137583l8199401
$$ -10644201 114517881 -70083411 -15560917 -110680347 60909791 76047374 37847973
4374C7847973J4562977p6123950L0513109k05662682J40891281K15697961j47658762
$$ 37847973 52410950 -23713000 6800109 -198862573 -57971292 157726669 10067907
4367A0067907m2142918K9919990q2881890p8365289K07821841j42795673K36783626
$$ 10067907 -32075011 -2155021 -85036911 -163402200 44419641 -98376032 138407594
4360A38407594j76068539k54222274K62029862o8351287m697292K8728335J44438807
$$ 138407594 -37660945 -291883219 -29853357 -98204644 -102901936 -74173601 70265206
4353G0265206p7236873J5121700m6112952P1604818L896520J7061941q4723703R4919610
$$ 70265206 -6971667 8150033 -37962919 33641899 37538419 54600360 -30123343 64796267
4345F4796267j06375691n0255741J83423640m0870185j34445257Q8073789L6313282
$$ 64796267 -41579424 -91835165 91588475 50718290 -83726967 4346822 40660104
4338D0660104j9941044P9276227J01284848j84407118q9856707P3104345j62998051
$$ 40660104 20719060 99995287 201280135 16873017 -72983690 120655 -162877396
4331a62877396K17290031j91634470K17581948P51114m8918465j07069924L0672651
$$ -162877396 54412635 -137221835 80360113 81111227 32192762 -74877162 -44204511
4324d4204511L0247882K3889288m6925951K1784025M6723293j51221206J04073028
$$ -44204511 -13956629 9932659 -36993292 -15209267 31514026 -119707180 -15634152
4317a5634152n7630364O9734399j0238307J58761164k23249726O2046J09889399j63920712
$$ -15634152 -73264516 -3530117 -13768424 144992740 -78256986 -78194940 31694459 -132226253
4309a32226253J83571672k2791305J461178n9036396P4646337l8832972o0202778J1388048
$$ -132226253 51345419 28554114 30015292 -29021104 45625233 6792261 -53410517 -42022469
4301d2022469l7547794K5845398J86824488j72596228Q883840J17731597j47814699
$$ -42022469 -79570263 -53724865 133099623 -39496605 -30612765 87118832 -60695867
4294f0695867J56820292j45206748O2098830n3862301R9728520J3718796n5277898
$$ -60695867 96124425 -49082323 13016507 -40845794 58882726 72601522 17323624
4287A7323624o8577173L687013N1239442N3322914Q6343814n1786525m2481602l9480652
$$ 17323624 -51253549 -47566536 3672906 56995820 143339634 91553109 49071507 9590855
4279I590855j33309689Q4315947L7706997M4694077j75951005K27989610k10988874
$$ 9590855 -123718834 -39402887 -1695890 42998187 -132952818 95036792 -115952082
4272a15952082J1089127Q7965080J0077013j15910342Q1355438J44809121k5918815
$$ -115952082 -104862955 -16897875 -6820862 -122731204 -41375766 103433355 77514540
4265G7514540j75018410P0550112r3987779J02222135p0666163o2076876M9753753
$$ 77514540 -97503870 -26953758 -120941537 -18719402 -89385565 -151462441 -101708688
4258a01708688J58878311j56270790J35389886o1893987j03708590K76032318l7426149
$$ -101708688 57169623 -99101167 36288719 -25605268 -129313858 146718460 109292311
4251A09292311j87174099n2972923J54578107k9428604R0654380j41239011L8300579
$$ 109292311 -77881788 -130854711 23723396 -5705208 84949172 -56289839 -17989260
4244a7989260J05196429O4359247j23416545p5633802M0162444M0586965n8162107
$$ -17989260 87207169 151566416 28149871 -47483931 -7321487 33265478 -24896629
4237b4896629O9809029k9011986j86107835K02878841O7796312j32905266J0331709
$$ -24896629 44912400 15900414 -170207421 32671420 100467732 -32437534 -22105825
4230b2105825m1102784m5330890L10346808k62654661M0074309p0957319p6558541
$$ -22105825 -63208609 -108539499 201807309 -60847352 -20773043 -91730362 -168288903
4223a68288903J49138399l5102681J20553030j06661020N8186436P0518767k45163441
$$ -168288903 -19150504 -54253185 66299845 -40361175 17825261 88344028 -156819413
4216a56819413J52213344j64471874J85823172M1693265j25467035J65899190k56710332
$$ -156819413 -4606069 -169077943 16745229 58438494 -67028541 98870649 -157839683
4209a57839683L7684812K22887683j22270060O508439K3283922r716812m2552397K4014579
$$ -157839683 -120154871 102732812 -19537248 -13028809 10255113 538301 -42014096 -17999517
4201a7999517M0075741Q760897N5638289J2648887n0182018L4244382q9118581O4686289
$$ -17999517 22076224 30837121 86475410 99124297 48942279 83186661 -5931920 58754369
4193E8754369m5665458J03177407k18673484K18677608j78172120O0424623Q6879475
$$ 58754369 13088911 116266318 -102407166 116270442 -61901678 -1477055 85402420
4186H5402420r0035525n7295095J1027653O7727956j68066186P9719892J4637314
$$ 85402420 -4633105 -61928200 -50900547 16827409 -151238777 -71518885 -56881571
4179e6881571j12507066J05839053m146277N2895848p0899529j6672228K4545578P6502428
$$ -56881571 -169388637 -63549584 -67695861 -14800013 -85699542 -102371770 -77826192 -1323764
4171a323764J5612887j77375885L8050989K20662402j10939917j38320076K32301996
$$ -1323764 14289123 -163086762 -125035773 95626629 -15313288 -153633364 78668632
4164G8668632k09243275k052993J03253307J4258437L386061J8148795L4728707n2534450
$$ 78668632 -130574643 -132627636 -29374329 -15115892 -11729831 6418964 41147671 -11386779
4156a1386779n966236J49926068k22259103J29395741r6064341J9212483L6415924
$$ -11386779 -17353015 132573053 -89686050 39709691 -56354650 -37142167 -726243
4149g26243p2700054R4054738K2301454j16681380Q7186783N2625982j68906245J53570738
$$ -726243 -73426297 20628441 42929895 -73751485 13435298 66061280 -102844965 50725773
4141E0725773n0844216O1562779m684922m5876125j13095349M4129935J32027155K9036337
$$ 50725773 -118443 61444336 56759414 10883289 -102212060 -58082125 73945030 102981367
4133A02981367R5364685k63432384J17102302m0752530O7322697J32736471j33433071
$$ 102981367 198346052 -65086332 52015970 11263440 78586137 211322608 77889537
4126G7889537n1772923O9424329o3844969J53316145j52268162K8597850j51122216
$$ 77889537 26116614 95540943 31695974 185012119 32743957 61341807 -89780409
4119h9780409J95663326n3959336m5943354k7297343M0351470K3571170j34978953
$$ -89780409 105882917 51923581 5980227 -21317116 19034354 42605524 -92373429
4112i2373429J30501012m0821853J43840086k60159638J50011867j28538994p9377420
$$ -92373429 38127583 -2694270 141145816 -119013822 30998045 -97540949 -176918369
4105a76918369J6605526J31236480Q0687839j64148164P4799656J66092441j75363532
$$ -176918369 -160312843 -29076363 51611476 -112536688 -37737032 128355409 -47008123
4098d7008123j2702279J63261888j07767176r4179355O315815J6693979O6747869
$$ -47008123 -59710402 103551486 -4215690 -98395045 -92079230 -75385251 -8637382
4091h637382J94402041j68223833L3934672Q0260371j09258546o716334n7737069M6740290
$$ -8637382 185764659 17540826 51475498 131735869 22477323 15760989 -41976080 4764210
4083D764210q3521365J17042827k3109748J02462223k30520004R7238860j1242721
$$ 4764210 -78757155 38285672 15175924 117638147 -112881857 -15642997 -26885718
4076b6885718J82685403q9243187j14003485p5924925K7477997J8915395L7097751
$$ -26885718 155799685 66556498 -47446987 -123371912 -95893915 -76978520 -39880769
4069c9880769R1279700j30051588N2408662Q5005819k829171o4499643M1438047K7734554
$$ -39880769 51398931 -78652657 -26243995 58761824 55932653 -8566990 32871057 60605611
4061F0605611l9233367j48000476K4355820P3869026J40150147p9844521j6665977
$$ 60605611 21372244 -126628232 -102272412 -28403386 111746761 31902240 15236263
4054A5236263P9560381j22145091N1726594L3436120O8791538j9133425j41246332
$$ 15236263 94796644 -27348447 24378147 57814267 126605805 107472380 -33773952
4047c3773952P0084809r5953515J62065967K4521454k09072605J32887926K2067562
$$ -33773952 36310857 -59642658 102423309 126944763 -82127842 50760084 72827646
4040G2827646j19662048j85492976K63217528n1449540J32025968j49646448J4387017
$$ 72827646 -46834402 -232327378 30890150 -20559390 111466578 -38179870 -23792853
4033b3792853n049323r5994016M6518206J06071673L7767857k01983264J35576416
$$ -23792853 -28842176 -124836192 -78317986 27753687 65521544 -136461720 -885304
4026h85304K4087263N8580185k55439611K24212493q1286701j8660535J15351283o1906800
$$ -885304 23201959 81782144 -173657467 50555026 -30731675 -49392210 65959073 4052273
4018D052273J1101354r2748945P2659364K0288974O9425921j03007585J20997403o2489003
$$ 4052273 15153627 -77595318 -4935954 15353020 84778941 -18228644 102768759 40279756
4010D0279756l3714345n1166377J1707985J5413084J49393848n4565788j86937726
$$ 40279756 6565411 -44600966 -32892981 -17479897 131913951 77348163 -109589563
4003a09589563L12892773j67964486N1064742r6128189O487792Q6183343j14323928
$$ -109589563 203303210 35338724 86403466 -9724723 -3236931 82946412 -31377516
3996c1377516Q3408459r1368200m3140794L437476L9641832L5565605K4273685n2473223
$$ -31377516 52030943 -39337257 -82478051 -79040575 -39398743 -3833138 20440547 -32032676
3988c2032676J9214872M9747029o5903744j55892427M1325099J09687326m9921762
$$ -32032676 -12817804 36929225 -28974519 -184866946 -143541847 -33854521 -83776283
3981h3776283K8950741J16682314j29486388N5431194K9292730p2588331L1754419
$$ -83776283 -54825542 61856772 -67629616 -12198422 17094308 -55494023 -23739604
3974b3739604M4114317M9075767n1793101J17050639k47019120J64887672p43809p924309
$$ -23739604 20374713 69450480 17657379 134708018 -112311102 52576570 51832761 43908452
3966D3908452L1934359M2593987q7300194k6146309j5065048J0404164Q3857326j03538344
$$ 43908452 75842811 118436798 31136604 4990295 -10074753 329411 84186737 -19351607
3958a9351607J35980456j15289360M601676q141161N9531652l8307603j86711947Q7525997
$$ -19351607 116628849 1339489 5941165 -2199996 57331656 19024053 -167687894 -80161897
3950h0161897J24618307k93595824K65171620j16730033R9170018j36558643J41760143
$$ -80161897 44456410 -249139414 16032206 -100697827 -1527809 -138086452 3673691
3943C673691j39368310K34444142j64333227k1276772j107113J12238416k3745333
$$ 3673691 -135694619 98749523 -65583704 -86860476 -87967589 24270827 525494
3936E25494R3792595j07730717j03028856K51173317k01063866k2091613m9311134
$$ 525494 94318089 -13412628 -116441484 134731833 -66332033 -88423646 -137734780
3929a37734780J43221302l6041232K26092232j935394k06686522m2967278Q6673409
$$ -137734780 5486522 -30554710 195537522 193602128 -13084394 -56051672 30621737
3922C0621737J07153902r6652495m6571886O8308878j5440703k7663292o8101316
$$ 30621737 137775639 41123144 -5448742 62860136 47419433 19756141 -48345175
3915d8345175J45529742o2461506m9443651J25004102j74977451N8900174l5488435
$$ -48345175 97184567 34723061 -14720590 110283512 -64693939 -5793765 -41282200
3908d1282200j5582741J25559812j45879566p2965608J80444448P3575149j15867712
$$ -41282200 -56864941 68694871 -77184695 -150150303 30294145 103869294 -11998418
3901a1998418O6023406o3215876p131718j11780951Q1903338Q0035877k40273699
$$ -11998418 54024988 -9190888 -16322606 -128103557 -46200219 33835658 -206438041
3894b06438041K97225712j40139004L1355858j58803622Q7146453L14206307k11940534
$$ -206438041 90787671 -49351333 -17995475 -176799097 -89652644 224553663 12613129
3887A2613129J02852187j92492623N287682J44523403j5866716J0890390l4963301q199951
$$ 12613129 115465316 -77027307 -71739625 72783778 56917062 67807452 32844151 24644200
3879B4644200n8732373J61418358q6451626j80873570J91019387R5047384j41825669
$$ 24644200 -34088173 127330185 40878559 -139995011 51024376 146071760 4246091
3872D246091L7276671q5605565J06163070M5154041p4495102P5268225J2445054q1347727
$$ 4246091 41522762 -44082803 62080267 107234308 32739206 108007431 120452485 39104758
3864C9104758r4480976J74077960r6015250n9111647N3513769j05882420J00398526
$$ 39104758 -55376218 118701742 22686492 -36425155 17088614 -88793806 11604720
3857A1604720J07053640o4872125Q3461894j25149605j43045832J27682234K6670979
$$ 11604720 118658360 53786235 137248129 12098524 -130947308 -3265074 23405905
3850B3405905j70957855O0266846J39209850j341756K0508970k03974624l7125713
$$ 23405905 -147551950 -87285104 51924746 50582990 71091960 -132882664 -170008377
3843a70008377Q2576394J74812816n4145289j3134982m277141m2193645j6974674N3078719
$$ -170008377 -87431983 87380833 33235544 20100562 15823421 -26370224 -43344898 9733821
3835I733821q122388j10608787K05677371k15464325p145314o5144406Q1192602R1256308
$$ 9733821 1611433 -108997354 96680017 -118784308 -125929622 -191074028 -109881426 -18625118
3827a8625118Q6795260m7601712j33231387K21300066l4435464k99727403J34099337
$$ -18625118 68170142 20568430 -112662957 108637109 74201645 -225525758 -91426421
3820i1426421Q2459405n3756458M4335557j30216892Q622184J66428393K8086391L5158079
$$ -91426421 -8967016 -62723474 -18387917 -148604809 -139982625 26445768 54532159 89690238
3812H9690238j9182990r1874980J41619624k0568599j45972636O5068573j13011936
$$ 89690238 70507248 -21367732 120251892 99683293 -46289343 18779230 -94232706
3805i4232706J49133115L9710051j9125673j12430266J2911423J19930624l0653666
$$ -94232706 54900409 94610460 75484787 -36945479 -24034056 95896568 65242902
3798F5242902o8153439J4234576k7601215J14053392Q3954520k23165570P0201289
$$ 65242902 -2910537 11324039 -16277176 97776216 181730736 -41434834 28766455
3791B8766455j25548792O0722958j6161983l6654070J71696028j76751196J45564558
$$ 28766455 -96782337 -36059379 -52221362 -88875432 82820596 -93930600 51633958
3784E1633958n5966120O4802652q8212322J138391k650270P3017602J3599995m6370807
$$ 51633958 -4332162 60470490 -27741832 -26603441 -29253711 43763891 57363886 10993079
3776A0993079o335665l5267415K0166220J71428716j64818274l2091469M4304301n8977220
$$ 10993079 4657414 -30610001 -10443781 160984935 -3833339 -35924808 8379493 -50597727
3768e0597727n8483005k5479563K53389676j26831783j7317827J76123294N083181
$$ -50597727 -109080732 -134560295 118829381 -8002402 -25320229 150803065 155886246
3761A55886246q6133398p3233965K8608276N2622990j02091940j10742630R5253336
$$ 155886246 69752848 -3481117 25127159 77750149 -24341791 -135084421 -39831085
3754c9831085p297476K0627197K72030318j31922850J40740292j26365142K9716617
$$ -39831085 -47128561 -26501364 245528954 113606104 254346396 127981254 157697871
3747A57697871l5946822K7799963k01658276J29262092j1734798m8815433j2343091
$$ 157697871 121751049 149551012 -52107264 77154828 65420030 16604597 4261506
3740D261506J78709632r6020919j00694265l5515131K9725902j7338036P0348479
$$ 4261506 182971138 86950219 -13744046 -49259177 -19533275 -36871311 33477168
3733C3477168j02134557P0666378J11082839k18194556J90760802j27979349J23099681
$$ 33477168 -68657389 2008989 113091828 -105102728 85658074 -42321275 80778406
3726H0778406k17811210K31484991j51303399j5436549m62289014M33335401P60802883
$$ 80778406 -137032804 94452187 -56851212 -72287761 -534576775 -101241374 659561509
3719F59561509l44949964J09970660j87532231K4402832R0841146r6894262j86324970
$$ 659561509 314611545 424582205 237049974 261452806 352293952 255399690 69074720
3712F9074720K19013351l11982059K68331705k39285424K05627813J71163627K6293393
$$ 69074720 288088071 -23893988 244437717 5152293 210780106 381943733 408237126
3705D08237126J739246521j186564316o93881210o7519706j80762703J61629781L1628833
$$ 408237126 2147483647 960919331 267038121 199518415 18755712 180385493 212014326
3698B12014326j06317022o1609408K4634611R971176J500762j3145143L69165833
$$ 212014326 105697304 44087896 68722507 78693683 80194445 67049302 436215135
3691D36215135j80426209J63773794k58651363o22497131J52311485K5532030J42145632
$$ 436215135 255788926 419562720 160911357 -461585774 -309274289 -283742259 -141596627
3684a41596627N3001882M1508229k18644472J81468054O6114172O2373933O4900061
$$ -141596627 -88594745 -47086516 -265730988 -84262934 -18148762 44225171 109125232
3677A09125232l4467413r0509613q3095647O8827074P2067168l9077820n3387525O1625096
$$ 109125232 74657819 -15851794 -98947441 -30120367 41946801 2868981 -50518544 11106552
3669A1106552n5911161N730252J02719459k262410N8581678j61239629J59093321j4411901
$$ 11106552 -44804609 -39074357 63645102 61382692 119964370 -41275259 117818062 103406161
3661A03406161j14355232R4803659L8019522k7137919j24200914k24293057N947673
$$ 103406161 -10949071 83854588 121874110 94736191 -29464723 -253757780 -247810107
3654b47810107R3921872J16210310j06678621R5176143J05758512o7501586L8755009
$$ -247810107 -153888235 -37677925 -144356546 -49180403 56578109 -10923477 27831532
3647B7831532k9291857j01255429N6383991O4453494J6953045q9103436L9986098
$$ 27831532 -1460325 -102715754 -46331763 18121731 35074776 -54028660 -14042562
3640a4042562j43913715J91880631N181371o3191696O9571157L7952233n5394900L3097619
$$ -14042562 -157956277 33924354 39105725 -24085971 45485186 83437419 28042519 61140138
3632F1140138l5984334J00110977r8413889J16530064j41440294J04195951l7554633
$$ 61140138 25155804 125266781 26852892 143382956 1942662 106138613 68583980
3625F8583980p0922876j24285136R5786145J9320210L9765967P765571o7029644O0695488
$$ 68583980 -2338896 -126624032 -30837887 -11517677 28248290 36013861 -31015783 29679705
3617B9679705j4075063R9681155J2895654j41197825J36761887p2357169o5042937
$$ 29679705 15604642 115285797 128181451 -13016374 123745513 51388344 -13654593
3610a3654593J00290046j07651790K30124173j31404826P8556789k2719691q6375655
$$ -13654593 86635453 -21016337 209107836 77703010 156259799 133540108 47164453
3603D7164453O6423333l6701667K030464l0073208l3392956J50407337j03941752Q1785114
$$ 47164453 113587786 76886119 78916583 48843375 15450419 165857756 61916004 143701118
3595A43701118o7064718P9389093k09701126r0316108L7567938k0203813J31840546
$$ 143701118 76636400 156025493 -53675633 -143991741 -106423803 -126627616 5212930
3588E212930o6655956K541622J2050905M1789905j604881L1633219j16058636J08563416
$$ 5212930 -61443026 -58901404 -46850499 -5060594 -6665475 24967744 -91090892 17472524
3580A7472524r4544939O0035508r1280143q3013796L15951694j30443965L8856324
$$ 17472524 -77072415 -17036907 -108317050 -191330846 124620848 -5823117 33033207
3573C3033207q9494691K4170525L81147924j49535612j23555501j07771935n5657497
$$ 33033207 -56461484 -32290959 348856965 199321353 75765852 -32006083 -87663580
3566h7663580R4699073k8962702J38999178j00843214J08530411j25385876Q571226
$$ -87663580 7035493 -21927209 117071969 16228755 124759166 -626710 7944516
3559G944516M8618340o562254l9838573M8580021L9852789q0167833L5578657J94878721
$$ 7944516 56562856 50000602 10162029 58742050 98594839 18427006 54005663 248884384
3551B48884384k28888560R1410949k7608284l2786552m3371654j84429487J65968917
$$ 248884384 19995824 111406773 83798489 51011937 7640283 -176789204 -10820287
3544a0820287K9825530q189837M2599919q0235945J0050990J23290217n9417970l755314
$$ -10820287 19005243 10815406 53415325 -26820620 -16769630 106520587 47102617 43347303
3536D3347303j18723252R8832731o7972472M04357L6963143O1501301j12722515Q1806051
$$ 43347303 -75375949 23456782 -44515690 -44111333 -7148190 54353111 -58369404 23436647
3528B3436647j00478590R8801462j23102643Q5790899R2332231P6638876l2620519
$$ 23436647 -77041943 21759519 -101343124 -15552225 76780006 153418882 120798363
3521A20798363j38009831Q463374o1440596O5122556J20884520j5984167j27499042
$$ 120798363 -17211468 -8748094 -70188690 -5066134 115818386 99834219 -27664823
3514b7664823J05112853M6049359j20921830P4618997N2631693j23325730J70719646
$$ -27664823 77448030 123497389 2575559 77194556 129826249 6500519 177220165
3507A77220165j53988890k1092446p0656685J51618863l9123418R8035837l01541441
$$ 177220165 23231275 2138829 -68517856 83101007 43977589 142013426 -159528015
3500a59528015K7896419L9231111J14293362J12127438k96921535k6874623R8019733
$$ -159528015 -131631596 -92400485 21892877 134020315 -162901220 -189775843 -91756110
3493i1756110j36119034J98279721Q0218112l357978l10147163L34058043l3661937
$$ -91756110 -227875144 -29595423 50622689 47264711 -262882452 71175591 37513654
3486C7513654j1756531j08481410J13453429j15868655q7400488M3682929O9481681
$$ 37513654 25757123 -82724287 30729142 -85139513 -172540001 -128857072 -59375391
3479e9375391K61613001p3908724k0679683L6481539j4499219j58642033R2793562
$$ -59375391 202237610 128328886 107649203 144130742 129631523 -29010510 63783052
3472F3783052M4759983k12443415K00837749p303341j19138468r9816413J51322385
$$ 63783052 108543035 -103900380 96937369 89634028 -29504440 -129320853 22001532
3465B2001532R1137234p0382757O2335648k69022612J25092676j3630825J2659666
$$ 22001532 113138766 42756009 105091657 -163930955 -38838279 -52469104 -39809438
3458c9809438l3639049j3634794j07842503J83801175p1001909N0475869J23234189
$$ -39809438 -73448487 -87083281 -194925784 -11124609 -82126518 -31650649 91583540
3451I1583540j23295243J3601682J8838310m3070203Q167215J05923341m6064392
$$ 91583540 -31711703 -18110021 728289 -42341914 -34174699 71748642 25684250
3444B5684250J79082491q1580691l7805611j35796028J40168651N2717060j92494964
$$ 25684250 204766741 123186050 85380439 -50415589 89753062 142470122 -50024842
3437e0024842O2414389l6620216Q8696757J0906521p484290l4685025n3667604m623535
$$ -50024842 12389547 -24230669 64466088 75372609 67888319 33203294 -20464310 -25087845
3429b5087845O7607652P194839j5982673r6307112J81483562j93131462o7479997Q4161949
$$ -25087845 42519807 49714646 33731973 -62575139 118908423 -74223039 -141703036 -57541087
3421e7541087J68223766j25184682K240778j21827606R3477576J4107140K85558427
$$ -57541087 110682679 -14502003 -12261225 -134088831 -40611255 -26504115 259054312
3414B59054312J36128767m6892514j21106583j84824842J12099555o1659211L5414346
$$ 259054312 395183079 348290565 227183982 42359140 154458695 92799484 128213830
3407A28213830k2614281j9658414O5192816j19339038R9962551J47507860O4121407
$$ 128213830 105599549 85941135 151133951 31794913 131757464 279265324 343386731
3400C43386731J15128002P68975940q25635737m92829445n2304121O6400806L9489450
$$ 343386731 458514733 1227490673 401854936 -90974509 -143278630 -76877824 -37388374
3393c7388374r596110j05454297L8935444R1586100j2503764o7509746Q5711888j840442
$$ -37388374 -46984484 -152438781 -113503337 -21917237 -34421001 -101930747 -16218859 -18059301
3385a8059301J3611698q1957737k62505928m9242290K02051447M3257680L7782163
$$ -18059301 -4447603 -86405340 -348911268 -398153558 -196102111 -152844431 -115062268
3378a15062268J39962200j35186392K0399530P4510121q0705600P2650024m0880255
$$ -115062268 24899932 -110286460 -89886930 -15376809 -96082409 -23432385 -64312640
3371f4312640O6898266j82346669K74868836q0627955Q1245930J7760048j23084569
$$ -64312640 2585626 -179761043 95107793 14479838 95725768 113485816 -9598753
3364i598753M7573323n4685278J56913941j09924524J0938557L1019690q8613234L6823864
$$ -9598753 37974570 -16710708 140203233 30278709 41217266 72236956 -16376278 20447586
3356B0447586N8847558J4404903J9420027j0688993K1371040j78873097k20232585
$$ 20447586 79295144 93700047 113120074 102431081 123802121 -55070976 -275303561
3349b75303561J64507720J74183323j25408783J73957721j74297885p655570K3159537
$$ -275303561 -110795841 63387482 -62021301 111936420 -62361465 -70017035 -46857498
3342d6857498J72060566j24447309L5996388O5324997q5702579M0618454j13062706
$$ -46857498 125203068 755759 36752147 102077144 16374565 56993019 -56069687
3335e6069687P8835127j16598991J06812217j20005504P8225938n8231121j22857318
$$ -56069687 22765440 -93833551 12978666 -107026838 -28800900 -87032021 -209889339
3328b09889339K73628117K5814548l8969702m0047623m885820N8600967M0406455
$$ -209889339 63738778 89553326 50583624 10536001 5650181 64251148 104657603
3321A04657603k16149589K4875504j4885757J279958O1145730r4443908K01255030
$$ 104657603 -111491986 -86616482 -101502239 -100222281 -39076551 -133520459 67734571
3314F7734571j41899566J92448631l8588533k5301653j39449208J9900702j8930311
$$ 67734571 -74164995 118283636 79695103 54393450 -85055758 -65155056 -84085367
3307h4085367L2864544j22965425J86928246q321807q421756L7480890p8702317J27056544
$$ -84085367 -51220823 -174186248 12741998 4420191 -4001565 33479325 -45222992 81833552
3299H1833552j92693328J06206777p5113501j0477963m1754044J30065945p1826121
$$ 81833552 -110859776 -4652999 -79766500 -90244463 -131998507 -1932562 -73758683
3292g3758683l7047090Q3815862P5310099M4462099o5864216o9885755J1595646j68986207
$$ -73758683 -110805773 -26989911 48320188 92782287 26918071 -42967684 -31372038 -200358245
3284b00358245K03286707p8357939k6284284K5069286j0409285K3755136R6433308
$$ -200358245 2928462 -75429477 -101713761 -76644475 -87053760 -63298624 33134684
3277C3134684l4400472m2594227J07699444j07860621J8549711K3788563n5323107
$$ 33134684 -1265788 -43860015 63839429 -44021192 -25471481 -1682918 -57006025
3270e7006025j0388485N1768674J37552378q4757348j13311256J24271546j14310188
$$ -57006025 -67394510 -15625836 121926542 37169194 -76142062 48129484 -66180704
3263f6180704K3595674J10778065r9837555Q9382678k3824559k9888489L719937K0677963
$$ -66180704 -42585030 68193035 -31644520 57738158 33913599 4025110 7745047 28423010
3255B8423010J13047767k33218961K23629942m8783362j69155051J21019991m9432125
$$ 28423010 141470777 -91748184 131881758 83098396 -86056655 34963336 -14468789
3248a4468789l2820728k7489952R7830460l4252648J42086756j06131403J92437832
$$ -14468789 -47289517 -74779469 23050991 -11201657 130885099 24753696 217191528
3241B17191528k26770295j3231149p6869613J43872994q5040641J35225607j52423741
$$ 217191528 -9578767 -22809916 -99679529 44193465 -40847176 94378431 -58045310
3234e8045310n87323Q1271348j45499447K02486718j01039597J26171762j6275471
$$ -58045310 -58632633 22638715 -122860732 79625986 -21413611 104758151 88482680
3227H8482680j17084684J4225064n3982842P356606n0787444p1701854J77152818
$$ 88482680 -28602004 -14376940 -68359782 -61003176 -111790620 -183492474 -6339656
3220f339656j62282863J16709281Q9892276j49783681J72387793o0628702n7037753
$$ -6339656 -168622519 -51913238 37979038 -111804643 60583150 -45552 -57083305
3213e7083305O391378L8849623L5268554j57001091K21974855j18058872R7939807
$$ -57083305 -50691927 -11842304 23426250 -133574841 88400014 -29658858 68280949
3206F8280949j26377945J96824487r3405423p7062417N0022199r6582561J9757866
$$ 68280949 -58096996 138727491 45322068 -31740349 18281850 -78300711 -58542845
3199e8542845J14822173o2940232O1285070L6060176l5297916r436660O8105221j14248856
$$ -58542845 56279328 -6660904 54624166 90684342 55386426 45949766 114054987 -193869
3191a93869N0301081Q0338069r6863025n3561381n510618K2145155q026164j02262968
$$ -193869 50107212 130445281 33582256 -19979125 -25489743 -3344588 -11370752 -113633720
3183a13633720J28294204L9712643k4684019j22792291Q4003975o0076495J63597714
$$ -113633720 14660484 54373127 29689108 -93103183 -9099208 -69175703 94422011
3176I4422011j23993849j8885553q0110665N5975694J5388513K5043683r6101341N3284412
$$ 94422011 -29571838 -48457391 -128568056 -72592362 -57203849 -32160166 -128261507 -74977095
3168g4977095R5941529j35380363N5925987p3376235P3942631J15782135n0356646
$$ -74977095 20964434 -114415929 -58489942 -131866177 -57923546 57858589 7501943
3161G501943k8162611j56316823P8855160N0750840L7712137K0256347L5726228r8320768
$$ 7501943 -20660668 -176977491 -98122331 -47371491 -9659354 10596993 46323221 -51997547
3153e1997547j1244166N6071063m3635378L8710836J2533291J58443906r0344628j8787120
$$ -51997547 -63241713 -7170650 -50806028 -12095192 438099 158882005 68537377 49750257
3145D9750257l6585215M9004971L5991156K4362367n8911525k93245P4619468k17880700
$$ 49750257 13165042 62170013 98161169 122523536 63612011 63318766 137938234 -79942466
3137g9942466j18768057J06176102J43531773N0687041J2452583r676742n1333166
$$ -79942466 -198710523 -92534421 50997352 101684393 114136976 104460234 53127068
3130E3127068R6687290q5210846k72615348J21745884k8303558P7673650J06115334
$$ 53127068 149814358 64603512 -208011836 -86265952 -114569510 -36895860 69219474
3123F9219474j87563433L5765959J9954483J37402685O1064871p8804601o0349713
$$ 69219474 -118343959 -82578000 -62623517 74779168 135844039 57039438 -3310275
3116c310275Q5386856j1256853j49169964r7732320K48474893k8479905l8499244M1749110
$$ -3310275 82076581 70819728 -78350236 -176082556 72392337 43912432 5413188 47162298
3108D7162298j7449555K3149258p6470944J7857184j9555904o512706k5274231J3863397
$$ 47162298 29712743 52862001 -23608943 -5751759 -25307663 -31820369 -57094600 -43231203
3100d3231203P6239129k43244122M53069653l07974201L2836792p1855056L5779662
$$ -43231203 33007926 -210236196 242833457 -65140744 -32303952 -104159008 -68379346
3093f8379346k2287866J47419851j88538060Q1231818m6162732J30183979m8317390
$$ -68379346 -90667212 56752639 -131785421 -50553603 -96716335 33467644 -14849746
3086a4849746P4075569j39882381m3590560J22651967r4882100N8920276l4572545
$$ -14849746 59225823 -80656558 -124247118 -1595151 -96477251 -37556975 -72129520
3079g2129520N9309431O938087M8975434j10389685J13855957j2071903k9759628O3950555
$$ -72129520 -12820089 -5882002 43093432 -67296253 46559704 34487801 4728173 68678728
3071F8678728q7539888m6423252R4607054J0001862j08724432L04791858r4421960
$$ 68678728 -18861160 -65284412 29322642 39324504 -69399928 235391930 140969970
3064A40969970j84414542N7410085l5352103M1007983M3304997J9601758l5412306
$$ 140969970 -43444572 13965513 -21386590 19621393 62926390 82528148 47115842
3057D7115842q6386103Q8131086j16826989J55162079N459126o3000758j12478693
$$ 47115842 -39270261 48860825 -67966164 87195915 92655041 29654283 -82824410
3050h2824410Q2724870l4001288j38826303K47800685j26988892J73031318q4838617
$$ -82824410 -99540 -34100828 -172927131 74873554 -52115338 120915980 36077363
3043C6077363p6393818K2916006J8698744o7804675J05201690j1094520j87241899
$$ 36077363 -40316455 -17400449 1298295 -66506380 38695310 27600790 -159641109
3036a59641109K21573140l8730125l0791054J17018725l6291981j66407542j4549835
$$ -159641109 61932031 23201906 -7589148 109429577 73137596 -93269946 -107819781
3029a07819781J11867517j7499993m3800956m8474130j929217J38191019l0513994
$$ -107819781 4047736 -13452257 -57253213 -105727343 -107656560 30534459 20465
3022B0465j32202205M0471881K1926401J76502540j34678703o8560544j23321953
$$ 20465 -132181740 -91709859 -69783458 106719082 -27959621 -96520165 -219842118
3015b19842118J78084803P0799378M4605906j25215116k9465831P0127688J88270K5697732
$$ -219842118 -41757315 29042063 73647969 -51567147 -81032978 -10905290 -10717020 14980712
3007A4980712o7790682J17272530L220599q8019342M2131434J3366860Q509479j34253024
$$ 14980712 -52809970 64462560 67683159 -20336183 21795251 35162111 43671590 -90581434
2999i0581434K44993656j81395977K4838152l6439365K7690799q0894831J25381585
$$ -90581434 154412222 -26983755 -2145603 -38584968 -10894169 -91789000 33592585
2992C3592585l2435912J1438113k7039244j7592231k8553573J28530081r1489088M2016599
$$ 33592585 1156673 12594786 -14444458 -32036689 -60590262 67939819 -23549269 18467330
2984A8467330l14070j1755293k5322770j13961779J7053957O8315873o2261891k6077696
$$ 18467330 18153260 6397967 -18924803 -132886582 -115832625 -47516752 -109778643 -135856339
2976a35856339J74200420j0976319l5656642l3832660Q9534873j07451142Q9455541
$$ -135856339 38344081 27367762 -8288880 -42121540 47413333 -60037809 29417732
2969B9417732j22934995J02143755J9865076r9412056N0490376Q8604832k1533640
$$ 29417732 -93517263 8626492 28491568 -70920488 -20430112 68174720 46641080
2962D6641080j24003491J53535778k9614017m1018074J2294224r8330790N9921653
$$ 46641080 -77362411 76173367 46559350 5541276 17835500 -80495290 -20573637
2955b0573637P3182390L329701j79451167Q9306588k2414033l8831821M1666380K9674852
$$ -20573637 52608753 55938454 -123512713 -34206125 -56620158 -95451979 -53785599 -24110747
2947b4110747m7981356J21610902O1598226j70961205J34238440q8363941j16304664
$$ -24110747 -72092103 49518799 111117025 -59844180 74394260 -13969681 -130274345
2940a30274345K43936007n1900156j82964493O1796118J01226260n1955462n6475875
$$ -130274345 113661662 61761506 -121202987 -59406869 41819391 -10136071 -66611946
2933f6611946J2057828Q4508993r1696182J64806516l4398127K7936546p7113073m8672311
$$ -66611946 -54554118 29954875 -61741307 103065209 68667082 96603628 19490555 -29181756
2925b9181756l8991039K25565961k76077755K44612050r2422005M129422j39736983
$$ -29181756 -68172795 157393166 -118684589 125927461 33505456 37634878 -102102105
2918a02102105J21673375K20616123k05289676Q664510j69346160J59419371o559002
$$ -102102105 19571270 240187393 34897717 43562227 -125783933 33635438 27076436
2911B7076436l3450521j18769725O8103529j6763659J30539892J8963070p0879264
$$ 27076436 -6374085 -125143810 -57040281 -73803940 56735952 75699022 4819758
2904D819758o6074214M8081959J1078703l6480084m9240257k193125M2729840j0027126
$$ 4819758 -61254456 -13172497 -2093794 -38573878 -87814135 -90007260 -47277420 -57304546
2896e7304546M9373014n7898043n9980935J89485413r4897119k5800349M577046L6239572
$$ -57304546 -7931532 -65829575 -125810510 63674903 -31222216 -57022565 -52445519 -16205947
2888a6205947M9014886J03905144k6839942j02787236Q637677J2717949l8868950O6347693
$$ -16205947 32808939 136714083 109874141 7086905 15724582 28442531 -10426419 55921274
2880E5921274l7786650Q28837P1290455k80950805L19310470q1765129o026273o042723
$$ 55921274 18134624 18963461 90253916 -190696889 128613581 46848452 40822179 34779456
2872C4779456R7890768P6153531l19244924J15441005M4163436j32521343J39552750
$$ 34779456 132670224 208823755 -110421169 5019836 49183272 -83338071 56214679
2865E6214679j1914088p113828Q8404689k53583269J17237870J43046840j4687835
$$ 56214679 44300591 37186763 125591452 -127991817 -10753947 132292893 117605058
2858A17605058r1172450n2312033P1381971k684622k87116932K43054082j09023842
$$ 117605058 26432608 -25879425 45502546 42817924 -244299008 -1244926 -110268768
2851a10268768R3140200p772365P6847235q9749537K230676N2097578M1351387m9159503
$$ -110268768 -17128568 -24900933 51946302 -37803235 -35572559 16525019 57876406 8716903
2843H716903l0166712L1098491M5213487m6768574q9554051l5664705m0332130N2324091
$$ 8716903 -21449809 9648682 54862169 8093595 -81460456 -117125161 -157457291 -105133200
2835a05133200J29052944j68603797K00449139P321804R457640j35193065M2197521
$$ -105133200 23919744 -144684053 55765086 63086890 72544530 -62648535 -20451014
2828b0451014K4867459L7036953J35201870k89926848M9882455L9954113n1320487
$$ -20451014 4416445 41453398 176655268 -113271580 -63389125 -23435012 -74755499
2821g4755499K04938830p1022505j2375965l1788743m8682179J61466536k18215960
$$ -74755499 130183331 59160826 46784861 14996118 -33686061 127780475 -90435485
2814i0435485P5641075N4139894q1093295L6777974l9279425j10769993K87560142
$$ -90435485 -14794410 39345484 -41747811 -4969837 -44249262 -155019255 132540887
2807A32540887k80635301J72429091N9819985j03625241j10814538O2896506J92515688
$$ 132540887 -148094414 24334677 84154662 -19470579 -130285117 -67388611 125127077
2800A25127077q2389337P2874974k65968970K08289199n128850l6715530j46318380
$$ 125127077 42737740 115612714 -150356256 57932943 52804093 16088563 -130229817
2793a30229817J51162945N1928917n9452940n5289468J747839J036577M8036096J19481158
$$ -130229817 20933128 72862045 13409105 -41880363 -40132524 -39095947 8940149 128421307
2785A28421307J21381664j68939826j56532213m2026018K52430874j46650251k87344
$$ 128421307 249802971 80863145 -75669068 -117695086 134735788 -11914463 -12201807
2778a2201807R5745166j80328797J17066979q4528784N0491233J62787q8169410M2502628
$$ -12201807 83543359 -96785438 20281541 -64247243 -13756010 -13593223 -101762633 -59260005
2770e9260005L0966113j42702265P3176950J8790472L1606190J8331407P8636845r5485164
$$ -59260005 -28293892 -170996157 -97819207 -79028735 -47422545 -29091138 49545707 -45939457
2762d5939457r2334301R9625752O233567j2627895R310199J1062100J45041420q3135373
$$ -45939457 -138273758 -38648006 -32414439 -45042334 -35732135 -24670035 120371385 37236012
2754C7236012p2175347R7007553m4104813J94443707l77371257J87061770J9875842
$$ 37236012 -34939335 62068218 17963405 212407112 -164964145 22097625 41973467
2747D1973467o5048511J40434029r0134294M899172j44832984O0996767k8886312j4909955
$$ 41973467 -23075044 117358985 27224691 32123863 -112709121 -51712354 -80598666 -95508621
2739i5508621M1152489k1808197N0085467q7640153K3244521l4277732J34213140n5983697
$$ -95508621 -54356132 -76164329 -26078862 -113719015 -90474494 -124752226 9460914 -46522783
2731d6522783m5719788N7657424p1599472k481122j3281023J59495470J2658075N1307731
$$ -46522783 -92242571 -34585147 -106184619 -108665741 -121946764 37548706 50206781 101514512
2723A01514512k6992879q1508173J08634915o5476268j17792077P3387325J7806740
$$ 101514512 74521633 -6986540 101648375 36172107 -81619970 -8232645 9574095
2716I574095Q3838509L3588023k08496892J81538066N6122149j56999369L2829605
$$ 9574095 93412604 127000627 -81496265 100041801 156163950 -835419 31994186
2709C1994186j2530781q1468434J8559520o0409538k0435778O3243260L415530j42639513
$$ 31994186 19463405 -62005029 -43445509 -103855047 -124290825 -61047565 -57632035 -200271548
2701b00271548L27824916J33141771l54971703J66674322o1255189q3500263k40341600
$$ -200271548 127553368 260695139 -94276564 72397758 11142569 -72357694 -312699294
2694c12699294M08556366N0718999j99175008N0536429m3001137J05754342j6052845
$$ -312699294 95857072 146576071 -52598937 -2062508 -45063645 60690697 44637852
2687D4637852j14887639K81882623L34523547l52942404j14503179o2306135p658372
$$ 44637852 -70249787 211632836 546156383 193213979 78710800 16404665 8746293
2680H746293j55323404J70003002J5582438k2722191q0577837L2987173Q2007529q6069700
$$ 8746293 -146577111 23425891 39008329 16286138 -64291699 -31304526 50703003 -35366697
2672c5366697M656080O0846962J37467177k30652485j14413406j0671679m1072828
$$ -35366697 -30710617 30136345 167603522 -63048963 -177462369 -188134048 -229206876
2665b29206876J4100064l6562821l23449847Q71983837k8528459j13500082q6121509
$$ -229206876 -215106812 -251669633 -575119480 296864357 268335898 154835816 68714307
2658F8714307J67649161j06904287K0383147l9795024j01608795J66049664j23599474
$$ 68714307 236363468 129459181 149842328 110047304 8438509 174488173 50888699
2651E0888699J1428009J95999619k5717692K4872248J173253217l11655332p52516843
$$ 50888699 62316708 258316327 232598635 257470883 1430724100 1119068768 366551925
2644C66551925j52400037j79388974J11842943m5839118j5924080J7258518L68632755
$$ 366551925 214151888 34762914 146605857 100766739 84842659 102101177 470733932
2637D70733932k48913231j33007931K6059198J55400782j94983598K40876779L11394951
$$ 470733932 221820701 88812770 114871968 270272750 75289152 316165931 627560882
2630F27560882r08320752j3152063Q4321375R1811089N3180530j12069302K09436434
$$ 627560882 -280759870 -293911933 -209590558 -117779469 -64598939 -176668241 32768193
2623C2768193l9387894M1085910j17255940J17885515m2131195Q5304809l9606997
$$ 32768193 -6619701 34466209 -82789731 35095784 -7035411 78269398 38662401
2616C8662401m7507251l5154853R7606664l183325j14422228R1806078p5152851N4215423
$$ 38662401 -8844850 -43999703 53606961 50423636 -63998592 27807486 -47345365 6870058
2608F870058J4892744M0728278J1977742O1147421j04816362J22111753q6004046
$$ 6870058 21762802 62491080 74468822 135616243 30799881 152911634 66907588
2601F6907588j29781512K30966518l3499569j59437227o6964939J48371084j44275674
$$ 66907588 -62873924 168092594 134593025 -24844202 -91809141 56561943 -87713731
2594h7713731m1857728J89908340m9846195N7583772l4487590n3720803J38350753
$$ -87713731 -129571459 60336881 10490686 68074458 33586868 -20133935 118216818
2587A18216818j47536684P7721567o182706J03109333j15553741j05035974J76401499
$$ 118216818 -29319866 48401701 42218995 145328328 29774587 -75261387 101140112
2580A01140112p6821085m516889j6917846P5838889n1740092N9394895p4296330p7458366
$$ 101140112 24319027 19802138 2884292 78723181 26983089 86377984 12081654 -65376712
2572f5376712O6932785o617090J32435817j71176471M8225538J02504512p7776947
$$ -65376712 1556073 -5061017 127374800 -43801671 4423867 106928379 29151432
2565B9151432j24189407N5912040j76416551Q8068727K48896378j48882022m8600676
$$ 29151432 -95037975 -39125935 -215542486 -127473759 121422619 -27459403 -76060079
2558g6060079P2345758k1731803j12455883K03784611m7575737M4645403N6040553
$$ -76060079 -3714321 -25446124 -137902007 65882604 18306867 62952270 118992823
2551A18992823j87288018M0201681q0160763J11173220j460291O5467700j27719115
$$ 118992823 -68295195 -28093514 -108254277 2918943 1458652 66926352 -60792763
2544f0792763J01258459p4259383O2745754K1489794L9834028N933436j26837509O3458699
$$ -60792763 40465696 -33793687 28952067 50441861 90275889 96209325 -30628184 32830515
2536C2830515j98738169K75809356o2239408p4846226L989557P3728385l02850621
$$ 32830515 -165907654 109901702 47662294 -27183932 -23194375 50534010 -252316611
2529b52316611K43703799L7630549q2382795R7729442j72747746N6195582m4606293
$$ -252316611 -8612812 29017737 -53365058 44364384 -128383362 -72187780 -116794073
2522a16794073J05411590j39922259J96815672R8442433j39931392q1558389L4107873
$$ -116794073 -11382483 -151304742 45510930 143953363 4021971 -77536418 -43428545
2515d3428545q1180867N0491283K5718614p4456436P7147696O1421183j23227130
$$ -43428545 -124609412 -74118129 -48399515 -122855951 -45708255 15712928 -107514202
2508a07514202J80072549j22625753K2416197n603840J19161509j605646j17939516
$$ -107514202 72558347 -50067406 -27651209 -33255049 85906460 84300814 -33638702
2501c3638702j2416659k8929896n0626784L7341348J39291035Q891898J15946770o6142523
$$ -33638702 -46055361 -74985257 -125612041 -88270693 51020342 59912240 175859010 109716487
2493A09716487N989753l1655287j06260614Q565345K90651207j07307073j93638534
$$ 109716487 115706240 84050953 -22209661 -13644316 277006891 169699818 -23938716
2486b3938716M1911385q311613n8624988J35873523n9115921K1015204p028468m8906872
$$ -23938716 17972669 9661056 -48963932 86909591 27793670 48808874 41780406 -7126466
2478g126466l9471845O5216284j02348081J48099283R6937320j42253750j47032455
$$ -7126466 -46598311 18617973 -83730108 64369175 161306495 19052745 -127979710
2471a27979710M7704391Q8527086m8703253p7277823n6296096k52343071M96490552
$$ -127979710 -80275319 8251767 -40451486 -117729309 -174025405 -426368476 70122076
2464G0122076J87076188j51617764o0602515K3915564R0328674m591068j681506k57160368
$$ 70122076 257198264 105580500 44977985 68893549 159222223 154631155 152949649 -104210719
2456a04210719M0529142J74135036q9034681k1880809K2698576M7665038R99078465
$$ -104210719 -63681577 110453459 21418778 -462031 22236545 69901583 1068980048
2449A068980048l9763600q29927124m4957452j43424568R9742133l6389500n5017982
$$ 1068980048 1029216448 199289324 154331872 10907304 110649437 74259937 19241955
2442A9241955l6863789j7516739J25700609N0612082q9428265k5910099R0905294
$$ 19241955 -17621834 -35138573 90562036 141174118 51745853 25835754 116741048
2435A16741048J63008494K45544591o68667061K8579498q8066276K21954204k8137013
$$ 116741048 279749542 525294133 -143372928 -114793430 -202859706 19094498 -9042515
2428i042515P2864883j272272l3840114R6126402m1216480j3832929n4958627o6920306
$$ -9042515 63822368 62550096 28709982 124836384 83619904 69786975 14828348 -52091958
2420e2091958k0186385p1899397K87495173k9543488k3723231j14558355J78181101
$$ -52091958 -72278343 -144177740 143317433 113773945 90050714 -24507641 153673460
2413A53673460M5887569j75742364k0221455J61451183j39941657q0152869N5485837
$$ 153673460 199561029 23818665 3597210 165048393 25106736 -55046133 439704
2406D39704r5302140J6211340Q0235990K15411734J3626140k08645352p9952015N9410266
$$ 439704 -94862436 -78651096 1584894 216996628 230622768 21977416 -57974599 1435667
2398A435667N8954965q5995746n0335706J12084105q2086995k5533598J12396953
$$ 1435667 60390632 -25605114 -75940820 36143285 -45943710 -71477308 40919645
2391D0919645j37008399O9131905l6656174K18929331j77326556M2791035R0927378
$$ 40919645 -96088754 -26956849 -63613023 155316308 -22010248 20780787 111708165
2384A11708165k06300116R3979676M3081978p6105138J06292443K2022559j78395822
$$ 111708165 -94591951 -612275 42469703 -33635435 72657008 94679567 -83716255
2377h3716255L645679R4374887j77304390J28186090R1083627l1003019M3005532l5336244
$$ -83716255 -80070576 14304311 -163000079 -34813989 56269638 25266619 68272151 32935907
2369C2935907j49829788J3359138q3339235J00473289O3754303Q6231675j62678218
$$ 32935907 -116893881 -103534743 -186873978 -86400689 -22646386 63585289 -99092929
2362i9092929j4544200N9915115p1272190P6559490K0231904j88694N4747350j49092123
$$ -99092929 -113637129 -53722014 -124994204 -48434714 -28202810 -28391504 26355846 -122736277
2354a22736277P9677190M7223769p5383569J23209614r197664N0950461n5345026L7990633
$$ -122736277 -43059087 4164682 -71218887 51990727 42793063 93743524 38398498 76389131
2346G6389131j38056734R450062J18359355j45180368P1866060N7970869j2646750
$$ 76389131 -61667603 -52217541 66141814 -79038554 -7172494 50798375 38151625
2339C8151625q7843325J77229677k43183133K29258302n7799276j28747930K05834535
$$ 38151625 -49691700 127537977 -115645156 113613146 55813870 -72934060 132900475
2332A32900475j24264776j31022329R6030282K2652742J42718496k04017625l7746139
$$ 132900475 8635699 -122386630 -26356348 -3703606 139014890 -65002735 -102748874
2325a02748874J62578458L0122313j43072026J77756970j2276667L5561592m6289180
$$ -102748874 59829584 89951897 -53120129 124636841 112360174 147921766 101632586
2318A01632586j34335392Q403165j9333815j16628397L22749511q1336072j78104813
$$ 101632586 -32702806 -24299641 -43633456 -160261853 162487658 81151586 -96953227
2311i6953227R422197J00027544J86016020j37957730Q353178K09479469l25119742
$$ -96953227 -87531030 12496514 198512534 60554804 68907982 278387451 -46732291
2304d6732291l903971N3784352K6113124j33644199m0277073K91595288j99694686
$$ -46732291 -50636262 3148090 29261214 -104382985 -144660058 146935230 -52759456
2297e2759456n3667268J10443821O5338506N4103209j67299219O6458316l2483184
$$ -52759456 -106426724 4017097 69355603 123458812 -43840407 22617909 -9865275
2290i865275j38252138J53746142O1764747n4189486j9689943j0077078O0803936n0217353
$$ -9865275 -148117413 5628729 67393476 13203990 -6485953 -16563031 44240905 -5976448
2282e976448j3401514k7707369J05456556M3212582k1865759j49525009P5460524J8272430
$$ -5976448 -19377962 -47085331 58371225 101583807 79718048 -69806961 5653563 23925993
2274B3925993K39223592j77557006j4544585j4516398j27056409J75053273j57580986
$$ 23925993 263149585 85592579 71047994 56531596 -70524813 104528460 -53052526
2267e3052526J42872535j13454264N4074182j2028251J57837006k03216515M3904713
$$ -53052526 89820009 -23634255 30439927 18411676 176248682 -26967833 16936880
2260A6936880l9308199Q1606035p7352930j7417078J14603348l05945068L15318197
$$ 16936880 -22371319 59234716 -18118214 -35535292 79068056 -226877012 88441185
2253H8441185j50950561N0295593l8495442K4163780k8198969j2364Q424068l3312286
$$ 88441185 -62509376 -12213783 -50709225 -26545445 -54744414 -54756778 -46332710 -79644996
2245g9644996l7205476J76078232j52620919K04292104j48394338p4486066M3007814
$$ -79644996 -116850472 59227760 -93393159 110898945 -37495393 -111981459 -68973645
2238f8973645J31013233o8467228r876124L0961366n520570J9429692N7666800j4924416
$$ -68973645 62039588 -6427640 -16303764 14657602 9137032 28566724 86233524 71309108
2230G1309108p5382981J46950804j13615260O9412544o9366168l3115579J19037075
$$ 71309108 -4073873 142876931 29261671 98674215 29308047 -3807532 115229543
2223A15229543n3676749J1645603p7991533m105780k7447602J89371858j18413712
$$ 115229543 61552794 73198397 -4793136 -8898916 -36346518 153025340 34611628
2216C4611628Q4071250l3628854j18929702j0690527M869355j1211316J53077527
$$ 34611628 118682878 85054024 -33875678 -44566205 -39696850 -50908166 102169361
2209A02169361j33509707k3875468K0894480r641724J29662968l2408604k1251280
$$ 102169361 -31340346 -55215814 -34321334 -43963058 85699910 53291306 32040026
2202C2040026L6865580j52035034P3382877j28533426N6199612O2101145P8921080
$$ 32040026 68905606 -83129428 -9746551 -138279977 -82080365 -19979220 58941860
2195E8941860j0185409q0464546J18290231j05335324M3658587J1662359N527098R8097126
$$ 58941860 48756451 -31708095 86582136 -18753188 24905399 36567758 42094856 140191982
2187A40191982j48672529o7570262J05207820l7946260M5593017J02888955k73911240
$$ 140191982 -8480547 -76050809 29157011 -8789249 36803768 139692723 -134218517
2180a34218517J90069563l9940380P0280906k63528963J23398618l7757229L7833901
$$ -134218517 55851046 15910666 86191572 -177337391 -53938773 -91696002 -53862101
2173e3862101J09906928K412933l6265624q9594313J50704543q7947097K6064000l3869209
$$ -53862101 56044827 58457760 22192136 -67402177 83302366 -4644731 21419269 -12449940
2165a2449940m2780225R3375636o9633174j00879201J48505643j1392524L0892391
$$ -12449940 -55230165 38145471 -31487703 -132366904 16138739 4746215 35638606
2158C5638606N3263374O5622282j18570919j49789578J50262007o0664219O8998617
$$ 35638606 88901980 154524262 35953343 -113836235 36425772 -24238447 44760170
2151D4760170j26257855j2423343N8252367J61492981j41549768l941906K7825256
$$ 44760170 -81497685 -93921028 -35668661 125824320 -15725448 -19667354 8157902
2144H157902O0061007l7000005j43234792K56722227l60144292J19078095k9683227
$$ 8157902 68218909 31218904 -112015888 144706339 -215437953 -96359858 -126043085
2137a26043085n6479643K43538920j13702944j40434328J86567714j20537060J1675144
$$ -126043085 -182522728 61016192 -52686752 -193121080 -6553366 -127090426 -115415282
2130a15415282J59884100j10078992J60192522j37311072P7209487j35574939j8567952
$$ -115415282 44468818 -65610174 94582348 -42728724 34480763 -101094176 -119662128
2123a19662128O9144411L1780366k0767204J6554990k85257104L90415534m7973578
$$ -119662128 -50517717 -18737351 -39504555 -22949565 -308206669 82208865 34235287
2116C4235287J37866285j38872728P3669234j30185826R9289081j59883347m5305201
$$ 34235287 172101572 33228844 106898078 -23287748 76001333 -83882014 -129187215
2109a29187215K08560097j44070997r998710J33667125l7030171o1620303j4302110
$$ -129187215 79372882 -64698115 -74696825 58970300 21940129 -39680174 -53982284
2102e3982284P9978250J26571483j20751258q3542684J0131403Q2650368j38479008
$$ -53982284 25995966 152567449 31816191 -51726493 -41595090 41055278 -97423730
2095i7423730K45637272k04892183J0066894J2793503J02942038M6773649M007157
$$ -97423730 148213542 -56678641 -46611747 -33818244 69123794 115897443 119904600
2088A19904600k14295569K25527334l4769182l4005896o2525299k0536878J20694707
$$ 119904600 -94390969 131136365 96367183 62361287 -164012 -20700890 99993817
2081I9993817l8675632m4915878P0595406m9306966j01815583P2542314o2595752M8616427
$$ 99993817 61318185 16402307 86997713 37690747 -64124836 8417478 -54178274 -5561847
2073e561847J3999682J94655740j48246008k8402983j6153267o3149030J86141603
$$ -5561847 8437835 203093575 54847567 26444584 10291317 -52857713 133283890
2066A33283890j63964766j78050305K30215495j4017863k9748702j3540607L387348
$$ 133283890 -30680876 -208731181 21484314 7466451 -22282251 -35822858 -32435510
2059c2435510k5081852K4959054J15934998k8230789j63010474J41490519k4600656
$$ -32435510 -57517362 -32558308 83376690 55145901 -107864573 33625946 9025290
2052I025290K0588549p5310547r472303k0489911J07633892L0894983P653784j38518899
$$ 9025290 29613839 -45696708 -55169011 -75658922 31974970 62869953 70523737 -67995162
2044f7995162N8093596n9910092J43188963j57058940r450461m4007515J01103984
$$ -67995162 -9901566 -69811658 73377305 -83681635 -93132096 -137139611 -36035627
2037c6035627J2770024j3161023J3705555j30516329J72931382L6479104r0492211
$$ -36035627 -23265603 -36426626 -22721071 -153237400 19693982 56173086 -34319125
2030c4319125q9049110J13849177l7933209R2199515j02685217M566764N0788183
$$ -34319125 -123368235 -9519058 -47452267 44747248 -57937969 -53371205 -2583022
2023b583022j00766758K4529008J67963666j23749339J49163069n9536546j1975653
$$ -2583022 -103349780 -78820772 89142894 -34606445 114556624 55020078 43044425
2016D3044425j79126317J24424844k7691038k8132815M027029J36453058o051979j8187248
$$ 43044425 -136081892 -11657048 -39348086 -67480901 -63453872 72999186 66947207 48759959
2008D8759959M7783385M378099j6036745j72603686P2876499o3108093J06871206j6588372
$$ 48759959 96543344 100921443 84884698 -87718988 -14842489 -77950582 28920624 12332252
2000A2332252J37375465j47033973J9414108p6736635O4649438O0312651j11130857
$$ 12332252 149707717 2673744 22087852 -54648783 10000655 70313306 -40817551
1993d0817551m1999981J39913763j01151782r9143491J26841600Q0338891j3216313
$$ -40817551 -82817532 57096231 -44055551 -143199042 -16357442 63981449 50765136
1986E0765136M0636651n3122846j42723152l9195560J33025850O1540143j48697597
$$ 50765136 91401787 38278941 -104444211 -143639771 -10613921 50926222 -97771375
1979i7771375J91501282j05093530m2682733N4578621m6846487M1462305q778928k520482
$$ -97771375 93729907 -11363623 -54046356 532265 -46314222 -4851917 -13630845 -16151327
1971a6151327N3953451R32693l3211225m7671427O2406816O2056993j49405836Q3546083
$$ -16151327 37802124 38734817 5523592 -42147835 20258981 82315974 -67089862 16456221
1963A6456221J41659356k56844592L0296939k2510459P3841863m8615020J93343229
$$ 16456221 158115577 -98729015 -68432076 -90942535 -17100672 -65715692 127627537
1956A27627537o512726k6305016l4063011j37311304k1934002J76693990j76221648
$$ 127627537 121114811 94809795 60746784 -76564520 -98498522 78195468 -98026180
1949i8026180k7530853J85772061q0909938q8704358K26131479j48923406P0410659
$$ -98026180 -125557033 60215028 -20694910 -109399268 116732211 -32191195 38219464
1942C8219464n5452295L04385940k21976728o3499618q400812j09856259P1096592
$$ 38219464 -17232831 287153109 65176381 1676763 -6724049 -116580308 -45483716
1935d5483716O6693217J9198131l7976242j549257J04337400J7385678j42278119k0165407
$$ -45483716 21209501 40407632 2431390 882133 105219533 122605211 -19672908 -39838315
1927c9838315K6245075J17860858O724898p4368615P0858837j10762472k2094473J5704306
$$ -39838315 -13593240 104267618 110992516 36623901 107482738 -3279734 -25374207 -9669901
1919i669901O6582534j32042144Q650738J98157885j22186935q4411589j1063797
$$ -9669901 56912633 -75129511 -66478773 131679112 9492177 -74919412 -85983209
1912h5983209J60220898N3889531j24514223K9521692k1641272j34919645P2204242
$$ -85983209 74237689 128127220 3612997 33134689 11493417 -123426228 -51221986
1905e1221986r5997882J4907702J54046521J280366j15258156J3221126J17802881
$$ -51221986 -147219868 -132312166 21734355 23014721 -92243435 -79022309 38780572
1898C8780572j59785915J49432310r7802278l9869015R6693239k7991444P582814L5498725
$$ 38780572 -121005343 28426967 -69375311 -109244326 -12551087 -40542531 -32959717 2539008
1890B539008P9801154L3345024j95759250J13408668r1909404J79352358k9451447
$$ 2539008 82340162 115685186 -80074064 33334604 -58574800 120777558 91326111
1883I1326111j88720979k0671856o1929747K52278177r8178342N9003807o20290R3723949
$$ 91326111 -97394868 -118066724 -179996471 72281706 -25896636 33107171 32486881 126210830
1875A26210830j16374965P877528L9375918j82140394J13772339L3177047O8932897
$$ 126210830 9835865 17713393 57089311 -125051083 -11278744 21898303 90831200
1868I0831200o6661259j13921055J17331509Q6943894j27127792K7946446j19642342
$$ 90831200 24169941 -89751114 27580395 114524289 -12603503 15342943 -104299399
1861a04299399K76112996j12652497j25606039O8090603o2020205R6759448k7777437
$$ -104299399 171813597 59161100 -66444939 1645664 -60374541 36384907 8607470
1854H607470J81121072q7509581q9644531P7794506r5803062M6410365n2492812O1485321
$$ 8607470 189728542 102218961 12574430 90368936 -5434126 40976239 -11516573 49968748
1846D9968748j3893390P0583814k30970846N7054288m3368348J76201419j25748901
$$ 49968748 36075358 106659172 -124311674 -67257386 -110625734 65575685 -60173216
1839f0173216j18489209J71171275p436735j01735082O7421355m9890456J15577524
$$ -60173216 -178662425 -7491150 -14927885 -116662967 -49241612 -99132068 16445456
1832A6445456j10342445j56462204M45044474j84206291n6972317N5808632o5534417
$$ 16445456 -93896989 -250359193 194685281 10478990 -46493327 9315305 -56219112
1825e6219112r8487799K9463861j1053243J20858383M2753173M8507051N961849o0406963
$$ -56219112 -154706911 -125243050 -136296293 -15437910 27315263 75822314 81784163 21377200
1817B1377200j17729654K4204100J23189884o9319106n9136644j84647214L31363976
$$ 21377200 -96352454 -72148354 51041530 -18277576 -77414220 -262061434 69302542
1810F9302542k21892420P2256967L9239690J62448458j57950048N7143685M55416q8828276
$$ 69302542 -152589878 -80332911 -41093221 121355237 -36594811 20548874 21004290 -67823986
1802f7823986J9055200m7154289j8859887M6063355P351108J46080124k6757180n0840926
$$ -67823986 -48768786 -95923075 -114782962 -68719607 -61368499 84711625 57954445 7113519
1794G113519l8000248j4345108K23493809k13061374J17770787N4668700r5862070
$$ 7113519 -30886729 -45231837 178261972 -34799402 82971385 137640085 41778015
1787D1778015o2157788k6578173R5058443Q0229501j16093323J06920700j47765481
$$ 41778015 -20379773 -46957946 48100497 128329998 12236675 119157375 -28608106
1780b8608106q2290494L703806k0816811Q3236768O5505008m6607748J9063826q7049094
$$ -28608106 -110898600 -107194794 -128011605 -44774837 20730171 -25877577 -6813751 -93862845
1772i3862845K2582313j53986315J01736395R7573796k95766597j02592997N44147077
$$ -93862845 -71280532 -225266847 -123530452 -25956656 -321723253 -424316250 119830827
1765A19830827J20950109n1657923p0105269J01079573p8061641J0555276j41631987
$$ 119830827 240780936 189123013 119017744 220097317 142035676 152590952 10958965
1758A0958965P731923Q2305842j07721260J55859448L147063M0071691j36127625
$$ 10958965 18690888 100996730 -6724530 149134918 152281981 192353672 56226047
1751E6226047J239184444m1907468p98155028l21464525k0900777j47498898R9336540
$$ 56226047 1295410491 1253503023 455347995 133883470 112982693 -34516205 64820335
1744F4820335J23763454j8667557j974588j5316451N7419605j34339253J27730194
$$ 64820335 188583789 169916232 167941644 152625193 210044798 75705545 203435739
1737B03435739J3492500J36677143L16136106p50252191m54012434K09710369K08403729
$$ 203435739 216928239 353605382 669741488 -80510703 -534523137 -324812768 -116409039
1730a16409039L2865262P4825753l1584481j3734599J5153457q4289406N8167678Q156044
$$ -116409039 -83543777 -8718024 -40302505 -54037104 -38883647 -123173053 -65005375 -56849331
1722e6849331Q9974454l8725459p8079966N4277073R4656756k21444637L54501476
$$ -56849331 33125123 -5600336 -83680302 -29403229 65253527 -156191110 198310366
1715A98310366k25990507k6142105q2098111J59110395M1978692p5095213O8261411
$$ 198310366 -27680141 -53822246 -135920357 23190038 65168730 -9926483 58334928
1708E8334928k4156229J14950345k71127935J94113178P0359302Q5485616k30697677
$$ 58334928 34178699 149129044 -121998891 72114287 142473589 227959205 -2738472
1701b738472j44440110J28011936k2009735L8678532m0767195l972936R2223219j44503621
$$ -2738472 -147178582 -19166646 -41176381 -2497849 -43265044 -47237980 44985239 -99518382
1693i9518382J12664927l7263189o4179577J26142251j34389470L0813567l7468603
$$ -99518382 13146545 -24116644 -88296221 37846030 -96543440 -65729873 -103198476
1686a03198476n8831064K78947558j36776930n2887441J23717364k4548517m6072062
$$ -103198476 -162029540 116918018 -19858912 -72746353 50971011 26422494 -19649568
1679a9649568k2923589O6955618L3814326l0606866m5505121j1701934Q7099401p3263333
$$ -19649568 -42573157 24382461 58196787 27589921 -17915200 -29617134 57482267 -15781066
1671a5781066J25409155l6180748j52472859o6996865O9666294J23234296j74996405
$$ -15781066 109628089 73447341 -79025518 -146022383 -76356089 46878207 -128118198
1664a28118198K51530872r2789628n3676891J9907482l0614158O7457685j05723528
$$ -128118198 123412674 30623046 -23053845 -3146363 -33760521 33697164 -72026364
1657g2026364n7341230J50713117j1308173N915571q2929183n0141779N6838750P5125373
$$ -72026364 -129367594 21345523 10037350 15952921 -66976262 -117118041 -60279291 14846082
1649A4846082o3614208P7030538j53561663O1672138L5187999N9021935J0364648
$$ 14846082 -48768126 28262412 -125299251 -63627113 -28439114 30582821 40947469
1642D0947469j59023413K50882601n1815296J3449824o9660823j65069220J13495148
$$ 40947469 -118075944 132806657 80991361 94441185 24780362 -140288858 -26793710
1635b6793710p0522150P0712014R5970732r579745k00035838J64118518m6566624k1612983
$$ -26793710 -97315860 -26603846 69366886 59787141 -140248697 23869821 -22696803 -44309786
1627d4309786K17978830k57112887k6559147K07188639j62644935j44006487M5619411
$$ -44309786 173669044 -83443843 -110002990 97185649 -65459286 -209465773 -163846362
1620a63846362J04578513L7236418P0714007q6931690J17050022j08928844J25637274
$$ -163846362 -59267849 -22031431 48682576 -38249114 78800908 -30127936 95509338
1613I5509338j58793423j5082511k5001577p8384634K72275771p0999285L8900486
$$ 95509338 -63284085 -78366596 -103368173 -181752807 90522964 19523679 58424165
1606E8424165j30471902M9480272j9598896Q9970646o1595120J34825309l78841138
$$ 58424165 -72047737 -22567465 -42166361 47804285 -13790835 121034474 -257806664
1599b57806664L35969856o5531644j17193866J20202280P0780229l4153552p3450794
$$ -257806664 78163192 12631548 -104562318 15639962 86420191 52266639 -21184155
1592b1184155M0172814j03686143M1115813j05223427N9212714J0755506J55620670
$$ -21184155 18988659 -84697484 -43581671 -148805098 -89592384 -78836878 76783792
1585G6783792k40256138J20202424L3420016q226467O8264024k1363219j92978249
$$ 76783792 -163472346 -43269922 -9849906 -18076373 50187651 28824432 -164153817
1578a64153817J00170696M2163871P6705578p7626991k2661129p3507597R7373871
$$ -164153817 -63983121 -21819250 54886328 -22740663 -45401792 -118909389 -21535518
1571b1535518j5205730J00392977j14755814J36023841o2602879P0614062l4525568
$$ -21535518 -36741248 63651729 -51104085 84919756 22316877 92930939 58405371
1564E8405371j16965958R0782640J17167058j38168858R0177116j04668104L5667892
$$ 58405371 -58560587 32222053 149389111 11220253 101397369 -3270735 32397157
1557C2397157M1149717N2069455r3830084n0127271Q6665464M0703061r618264k1202730
$$ 32397157 73546874 125616329 31786245 -18341026 68324438 109027499 99409235 78206505
1549G8206505m3616749J1946117r3639130J5661620o7236289J59073931k2610887
$$ 78206505 34589756 46535873 -47103257 -31441637 -98677926 60396005 37785118
1542C7785118J11152813j85822311m1565485R0333686q7999337K19559052k30489588
$$ 37785118 148937931 -36884380 -78449865 11883821 -76115516 143443536 -87046052
1535h7046052J70436957p5775836j63740047R8034J15114296K3109019J73120806
$$ -87046052 83390905 7615069 -156124978 -156026944 -40912648 -17803629 155317177
1528A55317177j92920424J9956711J09165520j07537817J113975N148686J3724689
$$ 155317177 -37603247 -17646536 91518984 -16018833 -14904858 -9756172 3968517
1521C968517P5405160p9856400r5943347R8198425n6924880J68491130j04552641O1398368
$$ 3968517 79373677 -482723 -96426070 1772355 -55152525 113338605 8785964 70184332
1513G0184332q6434400j07481083P0147671N8228658l16382633J63271509J46332174
$$ 70184332 -16250068 -123731151 -53583480 4645178 -311737455 -148465946 -2133772
1506b133772J28638855r0320780p0936341O4468210q0584495M1335819k0722676J8336409
$$ -2133772 126505083 36184303 -34752038 29716172 -50868323 -9532504 -30255180 -11918771
1498a1918771R7098312j36366038l0474285K13552895k90413812J81318052L78000376
$$ -11918771 85179541 -51186497 -81660782 131892113 -158521699 22796353 400796729
1491D00796729o6752275m0880342j55326063j37902225K486614J5406094o6232511
$$ 400796729 334044454 293164112 137838049 -64176 2422438 17828532 -48403979
1484d8403979J27575915j61808380Q7059667l1524591j6535474K20950938n0412701
$$ -48403979 79171936 -82636444 4423223 -27101368 -43636842 177314096 126901395
1477A26901395n422163J906014p1259431j26071801N6900337K3659608q8619147p5663727
$$ 126901395 121479232 123385246 52125815 -73945986 -17045649 6613959 -82005188 -157668915
1469a57668915K40400000n8118904K6109287j24058707J45824781J26903544J238021
$$ -157668915 82731085 24612181 50721468 -73337239 72487542 199391086 200629107
1462B00629107k36443741J18948806k10085593J10967460l2156094L9566052n5738745
$$ 200629107 -35814634 83134172 -126951421 -15983961 -48140055 -8574003 -64312748
1455f4312748L6806957K00335852j22882047K4816389M237122j12574908J36194889
$$ -64312748 -27505791 172830061 49948014 74764403 79001525 -33573383 102621506
1448A02621506n8908048m5434364n3795797n9302363J9968019K89349957k26481052
$$ 102621506 43713458 -1720906 -55516703 -114819066 -94851047 194498910 -31982142
1441c1982142m2807945J26585550m1117370p3240241Q1488242O6291517o4127446o262157
$$ -31982142 -74790087 51795463 10678093 -62562148 18926094 85217611 21090165 14828008
1433A4828008J7451399j5394870m4544020j19940302K99343833j70669505J24913440
$$ 14828008 32279407 16884537 -27659483 -147599785 151744048 -18925457 105987983
1426A05987983j61916070N8478355r5100241j85680545L05439215N2640638q7331956
$$ 105987983 -55928087 2550268 -92549973 -278230518 27208697 79849335 -7482621
1419g482621k1797388P65686O6929931o4729121L2273765r3949348L4312568o4107758
$$ -7482621 -29280009 -28514323 38415608 -26313513 5960252 -87989096 -53676528 -117784286
1411a17784286J68767803k01951972l2210814J0867064J45105043J21271496P069380
$$ -117784286 50983517 -150968455 -183179269 -172312205 -27207162 94064334 101133714
1404A01133714j17812537P904019L4881481j02906879L2117468P0511626j03203727
$$ 101133714 -16678823 -8774804 26106677 -76800202 -44682734 25828892 -77374835
1397g7374835M4874586O4811428j33893634M4272755O3346175J60456239q0865037
$$ -77374835 -32500249 32311179 -101582455 -57309700 6036475 166492714 85627677
1390H5627677O8768840k1462261r6670724j6911860j4692209M5416O9319514r6109398
$$ 85627677 154396517 132934256 36263532 19351672 4659463 4704879 74024393 -22085005
1382b2085005l2769519N6689638j2239890j2271782J03762944n884959n1831631M9804874
$$ -22085005 -54854524 1835114 -10404776 -22676558 81086386 75201427 23369796 73174670
1374G3174670j8827710P8049383k00514807M3980105n403308Q4524622l6663684j59425265
$$ 73174670 54346960 132396343 -68118464 -24138359 -29541667 54982955 18319271 -141105994
1366a41105994J03119454R1256890q6508996K04300867o4398252n6685153j6971151
$$ -141105994 -37986540 53270350 -33238646 171062221 106663969 49978816 33007665
1359C3007665j8707460R4397576O9715044j76455894O3089698N0976053o8492178l30691
$$ 33007665 14300205 108697781 178412825 1956931 65046629 116022682 47530504 47199813
1351D7199813j41578120J33047337J01775637j5939285o80794p9779469r6100672M5042378
$$ 47199813 -94378307 38669030 140444667 124505382 123824588 44045119 -52055553 -7013175
1343g013175N9657895P9636777j25114177O6015064j66775836P820316J01019418O8731652
$$ -7013175 52644720 132281497 7167320 73182384 -93593452 -85773136 15246282 83977934
1335H3977934j94279640J17351266l0622597K7686337j1016089p7107337M4618110
$$ 83977934 -110301706 7049560 -23573037 4113300 -6902789 -84010126 -39392016
1328c9392016N8405038l6160018M166860p230533l2915987O5253796K1011171k4078190
$$ -39392016 19013022 -17146996 -12980136 -20210669 -53126656 12127140 33138311 9060121
1320I060121n3106133M5735306J33532469p7008755r3195449N1082953j2124063O2804937
$$ 9060121 -44046012 1689294 135221763 58213008 -34982441 16100512 3976449 66781386
1312F6781386j35274264J96368796j56159549P4079663m8660153K2956327K4539303
$$ 66781386 -68492878 127875918 -28283631 45796032 -2864121 20092206 44631509
1305D4631509j3434720n3334284J27672609j64301676N1533254O5589653j77632525
$$ 44631509 31196789 -22137495 105535114 -58766562 -7233308 58356345 -119276180
1298a19276180J78968552j93055952K25006286q4834009r1287637o5798518J97096434
$$ -119276180 59692372 -133363580 91642706 6808697 -84478940 -150277458 46818976
1291D6818976p7493384L3815960R447909j18129332J53079358j72731621R7127818
$$ 46818976 -30674408 3141552 12589461 -105539871 47539487 -125192134 -28064316
1284b8064316M6251641m1151972J07985905r2563252j573934Q4846112j62509045Q9460623
$$ -28064316 18187325 -22964647 85021258 -7541994 -9115928 75730184 -86778861 2681762
1276B681762L3839269o9044692Q8363866K3917849r3521913n5013747M6387400m346159
$$ 2681762 36521031 -32523661 55840205 79758054 -13763859 -68777606 -22390206 -26736365
1268b6736365J28344349k63214452K17038839n2531392p3334133l7289439N8719563
$$ -26736365 101607984 -161606468 55432371 2900979 -70433154 -107722593 -49003030
1261d9003030o184880N2005862m1910926K6670405j38647408M8403263M7476148J4803482
$$ -49003030 -55187910 -3182048 -45092974 -18422569 -157069977 -108666714 -61190566 -46387084
1253d6387084k5422509J6234163L2413217n6671919q750446J17152236m3348661o319349
$$ -46387084 -71809593 -55575430 -23162213 -79834132 -88584578 28567658 -14781003 -21100352
1245b1100352P4534196k4184884o4358935J25869496p6563497J3731693K8026255m1903564
$$ -21100352 53433844 29248960 -35109975 90759521 14196024 27927717 55953972 14050408
1237A4050408o37577J01466892J4349341n1942421j30847960J18206633j04948526
$$ 14050408 13412831 114879723 129229064 77286643 -53561317 64645316 -40303210
1230d0303210K8103973L2751578q0516283J22850007j8905954j13376326P8754790
$$ -40303210 -12199237 20552341 -59963942 62886065 43980111 -69396215 9358575
1223I358575r6420630L7116959p438782L4968744r003780L5110647j33115033J67413869
$$ 9358575 -87062055 -49945096 -57383878 -22415134 -31418914 3691733 -129423300 37990569
1215C7990569j29849810P6148792J5054672R7338656j38592342p8253482J03956278
$$ 37990569 -91859241 -15710449 -655777 96682879 -41909463 -120162945 -16206667
1208a6206667Q3137770p5496525M6727529j24026429J83294294j7908429j12926363
$$ -16206667 66931103 -8565422 38162107 -85864322 97429972 79521543 -33404820
1201c3404820K4121496k527202k9138800k320654j4117222J06369812l2318462l6212680
$$ -33404820 -9283324 -11810526 -40949326 -43269980 -57387202 48982610 16664148 -19548532
1193a9548532P1467079j30998815R8258760q8217137J14768597o94661j4459869k18785667
$$ -19548532 51918547 -79080268 19178492 -69038645 45729952 45035291 30575422 -188210245
1185a88210245J69697714k7760826j4619016J7742585J0928229Q7052349j24886734
$$ -188210245 -18512531 -46273357 -60892373 -43149788 -32221559 54830790 -70055944
1178g0055944Q1327473j52459099K49137664o1498284N105314l5678325o2331595j4272903
$$ -70055944 11271529 -141187570 107950094 46451810 51557124 15878799 -46452796 -60725699
1170f0725699k5700913J03483228j00071203J01607139q2103145P8497527j14760020
$$ -60725699 -86426612 17056616 -83014587 18592552 -63510593 14986934 -99773086
1163i9773086J27268750j54356889J93694944p9981556m0183742J34705235j88290109
$$ -99773086 27495664 -126861225 66833719 -13147837 -53331579 81373656 -106916453
1156a06916453J9300962l0996087R8697358j9413166J7594730q9146401M8635688Q2744570
$$ -106916453 -87615491 -118611578 -19914220 -39327386 -21732656 -110879057 -62243369 20501201
1148B0501201L8079867q5279843K6967508o9944500Q0101316N1129649K3807168j51169580
$$ 20501201 58581068 -26698775 268733 -69675767 10425549 61555198 85362366 -65807214
1140f5807214J70549941k2080351R738083o9388134J67416270k10529284N7172722
$$ -65807214 104742727 82662376 92400459 23012325 190428595 -20100689 37072033
1133C7072033j4378370k2424960K0020014n4427210n7570702Q1749225J3003221j28147107
$$ 37072033 22693663 268703 20288717 -34138493 -91709195 -9959970 3043251 -125103856
1125a25103856R0711148N2338840l627022j2069321J0981223r4273453M0931228Q8373493
$$ -125103856 -34392708 17946132 14319110 2249789 13231012 -81042441 -40111213 48262280
1117D8262280J6791429k16234244J04665811o7115281J05865743j07400205J71364664
$$ 48262280 65053709 -151180535 -46514724 -113630005 -7764262 -115164467 56200197
1110E6200197j65580866J01073403m534323L046592j6560032J5115942J204027l3636797
$$ 56200197 -109380669 -8307266 -12841589 -9794997 -26355029 -11239087 -10035060 -43671857
1102d3671857N3244623K1526246r1386683R5728206j03257555p0945372K52751840
$$ -43671857 9572766 31099012 -60287671 35440535 -67817020 -138762392 113989448
1095A13989448L3540569m9961896k3894904q8380465J5441610k9031383O1794004k2424394
$$ 113989448 147530017 97568121 73673217 -14707248 734362 -28297021 33496983 11072589
1087A1072589j31920737J75850324j17464018J18910401j14783321k635109K7708877
$$ 11072589 -120848148 55002176 -62461842 56448559 -58334762 -60969871 -33260994
1080c3260994K22178290j81272409j34449518Q1848443J68545610r388018j89360243
$$ -33260994 188917296 7644887 -126804631 -44956188 123589422 114201404 -75158839
1073g5158839J55872180k3049867p6282960R2345536j07373134N0268465p109602m4440429
$$ -75158839 80713341 57663474 -18619486 73726050 -33647084 16621381 9511779 -34928650
1065c4928650J56572563q208422K584890l3861130n9931266M1590659j68381944P0222772
$$ -34928650 121643913 113435491 116020381 82159251 22227985 63818644 -104563300 -34340528
1057c4340528J8961449J9301317p0974923J37872813K8255664j58265429M8691197R130204
$$ -34340528 -15379079 3922238 -67052685 70820128 99075792 -59189637 -10498440 -1368236
1049a368236M9403397q2303372P5707223j26964435N9286389k6248268j19472316
$$ -1368236 48035161 -34268211 41439012 -85525423 -26239034 -52487302 -171959618
1042a71959618J27106201j7208266O4253478n2773047Q7072660j07275001K4420140
$$ -171959618 -44853417 -62061683 2191795 -50581252 36491408 -70783593 -46363453
1035d6363453j5605451R3849718q6065790j7727666N9003572P289468n9498884J54297304
$$ -46363453 -61968904 31880814 -54184976 -71912642 -12909070 -5619602 -65118486 89178818
1027H9178818p9264488P2106931l7833608l0860574r6607024J1163250R1952860P3126918
$$ 89178818 9914330 82021261 44187653 13327079 -83279945 -72116695 19836165 92963083
1019I2963083r5063703M0195745k1135227M2126347j21658609p4974273J12275289
$$ 92963083 -2100620 38095125 16959898 59086245 -62572364 -137546637 -25271348
1012b5271348J63635936j58671102m24273J06082281q0091095O391421J86673261
$$ -25271348 138364588 -20306514 -20730787 85351494 5260399 11651820 198325081
1005A98325081j50403848Q0103412j95892280m9071763K00321444j83096184J05015707
$$ 198325081 47921233 128024645 -67867635 -116939398 83382046 -99714138 5301569
998E301569j8506603J43647281q7813650K5006290l6985213R53137j29089239Q5587423
$$ 5301569 -13205034 130442247 42628597 67634887 30649674 31602811 -97486428 -11899005
990a1899005N8411561o2608883p1498499Q9219502n8914881R1724715N3194735j01583696
$$ -11899005 46512556 -16096327 -87594826 1624676 -57290205 34434510 87629245 -13954451
982a3954451J01665469j13187327P8910393j61209107R4911329N1776064J9927869
$$ -13954451 87711018 -25476309 53434084 -107775023 -12863694 38912370 58840239
975E8840239l0208528M1007996q8407424Q9661801r7273676l5703310J55757733j10910232
$$ 58840239 28631711 69639707 -18767717 70894084 -26379592 -62082902 93674831 -17235401
967a7235401k3873250O5569631o6017132J00686612l6158450O5878154j06935083j264004
$$ -17235401 -41108651 24460980 -41556152 59130460 22972010 88850164 -18084919 -19348923
959a9348923R7865321q3297586P6888850o5972839l6567997o6225978Q9284849K8269157
$$ -19348923 78516398 -4781188 72107662 6134823 -30433174 -96659152 -7374303 20894854
951B0894854j4930483l4733838m7725673K16284670j65366247R809041k8628447o4008645
$$ 20894854 5964371 -28769467 -76495140 139789530 -25576717 -15767676 -44396123 -108404768
943a08404768O4265733n8269296Q6916635n1223549k18060199K11839475J80927013
$$ -108404768 -44139035 -102408331 -15491696 -66715245 -284775444 -72935969 107991044
936A07991044j61282296P2314808j04956196O0023604j01779441O6316758O8366826
$$ 107991044 -53291252 19023556 -85932640 -25909036 -127688477 -61371719 6995107
929F995107Q4295781k88149319J41684453Q3110812m6332563n7995718n0376937K17676437
$$ 6995107 91290888 -196858431 -55173978 27936834 -18395729 -76391447 -126768384 90908053
921I0908053j05152933J83133121k0061896j57953624k1742533K1776187J79147858
$$ 90908053 -14244880 168888241 148826345 -9127279 -30869812 -9093625 170054233
914A70054233k33301832Q4291240j0423637P3617886n9905787K3125926r6996744O4418118
$$ 170054233 -63247599 21043641 10620004 84237890 24332103 47458029 -49538715 14879403
906A4879403J18365691M3292218j94552865L5545940j18739204J43482624l1624329
$$ 14879403 133245094 176537312 -18015553 17530387 -101208817 42273807 10649478
899A0649478R8553050m7694012k2055370L1076515j69419598K76000468j44164867
$$ 10649478 109202528 61508516 39453146 70529661 -98889937 177110531 32945664
892C2945664R9789189q1900650N0283589K0210799Q0279153j55589925k0522499O1706350
$$ 32945664 132734853 50834203 101117792 121328591 201607744 46017819 25495320 87201670
884H7201670J03649130k25145120J53649236j41038889R1038344l1292493M6649119
$$ 87201670 190850800 -34294320 119354916 -21683973 69354371 38061878 84710997
877H4710997n6777634O4023918o9723109m6022274Q8176841O6006167j78761017r1692496
$$ 84710997 27933363 91957281 22234172 -23788102 64388739 130394906 -48366111 -140058607
869a40058607K02884902o7742313Q7314127j18457267J34094820p6271479k4592115
$$ -140058607 62826295 -4916018 82398109 -36059158 98035662 21764183 -2827932
862b827932K1311380m7828333O8341348j60002525K00258374p2308929J0208778n726148
$$ -2827932 18483448 -29344885 38996463 -121006062 79252312 6943383 17152161 11426013
854A1426013r532117J00366900p5126831O8704216j47519208L8214956p2364051J25717186
$$ 11426013 1893896 102260796 27133965 95838181 -51681027 -13466071 -85830122 39887064
846C9887064Q7772639j27294981q5033126K18719932l5930133r4835391r0544817
$$ 39887064 127659703 364722 -84668404 134051528 98121395 3286004 -87258813
839h7258813J57990492j01644161J05793269o0598250n733025J02181823j90146292
$$ -87258813 70731679 -30912482 74880787 14282537 8549512 110731335 -79414957
832g9414957j8929404J38507562p8069470Q6251241m3007747l0716326L754057M7479789
$$ -79414957 -98344361 40163201 -37906269 48344972 5337225 -25379101 -21625044 25854745
824B5854745L0671622J047458r8049571N2926093l8927303L4079366k98120741K04584017
$$ 25854745 56526367 57573825 -40475746 12450347 -26476956 7602410 -290518331 -85934314
816h5934314J7706995M6298070M7245811Q0630871r982605p3374613R0181529j30786043
$$ -85934314 -68227319 -21929249 25316562 105947433 95964828 22590215 112771744 -18014299
808a8014299N7397588k01754595J88616824k6001321K1043439o427311r8777458L7102583
$$ -18014299 39383289 -162371306 26245518 244197 21287636 14860325 -83917133 -46814550
800d6814550M995356Q1044735R9988453L4006555j49004319L0762322j50540792P754213
$$ -46814550 -41819194 39225541 139213994 173220549 24216230 54978552 -95562240 -87808027
792h7808027m6813046R7360883J882658O8903461o810271k01337029J37064328M4442809
$$ -87808027 -134621073 -37260190 -35377532 33525929 26715658 -174621371 -37557043 6885766
784F885766N9977875m257458n053372o5155927p9588623o1484410R6714734l9007688
$$ 6885766 66863641 62606183 57552811 -7603116 -87191739 -148676149 -51961415 -90969103
776i0969103K02491833j10700550q1052552R9076978j14246946M8105619r1283212
$$ -90969103 111522730 822180 -80230372 18846606 -95400340 -47294721 -138577933
769a38577933J80491438j02595845J17536268k1995335j07219324Q7982007j27250729
$$ -138577933 41913505 -60682340 56853928 34858593 -72360731 15621276 -111629453
762a11629453K68922736j36600265K343292K63622j70396879J13152960J26591106
$$ -111629453 157293283 20693018 23036310 23299932 -147096947 -33943987 92647119
755I2647119j13114471R0884503N948826L0319964j5994088l0384771o6765581P313485
$$ 92647119 -20467352 70417151 76365977 106685941 90691853 60307082 -6458499 854986
747H54986m1133800J11930393j45171672J30498921j69178219J15846509R3913562
$$ 854986 -40278814 71651579 -73520093 56978828 -112199391 3647118 97560680
740I7560680q0640214K3725142m2327141K4684529k6178276j08029846J39544767r0012331
$$ 97560680 16920466 40645608 -1681533 23002996 -3175280 -111205126 28339641 -61672690
732f1672690P6012921q9024803m0191637J85575181j16169731J04576432n9293756
$$ -61672690 14340231 -74684572 -114876209 70698972 -45470759 59105673 -188083
725a88083O2891388k6395519l0249572k9589630o6087082N9125881P6797677k8571694
$$ -188083 62703305 36307786 6058214 -23531416 -89618498 -30492617 46305060 17733366
717A7733366J3358725o3362480r505078J4983173J85063803r1146005n4431508j8214436
$$ 17733366 31092091 -32270389 -41775467 -26792294 158271509 67125504 12693996 -5520440
709e520440m2895141l3471671l5624078J87979550K3907716j84539753L4024900J37916735
$$ -5520440 -48415581 -81887252 -117511330 70468220 94375936 -90163817 -56138917 81777818
701H1777818k06843956R9321082M4014566L0428568k8098181j30222937K0308669
$$ 81777818 -125066138 -25745056 18269510 48698078 20599897 -109623040 -89314371
694h9314371J95084402k8120434k06074293J76051647q2762758j16966778K05311950
$$ -89314371 105770031 77649597 -128424696 47626951 -35135807 -152102585 53209365
687E3209365n0894031K5370717m8908599Q1839045k2012074l9930942l2823999Q0968663
$$ 53209365 2315334 27686051 -21222548 60616497 38604423 -1326519 -34150518 46818145
679D6818145K8747248o4917629p59853o2017804L0496848o4636666O4045987L4737592
$$ 46818145 75565393 10647764 9887911 -52129893 -21633045 -86269711 -22223724 12513868
671A2513868l9664556J17452729q1221481N0288205j26492728O8941947o7261995L8529324
$$ 12513868 -27150688 90302041 9080560 59368765 -67123963 1817984 -65444011 -26914687
663b6914687j35292681R8336638q5409872M0647601R2866462k418280k9512286O6817597
$$ -26914687 -162207368 -63870730 -149280602 -108633001 -15766539 -18184819 -47697105 19120492
655A9120492P5575422p0380021P32485n0493734k1731060l5758681K8165545m2124386
$$ 19120492 94695914 24315893 25048378 -25445356 -47176416 -82935097 -54769552 -96893938
647i6893938R9970791l9128836k2286642J05951346p3734802P7402859j01245754P0682395
$$ -96893938 3076853 -36051983 -58338625 47612721 -26122081 51280778 -49964976 20717419
639B0717419k2839605K5760999L5958267P4793891j19033040J727508L4348565k2046939
$$ 20717419 -2122186 23638813 59597080 134390971 15357931 17085439 51434004 29387065
631B9387065j02486383O0694453O6788316j30082467J7686928m8323654K13407733
$$ 29387065 -73099318 -12404865 54383451 -75699016 -58012088 -106335742 107071991
624A07071991j3698260j02152856K5147259J40292108k23319350L9747278O607790
$$ 107071991 93373731 -8779125 16368134 156660242 -66659108 -26911830 -20304040
617b0304040J13086821k66152319J83041784L7830926n3593949J3165006K7692924
$$ -20304040 92782781 -173369538 9672246 47503172 -6090777 7074229 34767153
610C4767153J20492076R8814371j17673778o4509507n2174739K341442r9307149J67206888
$$ 34767153 155259229 254073600 136399822 71890315 19715576 22057018 -77250131 89956757
602H9956757m8914191m6883038J10982980R3544915j55569627n7763694J0779464K0753248
$$ 89956757 41042566 -5840472 105142508 198687423 43117796 -14645898 -3866434 16886814
594A6886814k9353723J13423253k24501482J34159092j77654250K88546387j82678241
$$ 16886814 -12466909 100956344 -123545138 10613954 -167040296 121506091 -61172150
587f1172150O9854405N1447726j7591208l4948026K0814154j71270618J71878961m6138579
$$ -61172150 8682255 60129981 42538773 7590747 28404901 -142865717 29013244 -17125335
579a7125335M2206708O7597147j01397199n9737328N9389439q380032M3919841m3915247
$$ -17125335 25081373 92678520 -8718679 -68456007 -9066568 -17446600 26473241 -17442006
571a7442006j17664132M2341012J90648155j39504759L2844594p3999090P0105244
$$ -17442006 -135106138 -92765126 97883029 -41621730 -8777136 -82776226 -12670982
564a2670982N0216216k6412226j7503076j58937636R7876533p5976487J18641918R989097
$$ -12670982 37545234 11133008 -6370068 -165307704 -67431171 -143407658 -24765740 -14776643
556a4776643j42956237p57651J37203704m9236466l4008242K6762162M253567N9035350
$$ -14776643 -157732880 -158490531 -21286827 -70523293 -104531535 -77769373 -73515806 -14480456
548a4480456J44639120j83770780l1064350L0086390m8335574R6543088o7635765
$$ -14480456 130158664 -53612116 -84676466 -54590076 -102925650 -6382562 -74018327
541g4018327J77022071j16347837k4835288J44280636j10785519J04400643o744752
$$ -74018327 103003744 -13344093 -38179381 106101255 -4684264 99716379 92971627
534I2971627j64341032L1765126J40510111j41976795q209996N6302813o2147563
$$ 92971627 -71369405 -39604279 100905832 -41070963 -49280959 7021854 -55125709
527e5125709j01011052J31401312Q476048N0936205j2476837r9923627j5806758N2436817
$$ -55125709 -156136761 -24735449 -16259401 34676804 22199967 -77723660 -93530418 -41093601
519d1093601J7089581j99111012J09003267j775030n835909K6396742O8903595P5418070
$$ -41093601 -24004020 -223115032 -114111765 -115886795 -121722704 -95325962 -26422367 48995703
511D8995703J3389380k4668595o3109463J61827369j58354435M277125J1726644O5268164
$$ 48995703 62385083 37716488 -25392975 136434394 -21920041 -17642916 -5916272 59351892
503E9351892j34288698m3524342R6032940M1822453j07744323J44784994R658621k3816840
$$ 59351892 -74936806 -118461148 -22428208 19394245 -88350078 56434916 66093537 42276697
495D2276697k9222798N8392640j84983898J45355143m3584522N4594164n2362074m8691894
$$ 42276697 13053899 71446539 -113537359 31817784 -11766738 42827426 -9534648 -58226542
487e8226542k9593499l0786087K39396071j66973695N317103J8840540N4434160Q780722
$$ -58226542 -87820041 -118606128 120789943 -46183752 -40866649 -22026109 32408051 41188773
479D1188773m5186032K51540072m66432416L97257903q9155898j51146876J00793125
$$ 41188773 -3997259 247542813 -218889603 178368300 89212402 -61934474 38858651
472C8858651M6556330r4422885N4457569Q984331r3987789L9802036L8062080J0772284
$$ 38858651 85414981 -9007904 45449665 54433996 -39553793 248243 38310323 49082607
464D9082607J23349502j54313622l4414277n6588386n654242K2387501N8214388k31507027
$$ 49082607 172432109 18118487 -16295790 -72884176 -78538418 -56150917 2063471 -229443556
456b29443556J30261219k3247856J55927410j358264J96668l0682552j5559584l1595562
$$ -229443556 -99182337 -122430193 33497217 32138953 32335621 1653069 -13906515 -45502077
448d5502077J35142628k18473657Q8207850J5816685n4100909K4671869O7295861P968678
$$ -45502077 89640551 -128833106 -40625256 -24808571 -78909480 -54237611 13058250 21026928
440B1026928J5903261J08842364k3049110m5943129o4845734k8240612K65315058
$$ 21026928 36930189 145772553 122723443 76780314 11934580 -16306032 249009026
433B49009026j95262087M9465359j02470710J6745302p3882300Q6778373M9129132
$$ 249009026 53746939 103212298 741588 17486890 -56395410 30382963 79512095
426G9512095p2997642j2953509J5302482j8956113k525035j97817519J96473799P5390602
$$ 79512095 6514453 -6439056 8863426 -10092687 -12617722 -210435241 -13961442 61429160
418F1429160M7819910k10284780N0718318n6677954J36849060j27180905K08725890
$$ 61429160 109249070 -101035710 -50317392 -106995346 29853714 -97327191 111398699
411A11398699j07876902k4525353p1135302O1622301J48079523j42133819j5907498
$$ 111398699 3521797 -21003556 -92138858 -30516557 117562966 -24570853 -40478351
404d0478351M3641912q2085650P2777923J0191204M7912501k349636p556245l777524
$$ -40478351 3163561 -78922089 -6144166 4047038 51959539 49609903 42053658 38276134
396C8276134p0090615J9482840R4571768j09873503Q648338j8967003M0764679j47848324
$$ 38276134 -31814481 -12331641 82240127 -27633376 -18985038 -37952041 2812638 -145035686
388a45035686J29895755Q0716615J26827677k04517227r285509R1513829m0081620
$$ -145035686 -15139931 65576684 192404361 -12112866 -21398375 70115454 30033834
381C0033834j1300703L2905216J2911316j33467794n4540229K19504497l5502246q6392942
$$ 30033834 18733131 51638347 64549663 -68918131 -123458360 96046137 60543891 -25849051
373b5849051O310066P6574952K7099783j70216768L0983100O7632450j4285166N9908882
$$ -25849051 -19538985 57035967 84135750 -86081018 -55097918 12534532 -1750634 58158248
365E8158248l9070498l8922728r7402918R6859272Q2203545L0130569j95243054J50894475
$$ 58158248 19087750 -19834978 -117237896 -20378624 61824921 91955490 -103287564 47606911
357D7606911m7981064Q872251q8186717N4237648K7432105j82301669K08245784p1426528
$$ 47606911 -374153 8498098 -79688619 -25450971 1981134 -180320535 27925249 -43501279
349d3501279o0408884O8741728O6260379M6984924j03077336l6426305J94706768
$$ -43501279 -103910163 -35168435 31091944 78076868 -25000468 -61426773 133279995
342A33279995j94549030J9304894L8265899K00467895k46146756l42840m7687549
$$ 133279995 -61269035 -41964141 -3698242 196769653 -49377103 -49719943 -97407492
335i7407492K10373776j22296164J7398723R4757017p1369411n1537155r1545346
$$ -97407492 112966284 -9329880 8068843 102825860 31456449 -20080706 -111626052
328a11626052K27334288k04148282l1781313o7739074K28129727J7630713j18982434
$$ -111626052 115708236 -88440046 -120221359 -187960433 40169294 57800007 -61182427
321f1182427J08179066L5700758q3236484j67711757R2975572j8490519M7620377n4727465
$$ -61182427 46996639 82697397 -539087 -168250844 -75275272 -93765791 -46145414 -100872879
313a00872879n3286258J18809244n6409389K6055248o1415670K04996922n4067091
$$ -100872879 -154159137 -35349893 -91759282 -65704034 -127119704 77877218 23810127
306B3810127k2455831k08493879R0521146J49497055q1164012n3017083K54904415
$$ 23810127 1354296 -207139583 -116618437 32878618 -48285394 -101302477 153601938
299A53601938j69938834j4169099n3941058Q1868312K2322051p6896011m6914901
$$ 153601938 -16336896 -30505995 -84447053 -2578741 19743310 -57152701 -104067602
292a04067602L34224385k96773944K5656771J4109457J96434305k33682839L9267196
$$ -104067602 230156783 -66617161 -40960390 -26850933 169583372 -64099467 -24832271
285b4832271J14821600K3372174k08068191P1639266j3437606K88382529j88481994
$$ -24832271 89989329 113361503 -94706688 -23067422 -36505028 251877501 63395507
278F3395507J9625366N7016464q9621875L6588235j37008082K24488610k32674603J945041
$$ 63395507 83020873 140037337 50415462 87003697 -50004385 174484225 -58190378 -56245337
270e6245337N2354541J22129743j05626911m4141710K46562135q0398248j00280307
$$ -56245337 -3890796 118238947 12612036 -31529674 215032461 134634213 34353906
263C4353906j4729892p2288305P9021454R9764607k14519897N7601056k3566526K9165920
$$ 34353906 19624014 -52664291 26357163 126121770 -88398127 -30797071 -54363597 -25197677
255b5197677n3571248K13218420j94889669n7732800J00023624l6544880n0719011
$$ -25197677 -78768925 134449495 -60440174 -118172974 -18149350 -54694230 -105413241
248a05413241L9983000J22052231j95550406N2147882O9367266m2852812n868106M3628849
$$ -105413241 -65430241 56621990 -138928416 -86780534 -17413268 -60266080 -66134186 -22505337
240b2505337l210808K1056405n3337248M9092554o3217011n1902449J08188388L9098990
$$ -22505337 -25716145 -4659740 -57996988 -8904434 -72121445 -124023894 -15835506 23263484
232B3263484k8884960k5533054p7782894L5164886J71787289j58270476J43378047
$$ 23263484 -5621476 -31154530 -108937424 -73772538 98014751 -60255725 83122322
225H3122322J7105640j50239890q7957071Q7838014n4406741L8031041J25999217
$$ 83122322 100227962 -50011928 -137968999 -50130985 -104537726 -66506685 59492532
218E9492532j36127025P6080124L7552781j31505749P9094243L2096585J3990728R3204253
$$ 59492532 -76634493 -554369 36998412 -94507337 -15413094 16683491 30674219 123878472
210A23878472q2740641j70380618M1896177R4794154j8407340J6127392j5672958l4242284
$$ 123878472 41137831 -129242787 -87346610 7447544 -10959796 5167596 -10505362 -44747646
202d4747646R0062626J11535369q7803382p3217008M7410707p1802277M8287081p7819446
$$ -44747646 45314980 156850349 69046967 -4170041 43240666 -28561611 19725470 -58093976
194e8093976j6903470R4262015r694378J9886651p332913N7892181j40905419J23927920
$$ -58093976 -74997446 19264569 9570191 29456842 22123929 80016110 -60889309 63038611
186F3038611m1544834J3738296q7216417R4967681N9269923m5544996j55922574O8380017
$$ 63038611 21493777 35232073 -51984344 42983337 102253260 56708264 -99214310 -30834293
178c0834293P8943547j20199656Q4002374p4590309N4170444L5805983j15063737
$$ -30834293 48109254 -72090402 11911972 -62678337 -8507893 27298090 -87765647
171h7765647J28595889j2746626m1994608P5500732q2041346L2268672J6962097o3747578
$$ -87765647 40830242 28083616 -13910992 61589740 -20451606 11817066 28779163 -34968415
163c4968415R0514744j08428311J08974152j55033230Q5664228Q4075648j45700686
$$ -34968415 55546329 -52881982 56092170 -98941060 -13276832 70798816 -74901870
156g4901870J67606435p1625950P1654524j5306947p2339825l4882565m6763870J34295547
$$ -74901870 92704565 21078615 92733139 77426192 5086367 -29796198 -76560068 57735479
148E7735479j93918051K99231726q9999740o4384565r1097851L845718R7651663l3327536
$$ 57735479 -136182572 163049154 73049414 8664849 -82433002 -78587284 19064379 -14263157
140a4263157J9967924j01295815J88031894J6518325q5590880o6211763o9228472R7526309
$$ -14263157 5704767 -95591048 92440846 108959171 23368291 -42843472 -112071944 -14545635
132a4545635P9939246J8356810k91359263J06679953J28814393k02181824J50949899
$$ -14545635 65393611 83750421 -207608842 -100928889 27885504 -174296320 -23346421
125b3346421R2360638j13668334Q6505389q9088817Q1301335J1103088K3715736m9672983
$$ -23346421 69014217 -44654117 41851272 -47237545 34063790 45166878 68882614 19209631
117A9209631J5772778j99229719Q2183227n0572696J48340236n0429253J18575252
$$ 19209631 34982409 -164247310 -82064083 -132636779 15703457 -34725796 83849456
110H3849456R5658393k00306631M4048942o1838277N7188446N8059884m2441238j45210841
$$ 83849456 179507849 -20798782 23250160 -38588117 18600329 76660213 34218975 -110991866
102a10991866N9563547p2987139j6157527J31762862j35222057K81010033k22325519
$$ -110991866 -51428319 -124415458 -140572985 -8810123 -144032180 136977853 -85347666
95h5347666N5275562j666761M8454972j21405539J13208198J16581451j35124360q3500663
$$ -85347666 -30072104 -31738865 16716107 -104689432 8518766 125100217 -10024143 -93524806
87i3524806K479963O4722639o1249149L6077639p570113J78339181M732152j79879539
$$ -93524806 -91044843 -26322204 -87571353 -51493714 -59063827 119275354 124007506 -55872033
79e5872033J01831078N2227544j9159569l5598597o8689610L4594359m9329421k5374956
$$ -55872033 45959045 98186589 79027020 43428423 -25261187 9333172 -39996249 -65371205
71f5371205L6446485j60013885J92368310M8030474P1056192o9573616j05950196j1414939
$$ -65371205 -28924720 -188938605 3429705 51460179 122516371 52942755 -53007441 -64422380
63f4422380J00409311r3770382l9180495L0782858L1575604J55970753k02769371k3999717
$$ -64422380 35986931 -57783451 -96963946 -66181088 -34605484 121365269 -81404102 -105403819
55a05403819O7409212j436326J36719573j04624246P1949649j11350578M5360263o3201772
$$ -105403819 -37994607 -39430933 97288640 -7335606 64614043 -46736535 -1376272 -64578044
47f4578044L2834162Q1033382m6448039L8051455l8738198L1722276n1729919l478527
$$ -64578044 -31743882 49289500 2841461 40892916 2154718 33876994 -17852925 -21331452
39b1331452l2044845k0368061L9586887j7435061j2404441K5526195p5034073M0107253
$$ -21331452 -53376297 -73744358 -34157471 -51592532 -63996973 -38470778 -113504851 -73397598
31g3397598J20213203j52104843J3888772J59471121o3524747K9152829m5913680m0420672
$$ -73397598 46815605 -105289238 -91400466 68070655 4545908 33698737 -12214943 -52635615
23e2635615q3430194J44316445j26869138k9961324K05023313o5301978L7663222l2983408
$$ -52635615 -136065809 8250636 -118618502 -148579826 56443487 -8858491 28804731 -4178677
15d178677Q0567478L0753102R87937L9068651l0235670p3646003j8337164R0248278
$$ -4178677 76388801 107141903 108129840 147198491 116962821 43316818 24979654 115227932
7A15227932q7096093n0685135Q0133477p213189R4322298o8502095p3168718L4213505
$$ 115227932 28131839 -22553296 57580181 50366992 144689290 76187195 3018477 37231982
-1C7231982L872320j5541673r6539354j19552892P1960704J69608743q4015951N320252
$$ 37231982 41104302 25562629 -70976725 -190529617 -118568913 51039830 -32976121 -27655869
-9b7655869L423575P496631M9307560j07131314J7486734k7583396M4921805k5254311
$$ -27655869 -24232294 -16735663 32571897 -74559417 -57072683 -84656079 -39734274 -64988585
-17f4988585j47797806N9578205J15141274R2596249m7878341Q8077119M9453172
$$ -64988585 -212786391 -153208186 -38066912 54529337 6650996 94728115 144181287
-24A44181287j51989290M0555670j07007020J63141763j3262784k1826508j42326066
$$ 144181287 -7808003 32747667 -74259353 88882410 75619626 53793118 -88532948
-31h8532948O2017436k6683892O9453822M1163480k264812N204683Q2069497p9298335
$$ -88532948 -26515512 -53199404 16254418 57417898 55153086 60357769 142427266 63128931
-39F3128931l8731971k4127945o3979887L3398756J32642212M8948661k12311086m1458146
$$ 63128931 24396960 269015 -63710872 -30312116 102330096 151278757 -61032329 -102490475
-47a02490475J06212294O6435852m7280953o2678735J49393796j05326517L7806264
$$ -102490475 3721819 70157671 22876718 -39802017 109591779 4265262 42071526
-54D2071526j58389429N0385848R7660157N936412K6250563o117723m1899946q9563228
$$ 42071526 -116317903 -65932055 31728102 37664514 63915077 57797354 15897408 -73665820
-62g3665820k9027004O3995209L3681981O1399293O8429928j13017496l0084753r4733054
$$ -73665820 -102692824 -38697615 -5015634 56383659 124813587 11796091 -18288662 -113021716
-70a13021716J07389966K5953260n8234490M9879966l6146187j460700M8046160k37605645
$$ -113021716 -5631750 20321510 -37912980 11966986 -24179201 -25639901 22406259 -215199386
-78b15199386J67250018N3510490p6108520n8520191K62524519k47607980R4315251
$$ -215199386 -47949368 5561122 -70547398 -129067589 133456930 -114151050 -19835799
-85a9835799k3283759n8345079P4801979q7240106J22864171r929446q7810758L39400
$$ -19835799 -43119558 -101464637 -26662658 -113902764 8961407 -968039 -88778797 -88439397
-93h8439397j15035888K00206508q8200194J7504906J27324160R453376L8750706
$$ -88439397 -203475285 -3268777 -91468971 -73964065 53360095 62813471 101564177
-100A01564177j90031314l262858J54362820j90501892K30762140k3098255l5300273
$$ 101564177 -88467137 -91729995 62632825 -127869067 102893073 79794818 44494545
-107D4494545J8248572r2420448Q2558306p1814403J00640834j53216133J42899491
$$ 44494545 62743117 -29677331 52880975 -18933428 81707406 -71508727 71390764
-114G1390764q0343304k3563807N293574k682387n6279865J07974321N8620566M8639100
$$ 71390764 -8952540 -32516347 -27222773 -29905160 -86185025 21789296 80409862 129048962
-122A29048962j60554541J39803308j82454548P7317517M3518762n673304k0634512
$$ 129048962 -31505579 108297729 -74156819 3160698 46679460 41006156 20371644
-129B0371644q7278247J34471054q6938480l9757459j3339746J170725J4284949J34800208
$$ 20371644 -66906603 67564451 -19374029 -59131488 -72471234 -71300509 -57015560 77784648
-137G7784648r3316400L6908978l8406350Q9588856j32157793J13396608j42148741
$$ 77784648 -15531752 21377226 -17029124 72559732 -59598061 53798547 -88350194
-144h8350194J16522624k9975176j63923748J37630698n3379828J04828001n7040949
$$ -88350194 28172430 -1802746 -165726494 -28095796 -81475624 23352377 -33688572
-151c3688572J2979423N6079201r7783103J33756288j23288870k7759161K3477585
$$ -33688572 -20709149 35370052 -62413051 71343237 -51945633 -79704794 -56227209
-158e6227209P8686829o7599236m3157867N5686276n6420681j5844950J00814637j7579297
$$ -56227209 22459620 -45139616 -88297483 -32611207 -89031888 -104876838 -4062201 -21641498
-166b1641498R0676527N3643022k23560560O3411652j1128883p5890580k3735299
$$ -21641498 69035029 122678051 -100882509 -37470857 -48599740 -124490320 -148225619
-173a48225619K04921794j79994811N6573121J41209859j34415008J01569486N2607494
$$ -148225619 56696175 -123298636 -66725515 74484344 -59930664 41638822 94246316
-180I4246316j10993180K006559k760108k8292960Q617938J354293N8372699n1973343
$$ 94246316 -16746864 -14740305 -17500413 -45793373 -37175435 -35821142 22551557 -29421786
-188b9421786J41835192j4077800k09031324K09434026r6337910k3050518m9484438
$$ -29421786 112413406 98335606 -110695718 98738308 2400398 -20650120 -70134558
-195g0134558O651518o1863004J3459568Q5250004R2939608m9466937p0070072M2106968
$$ -70134558 -63483040 -125346044 -111886476 -26636472 66303136 16836199 -53233873 -11126905
-203a1126905O8080942J750773l2574319j36300620J3878626q4337221J66706513r4573585
$$ -11126905 56954037 58704810 26130491 -110170129 -96291503 -180628724 -13922211 -108495796
-211a08495796K2835407N2150520R9692266J50024701j82133437K90297j4117700O4461206
$$ -108495796 -85660389 -33509869 66182397 216207098 34073661 34363958 20246258 84707464
-219H4707464P4243392j40608392j07334910j6513045J8848079Q9442107K9328107o860234
$$ 84707464 158950856 18342464 -88992446 -105505491 -86657412 2784695 32112802 25252568
-227B5252568n7214377K12016411l3112928p3745644L7532827O3625129j37439296
$$ 25252568 -31961809 180054602 146941674 73196030 110728857 174353986 36914690
-234C6914690m9835739N3487760j94195947K32989275j88677265J56806418L1591376
$$ 36914690 -12921049 40566711 -153629236 79360039 -109317226 47489192 79080568
-241G9080568p8449640m6008878N8278980J4872689r7018457R2382736q7009007N3629027
$$ 79080568 630928 -45377950 12901030 27773719 -69244738 23137998 -63871009 -10241982
-249a0241982Q6827158o5858102j8755L9073256j46314270P9337973O992460j06987729
$$ -10241982 76585176 10727074 10708319 49781575 -96532695 -17194722 -10202262 -117189991
-257a17189991m493677K86036806k73118523J70695434p7858240K8156411K8835260
$$ -117189991 -121683668 164353138 -108765385 61930049 -15928191 12228220 41063480
-264D1063480K3173117L814493m0962442j06630752j39788471K68898268j28104662
$$ 41063480 64236597 68051090 27088648 -79542104 -219330575 49567693 -78536969
-271g8536969J3991358Q6185673Q8323522j20097452J1298259n315414M1041663k7197607
$$ -78536969 -64545611 21640062 109963584 -10133868 1164391 -4151023 36890640 9693033
-279I693033J58089115m2881408k98262909M2364799K4896348J15078120q4380496
$$ 9693033 167782148 124900740 -173362169 -130997370 -106101022 8977098 -75403398
-286g5403398L7966966J01623397m7221896p1149715L3647791K2836198o6247040
$$ -75403398 -37436432 64186965 16965069 -54184646 -20536855 2299343 -63947697
-293f3947697J10986984L7001075q0804233L4784882j67559157J04685201j53811904
$$ -63947697 47039287 84040362 3236129 38021011 -129538146 -24852945 -178664849
-300a78664849J10266009J1069774J33673413j20718492Q8845787o5515557J4466655
$$ -178664849 -68398840 -57329066 76344347 -44374145 44471642 -21043915 -6577260
-307f577260j6930598J04866852j06391079J16725900n7662316n3953256q4007952
$$ -6577260 -23507858 81358994 -25032085 91693815 34031499 -19921757 -103929709
-314a03929709Q1536199l9900521Q2435192M9341267q8699350R7878898n0290484j9916095
$$ -103929709 -22393510 -62294031 20141161 69482428 -19216922 78661976 28371492 8455397
-322H455397p604145Q5673575r9327417J6556967j35833559N2193441L8163521Q266576
$$ 8455397 851252 86524827 -12802590 3754377 -132079182 -79885741 -41722220 -33455644
-330c3455644O9538671O066699o7438895j00502159J28741913l2331960j51274745
$$ -33455644 36083027 42149726 -25289169 -125791328 2950585 -29381375 -180656120
-337a80656120K14487410m6685626k0822315k6254266o4847591M4647423O195005M8306554
$$ -180656120 33831290 -12854336 -33676651 -59930917 -124778508 -80131085 -73936080 -25629526
-345b5629526L1572060p0629007N3493425j00473202J81294490r187422O1549460
$$ -25629526 5942534 -64686473 -11193048 -111666250 69628240 60440818 121990278
-352A21990278k20607683J08197653n0627074J28121537k8888721N6759670l90766
$$ 121990278 -98617405 9580248 -41046826 87074711 58185990 114945660 114554894
-359A14554894j58586425M1026107j3703138Q3440646j3013931j1933490l5354599
$$ 114554894 -44031531 -3005424 -16708562 66732084 53718153 41784663 6430064
-366F430064J24904682r7348444j03420069M5124118R4898586m8457934r2415205n3049241
$$ 6430064 131334746 33986302 -69433767 -24309649 70588937 22131003 -70284202 -123333443
-374a23333443P7655444M760130o4841571Q8860830l2233425l4470633J27394246
$$ -123333443 -45677999 -40917869 -105759440 -16898610 -49132035 -83602668 43791578
-381D3791578j58206778N4557647L0382860r1748774J11292317r8245702J06260294
$$ 43791578 -114415200 -59857553 -29474693 -121223467 -9931150 -108176852 -1916558
-388a916558j07668951Q0366963M7251178l8775880Q6540847k03600670P6407968
$$ -1916558 -109585509 -29218546 18032632 -20743248 65797599 -137803071 -61395103
-395f1395103J03522663l6977870J2830722J18497015n4776784j11023874J43720087
$$ -61395103 42127560 5149690 17980412 136477427 81700643 -29323231 114396856
-402A14396856j28031300L2897757q881546N4133473j26436903J24750301O1334881
$$ 114396856 -13634444 19263313 10381767 64515240 -61921663 62828638 124163519
-409A24163519j92494915J02965682Q6021593k1389164r1215505m1769987K3457121
$$ 124163519 -68331396 34634286 120655879 99266715 8051210 -33718777 -10261656
-416a0261656q4080131J36852717O1877793m6546325l3666997j40995271J84735674
$$ -10261656 -94341787 42510930 104388723 57842398 24175401 -116819870 67915804
-423F7915804M4051053j30411868O3733617n5101986j18825486Q3484849o9606975
$$ 67915804 111966857 -18445011 45288606 -9813380 -128638866 -45154017 -114760992
-430a14760992J49469765n9991060M9674232m9730783P5500922m6063465j3689205
$$ -114760992 34708773 -25282287 24391945 -25338838 50162084 4098619 -9590586
-437i590586l9025383J18510223n8369219N0571508j26435632J01192774r4432841
$$ -9590586 -48615969 69894254 11525035 62096543 -64339089 36853685 -57579156
-444e7579156J03059592M1565208J45841038k03955694K7279319j9361077j0504741
$$ -57579156 45480436 87045644 232886682 28930988 56210307 36849230 26344489
-451B6344489p6748849J33353680p77075P3698328o2639763j28741937N1185423L0177005
$$ 26344489 -50404360 82949320 82172245 155870573 93230810 -35511127 15674296 45851301
-459D5851301R1816818p7503059n0139899j5557338l6948913J47670661j65289196
$$ 45851301 137668119 60165060 10025161 -5532177 -42481090 105189571 -60099625
-466f0099625N4203410P8018013o6614686K7732103k4851766o7986561Q094191j1144233
$$ -60099625 -5896215 72121798 5507112 33239215 8387449 -59599112 -51504921 -62649154
-474f2649154J32894365j53880288M8327427R7253227L8338065k57001079O280986
$$ -62649154 70245211 -83635077 -35307650 61945577 100283642 -156717437 -150436451
-481a50436451J15672184j7871388P0755654n3415572J01172046j99554298R6573825
$$ -150436451 -34764267 -52635655 18119999 -35295573 65876473 -133677825 -37104000
-488c7104000k6881906L9844065j950846J43345191j24675533j365160K4206282n6274372
$$ -37104000 -63985906 -24141841 -26092687 117252504 -7423029 -8788189 15418093 -40856279
-496d0856279R8136054j03221339J09028262J108782j20385912M6311841N6332054M071264
$$ -40856279 57279775 -45941564 63086698 64195480 -56190432 -9878591 46453463 50524727
-504E0524727q9026691Q7527705m953113k2212242K384252J9383992l6915030m3836063
$$ 50524727 -38501964 49025741 44072628 21860386 24244638 43628630 6713600 -37122463
-512c7122463Q2552564l9168710j83194O044427q6015043J35570370j2728461n9289
$$ -37122463 45430101 6261391 6078197 12122624 -73892419 61677951 48949490 48890201
-520D8890201o5600271m2006650O2301088J26598984j93389949Q4500120K4786786
$$ 48890201 -16710070 -58716720 3584368 130183352 -63206597 21293523 46080309
-527D6080309j40955894Q3950286R0150665m4724769k0681933m215112P2014778j87964353
$$ 46080309 -94875585 -10925299 79225366 34500597 13818664 9603552 81618330 -106346023
-535a06346023L7952279J1226831M2295601p8432573J29410757m4423992J08072761
$$ -106346023 -68393744 -57166913 -14871312 -93303885 36106872 -8317120 99755641
-542I9755641j82035309L1957737K6780522J88360207j09535390n2285511m0252138
$$ 99755641 -82279668 -50321931 -23541409 164818798 55283408 2997897 -37254241
-549c7254241l875259J36719924j73021966l5917146M8929239K08461839k14468588
$$ -37254241 -41129500 95590424 -77431542 -113348688 -64419449 144042390 -70426198
-556g0426198O6872191j4325069j17103501K28042509r3621140o6009953p3403538
$$ -70426198 -3554007 -17879076 -134982577 93059932 -561208 -66571161 -139974699
-563a39974699J50464552L0663882Q7498626j24753049o8962185K4863694J92224396
$$ -139974699 10489853 41153735 128652361 3899312 -65062873 -40199179 152025217
-570A52025217j97559377l2159820J20132077j8974705p0059893l9131766J16112687
$$ 152025217 -45534160 -77693980 42438097 23463392 -46596501 -85728267 30384420
-577C0384420L2750506l4871575m270344M4316960o583146j64470977J64675761j3805564
$$ 30384420 63134926 28263351 23993007 68309967 61726821 -102744156 61931605 48126041
-585D8126041J5459507l2934461l5784728O4858729j75229126q6994660J95314935
$$ 48126041 63585548 30651087 -5133641 59725088 -115504038 -202498698 -7183763
-592g183763J31624343j11034015J61166434j52883710N2690822K7769401m6005573
$$ -7183763 124440580 13406565 174572999 21689289 74380111 102149512 56143939
-599E6143939l7562420j07140050O3598524O6454704m6752555n5458098P7850712J9260578
$$ 56143939 18581519 -88558531 -24960007 41494697 -5257858 -60715956 17134756 36395334
-607C6395334M8323424r1624194O0869640j7350893j03855710R6485412K5747421
$$ 36395334 84718758 -6905436 53964204 36613311 -67242399 29243013 54990434
-614E4990434j73436338n928788L4750833J19012732p3715721o8235674J82455428
$$ 54990434 -118445904 -124374692 -89623859 29388873 -44326848 -112562522 69892906
-621F9892906j53204940l0922271J30084439n3040195j0383143M806120J19611414
$$ 69892906 -83312034 -114234305 15850134 -37190061 -47573204 -42767084 76844330
-628G6844330j92227046M482510J43030527k1164319N1578184k5848385n4437663N8811838
$$ 76844330 -115382716 -110900206 32130321 10966002 62544186 36695801 -17741862 41069976
-636D1069976N911197P722328l7839308J08949040j66905867J31795794q2899288l6917401
$$ 41069976 46981173 54703501 16864193 125813233 -41092634 90703160 7803872 -29113529
-644b9113529M3266723K4425970r8999142k5472688J36932189r1669123M8955148N1223104
$$ -29113529 14153194 38579164 -60419978 -85892666 51039523 -40629600 8325548 59548652
-652E9548652o9199529j2544025j09415105K12918796J1532460l7404927j2465791
$$ 59548652 -9650877 -22194902 -131610007 81308789 92841249 55436322 42970531
-659D2970531M6218498k06012253l7894788j663766J04885281Q5753922j28876359
$$ 42970531 89189029 -116823224 -154718012 -156381778 -51496497 34257425 -94618934
-666i4618934O1468063m6538396J31925626j60654488K23423594j84024329J12993855
$$ -94618934 -33150871 -79689267 52236359 -108418129 115005465 -69018864 43974991
-673D3974991K2011742j52999522l2991377R122400J2989237J76211854j17399387
$$ 43974991 65986733 -87012789 -120004166 -110881766 -97892529 78319325 -39080062
-680c9080062p2145642K09275732l4781153k426510M2502002q9248961j70324235
$$ -39080062 -111225704 98050028 63268875 60842365 103344367 14095406 -156228829
-687a56228829J39232036O2335252p7608376l1117324o36133l4054970J40244306k2160426
$$ -156228829 -16996793 45338459 -32269917 -63387241 -64023374 -98078344 42165962 20005536
-695B0005536j1790792q9166465P8831804O0242949k54905856J64924879m5540705
$$ 20005536 8214744 -80951721 -2119917 58123032 -196782824 -31857945 -77398650
-702g7398650M3838171K3090286J29711684j85353437q5243002L2442086J63446743
$$ -77398650 -33560479 -10470193 119241491 -66111946 -151354948 -118912862 44533881
-709D4533881J08726712r4527565j37832139K3704210Q5586174j4107513j12446650
$$ 44533881 153260593 58733028 -79099111 -55394901 30191273 16083760 -96362890
-716i6362890K8759637O9240015l2940932L1827261n132342L9969795q5083986P9997798
$$ -96362890 -67603253 1636762 -31304170 523091 -4609251 35360544 -49723442 30274356
-724C0274356J6165402m8105095k9495929m1318946O9641715o2711888N1113785l5085509
$$ 30274356 46439758 -1665337 -31161266 -72480212 -2838497 -65550385 -14436600 -49522109
-732d9522109P8663262J992005O6896991j45221181O9913079O6964661j49915072
$$ -49522109 29141153 31133158 98030149 -47191032 22722047 89686708 -60228364
-739f0228364K81470910k85316472Q2481366j01609908J8366461J87699467j31435063
$$ -60228364 221242546 -64073926 18407440 -83202468 -64836007 122863460 -8571603
-746h571603L3373834m4436109l8464174O9734725j50928908J23363915R0486617
$$ -8571603 24802231 -19633878 -58098052 11636673 -139292235 -15928320 74558297
-753G4558297j86885920J08190796m1037354m1378321J66643205j39356781J58147710
$$ 74558297 -112327623 -4136827 -45174181 -86552502 80090703 -59266078 98881632
-760I8881632o5507991l3558022j26603852J01452331n4148914q8204681J86600183
$$ 98881632 33373641 -184381 -126788233 -25335902 -79484816 -167689497 18910686
-767A8910686J04733484n7074849r4902500j3274538p0003448J25518437o1325057
$$ 18910686 123644170 66569321 -28333179 -41607717 -111611165 13907272 -47417785
-774d7417785K46774098k32157130l3608894Q8207771J0530513l9497911M3179971
$$ -47417785 199356313 -32800817 -66409711 21798060 32328573 -7169338 36010633
-781C6010633p4800388J72644343r0804886k08659342J38935144R1345956o8096858
$$ 36010633 -38789755 133854588 43049702 -165609640 -26674496 64671460 -3425398
-788c425398k1645268J02858719p4691308j22297016K22301161j07677347k2184797
$$ -3425398 -25070666 77788053 3096745 -119200271 103100890 -4576457 -26761254
-795b6761254j4137404M9161109l2263950K3528782L0331314k7924521J5834218m8174698
$$ -26761254 -40898658 8262451 -24001499 -472717 29858597 1934076 17768294 -30406404
-803c0406404m5050899J86604414r3304590P3013117m2833326r2874264o7776308N6902110
$$ -30406404 -75457303 111147111 17842521 90855638 48022312 -44851952 -112628260 -55726150
-811e5726150P4949549j5235505J71825252j40167689j6336241r2182727P9580827
$$ -55726150 19223399 3987894 175813146 35645457 19309216 -72873511 6707316
-818F707316j4975310O1040022N2594518J8779621j32799392j89143664J82730654
$$ 6707316 -8267994 52772028 105366546 124146167 -8653225 -197796889 -15066235
-825a5066235L6449055O0197428l9205011j3885987J3636187j33303923J33972622
$$ -15066235 21382820 81580248 42375237 28489250 42125437 -91178486 42794136
-832D2794136r7379525n28425K4110451p7095241O047977J12121391j445781m4024467
$$ 42794136 -54585389 -55113814 -31003363 -108098604 -102050627 10070764 8624983 -35399484
-840c5399484K7295876J36782912p3062697M6077386j49698196M8665946n1638199
$$ -35399484 -8103608 128679304 55616607 101693993 -48004203 661743 -50976456
-847e0976456j12712649J58069906j85360109J40457507K210805O9160654N194900
$$ -50976456 -163689105 -5619199 -190979308 -50521801 -48310996 20849658 26044558
-854B6044558J9041612n2631826M9024420O0067029l9693426k10070860R8458951K5084373
$$ 26044558 45086170 -7545656 41478764 101545793 61852367 -148218493 -49759542 -24675169
-862b4675169j65130968N4739496J54159532l1033848l0923946M4388188P9053830
$$ -24675169 -189806137 -135066641 19092891 -11940957 -42864903 1523285 80577115
-869H0577115l0876305j11302381J09750939o0959457O073931P7379808q5745843j5989909
$$ 80577115 49700810 -61601571 48149368 -12810089 -6736158 70643650 -15102193 -31092102
-877c1092102q2831878R1354832R8420383j59768886J09993661j43010586P4872267
$$ -31092102 -113923980 -22569148 75851235 -83917651 26076010 -116934576 -42062309
-884d2062309N5639279o043999q3874627J27233612l1908021Q8600142k02810864J3833687
$$ -42062309 13576970 7532971 -76341656 50891956 18983935 107584077 -95226787 -81393100
-892h1393100q132719J04239361m6447710L2113532j4907134p8186337K875991J64791245
$$ -81393100 -89525819 14713542 -31734168 379364 -14527770 -92714107 -89838116 74953129
-900G4953129k07949970O0806746k6162361J82593769j39604405j38883212Q7177039
$$ 74953129 -132996841 -72190095 -98352456 84241313 -55363092 -194246304 -107069265
-907a07069265J45048718o0759953L5235999j08697414N2315741j4377031j3043135
$$ -107069265 37979453 -22780500 12455499 -96241915 -43926174 -58303205 -71346340
-914g1346340R8704896K5030144n4007024J17454544j26477506Q156450J0473468
$$ -71346340 27358556 52388700 -1618324 115836220 -10641286 -2484836 7988632
-921G988632j67101777K04677489j8785130q8633234J25012320j08562437J39036455
$$ 7988632 -159113145 45564344 26779214 -61854020 63158300 -45404137 93632318
-928I3632318P907909N1440887q1468835O7699619m4587504j23403696J35408027
$$ 93632318 101540227 152981114 71512279 139211898 94624394 -28779302 106628725
-935A06628725J57254590l64285259O7921718R8087581N7334502q0935113L6241371
$$ 106628725 263883315 -100401944 -32480226 65607355 122941857 42006744 78248115
-942G8248115J909787M5759658k5814105p5537148J2290151J7347814j76923284Q3389938
$$ 78248115 80157902 125917560 100103455 24566307 36856458 54204272 -122719012 -39329074
-950c9329074J31566425j13547063q3113936K25946289n0845224j17230153P4077422
$$ -39329074 92237351 -21309712 -104423648 121522641 70677417 -46552736 27524686
-957B7524686M6925933j02817500J17699507j768585j74596938n2470343j9792382
$$ 27524686 74450619 -28366881 89332626 87564041 -87032897 -139503240 -159295622
-964a59295622K43176681j38429541J74781091j3445924M014876j09186443m0726413
$$ -159295622 83881059 -54548482 120232609 106786685 110801561 1615118 -39111295
-971c9111295O3267444p506995q1191983Q6792138R5848697k47242564j14666468
$$ -39111295 24156149 16649154 -64542829 22249309 118098006 -129144558 -243811026
-978b43811026K97813694j1782357j7028104K8379873P3532489j69087377L4989078
$$ -243811026 54002668 42220311 25192207 53572080 127104569 -41982808 -6993730
-985f993730Q685042r080209O1511876j33726976R1308476Q9594215k96689498N2081148
$$ -6993730 1691312 -7388897 54122979 -79603997 11704479 101298694 -195390804 -143309656
-993a43309656K04922142Q170734m1104554k1146471j3501779K2844845m059486j38172328
$$ -143309656 61612486 69783220 28678666 7532195 -5969584 16875261 12815775 -125356553
-1001a25356553R4606705n8595958J11848149K2161126O452725j64792259M0087344
$$ -125356553 -30749848 -89345806 22502343 44663469 51116194 -113676065 -73588721
-1008g3588721P3477265R5326346k33356826Q3612148M454273m7314706j7706281Q0335017
$$ -73588721 -111456 95214890 -138141936 -54529788 -50075515 -97390221 -115096502 -34761485
-1016c4761485L0693105l547734J81059675r3895825p4942907j49792863J26938733
$$ -34761485 -4068380 -7616114 173443561 79547736 4604829 -145188034 -18249301
-1023a8249301M631346j2316617K3314430o0118807O3213043K3219813l3298535J49727498
$$ -18249301 -13617955 -25934572 -2620142 -62738949 474094 23693907 -9604628 140122870
-1031A40122870k20510110J21464097r069708j7461575J02629092j47542073m912487
$$ 140122870 -80387240 41076857 32007149 14545574 117174666 -30367407 -35279894
-1038c5279894R1882376r3692478J3514919m5539983N2439723R9088754J6154666j2863955
$$ -35279894 56602482 -37089996 -23575077 -69115060 -16675337 82413417 98568083 85704128
-1046H5704128n7906080j11318878J84401594n3875942j8303584j86637510K34125442
$$ 85704128 27798048 -83520830 100880764 47004822 28701238 -157936272 76189170
-1053G6189170q6595403m6413179J7249879L6484719o0932056P5744105l972841R43878
$$ 76189170 -10406233 -56819412 -39569533 -3084814 -64016870 11727235 7754394 8698272
-1061H698272q060867L1324640N6869446j94661557P0924991P282850k0695708k8625540
$$ 8698272 637405 31962045 88831491 -105830066 -34905075 -27622225 -48317933 -76943473
-1069g6943473N4888323K1279003N3857134q7702567M5073417N1972666L2411498n0570045
$$ -76943473 -22055150 -776147 53080987 -34621580 10451837 62424503 94836001 44265956
-1077D4265956n4159898j9012879r1704864Q1887808J4122361p9553342Q8773193J4120628
$$ 44265956 -9893942 -28906821 -120611685 -38723877 -24601516 -104154858 -15381665 -1261037
-1085a261037p353810P520618n6129830o9281740J74136509n8060211l1125214j80215080
$$ -1261037 -8614847 -1094229 -57224059 -126505799 47630710 -10429501 -41554715 -221769795
-1093b21769795K59746128M2914649p3562470k3925829l4479367N5310227j60494007
$$ -221769795 37976333 80890982 7328512 -16597317 -51076684 4233543 -156260464
-1100a56260464J32052365m4285125Q5844223j0771623l3581279q4480491J6950369
$$ -156260464 -24208099 -68493224 17350999 6579376 -27001903 -111482394 -94532025
-1107i4532025J22244585J71453010p1440246j01816816j93597892L7420180J08045710
$$ -94532025 27712560 199165570 127725324 25908508 -167689384 -130269204 -22223494
-1114b2223494R9049343j12787683J6753013L329109m272987J02966284k79688407
$$ -22223494 76825849 -35961834 -19208821 -15879712 -20152699 82813585 -196874822
-1121a96874822J07897595J93858869J12996945j68359366j14649274O1944618L4292925
$$ -196874822 -88977227 104881642 217878587 49519221 -65130053 -3185435 31107490
-1128C1107490n9665146n9526754R8547321n2773636J08571162j18434518J44723040
$$ 31107490 -28557656 -88084410 10462911 -42310725 66260437 -52174081 92548959
-1135I2548959r1762422l4418375J90468448J7323835j89747530l1773116N4078489
$$ 92548959 786537 -33631838 156836610 174160445 -15587085 -47360201 6718288
$$ [...]
-3284e0532363  $$ checkpoint
##END NTUPLES=
##END=
